[
    {
      "id": 12,
      "course": {
        "id": 2
      },
      "name": "tiktok",
      "slug": "tiktok",
      "is_published": true,
      "video_tags_string": "tiktok"
    },
    {
      "id": 11,
      "course": {
        "id": 1
      },
      "name": "praca s obrazkom",
      "slug": "praca-s-obrazkom",
      "is_published": true,
      "video_tags_string": "obrazok"
    },
    {
      "id": 10,
      "course": {
        "id": 1
      },
      "name": "praca s textom",
      "slug": "praca-s-textom",
      "is_published": true,
      "video_tags_string": "text"
    }
  ]
