addi 3 16 3
seti 1 3 1
seti 1 2 4
mulr 1 4 5
eqrr 5 2 5
addr 5 3 3
addi 3 1 3
addr 1 0 0
addi 4 1 4
gtrr 4 2 5
addr 3 5 3
seti 2 6 3
addi 1 1 1
gtrr 1 2 5
addr 5 3 3
seti 1 0 3
mulr 3 3 3
addi 2 2 2
mulr 2 2 2
mulr 3 2 2
muli 2 11 2
addi 5 8 5
mulr 5 3 5
addi 5 6 5
addr 2 5 2
addr 3 0 3
seti 0 5 3
setr 3 0 5
mulr 5 3 5
addr 3 5 5
mulr 3 5 5
muli 5 14 5
mulr 5 3 5
addr 2 5 2
seti 0 8 0
seti 0 9 3