{
	"info": {
		"_postman_id": "5e3ff941-169b-40e0-9c04-65442de960aa",
		"name": "HitTheWall",
		"schema": "https://schema.getpostman.com/json/collection/v2.0.0/collection.json"
	},
	"item": [
		{
			"name": "MapInfo",
			"request": {
				"method": "GET",
				"header": [],
				"url": "https://localhost:44301/MapManager/MapInfo"
			},
			"response": []
		},
		{
			"name": "MapFile by ID",
			"request": {
				"method": "GET",
				"header": [],
				"url": "https://localhost:44301/MapManager/MapFile/7"
			},
			"response": []
		},
		{
			"name": "MapFile Latest",
			"protocolProfileBehavior": {
				"disableBodyPruning": true
			},
			"request": {
				"method": "GET",
				"header": [
					{
						"key": "Content-Type",
						"name": "Content-Type",
						"value": "application/json",
						"type": "text"
					}
				],
				"body": {
					"mode": "raw",
					"raw": ""
				},
				"url": "https://localhost:44301/MapManager/MapFile"
			},
			"response": []
		},
		{
			"name": "MapFile Create",
			"request": {
				"method": "POST",
				"header": [
					{
						"key": "Content-Type",
						"name": "Content-Type",
						"value": "application/json",
						"type": "text"
					}
				],
				"body": {
					"mode": "raw",
					"raw": "{\n    \"MapName\": \"Demo\",\n    \"CreatedBy\": \"Peter M.\",\n    \"MaxHits\": 10,\n    \"MaxObjects\": 4,\n    \"MapTiles\": [\n        {\n            \"RoomID\": 1,\n            \"RoomName\": \"Entrance\",\n            \"RoomObject\": \"Mirror\",\n            \"xcoord\": 3,\n            \"ycoord\": 2,\n            \"N\": 2,\n            \"E\": 0,\n            \"S\": 0,\n            \"W\": 0\n        },\n        {\n            \"RoomID\": 2,\n            \"RoomName\": \"Dining Room\",\n            \"RoomObject\": \"Table\",\n            \"xcoord\": 2,\n            \"ycoord\": 2,\n            \"N\": 0,\n            \"E\": 3,\n            \"S\": 1,\n            \"W\": 4\n        },\n        {\n            \"RoomID\": 3,\n            \"RoomName\": \"Kitchen\",\n            \"RoomObject\": \"Knife\",\n            \"xcoord\": 2,\n            \"ycoord\": 3,\n            \"N\": 0,\n            \"E\": 0,\n            \"S\": 0,\n            \"W\": 2\n        },\n        {\n            \"RoomID\": 4,\n            \"RoomName\": \"Hallway\",\n            \"RoomObject\": \"Potted Plant\",\n            \"xcoord\": 2,\n            \"ycoord\": 1,\n            \"N\": 5,\n            \"E\": 2,\n            \"S\": 0,\n            \"W\": 0\n        },\n        {\n            \"RoomID\": 5,\n            \"RoomName\": \"Living Room\",\n            \"RoomObject\": \"Book\",\n            \"xcoord\": 1,\n            \"ycoord\": 1,\n            \"N\": 0,\n            \"E\": 0,\n            \"S\": 4,\n            \"W\": 6\n        },\n        {\n            \"RoomID\": 6,\n            \"RoomName\": \"Master Bedroom\",\n            \"RoomObject\": \"Lamp\",\n            \"xcoord\": 1,\n            \"ycoord\": 0,\n            \"N\": 7,\n            \"E\": 5,\n            \"S\": 0,\n            \"W\": 0\n        },\n        {\n            \"RoomID\": 7,\n            \"RoomName\": \"Patio\",\n            \"RoomObject\": \"Puppy\",\n            \"xcoord\": 0,\n            \"ycoord\": 0,\n            \"N\": 0,\n            \"E\": 0,\n            \"S\": 6,\n            \"W\": 0\n        }\n    ]\n}"
				},
				"url": "https://localhost:44301/MapManager/MapFile",
				"description": "df"
			},
			"response": []
		}
	]
}