../Core/Src/main.c:76:5:main	16	static
../Core/Src/main.c:131:6:SystemClock_Config	88	static
../Core/Src/main.c:179:13:MX_GPIO_Init	40	static
../Core/Src/main.c:218:6:Error_Handler	4	static,ignoring_inline_asm
