Design Route Status
                                               :      # nets :
   ------------------------------------------- : ----------- :
   # of logical nets.......................... :         169 :
       # of nets not needing routing.......... :          50 :
           # of internally routed nets........ :          50 :
       # of routable nets..................... :         119 :
           # of fully routed nets............. :         119 :
       # of nets with routing errors.......... :           0 :
   ------------------------------------------- : ----------- :

