5Hz,6Hz,10Hz
29.64888555323139,34.121762496900196,45.03513719492689
54.42511519759437,41.445621953953946,29.66339274043644
22.05668062987317,17.410553281623823,22.020589207244768
5.7565802414968426,4.3639833093414735,3.263420771403598
108.68222855059778,85.40220344945506,154.73329959899428
51.459686768836164,49.611090491627564,35.51544811605753
27.019608090515657,20.385754755979974,20.24080305914432
136.92915948251004,76.10113079930561,36.96322920591052
50.44898134017813,45.396533862364365,61.60528057029551
42.152320713953706,34.47403403939009,31.596818852471
49.0805727292078,41.89206187428843,36.3908396889183
18.830328500103153,17.703122456869167,20.576271239205933
64.68369892424059,49.57922216330412,33.982616180679884
42.194855023414675,32.48232321712308,22.433486596336884
21.188601057656676,18.97686426474952,20.832344046328966
49.583449217620746,38.591724855648756,56.05279732483866
31.955746293191215,33.275289529724255,44.659409593531365
4.457189625766283,3.326762827225301,2.48041568706077
78.45090116825723,56.17844412672563,27.916525147780277
93.28093140062718,73.22612954514611,170.54348233633374
