15.8 148 13000 42 29 132 25
15.1 150 15000 45 30 138 24
14.6 146 17000 47 31 140 22
15.3 141 14000 43 29 143 21
15.5 148 13000 42 29 146 21
15.1 150 15000 45 30 148 20.7
14.6 146 17000 47 31 146 20.3
15.3 141 14000 43 29 149 20
15.1 148 13000 42 29 150 19.8
14.7 150 15000 45 30 151 19.5
14.1 146 17000 47 31 157 19.1
13.8 141 14000 43 29 154 18.7
13.2 148 13000 42 29 153 18.5
13.0 150 15000 45 30 151 18.8
12.9 146 17000 47 31 157 19.2
12.8 141 14000 43 29 154 19.5
12.5 148 13000 42 29 150 19.1
12.2 150 15000 45 30 151 18.7
12.3 146 17000 47 31 157 18.4
12.0 141 14000 43 29 154 18.4
12.2 138 13000 42 29 153 18.5
12.5 134 15000 45 30 151 18.8
12.7 131 17000 47 31 157 19.2
12.9 131 14000 43 29 154 19.5
12.5 128 13000 42 29 150 19.1
12.1 126 15000 45 30 151 18.7
11.9 127 17000 47 31 157 18.4
12.4 125 14000 43 29 154 18.4
12.2 138 13000 42 29 153 18.5
12.5 134 15000 45 30 151 18.8
12.7 131 17000 47 31 148 19.2
12.9 129 14000 43 29 146 19.5
13.0 128 13000 42 29 145 19.7
13.2 126 15000 45 30 142 20.1
13.3 129 14000 43 29 139 20.3
13.5 128 13000 42 29 138 20.7
13.7 126 15000 45 30 135 20.9
14.2 127 17000 47 31 130 21.2
14.1 125 14000 43 29 131 22.9
14.6 127 17000 47 31 135 22
15.3 122 18000 43 29 133 21
15.8 123 18500 42 29 132 25
15.1 119 18900 45 30 138 24
14.6 120 19100 47 31 140 22
15.3 118 20000 43 29 143 21
14.6 127 19100 47 31 140 22
15.3 122 19200 43 33 143 21
15.8 123 19500 42 34 132 25
15.1 119 19400 45 36 138 24
14.6 120 19100 47 38 140 22
15.3 118 20000 43 40 143 21
14.6 121 19100 47 42 140 22
15.3 125 19200 43 40 143 21
15.8 127 19500 42 38 132 25
15.1 129 19400 45 36 138 24
14.6 132 19100 47 34 140 22
15.3 134 18500 43 34 143 21
14.6 138 18100 47 32 140 22
15.3 143 18100 43 30 143 21
15.8 150 17000 42 31 132 25
15.1 151 16400 45 29 138 24
14.6 152 16000 47 31 140 22
15.3 150 15000 43 30 143 21
15.8 150 17000 42 31 132 25
15.1 151 16400 45 29 138 24
14.6 152 16000 47 31 140 22
15.3 150 15000 43 30 143 21