@startuml

title __ZALAGONICA's Class Diagram__\n

  package hr.fer.zalagonica {
    class ZalagonicaApplication {
        + pswdEncoder()
        {static} + main()
        ~ init()
    }
  }
  



right footer


PlantUML diagram generated by SketchIt! (https://bitbucket.org/pmesmeur/sketch.it)
For more information about this tool, please contact philippe.mesmeur@gmail.com
endfooter

@enduml
