{
  "log": {
    "version": "1.2",
    "creator": {
      "name": "BrowserMob Proxy",
      "version": "2.1.6",
      "comment": ""
    },
    "pages": [{
      "id": "Page 0",
      "startedDateTime": "2018-02-19T11:40:05.981Z",
      "title": "Page 0 ţ€$ţɨɲǥ µɲɨȼ๏ď€ ɨɲ Ќ6 \" \u0000\n\t♥\u2028",
      "pageTimings": {
        "onLoad": 32028,
        "comment": ""
      },
      "comment": ""
    }],
    "entries": [{
      "pageref": "Page 0",
      "startedDateTime": "2018-02-19T11:40:14.325Z",
      "request": {
        "method": "POST",
        "url": "https://some-host.example.com/checkout/v3/orders",
        "httpVersion": "HTTP/1.1",
        "cookies": [],
        "headers": [{
          "name": "Authorization",
          "value": "Basic stuffz"
        }, {
          "name": "User-Agent",
          "value": "SysTest - perf"
        }, {
          "name": "Accept",
          "value": "application/json; charset=utf-8"
        }, {
          "name": "Content-Type",
          "value": "application/json"
        }, {
          "name": "Accept-Encoding",
          "value": "gzip;q=1.0,deflate;q=0.6,identity;q=0.3"
        }, {
          "name": "Host",
          "value": "some-host.example.com"
        }, {
          "name": "Content-Length",
          "value": "2042"
        }],
        "queryString": [],
        "postData": {
          "mimeType": "application/json",
          "text": "{\"purchase_currency\":\"SEK\",\"purchase_country\":\"se\",\"locale\":\"sv-SE\",\"merchant_urls\":{\"terms\":\"https://some-fourth-host.example.com/v1/redirect/terms\",\"checkout\":\"https://some-fourth-host.example.com/v1/redirect/checkout\",\"confirmation\":\"https://some-fourth-host.example.com/v1/redirect/confirm\",\"push\":\"https://some-fourth-host.example.com/v1/callback/push/{checkout.order.id}?merchant_id=smi-merchant-all-validation\\u0026env=perf\"},\"options\":{},\"order_lines\":[{\"reference\":\"jkwedq9f6t\",\"name\":\"Mediokra Betong Lampa. Tangentbord\",\"type\":\"physical\",\"quantity\":1,\"quantity_unit\":\"kg\",\"unit_price\":16278,\"tax_rate\":800,\"total_amount\":16278,\"total_discount_amount\":0,\"total_tax_amount\":1206,\"product_url\":\"http://aufderharluettgen.info/haven\",\"image_url\":\"https://s3-eu-west-1.amazonaws.com/s3.example.net/my/system-test/images/7.jpg\"}],\"order_amount\":16278,\"order_tax_amount\":1206,\"shipping_countries\":[\"AD\",\"AE\",\"AG\",\"AI\",\"AL\",\"AM\",\"AQ\",\"AR\",\"AS\",\"AT\",\"AU\",\"AW\",\"AX\",\"AZ\",\"BB\",\"BD\",\"BE\",\"BF\",\"BG\",\"BH\",\"BJ\",\"BL\",\"BM\",\"BN\",\"BO\",\"BQ\",\"BR\",\"BS\",\"BT\",\"BV\",\"BW\",\"BZ\",\"CA\",\"CC\",\"CH\",\"CK\",\"CL\",\"CM\",\"CO\",\"CR\",\"CU\",\"CV\",\"CW\",\"CX\",\"CY\",\"CZ\",\"DE\",\"DJ\",\"DK\",\"DM\",\"DO\",\"DZ\",\"EC\",\"EE\",\"EH\",\"ES\",\"ET\",\"FI\",\"FJ\",\"FK\",\"FM\",\"FO\",\"FR\",\"GA\",\"GB\",\"GD\",\"GE\",\"GF\",\"GG\",\"GH\",\"GI\",\"GL\",\"GM\",\"GP\",\"GQ\",\"GR\",\"GS\",\"GT\",\"GU\",\"HK\",\"HM\",\"HN\",\"HR\",\"HU\",\"ID\",\"IE\",\"IL\",\"IM\",\"IN\",\"IO\",\"IS\",\"IT\",\"JE\",\"JM\",\"JO\",\"JP\",\"KE\",\"KG\",\"KH\",\"KI\",\"KM\",\"KN\",\"KR\",\"KW\",\"KY\",\"KZ\",\"LC\",\"LI\",\"LK\",\"LS\",\"LT\",\"LU\",\"LV\",\"MA\",\"MC\",\"ME\",\"MF\",\"MG\",\"MH\",\"MK\",\"ML\",\"MN\",\"MO\",\"MP\",\"MQ\",\"MR\",\"MS\",\"MT\",\"MU\",\"MV\",\"MW\",\"MX\",\"MY\",\"MZ\",\"NA\",\"NC\",\"NE\",\"NF\",\"NG\",\"NI\",\"NL\",\"NO\",\"NP\",\"NR\",\"NU\",\"NZ\",\"OM\",\"PA\",\"PE\",\"PF\",\"PH\",\"PK\",\"PL\",\"PM\",\"PN\",\"PR\",\"PS\",\"PT\",\"PW\",\"PY\",\"QA\",\"RE\",\"RO\",\"RW\",\"SA\",\"SB\",\"SC\",\"SE\",\"SG\",\"SH\",\"SI\",\"SJ\",\"SK\",\"SL\",\"SM\",\"SN\",\"SR\",\"ST\",\"SV\",\"SX\",\"SZ\",\"TC\",\"TD\",\"TF\",\"TG\",\"TH\",\"TJ\",\"TK\",\"TL\",\"TM\",\"TO\",\"TR\",\"TT\",\"TV\",\"TW\",\"TZ\",\"UM\",\"US\",\"UY\",\"UZ\",\"VA\",\"VC\",\"VE\",\"VG\",\"VI\",\"VN\",\"WF\",\"WS\",\"YT\",\"ZA\",\"ZM\"]}",
          "comment": ""
        },
        "headersSize": 365,
        "bodySize": 2042,
        "comment": ""
      },
      "response": {
        "status": 201,
        "statusText": "Created",
        "httpVersion": "HTTP/1.1",
        "cookies": [],
        "headers": [{
          "name": "Cache-Control",
          "value": "max-age=0, no-cache, no-store"
        }, {
          "name": "Content-Type",
          "value": "application/json"
        }, {
          "name": "Date",
          "value": "Mon, 19 Feb 2018 11:40:07 GMT"
        }, {
          "name": "Correlation-Id",
          "value": "ff8b3cca-0477-40cf-9a80-0558f54509f6"
        }, {
          "name": "Location",
          "value": "https://some-host.example.com/checkout/v3/orders/570714bf-3c2b-452e-90cd-f7c5e552bb25"
        }, {
          "name": "Pragma",
          "value": "no-cache"
        }, {
          "name": "Render-Time",
          "value": "1310"
        }, {
          "name": "Server",
          "value": "openresty"
        }, {
          "name": "Strict-Transport-Security",
          "value": "max-age=31536000; includeSubDomains"
        }, {
          "name": "Content-Length",
          "value": "6840"
        }, {
          "name": "Connection",
          "value": "keep-alive"
        }],
        "content": {
          "size": 6840,
          "mimeType": "application/json",
          "text": "{\n  \"order_id\" : \"570714bf-3c2b-452e-90cd-f7c5e552bb25\",\n  \"status\" : \"checkout_incomplete\",\n  \"purchase_country\" : \"se\",\n  \"purchase_currency\" : \"SEK\",\n  \"locale\" : \"sv-SE\",\n  \"billing_address\" : {\n    \"country\" : \"se\"\n  },\n  \"customer\" : { },\n  \"shipping_address\" : {\n    \"country\" : \"se\"\n  },\n  \"order_amount\" : 16278,\n  \"order_tax_amount\" : 1206,\n  \"order_lines\" : [ {\n    \"type\" : \"physical\",\n    \"reference\" : \"jkwedq9f6t\",\n    \"name\" : \"Mediokra Betong Lampa. Tangentbord\",\n    \"quantity\" : 1,\n    \"quantity_unit\" : \"kg\",\n    \"unit_price\" : 16278,\n    \"tax_rate\" : 800,\n    \"total_amount\" : 16278,\n    \"total_discount_amount\" : 0,\n    \"total_tax_amount\" : 1206,\n    \"product_url\" : \"http://aufderharluettgen.info/haven\",\n    \"image_url\" : \"https://s3-eu-west-1.amazonaws.com/s3.example.net/my/system-test/images/7.jpg\"\n  } ],\n  \"merchant_urls\" : {\n    \"terms\" : \"https://some-fourth-host.example.com/v1/redirect/terms\",\n    \"checkout\" : \"https://some-fourth-host.example.com/v1/redirect/checkout\",\n    \"confirmation\" : \"https://some-fourth-host.example.com/v1/redirect/confirm\",\n    \"push\" : \"https://some-fourth-host.example.com/v1/callback/push/{checkout.order.id}?merchant_id=smi-merchant-all-validation&env=perf\"\n  },\n  \"html_snippet\" : \"<div id=\\\"container\\\" style=\\\"overflow-x: hidden;\\\">\\n  <div id=\\\"unsupported-page\\\">\\n  <style type=\\\"text/css\\\">\\n  @-webkit-keyframes FadeIn{from{opacity:0}to{opacity:1}}@-moz-keyframes FadeIn{from{opacity:0}to{opacity:1}}@keyframes FadeIn{from{opacity:0}to{opacity:1}}#unsupported-page{opacity:0;opacity:1\\\\9;-webkit-animation:FadeIn ease-in 1;-moz-animation:FadeIn ease-in 1;animation:FadeIn ease-in 1;-webkit-animation-fill-mode:forwards;-moz-animation-fill-mode:forwards;animation-fill-mode:forwards;-webkit-animation-duration:.1s;-moz-animation-duration:.1s;animation-duration:.1s;-webkit-animation-delay:5s;-moz-animation-delay:5s;animation-delay:5s;text-align:center;padding-top:64px}#unsupported-page .heading{font-family:Source Sans Pro,Helvetica,Arial,sans-serif;line-height:48px;font-weight:200;color:#303030;font-size:42px;margin:24px 0}#unsupported-page .subheading{font-family:Source Sans Pro,Helvetica,Arial,sans-serif;line-height:28px;font-weight:400;color:rgba(0,0,0,.7);font-size:19px;max-width:560px;margin:10px auto}#unsupported-page .subheading a{text-decoration:none;background-color:transparent;border:0;color:rgba(0,0,0,.7);font-weight:600}\\n  </style>\\n  <h1 class=\\\"heading\\\">Oops.</h1>\\n  <p class=\\\"subheading\\\">It seems you might be using an older web browser which is not safe nor compatible with modern web sites. For a smoother checkout experience, please install a <a href=\\\"http://outdatedbrowser.com/en\\\" target=\\\"_blank\\\">newer browser</a>.</p>\\n  <p class=\\\"subheading\\\">Sorry for any inconvenience. For any questions, please contact customer service at <a href=\\\"https://www.example.com\\\">Example.com</a>.</p>\\n  </div>\\n  <script type=\\\"text/javascript\\\">\\n  /* <![CDATA[ */\\n  (function(w,k,i,d,n,c,l){\\n    w[k]=w[k]||function(){(w[k].q=w[k].q||[]).push(arguments)};\\n    l=w[k].config={\\n      container:w.document.getElementById(i),\\n      ORDER_URL:'https://some-other-host.example.com/yaco/orders/570714bf-3c2b-452e-90cd-f7c5e552bb25',\\n      AUTH_HEADER:'Checkout otherStuffz',\\n      LAYOUT:'desktop',\\n      LOCALE:'sv-SE',\\n      ORDER_STATUS:'checkout_incomplete',\\n      MERCHANT_TAC_URI:'https://some-fourth-host.example.com/v1/redirect/terms',\\n      MERCHANT_TAC_TITLE:'SMI Merchant All Validation',\\n      MERCHANT_NAME:'SMI Merchant All Validation',\\n      MERCHANT_COLOR:'',\\n      GUI_OPTIONS:[],\\n      ALLOW_SEPARATE_SHIPPING_ADDRESS:false,\\n      PURCHASE_COUNTRY:'swe',\\n      PURCHASE_CURRENCY:'SEK',\\n      DISALLOW_SKIP_NIN:false,\\n      ANALYTICS:'UA-36053137-1',\\n      TESTDRIVE:false,\\n      CHECKOUT_DOMAIN:'https://some-other-host.example.com',\\n      ASSETS_DOMAIN:'https://checkout.cdn.example.com',\\n      BOOTSTRAP_SRC:'https://checkout2.cdn.example.com/180218-4e2ae24/checkout.bootstrap.js',\\n      PREFILLED:false,\\n      DEVICE_RECOGNITION_URL:'https://some-other-host.example.com/yaco/orders/570714bf-3c2b-452e-90cd-f7c5e552bb25/device_recognition',\\n      CLIENT_EVENT_HOST:'https://really-just-a-fifth-host.example.com',\\n      NEW_CONFIRMATION_PAGE: 'false'\\n    };\\n    n=d.createElement('script');\\n    c=d.getElementById(i);\\n    n.async=!0;\\n    n.src=l.BOOTSTRAP_SRC;\\n    c.appendChild(n);\\n    try{\\n      ((w.Image && (new w.Image))||(d.createElement && d.createElement('img'))||{}).src =\\n        l.CLIENT_EVENT_HOST + '/v1/checkout/snippet/load' +\\n        '?sid=' + l.ORDER_URL.split('/').slice(-1) +\\n        '&order_status=' + w.encodeURIComponent(l.ORDER_STATUS) +\\n        '&timestamp=' + (new Date).getTime();\\n    }catch(e){}\\n  })(this,'_Checkout','container',document);\\n  /* ]]> */\\n  </script>\\n      \\n  <noscript>\\nPlease <a href=\\\"http://enable-javascript.com\\\">enable JavaScript</a>.\\n  </noscript>\\n</div>\",\n  \"started_at\" : \"2018-02-19T11:40:06Z\",\n  \"last_modified_at\" : \"2018-02-19T11:40:06Z\",\n  \"options\" : {\n    \"allow_separate_shipping_address\" : false,\n    \"date_of_birth_mandatory\" : false,\n    \"require_validate_callback_success\" : false\n  },\n  \"external_payment_methods\" : [ ],\n  \"external_checkouts\" : [ ],\n  \"shipping_countries\" : [ \"AD\", \"AE\", \"AG\", \"AI\", \"AL\", \"AM\", \"AQ\", \"AR\", \"AS\", \"AT\", \"AU\", \"AW\", \"AX\", \"AZ\", \"BB\", \"BD\", \"BE\", \"BF\", \"BG\", \"BH\", \"BJ\", \"BL\", \"BM\", \"BN\", \"BO\", \"BQ\", \"BR\", \"BS\", \"BT\", \"BV\", \"BW\", \"BZ\", \"CA\", \"CC\", \"CH\", \"CK\", \"CL\", \"CM\", \"CO\", \"CR\", \"CU\", \"CV\", \"CW\", \"CX\", \"CY\", \"CZ\", \"DE\", \"DJ\", \"DK\", \"DM\", \"DO\", \"DZ\", \"EC\", \"EE\", \"EH\", \"ES\", \"ET\", \"FI\", \"FJ\", \"FK\", \"FM\", \"FO\", \"FR\", \"GA\", \"GB\", \"GD\", \"GE\", \"GF\", \"GG\", \"GH\", \"GI\", \"GL\", \"GM\", \"GP\", \"GQ\", \"GR\", \"GS\", \"GT\", \"GU\", \"HK\", \"HM\", \"HN\", \"HR\", \"HU\", \"ID\", \"IE\", \"IL\", \"IM\", \"IN\", \"IO\", \"IS\", \"IT\", \"JE\", \"JM\", \"JO\", \"JP\", \"KE\", \"KG\", \"KH\", \"KI\", \"KM\", \"KN\", \"KR\", \"KW\", \"KY\", \"KZ\", \"LC\", \"LI\", \"LK\", \"LS\", \"LT\", \"LU\", \"LV\", \"MA\", \"MC\", \"ME\", \"MF\", \"MG\", \"MH\", \"MK\", \"ML\", \"MN\", \"MO\", \"MP\", \"MQ\", \"MR\", \"MS\", \"MT\", \"MU\", \"MV\", \"MW\", \"MX\", \"MY\", \"MZ\", \"NA\", \"NC\", \"NE\", \"NF\", \"NG\", \"NI\", \"NL\", \"NO\", \"NP\", \"NR\", \"NU\", \"NZ\", \"OM\", \"PA\", \"PE\", \"PF\", \"PH\", \"PK\", \"PL\", \"PM\", \"PN\", \"PR\", \"PS\", \"PT\", \"PW\", \"PY\", \"QA\", \"RE\", \"RO\", \"RW\", \"SA\", \"SB\", \"SC\", \"SE\", \"SG\", \"SH\", \"SI\", \"SJ\", \"SK\", \"SL\", \"SM\", \"SN\", \"SR\", \"ST\", \"SV\", \"SX\", \"SZ\", \"TC\", \"TD\", \"TF\", \"TG\", \"TH\", \"TJ\", \"TK\", \"TL\", \"TM\", \"TO\", \"TR\", \"TT\", \"TV\", \"TW\", \"TZ\", \"UM\", \"US\", \"UY\", \"UZ\", \"VA\", \"VC\", \"VE\", \"VG\", \"VI\", \"VN\", \"WF\", \"WS\", \"YT\", \"ZA\", \"ZM\" ]\n}",
          "comment": ""
        },
        "redirectURL": "",
        "headersSize": 482,
        "bodySize": 6840,
        "comment": ""
      },
      "cache": {},
      "timings": {
        "comment": "",
        "dns": 7,
        "connect": 804,
        "send": 39,
        "wait": 1424,
        "receive": 1,
        "blocked": 0,
        "ssl": 743
      },
      "serverIPAddress": "10.225.41.133",
      "comment": "",
      "time": 2276
    }, {
      "pageref": "Page 0",
      "startedDateTime": "2018-02-19T11:40:15.949Z",
      "request": {
        "method": "GET",
        "url": "https://some-host.example.com/checkout/v3/orders/570714bf-3c2b-452e-90cd-f7c5e552bb25",
        "httpVersion": "HTTP/1.1",
        "cookies": [],
        "headers": [{
          "name": "Authorization",
          "value": "Basic stuffz"
        }, {
          "name": "User-Agent",
          "value": "SysTest - perf"
        }, {
          "name": "Accept",
          "value": "application/json; charset=utf-8"
        }, {
          "name": "Content-Type",
          "value": "application/json"
        }, {
          "name": "Accept-Encoding",
          "value": "gzip;q=1.0,deflate;q=0.6,identity;q=0.3"
        }, {
          "name": "Host",
          "value": "some-host.example.com"
        }],
        "queryString": [],
        "headersSize": 379,
        "bodySize": 0,
        "comment": ""
      },
      "response": {
        "status": 200,
        "statusText": "OK",
        "httpVersion": "HTTP/1.1",
        "cookies": [],
        "headers": [{
          "name": "Cache-Control",
          "value": "max-age=0, no-cache, no-store"
        }, {
          "name": "Content-Encoding",
          "value": "gzip"
        }, {
          "name": "Content-Type",
          "value": "application/json"
        }, {
          "name": "Date",
          "value": "Mon, 19 Feb 2018 11:40:08 GMT"
        }, {
          "name": "Correlation-Id",
          "value": "ab776e1a-2ddf-42f1-8ab6-d31987d8f7e6"
        }, {
          "name": "Pragma",
          "value": "no-cache"
        }, {
          "name": "Render-Time",
          "value": "11"
        }, {
          "name": "Server",
          "value": "openresty"
        }, {
          "name": "Strict-Transport-Security",
          "value": "max-age=31536000; includeSubDomains"
        }, {
          "name": "Vary",
          "value": "Accept-Encoding"
        }, {
          "name": "Content-Length",
          "value": "2822"
        }, {
          "name": "Connection",
          "value": "keep-alive"
        }],
        "content": {
          "size": 6840,
          "mimeType": "application/json",
          "text": "{\n  \"order_id\" : \"570714bf-3c2b-452e-90cd-f7c5e552bb25\",\n  \"status\" : \"checkout_incomplete\",\n  \"purchase_country\" : \"se\",\n  \"purchase_currency\" : \"SEK\",\n  \"locale\" : \"sv-SE\",\n  \"billing_address\" : {\n    \"country\" : \"se\"\n  },\n  \"customer\" : { },\n  \"shipping_address\" : {\n    \"country\" : \"se\"\n  },\n  \"order_amount\" : 16278,\n  \"order_tax_amount\" : 1206,\n  \"order_lines\" : [ {\n    \"type\" : \"physical\",\n    \"reference\" : \"jkwedq9f6t\",\n    \"name\" : \"Mediokra Betong Lampa. Tangentbord\",\n    \"quantity\" : 1,\n    \"quantity_unit\" : \"kg\",\n    \"unit_price\" : 16278,\n    \"tax_rate\" : 800,\n    \"total_amount\" : 16278,\n    \"total_discount_amount\" : 0,\n    \"total_tax_amount\" : 1206,\n    \"product_url\" : \"http://aufderharluettgen.info/haven\",\n    \"image_url\" : \"https://s3-eu-west-1.amazonaws.com/s3.example.net/my/system-test/images/7.jpg\"\n  } ],\n  \"merchant_urls\" : {\n    \"terms\" : \"https://some-fourth-host.example.com/v1/redirect/terms\",\n    \"checkout\" : \"https://some-fourth-host.example.com/v1/redirect/checkout\",\n    \"confirmation\" : \"https://some-fourth-host.example.com/v1/redirect/confirm\",\n    \"push\" : \"https://some-fourth-host.example.com/v1/callback/push/{checkout.order.id}?merchant_id=smi-merchant-all-validation&env=perf\"\n  },\n  \"html_snippet\" : \"<div id=\\\"container\\\" style=\\\"overflow-x: hidden;\\\">\\n  <div id=\\\"unsupported-page\\\">\\n  <style type=\\\"text/css\\\">\\n  @-webkit-keyframes FadeIn{from{opacity:0}to{opacity:1}}@-moz-keyframes FadeIn{from{opacity:0}to{opacity:1}}@keyframes FadeIn{from{opacity:0}to{opacity:1}}#unsupported-page{opacity:0;opacity:1\\\\9;-webkit-animation:FadeIn ease-in 1;-moz-animation:FadeIn ease-in 1;animation:FadeIn ease-in 1;-webkit-animation-fill-mode:forwards;-moz-animation-fill-mode:forwards;animation-fill-mode:forwards;-webkit-animation-duration:.1s;-moz-animation-duration:.1s;animation-duration:.1s;-webkit-animation-delay:5s;-moz-animation-delay:5s;animation-delay:5s;text-align:center;padding-top:64px}#unsupported-page .heading{font-family:Source Sans Pro,Helvetica,Arial,sans-serif;line-height:48px;font-weight:200;color:#303030;font-size:42px;margin:24px 0}#unsupported-page .subheading{font-family:Source Sans Pro,Helvetica,Arial,sans-serif;line-height:28px;font-weight:400;color:rgba(0,0,0,.7);font-size:19px;max-width:560px;margin:10px auto}#unsupported-page .subheading a{text-decoration:none;background-color:transparent;border:0;color:rgba(0,0,0,.7);font-weight:600}\\n  </style>\\n  <h1 class=\\\"heading\\\">Oops.</h1>\\n  <p class=\\\"subheading\\\">It seems you might be using an older web browser which is not safe nor compatible with modern web sites. For a smoother checkout experience, please install a <a href=\\\"http://outdatedbrowser.com/en\\\" target=\\\"_blank\\\">newer browser</a>.</p>\\n  <p class=\\\"subheading\\\">Sorry for any inconvenience. For any questions, please contact customer service at <a href=\\\"https://www.example.com\\\">Example.com</a>.</p>\\n  </div>\\n  <script type=\\\"text/javascript\\\">\\n  /* <![CDATA[ */\\n  (function(w,k,i,d,n,c,l){\\n    w[k]=w[k]||function(){(w[k].q=w[k].q||[]).push(arguments)};\\n    l=w[k].config={\\n      container:w.document.getElementById(i),\\n      ORDER_URL:'https://some-other-host.example.com/yaco/orders/570714bf-3c2b-452e-90cd-f7c5e552bb25',\\n      AUTH_HEADER:'Checkout otherStuffz',\\n      LAYOUT:'desktop',\\n      LOCALE:'sv-SE',\\n      ORDER_STATUS:'checkout_incomplete',\\n      MERCHANT_TAC_URI:'https://some-fourth-host.example.com/v1/redirect/terms',\\n      MERCHANT_TAC_TITLE:'SMI Merchant All Validation',\\n      MERCHANT_NAME:'SMI Merchant All Validation',\\n      MERCHANT_COLOR:'',\\n      GUI_OPTIONS:[],\\n      ALLOW_SEPARATE_SHIPPING_ADDRESS:false,\\n      PURCHASE_COUNTRY:'swe',\\n      PURCHASE_CURRENCY:'SEK',\\n      DISALLOW_SKIP_NIN:false,\\n      ANALYTICS:'UA-36053137-1',\\n      TESTDRIVE:false,\\n      CHECKOUT_DOMAIN:'https://some-other-host.example.com',\\n      ASSETS_DOMAIN:'https://checkout.cdn.example.com',\\n      BOOTSTRAP_SRC:'https://checkout2.cdn.example.com/180218-4e2ae24/checkout.bootstrap.js',\\n      PREFILLED:false,\\n      DEVICE_RECOGNITION_URL:'https://some-other-host.example.com/yaco/orders/570714bf-3c2b-452e-90cd-f7c5e552bb25/device_recognition',\\n      CLIENT_EVENT_HOST:'https://really-just-a-fifth-host.example.com',\\n      NEW_CONFIRMATION_PAGE: 'false'\\n    };\\n    n=d.createElement('script');\\n    c=d.getElementById(i);\\n    n.async=!0;\\n    n.src=l.BOOTSTRAP_SRC;\\n    c.appendChild(n);\\n    try{\\n      ((w.Image && (new w.Image))||(d.createElement && d.createElement('img'))||{}).src =\\n        l.CLIENT_EVENT_HOST + '/v1/checkout/snippet/load' +\\n        '?sid=' + l.ORDER_URL.split('/').slice(-1) +\\n        '&order_status=' + w.encodeURIComponent(l.ORDER_STATUS) +\\n        '&timestamp=' + (new Date).getTime();\\n    }catch(e){}\\n  })(this,'_Checkout','container',document);\\n  /* ]]> */\\n  </script>\\n      \\n  <noscript>\\nPlease <a href=\\\"http://enable-javascript.com\\\">enable JavaScript</a>.\\n  </noscript>\\n</div>\",\n  \"started_at\" : \"2018-02-19T11:40:06Z\",\n  \"last_modified_at\" : \"2018-02-19T11:40:06Z\",\n  \"options\" : {\n    \"allow_separate_shipping_address\" : false,\n    \"date_of_birth_mandatory\" : false,\n    \"require_validate_callback_success\" : false\n  },\n  \"external_payment_methods\" : [ ],\n  \"external_checkouts\" : [ ],\n  \"shipping_countries\" : [ \"AD\", \"AE\", \"AG\", \"AI\", \"AL\", \"AM\", \"AQ\", \"AR\", \"AS\", \"AT\", \"AU\", \"AW\", \"AX\", \"AZ\", \"BB\", \"BD\", \"BE\", \"BF\", \"BG\", \"BH\", \"BJ\", \"BL\", \"BM\", \"BN\", \"BO\", \"BQ\", \"BR\", \"BS\", \"BT\", \"BV\", \"BW\", \"BZ\", \"CA\", \"CC\", \"CH\", \"CK\", \"CL\", \"CM\", \"CO\", \"CR\", \"CU\", \"CV\", \"CW\", \"CX\", \"CY\", \"CZ\", \"DE\", \"DJ\", \"DK\", \"DM\", \"DO\", \"DZ\", \"EC\", \"EE\", \"EH\", \"ES\", \"ET\", \"FI\", \"FJ\", \"FK\", \"FM\", \"FO\", \"FR\", \"GA\", \"GB\", \"GD\", \"GE\", \"GF\", \"GG\", \"GH\", \"GI\", \"GL\", \"GM\", \"GP\", \"GQ\", \"GR\", \"GS\", \"GT\", \"GU\", \"HK\", \"HM\", \"HN\", \"HR\", \"HU\", \"ID\", \"IE\", \"IL\", \"IM\", \"IN\", \"IO\", \"IS\", \"IT\", \"JE\", \"JM\", \"JO\", \"JP\", \"KE\", \"KG\", \"KH\", \"KI\", \"KM\", \"KN\", \"KR\", \"KW\", \"KY\", \"KZ\", \"LC\", \"LI\", \"LK\", \"LS\", \"LT\", \"LU\", \"LV\", \"MA\", \"MC\", \"ME\", \"MF\", \"MG\", \"MH\", \"MK\", \"ML\", \"MN\", \"MO\", \"MP\", \"MQ\", \"MR\", \"MS\", \"MT\", \"MU\", \"MV\", \"MW\", \"MX\", \"MY\", \"MZ\", \"NA\", \"NC\", \"NE\", \"NF\", \"NG\", \"NI\", \"NL\", \"NO\", \"NP\", \"NR\", \"NU\", \"NZ\", \"OM\", \"PA\", \"PE\", \"PF\", \"PH\", \"PK\", \"PL\", \"PM\", \"PN\", \"PR\", \"PS\", \"PT\", \"PW\", \"PY\", \"QA\", \"RE\", \"RO\", \"RW\", \"SA\", \"SB\", \"SC\", \"SE\", \"SG\", \"SH\", \"SI\", \"SJ\", \"SK\", \"SL\", \"SM\", \"SN\", \"SR\", \"ST\", \"SV\", \"SX\", \"SZ\", \"TC\", \"TD\", \"TF\", \"TG\", \"TH\", \"TJ\", \"TK\", \"TL\", \"TM\", \"TO\", \"TR\", \"TT\", \"TV\", \"TW\", \"TZ\", \"UM\", \"US\", \"UY\", \"UZ\", \"VA\", \"VC\", \"VE\", \"VG\", \"VI\", \"VN\", \"WF\", \"WS\", \"YT\", \"ZA\", \"ZM\" ]\n}",
          "comment": ""
        },
        "redirectURL": "",
        "headersSize": 408,
        "bodySize": 2822,
        "comment": ""
      },
      "cache": {},
      "timings": {
        "comment": "",
        "dns": 0,
        "connect": 126,
        "send": 1,
        "wait": 114,
        "receive": 3,
        "blocked": 0,
        "ssl": 83
      },
      "serverIPAddress": "10.225.41.133",
      "comment": "",
      "time": 246
    }, {
      "pageref": "Page 0",
      "startedDateTime": "2018-02-19T11:40:16.647Z",
      "request": {
        "method": "GET",
        "url": "https://some-other-host.example.com/yaco/orders/570714bf-3c2b-452e-90cd-f7c5e552bb25",
        "httpVersion": "HTTP/1.1",
        "cookies": [],
        "headers": [{
          "name": "Authorization",
          "value": "Checkout otherStuffz"
        }, {
          "name": "User-Agent",
          "value": "SysTest - perf"
        }, {
          "name": "Accept",
          "value": "application/vnd.checkout.server-order-v1+json"
        }, {
          "name": "Content-Type",
          "value": "application/vnd.checkout.client-order-v1+json"
        }, {
          "name": "Accept-Encoding",
          "value": "gzip;q=1.0,deflate;q=0.6,identity;q=0.3"
        }, {
          "name": "Host",
          "value": "some-other-host.example.com"
        }],
        "queryString": [],
        "headersSize": 387,
        "bodySize": 0,
        "comment": ""
      },
      "response": {
        "status": 200,
        "statusText": "OK",
        "httpVersion": "HTTP/1.1",
        "cookies": [],
        "headers": [{
          "name": "Cache-Control",
          "value": "max-age=0, no-cache, no-store"
        }, {
          "name": "Content-Encoding",
          "value": "gzip"
        }, {
          "name": "Content-Type",
          "value": "application/vnd.checkout.server-order-v1+json"
        }, {
          "name": "Date",
          "value": "Mon, 19 Feb 2018 11:40:09 GMT"
        }, {
          "name": "Correlation-Id",
          "value": "a84e5613-526c-4047-be4a-05eed9c6019a"
        }, {
          "name": "Pragma",
          "value": "no-cache"
        }, {
          "name": "Render-Time",
          "value": "451"
        }, {
          "name": "Server",
          "value": "openresty"
        }, {
          "name": "Strict-Transport-Security",
          "value": "max-age=31536000; includeSubDomains"
        }, {
          "name": "Vary",
          "value": "Accept-Encoding"
        }, {
          "name": "Content-Length",
          "value": "1478"
        }, {
          "name": "Connection",
          "value": "keep-alive"
        }],
        "content": {
          "size": 5167,
          "mimeType": "application/vnd.checkout.server-order-v1+json",
          "text": "{\n  \"shared\" : {\n    \"challenge\" : {\n      \"country\" : \"swe\"\n    },\n    \"billing_address\" : {\n      \"country\" : \"swe\"\n    },\n    \"customer\" : {\n      \"type\" : \"person\"\n    },\n    \"language\" : \"sv\",\n    \"currency\" : \"SEK\"\n  },\n  \"cart\" : {\n    \"total_tax_amount\" : 1206,\n    \"total_price_including_tax\" : 16278,\n    \"total_price_excluding_tax\" : 15072,\n    \"total_shipping_amount_excluding_tax\" : 0,\n    \"total_surcharge_amount_excluding_tax\" : 0,\n    \"total_discount_amount_excluding_tax\" : 0,\n    \"subtotal\" : 15072,\n    \"total_store_credit\" : 0,\n    \"items\" : [ {\n      \"type\" : \"physical\",\n      \"reference\" : \"jkwedq9f6t\",\n      \"name\" : \"Mediokra Betong Lampa. Tangentbord\",\n      \"quantity\" : 1,\n      \"unit_price\" : 16278,\n      \"total_tax_amount\" : 1206,\n      \"tax_rate\" : 800,\n      \"total_price_including_tax\" : 16278,\n      \"total_price_excluding_tax\" : 15072,\n      \"product_url\" : \"http://aufderharluettgen.info/haven\",\n      \"image_url\" : \"https://s3-eu-west-1.amazonaws.com/s3.example.net/my/system-test/images/7.jpg\"\n    } ]\n  },\n  \"required_fields\" : [ \"challenge.email\", \"challenge.postal_code\" ],\n  \"options\" : {\n    \"allow_separate_shipping_address\" : false,\n    \"date_of_birth_mandatory\" : false,\n    \"national_identification_number_mandatory\" : false,\n    \"allowed_customer_types\" : [ \"person\" ],\n    \"payment_selector_on_load\" : false\n  },\n  \"preview_payment_methods\" : [ {\n    \"id\" : \"-1\",\n    \"type\" : \"invoice\",\n    \"data\" : {\n      \"days\" : 14\n    }\n  }, {\n    \"id\" : \"-1\",\n    \"type\" : \"credit_card\",\n    \"data\" : {\n      \"available_cards\" : [ \"VISA\", \"MASTER\" ],\n      \"allow_saved_card\" : false,\n      \"do_save_card\" : false\n    }\n  } ],\n  \"allowed_billing_countries\" : [ \"and\", \"are\", \"atg\", \"aia\", \"alb\", \"arm\", \"ata\", \"arg\", \"asm\", \"aut\", \"aus\", \"abw\", \"ala\", \"aze\", \"brb\", \"bgd\", \"bel\", \"bfa\", \"bgr\", \"bhr\", \"ben\", \"blm\", \"bmu\", \"brn\", \"bol\", \"bes\", \"bra\", \"bhs\", \"btn\", \"bvt\", \"bwa\", \"blz\", \"can\", \"cck\", \"che\", \"cok\", \"chl\", \"cmr\", \"col\", \"cri\", \"cub\", \"cpv\", \"cuw\", \"cxr\", \"cyp\", \"cze\", \"deu\", \"dji\", \"dnk\", \"dma\", \"dom\", \"dza\", \"ecu\", \"est\", \"esh\", \"esp\", \"eth\", \"fin\", \"fji\", \"flk\", \"fsm\", \"fro\", \"fra\", \"gab\", \"gbr\", \"grd\", \"geo\", \"guf\", \"ggy\", \"gha\", \"gib\", \"grl\", \"gmb\", \"glp\", \"gnq\", \"grc\", \"sgs\", \"gtm\", \"gum\", \"hkg\", \"hmd\", \"hnd\", \"hrv\", \"hun\", \"idn\", \"irl\", \"isr\", \"imn\", \"ind\", \"iot\", \"isl\", \"ita\", \"jey\", \"jam\", \"jor\", \"jpn\", \"ken\", \"kgz\", \"khm\", \"kir\", \"com\", \"kna\", \"kor\", \"kwt\", \"cym\", \"kaz\", \"lca\", \"lie\", \"lka\", \"lso\", \"ltu\", \"lux\", \"lva\", \"mar\", \"mco\", \"mne\", \"maf\", \"mdg\", \"mhl\", \"mkd\", \"mli\", \"mng\", \"mac\", \"mnp\", \"mtq\", \"mrt\", \"msr\", \"mlt\", \"mus\", \"mdv\", \"mwi\", \"mex\", \"mys\", \"moz\", \"nam\", \"ncl\", \"ner\", \"nfk\", \"nga\", \"nic\", \"nld\", \"nor\", \"npl\", \"nru\", \"niu\", \"nzl\", \"omn\", \"pan\", \"per\", \"pyf\", \"phl\", \"pak\", \"pol\", \"spm\", \"pcn\", \"pri\", \"pse\", \"prt\", \"plw\", \"pry\", \"qat\", \"reu\", \"rou\", \"rwa\", \"sau\", \"slb\", \"syc\", \"swe\", \"sgp\", \"shn\", \"svn\", \"sjm\", \"svk\", \"sle\", \"smr\", \"sen\", \"sur\", \"stp\", \"slv\", \"sxm\", \"swz\", \"tca\", \"tcd\", \"atf\", \"tgo\", \"tha\", \"tjk\", \"tkl\", \"tls\", \"tkm\", \"ton\", \"tur\", \"tto\", \"tuv\", \"twn\", \"tza\", \"umi\", \"usa\", \"ury\", \"uzb\", \"vat\", \"vct\", \"ven\", \"vgb\", \"vir\", \"vnm\", \"wlf\", \"wsm\", \"myt\", \"zaf\", \"zmb\" ],\n  \"allowed_shipping_countries\" : [ \"and\", \"are\", \"atg\", \"aia\", \"alb\", \"arm\", \"ata\", \"arg\", \"asm\", \"aut\", \"aus\", \"abw\", \"ala\", \"aze\", \"brb\", \"bgd\", \"bel\", \"bfa\", \"bgr\", \"bhr\", \"ben\", \"blm\", \"bmu\", \"brn\", \"bol\", \"bes\", \"bra\", \"bhs\", \"btn\", \"bvt\", \"bwa\", \"blz\", \"can\", \"cck\", \"che\", \"cok\", \"chl\", \"cmr\", \"col\", \"cri\", \"cub\", \"cpv\", \"cuw\", \"cxr\", \"cyp\", \"cze\", \"deu\", \"dji\", \"dnk\", \"dma\", \"dom\", \"dza\", \"ecu\", \"est\", \"esh\", \"esp\", \"eth\", \"fin\", \"fji\", \"flk\", \"fsm\", \"fro\", \"fra\", \"gab\", \"gbr\", \"grd\", \"geo\", \"guf\", \"ggy\", \"gha\", \"gib\", \"grl\", \"gmb\", \"glp\", \"gnq\", \"grc\", \"sgs\", \"gtm\", \"gum\", \"hkg\", \"hmd\", \"hnd\", \"hrv\", \"hun\", \"idn\", \"irl\", \"isr\", \"imn\", \"ind\", \"iot\", \"isl\", \"ita\", \"jey\", \"jam\", \"jor\", \"jpn\", \"ken\", \"kgz\", \"khm\", \"kir\", \"com\", \"kna\", \"kor\", \"kwt\", \"cym\", \"kaz\", \"lca\", \"lie\", \"lka\", \"lso\", \"ltu\", \"lux\", \"lva\", \"mar\", \"mco\", \"mne\", \"maf\", \"mdg\", \"mhl\", \"mkd\", \"mli\", \"mng\", \"mac\", \"mnp\", \"mtq\", \"mrt\", \"msr\", \"mlt\", \"mus\", \"mdv\", \"mwi\", \"mex\", \"mys\", \"moz\", \"nam\", \"ncl\", \"ner\", \"nfk\", \"nga\", \"nic\", \"nld\", \"nor\", \"npl\", \"nru\", \"niu\", \"nzl\", \"omn\", \"pan\", \"per\", \"pyf\", \"phl\", \"pak\", \"pol\", \"spm\", \"pcn\", \"pri\", \"pse\", \"prt\", \"plw\", \"pry\", \"qat\", \"reu\", \"rou\", \"rwa\", \"sau\", \"slb\", \"syc\", \"swe\", \"sgp\", \"shn\", \"svn\", \"sjm\", \"svk\", \"sle\", \"smr\", \"sen\", \"sur\", \"stp\", \"slv\", \"sxm\", \"swz\", \"tca\", \"tcd\", \"atf\", \"tgo\", \"tha\", \"tjk\", \"tkl\", \"tls\", \"tkm\", \"ton\", \"tur\", \"tto\", \"tuv\", \"twn\", \"tza\", \"umi\", \"usa\", \"ury\", \"uzb\", \"vat\", \"vct\", \"ven\", \"vgb\", \"vir\", \"vnm\", \"wlf\", \"wsm\", \"myt\", \"zaf\", \"zmb\" ],\n  \"status\" : {\n    \"prescreened\" : false,\n    \"require_terms_consent\" : true\n  },\n  \"merchant_urls\" : {\n    \"checkout\" : \"https://some-fourth-host.example.com/v1/redirect/checkout\",\n    \"confirmation\" : \"https://some-other-host.example.com/yaco/orders/570714bf-3c2b-452e-90cd-f7c5e552bb25/redirect?auth_token=otherStuffz\",\n    \"terms\" : \"https://some-fourth-host.example.com/v1/redirect/terms\"\n  }\n}",
          "comment": ""
        },
        "redirectURL": "",
        "headersSize": 445,
        "bodySize": 1478,
        "comment": ""
      },
      "cache": {},
      "timings": {
        "comment": "",
        "dns": 7,
        "connect": 544,
        "send": 1,
        "wait": 698,
        "receive": 1,
        "blocked": 0,
        "ssl": 499
      },
      "serverIPAddress": "10.225.41.52",
      "comment": "",
      "time": 1254
    }, {
      "pageref": "Page 0",
      "startedDateTime": "2018-02-19T11:40:17.478Z",
      "request": {
        "method": "POST",
        "url": "https://some-other-host.example.com/yaco/orders/570714bf-3c2b-452e-90cd-f7c5e552bb25",
        "httpVersion": "HTTP/1.1",
        "cookies": [],
        "headers": [{
          "name": "Authorization",
          "value": "Checkout otherStuffz"
        }, {
          "name": "User-Agent",
          "value": "SysTest - perf"
        }, {
          "name": "Content-Type",
          "value": "application/vnd.checkout.client-order-v1+json"
        }, {
          "name": "Accept",
          "value": "application/vnd.checkout.server-order-v1+json"
        }, {
          "name": "Accept-Encoding",
          "value": "gzip;q=1.0,deflate;q=0.6,identity;q=0.3"
        }, {
          "name": "Host",
          "value": "some-other-host.example.com"
        }, {
          "name": "Content-Length",
          "value": "4351"
        }],
        "queryString": [],
        "postData": {
          "mimeType": "application/vnd.checkout.client-order-v1+json",
          "text": "{\"shared\":{\"challenge\":{\"country\":\"swe\",\"email\":\"drop+b28643c0e7c74da6b6ff2f4131aa3d64+d0+gr@example.com\",\"postal_code\":\"10066\"},\"billing_address\":{\"country\":\"swe\"},\"customer\":{\"type\":\"person\"},\"language\":\"sv\",\"currency\":\"SEK\"},\"cart\":{\"total_tax_amount\":1206,\"total_price_including_tax\":16278,\"total_price_excluding_tax\":15072,\"total_shipping_amount_excluding_tax\":0,\"total_surcharge_amount_excluding_tax\":0,\"total_discount_amount_excluding_tax\":0,\"subtotal\":15072,\"total_store_credit\":0,\"items\":[{\"type\":\"physical\",\"reference\":\"jkwedq9f6t\",\"name\":\"Mediokra Betong Lampa. Tangentbord\",\"quantity\":1,\"unit_price\":16278,\"total_tax_amount\":1206,\"tax_rate\":800,\"total_price_including_tax\":16278,\"total_price_excluding_tax\":15072,\"product_url\":\"http://aufderharluettgen.info/haven\",\"image_url\":\"https://s3-eu-west-1.amazonaws.com/s3.example.net/my/system-test/images/7.jpg\"}]},\"required_fields\":[\"challenge.email\",\"challenge.postal_code\"],\"options\":{\"allow_separate_shipping_address\":false,\"date_of_birth_mandatory\":false,\"national_identification_number_mandatory\":false,\"allowed_customer_types\":[\"person\"],\"payment_selector_on_load\":false},\"preview_payment_methods\":[{\"id\":\"-1\",\"type\":\"invoice\",\"data\":{\"days\":14}},{\"id\":\"-1\",\"type\":\"credit_card\",\"data\":{\"available_cards\":[\"VISA\",\"MASTER\"],\"allow_saved_card\":false,\"do_save_card\":false}}],\"allowed_billing_countries\":[\"and\",\"are\",\"atg\",\"aia\",\"alb\",\"arm\",\"ata\",\"arg\",\"asm\",\"aut\",\"aus\",\"abw\",\"ala\",\"aze\",\"brb\",\"bgd\",\"bel\",\"bfa\",\"bgr\",\"bhr\",\"ben\",\"blm\",\"bmu\",\"brn\",\"bol\",\"bes\",\"bra\",\"bhs\",\"btn\",\"bvt\",\"bwa\",\"blz\",\"can\",\"cck\",\"che\",\"cok\",\"chl\",\"cmr\",\"col\",\"cri\",\"cub\",\"cpv\",\"cuw\",\"cxr\",\"cyp\",\"cze\",\"deu\",\"dji\",\"dnk\",\"dma\",\"dom\",\"dza\",\"ecu\",\"est\",\"esh\",\"esp\",\"eth\",\"fin\",\"fji\",\"flk\",\"fsm\",\"fro\",\"fra\",\"gab\",\"gbr\",\"grd\",\"geo\",\"guf\",\"ggy\",\"gha\",\"gib\",\"grl\",\"gmb\",\"glp\",\"gnq\",\"grc\",\"sgs\",\"gtm\",\"gum\",\"hkg\",\"hmd\",\"hnd\",\"hrv\",\"hun\",\"idn\",\"irl\",\"isr\",\"imn\",\"ind\",\"iot\",\"isl\",\"ita\",\"jey\",\"jam\",\"jor\",\"jpn\",\"ken\",\"kgz\",\"khm\",\"kir\",\"com\",\"kna\",\"kor\",\"kwt\",\"cym\",\"kaz\",\"lca\",\"lie\",\"lka\",\"lso\",\"ltu\",\"lux\",\"lva\",\"mar\",\"mco\",\"mne\",\"maf\",\"mdg\",\"mhl\",\"mkd\",\"mli\",\"mng\",\"mac\",\"mnp\",\"mtq\",\"mrt\",\"msr\",\"mlt\",\"mus\",\"mdv\",\"mwi\",\"mex\",\"mys\",\"moz\",\"nam\",\"ncl\",\"ner\",\"nfk\",\"nga\",\"nic\",\"nld\",\"nor\",\"npl\",\"nru\",\"niu\",\"nzl\",\"omn\",\"pan\",\"per\",\"pyf\",\"phl\",\"pak\",\"pol\",\"spm\",\"pcn\",\"pri\",\"pse\",\"prt\",\"plw\",\"pry\",\"qat\",\"reu\",\"rou\",\"rwa\",\"sau\",\"slb\",\"syc\",\"swe\",\"sgp\",\"shn\",\"svn\",\"sjm\",\"svk\",\"sle\",\"smr\",\"sen\",\"sur\",\"stp\",\"slv\",\"sxm\",\"swz\",\"tca\",\"tcd\",\"atf\",\"tgo\",\"tha\",\"tjk\",\"tkl\",\"tls\",\"tkm\",\"ton\",\"tur\",\"tto\",\"tuv\",\"twn\",\"tza\",\"umi\",\"usa\",\"ury\",\"uzb\",\"vat\",\"vct\",\"ven\",\"vgb\",\"vir\",\"vnm\",\"wlf\",\"wsm\",\"myt\",\"zaf\",\"zmb\"],\"allowed_shipping_countries\":[\"and\",\"are\",\"atg\",\"aia\",\"alb\",\"arm\",\"ata\",\"arg\",\"asm\",\"aut\",\"aus\",\"abw\",\"ala\",\"aze\",\"brb\",\"bgd\",\"bel\",\"bfa\",\"bgr\",\"bhr\",\"ben\",\"blm\",\"bmu\",\"brn\",\"bol\",\"bes\",\"bra\",\"bhs\",\"btn\",\"bvt\",\"bwa\",\"blz\",\"can\",\"cck\",\"che\",\"cok\",\"chl\",\"cmr\",\"col\",\"cri\",\"cub\",\"cpv\",\"cuw\",\"cxr\",\"cyp\",\"cze\",\"deu\",\"dji\",\"dnk\",\"dma\",\"dom\",\"dza\",\"ecu\",\"est\",\"esh\",\"esp\",\"eth\",\"fin\",\"fji\",\"flk\",\"fsm\",\"fro\",\"fra\",\"gab\",\"gbr\",\"grd\",\"geo\",\"guf\",\"ggy\",\"gha\",\"gib\",\"grl\",\"gmb\",\"glp\",\"gnq\",\"grc\",\"sgs\",\"gtm\",\"gum\",\"hkg\",\"hmd\",\"hnd\",\"hrv\",\"hun\",\"idn\",\"irl\",\"isr\",\"imn\",\"ind\",\"iot\",\"isl\",\"ita\",\"jey\",\"jam\",\"jor\",\"jpn\",\"ken\",\"kgz\",\"khm\",\"kir\",\"com\",\"kna\",\"kor\",\"kwt\",\"cym\",\"kaz\",\"lca\",\"lie\",\"lka\",\"lso\",\"ltu\",\"lux\",\"lva\",\"mar\",\"mco\",\"mne\",\"maf\",\"mdg\",\"mhl\",\"mkd\",\"mli\",\"mng\",\"mac\",\"mnp\",\"mtq\",\"mrt\",\"msr\",\"mlt\",\"mus\",\"mdv\",\"mwi\",\"mex\",\"mys\",\"moz\",\"nam\",\"ncl\",\"ner\",\"nfk\",\"nga\",\"nic\",\"nld\",\"nor\",\"npl\",\"nru\",\"niu\",\"nzl\",\"omn\",\"pan\",\"per\",\"pyf\",\"phl\",\"pak\",\"pol\",\"spm\",\"pcn\",\"pri\",\"pse\",\"prt\",\"plw\",\"pry\",\"qat\",\"reu\",\"rou\",\"rwa\",\"sau\",\"slb\",\"syc\",\"swe\",\"sgp\",\"shn\",\"svn\",\"sjm\",\"svk\",\"sle\",\"smr\",\"sen\",\"sur\",\"stp\",\"slv\",\"sxm\",\"swz\",\"tca\",\"tcd\",\"atf\",\"tgo\",\"tha\",\"tjk\",\"tkl\",\"tls\",\"tkm\",\"ton\",\"tur\",\"tto\",\"tuv\",\"twn\",\"tza\",\"umi\",\"usa\",\"ury\",\"uzb\",\"vat\",\"vct\",\"ven\",\"vgb\",\"vir\",\"vnm\",\"wlf\",\"wsm\",\"myt\",\"zaf\",\"zmb\"],\"status\":{\"prescreened\":false,\"require_terms_consent\":true},\"merchant_urls\":{\"checkout\":\"https://some-fourth-host.example.com/v1/redirect/checkout\",\"confirmation\":\"https://some-other-host.example.com/yaco/orders/570714bf-3c2b-452e-90cd-f7c5e552bb25/redirect?auth_token=otherStuffz\",\"terms\":\"https://some-fourth-host.example.com/v1/redirect/terms\"}}",
          "comment": ""
        },
        "headersSize": 410,
        "bodySize": 4351,
        "comment": ""
      },
      "response": {
        "status": 200,
        "statusText": "OK",
        "httpVersion": "HTTP/1.1",
        "cookies": [],
        "headers": [{
          "name": "Cache-Control",
          "value": "max-age=0, no-cache, no-store"
        }, {
          "name": "Content-Encoding",
          "value": "gzip"
        }, {
          "name": "Content-Type",
          "value": "application/vnd.checkout.server-order-v1+json"
        }, {
          "name": "Date",
          "value": "Mon, 19 Feb 2018 11:40:09 GMT"
        }, {
          "name": "Correlation-Id",
          "value": "f6df29e7-f850-4c36-81fc-11def2f44b81"
        }, {
          "name": "Pragma",
          "value": "no-cache"
        }, {
          "name": "Render-Time",
          "value": "129"
        }, {
          "name": "Server",
          "value": "openresty"
        }, {
          "name": "Strict-Transport-Security",
          "value": "max-age=31536000; includeSubDomains"
        }, {
          "name": "Vary",
          "value": "Accept-Encoding"
        }, {
          "name": "Content-Length",
          "value": "1636"
        }, {
          "name": "Connection",
          "value": "keep-alive"
        }],
        "content": {
          "size": 5598,
          "mimeType": "application/vnd.checkout.server-order-v1+json",
          "text": "{\n  \"shared\" : {\n    \"challenge\" : {\n      \"email\" : \"drop+b28643c0e7c74da6b6ff2f4131aa3d64+d0+gr@example.com\",\n      \"postal_code\" : \"10066\",\n      \"country\" : \"swe\"\n    },\n    \"billing_address\" : {\n      \"email\" : \"drop+b28643c0e7c74da6b6ff2f4131aa3d64+d0+gr@example.com\",\n      \"postal_code\" : \"10066\",\n      \"country\" : \"swe\"\n    },\n    \"customer\" : {\n      \"type\" : \"person\"\n    },\n    \"language\" : \"sv\",\n    \"currency\" : \"SEK\"\n  },\n  \"cart\" : {\n    \"total_tax_amount\" : 1206,\n    \"total_price_including_tax\" : 16278,\n    \"total_price_excluding_tax\" : 15072,\n    \"total_shipping_amount_excluding_tax\" : 0,\n    \"total_surcharge_amount_excluding_tax\" : 0,\n    \"total_discount_amount_excluding_tax\" : 0,\n    \"subtotal\" : 15072,\n    \"total_store_credit\" : 0,\n    \"items\" : [ {\n      \"type\" : \"physical\",\n      \"reference\" : \"jkwedq9f6t\",\n      \"name\" : \"Mediokra Betong Lampa. Tangentbord\",\n      \"quantity\" : 1,\n      \"unit_price\" : 16278,\n      \"total_tax_amount\" : 1206,\n      \"tax_rate\" : 800,\n      \"total_price_including_tax\" : 16278,\n      \"total_price_excluding_tax\" : 15072,\n      \"product_url\" : \"http://aufderharluettgen.info/haven\",\n      \"image_url\" : \"https://s3-eu-west-1.amazonaws.com/s3.example.net/my/system-test/images/7.jpg\"\n    } ]\n  },\n  \"required_fields\" : [ \"billing_address.given_name\", \"billing_address.family_name\", \"billing_address.street_address\", \"billing_address.city\", \"billing_address.phone\", \"customer.national_identification_number\" ],\n  \"options\" : {\n    \"allow_separate_shipping_address\" : false,\n    \"date_of_birth_mandatory\" : false,\n    \"national_identification_number_mandatory\" : false,\n    \"allowed_customer_types\" : [ \"person\" ],\n    \"payment_selector_on_load\" : false\n  },\n  \"preview_payment_methods\" : [ {\n    \"id\" : \"-1\",\n    \"type\" : \"invoice\",\n    \"data\" : {\n      \"days\" : 14\n    }\n  }, {\n    \"id\" : \"-1\",\n    \"type\" : \"credit_card\",\n    \"data\" : {\n      \"available_cards\" : [ \"VISA\", \"MASTER\" ],\n      \"allow_saved_card\" : false,\n      \"do_save_card\" : false\n    }\n  } ],\n  \"allowed_billing_countries\" : [ \"and\", \"are\", \"atg\", \"aia\", \"alb\", \"arm\", \"ata\", \"arg\", \"asm\", \"aut\", \"aus\", \"abw\", \"ala\", \"aze\", \"brb\", \"bgd\", \"bel\", \"bfa\", \"bgr\", \"bhr\", \"ben\", \"blm\", \"bmu\", \"brn\", \"bol\", \"bes\", \"bra\", \"bhs\", \"btn\", \"bvt\", \"bwa\", \"blz\", \"can\", \"cck\", \"che\", \"cok\", \"chl\", \"cmr\", \"col\", \"cri\", \"cub\", \"cpv\", \"cuw\", \"cxr\", \"cyp\", \"cze\", \"deu\", \"dji\", \"dnk\", \"dma\", \"dom\", \"dza\", \"ecu\", \"est\", \"esh\", \"esp\", \"eth\", \"fin\", \"fji\", \"flk\", \"fsm\", \"fro\", \"fra\", \"gab\", \"gbr\", \"grd\", \"geo\", \"guf\", \"ggy\", \"gha\", \"gib\", \"grl\", \"gmb\", \"glp\", \"gnq\", \"grc\", \"sgs\", \"gtm\", \"gum\", \"hkg\", \"hmd\", \"hnd\", \"hrv\", \"hun\", \"idn\", \"irl\", \"isr\", \"imn\", \"ind\", \"iot\", \"isl\", \"ita\", \"jey\", \"jam\", \"jor\", \"jpn\", \"ken\", \"kgz\", \"khm\", \"kir\", \"com\", \"kna\", \"kor\", \"kwt\", \"cym\", \"kaz\", \"lca\", \"lie\", \"lka\", \"lso\", \"ltu\", \"lux\", \"lva\", \"mar\", \"mco\", \"mne\", \"maf\", \"mdg\", \"mhl\", \"mkd\", \"mli\", \"mng\", \"mac\", \"mnp\", \"mtq\", \"mrt\", \"msr\", \"mlt\", \"mus\", \"mdv\", \"mwi\", \"mex\", \"mys\", \"moz\", \"nam\", \"ncl\", \"ner\", \"nfk\", \"nga\", \"nic\", \"nld\", \"nor\", \"npl\", \"nru\", \"niu\", \"nzl\", \"omn\", \"pan\", \"per\", \"pyf\", \"phl\", \"pak\", \"pol\", \"spm\", \"pcn\", \"pri\", \"pse\", \"prt\", \"plw\", \"pry\", \"qat\", \"reu\", \"rou\", \"rwa\", \"sau\", \"slb\", \"syc\", \"swe\", \"sgp\", \"shn\", \"svn\", \"sjm\", \"svk\", \"sle\", \"smr\", \"sen\", \"sur\", \"stp\", \"slv\", \"sxm\", \"swz\", \"tca\", \"tcd\", \"atf\", \"tgo\", \"tha\", \"tjk\", \"tkl\", \"tls\", \"tkm\", \"ton\", \"tur\", \"tto\", \"tuv\", \"twn\", \"tza\", \"umi\", \"usa\", \"ury\", \"uzb\", \"vat\", \"vct\", \"ven\", \"vgb\", \"vir\", \"vnm\", \"wlf\", \"wsm\", \"myt\", \"zaf\", \"zmb\" ],\n  \"allowed_shipping_countries\" : [ \"and\", \"are\", \"atg\", \"aia\", \"alb\", \"arm\", \"ata\", \"arg\", \"asm\", \"aut\", \"aus\", \"abw\", \"ala\", \"aze\", \"brb\", \"bgd\", \"bel\", \"bfa\", \"bgr\", \"bhr\", \"ben\", \"blm\", \"bmu\", \"brn\", \"bol\", \"bes\", \"bra\", \"bhs\", \"btn\", \"bvt\", \"bwa\", \"blz\", \"can\", \"cck\", \"che\", \"cok\", \"chl\", \"cmr\", \"col\", \"cri\", \"cub\", \"cpv\", \"cuw\", \"cxr\", \"cyp\", \"cze\", \"deu\", \"dji\", \"dnk\", \"dma\", \"dom\", \"dza\", \"ecu\", \"est\", \"esh\", \"esp\", \"eth\", \"fin\", \"fji\", \"flk\", \"fsm\", \"fro\", \"fra\", \"gab\", \"gbr\", \"grd\", \"geo\", \"guf\", \"ggy\", \"gha\", \"gib\", \"grl\", \"gmb\", \"glp\", \"gnq\", \"grc\", \"sgs\", \"gtm\", \"gum\", \"hkg\", \"hmd\", \"hnd\", \"hrv\", \"hun\", \"idn\", \"irl\", \"isr\", \"imn\", \"ind\", \"iot\", \"isl\", \"ita\", \"jey\", \"jam\", \"jor\", \"jpn\", \"ken\", \"kgz\", \"khm\", \"kir\", \"com\", \"kna\", \"kor\", \"kwt\", \"cym\", \"kaz\", \"lca\", \"lie\", \"lka\", \"lso\", \"ltu\", \"lux\", \"lva\", \"mar\", \"mco\", \"mne\", \"maf\", \"mdg\", \"mhl\", \"mkd\", \"mli\", \"mng\", \"mac\", \"mnp\", \"mtq\", \"mrt\", \"msr\", \"mlt\", \"mus\", \"mdv\", \"mwi\", \"mex\", \"mys\", \"moz\", \"nam\", \"ncl\", \"ner\", \"nfk\", \"nga\", \"nic\", \"nld\", \"nor\", \"npl\", \"nru\", \"niu\", \"nzl\", \"omn\", \"pan\", \"per\", \"pyf\", \"phl\", \"pak\", \"pol\", \"spm\", \"pcn\", \"pri\", \"pse\", \"prt\", \"plw\", \"pry\", \"qat\", \"reu\", \"rou\", \"rwa\", \"sau\", \"slb\", \"syc\", \"swe\", \"sgp\", \"shn\", \"svn\", \"sjm\", \"svk\", \"sle\", \"smr\", \"sen\", \"sur\", \"stp\", \"slv\", \"sxm\", \"swz\", \"tca\", \"tcd\", \"atf\", \"tgo\", \"tha\", \"tjk\", \"tkl\", \"tls\", \"tkm\", \"ton\", \"tur\", \"tto\", \"tuv\", \"twn\", \"tza\", \"umi\", \"usa\", \"ury\", \"uzb\", \"vat\", \"vct\", \"ven\", \"vgb\", \"vir\", \"vnm\", \"wlf\", \"wsm\", \"myt\", \"zaf\", \"zmb\" ],\n  \"status\" : {\n    \"prescreened\" : false,\n    \"require_terms_consent\" : true\n  },\n  \"analytics_user_id\" : \"2EUwzTXiwfzWhYBUkPGxmjTIK9_mDMM7vDQo2wk_C7o=\",\n  \"merchant_urls\" : {\n    \"checkout\" : \"https://some-fourth-host.example.com/v1/redirect/checkout\",\n    \"confirmation\" : \"https://some-other-host.example.com/yaco/orders/570714bf-3c2b-452e-90cd-f7c5e552bb25/redirect?auth_token=otherStuffz\",\n    \"terms\" : \"https://some-fourth-host.example.com/v1/redirect/terms\"\n  }\n}",
          "comment": ""
        },
        "redirectURL": "",
        "headersSize": 445,
        "bodySize": 1636,
        "comment": ""
      },
      "cache": {},
      "timings": {
        "comment": "",
        "dns": 0,
        "connect": 105,
        "send": 2,
        "wait": 232,
        "receive": 1,
        "blocked": 0,
        "ssl": 63
      },
      "serverIPAddress": "10.225.41.52",
      "comment": "",
      "time": 342
    }, {
      "pageref": "Page 0",
      "startedDateTime": "2018-02-19T11:40:17.845Z",
      "request": {
        "method": "POST",
        "url": "https://some-other-host.example.com/yaco/orders/570714bf-3c2b-452e-90cd-f7c5e552bb25",
        "httpVersion": "HTTP/1.1",
        "cookies": [],
        "headers": [{
          "name": "Authorization",
          "value": "Checkout otherStuffz"
        }, {
          "name": "User-Agent",
          "value": "SysTest - perf"
        }, {
          "name": "Content-Type",
          "value": "application/vnd.checkout.client-order-v1+json"
        }, {
          "name": "Accept",
          "value": "application/vnd.checkout.server-order-v1+json"
        }, {
          "name": "Accept-Encoding",
          "value": "gzip;q=1.0,deflate;q=0.6,identity;q=0.3"
        }, {
          "name": "Host",
          "value": "some-other-host.example.com"
        }, {
          "name": "Content-Length",
          "value": "5003"
        }],
        "queryString": [],
        "postData": {
          "mimeType": "application/vnd.checkout.client-order-v1+json",
          "text": "{\"shared\":{\"challenge\":{\"email\":\"drop+b28643c0e7c74da6b6ff2f4131aa3d64+d0+gr@example.com\",\"postal_code\":\"10066\",\"country\":\"swe\"},\"billing_address\":{\"email\":\"drop+b28643c0e7c74da6b6ff2f4131aa3d64+d0+gr@example.com\",\"postal_code\":\"10066\",\"country\":\"swe\",\"given_name\":\"Eva InvoiceGreenNewSpec\",\"family_name\":\"Anglund\",\"street_address\":\"Sveavägen 44, 11111 Stockholm, Sweden Eriks Gata gatan\",\"city\":\"AlingHelsingstadfors\",\"phone\":\"+46700012878\",\"care_of\":\"C/O Hakan Ostlund\"},\"customer\":{\"type\":\"person\",\"national_identification_number\":\"8910210312\"},\"language\":\"sv\",\"currency\":\"SEK\"},\"cart\":{\"total_tax_amount\":1206,\"total_price_including_tax\":16278,\"total_price_excluding_tax\":15072,\"total_shipping_amount_excluding_tax\":0,\"total_surcharge_amount_excluding_tax\":0,\"total_discount_amount_excluding_tax\":0,\"subtotal\":15072,\"total_store_credit\":0,\"items\":[{\"type\":\"physical\",\"reference\":\"jkwedq9f6t\",\"name\":\"Mediokra Betong Lampa. Tangentbord\",\"quantity\":1,\"unit_price\":16278,\"total_tax_amount\":1206,\"tax_rate\":800,\"total_price_including_tax\":16278,\"total_price_excluding_tax\":15072,\"product_url\":\"http://aufderharluettgen.info/haven\",\"image_url\":\"https://s3-eu-west-1.amazonaws.com/s3.example.net/my/system-test/images/7.jpg\"}]},\"required_fields\":[\"billing_address.given_name\",\"billing_address.family_name\",\"billing_address.street_address\",\"billing_address.city\",\"billing_address.phone\",\"customer.national_identification_number\",\"billing_address.care_of\"],\"options\":{\"allow_separate_shipping_address\":false,\"date_of_birth_mandatory\":false,\"national_identification_number_mandatory\":false,\"allowed_customer_types\":[\"person\"],\"payment_selector_on_load\":false},\"preview_payment_methods\":[{\"id\":\"-1\",\"type\":\"invoice\",\"data\":{\"days\":14}},{\"id\":\"-1\",\"type\":\"credit_card\",\"data\":{\"available_cards\":[\"VISA\",\"MASTER\"],\"allow_saved_card\":false,\"do_save_card\":false}}],\"allowed_billing_countries\":[\"and\",\"are\",\"atg\",\"aia\",\"alb\",\"arm\",\"ata\",\"arg\",\"asm\",\"aut\",\"aus\",\"abw\",\"ala\",\"aze\",\"brb\",\"bgd\",\"bel\",\"bfa\",\"bgr\",\"bhr\",\"ben\",\"blm\",\"bmu\",\"brn\",\"bol\",\"bes\",\"bra\",\"bhs\",\"btn\",\"bvt\",\"bwa\",\"blz\",\"can\",\"cck\",\"che\",\"cok\",\"chl\",\"cmr\",\"col\",\"cri\",\"cub\",\"cpv\",\"cuw\",\"cxr\",\"cyp\",\"cze\",\"deu\",\"dji\",\"dnk\",\"dma\",\"dom\",\"dza\",\"ecu\",\"est\",\"esh\",\"esp\",\"eth\",\"fin\",\"fji\",\"flk\",\"fsm\",\"fro\",\"fra\",\"gab\",\"gbr\",\"grd\",\"geo\",\"guf\",\"ggy\",\"gha\",\"gib\",\"grl\",\"gmb\",\"glp\",\"gnq\",\"grc\",\"sgs\",\"gtm\",\"gum\",\"hkg\",\"hmd\",\"hnd\",\"hrv\",\"hun\",\"idn\",\"irl\",\"isr\",\"imn\",\"ind\",\"iot\",\"isl\",\"ita\",\"jey\",\"jam\",\"jor\",\"jpn\",\"ken\",\"kgz\",\"khm\",\"kir\",\"com\",\"kna\",\"kor\",\"kwt\",\"cym\",\"kaz\",\"lca\",\"lie\",\"lka\",\"lso\",\"ltu\",\"lux\",\"lva\",\"mar\",\"mco\",\"mne\",\"maf\",\"mdg\",\"mhl\",\"mkd\",\"mli\",\"mng\",\"mac\",\"mnp\",\"mtq\",\"mrt\",\"msr\",\"mlt\",\"mus\",\"mdv\",\"mwi\",\"mex\",\"mys\",\"moz\",\"nam\",\"ncl\",\"ner\",\"nfk\",\"nga\",\"nic\",\"nld\",\"nor\",\"npl\",\"nru\",\"niu\",\"nzl\",\"omn\",\"pan\",\"per\",\"pyf\",\"phl\",\"pak\",\"pol\",\"spm\",\"pcn\",\"pri\",\"pse\",\"prt\",\"plw\",\"pry\",\"qat\",\"reu\",\"rou\",\"rwa\",\"sau\",\"slb\",\"syc\",\"swe\",\"sgp\",\"shn\",\"svn\",\"sjm\",\"svk\",\"sle\",\"smr\",\"sen\",\"sur\",\"stp\",\"slv\",\"sxm\",\"swz\",\"tca\",\"tcd\",\"atf\",\"tgo\",\"tha\",\"tjk\",\"tkl\",\"tls\",\"tkm\",\"ton\",\"tur\",\"tto\",\"tuv\",\"twn\",\"tza\",\"umi\",\"usa\",\"ury\",\"uzb\",\"vat\",\"vct\",\"ven\",\"vgb\",\"vir\",\"vnm\",\"wlf\",\"wsm\",\"myt\",\"zaf\",\"zmb\"],\"allowed_shipping_countries\":[\"and\",\"are\",\"atg\",\"aia\",\"alb\",\"arm\",\"ata\",\"arg\",\"asm\",\"aut\",\"aus\",\"abw\",\"ala\",\"aze\",\"brb\",\"bgd\",\"bel\",\"bfa\",\"bgr\",\"bhr\",\"ben\",\"blm\",\"bmu\",\"brn\",\"bol\",\"bes\",\"bra\",\"bhs\",\"btn\",\"bvt\",\"bwa\",\"blz\",\"can\",\"cck\",\"che\",\"cok\",\"chl\",\"cmr\",\"col\",\"cri\",\"cub\",\"cpv\",\"cuw\",\"cxr\",\"cyp\",\"cze\",\"deu\",\"dji\",\"dnk\",\"dma\",\"dom\",\"dza\",\"ecu\",\"est\",\"esh\",\"esp\",\"eth\",\"fin\",\"fji\",\"flk\",\"fsm\",\"fro\",\"fra\",\"gab\",\"gbr\",\"grd\",\"geo\",\"guf\",\"ggy\",\"gha\",\"gib\",\"grl\",\"gmb\",\"glp\",\"gnq\",\"grc\",\"sgs\",\"gtm\",\"gum\",\"hkg\",\"hmd\",\"hnd\",\"hrv\",\"hun\",\"idn\",\"irl\",\"isr\",\"imn\",\"ind\",\"iot\",\"isl\",\"ita\",\"jey\",\"jam\",\"jor\",\"jpn\",\"ken\",\"kgz\",\"khm\",\"kir\",\"com\",\"kna\",\"kor\",\"kwt\",\"cym\",\"kaz\",\"lca\",\"lie\",\"lka\",\"lso\",\"ltu\",\"lux\",\"lva\",\"mar\",\"mco\",\"mne\",\"maf\",\"mdg\",\"mhl\",\"mkd\",\"mli\",\"mng\",\"mac\",\"mnp\",\"mtq\",\"mrt\",\"msr\",\"mlt\",\"mus\",\"mdv\",\"mwi\",\"mex\",\"mys\",\"moz\",\"nam\",\"ncl\",\"ner\",\"nfk\",\"nga\",\"nic\",\"nld\",\"nor\",\"npl\",\"nru\",\"niu\",\"nzl\",\"omn\",\"pan\",\"per\",\"pyf\",\"phl\",\"pak\",\"pol\",\"spm\",\"pcn\",\"pri\",\"pse\",\"prt\",\"plw\",\"pry\",\"qat\",\"reu\",\"rou\",\"rwa\",\"sau\",\"slb\",\"syc\",\"swe\",\"sgp\",\"shn\",\"svn\",\"sjm\",\"svk\",\"sle\",\"smr\",\"sen\",\"sur\",\"stp\",\"slv\",\"sxm\",\"swz\",\"tca\",\"tcd\",\"atf\",\"tgo\",\"tha\",\"tjk\",\"tkl\",\"tls\",\"tkm\",\"ton\",\"tur\",\"tto\",\"tuv\",\"twn\",\"tza\",\"umi\",\"usa\",\"ury\",\"uzb\",\"vat\",\"vct\",\"ven\",\"vgb\",\"vir\",\"vnm\",\"wlf\",\"wsm\",\"myt\",\"zaf\",\"zmb\"],\"status\":{\"prescreened\":false,\"require_terms_consent\":true},\"analytics_user_id\":\"2EUwzTXiwfzWhYBUkPGxmjTIK9_mDMM7vDQo2wk_C7o=\",\"merchant_urls\":{\"checkout\":\"https://some-fourth-host.example.com/v1/redirect/checkout\",\"confirmation\":\"https://some-other-host.example.com/yaco/orders/570714bf-3c2b-452e-90cd-f7c5e552bb25/redirect?auth_token=otherStuffz\",\"terms\":\"https://some-fourth-host.example.com/v1/redirect/terms\"},\"correlation_id\":\"f6df29e7-f850-4c36-81fc-11def2f44b81\"}",
          "comment": ""
        },
        "headersSize": 410,
        "bodySize": 5003,
        "comment": ""
      },
      "response": {
        "status": 200,
        "statusText": "OK",
        "httpVersion": "HTTP/1.1",
        "cookies": [],
        "headers": [{
          "name": "Cache-Control",
          "value": "max-age=0, no-cache, no-store"
        }, {
          "name": "Content-Encoding",
          "value": "gzip"
        }, {
          "name": "Content-Type",
          "value": "application/vnd.checkout.server-order-v1+json"
        }, {
          "name": "Date",
          "value": "Mon, 19 Feb 2018 11:40:10 GMT"
        }, {
          "name": "Correlation-Id",
          "value": "a6c51342-b107-4463-a2a0-b530f1bac03e"
        }, {
          "name": "Pragma",
          "value": "no-cache"
        }, {
          "name": "Render-Time",
          "value": "295"
        }, {
          "name": "Server",
          "value": "openresty"
        }, {
          "name": "Strict-Transport-Security",
          "value": "max-age=31536000; includeSubDomains"
        }, {
          "name": "Vary",
          "value": "Accept-Encoding"
        }, {
          "name": "Content-Length",
          "value": "1714"
        }, {
          "name": "Connection",
          "value": "keep-alive"
        }],
        "content": {
          "size": 5588,
          "mimeType": "application/vnd.checkout.server-order-v1+json",
          "text": "{\n  \"shared\" : {\n    \"challenge\" : {\n      \"email\" : \"drop+b28643c0e7c74da6b6ff2f4131aa3d64+d0+gr@example.com\",\n      \"postal_code\" : \"10066\",\n      \"country\" : \"swe\"\n    },\n    \"billing_address\" : {\n      \"given_name\" : \"Eva InvoiceGreenNewSpec\",\n      \"family_name\" : \"Anglund\",\n      \"email\" : \"drop+b28643c0e7c74da6b6ff2f4131aa3d64+d0+gr@example.com\",\n      \"street_address\" : \"Sveavägen 44, 11111 Stockholm, Sweden Eriks Gata gatan\",\n      \"street_address2\" : \"c/o C/O Hakan Ostlund\",\n      \"postal_code\" : \"10066\",\n      \"city\" : \"AlingHelsingstadfors\",\n      \"phone\" : \"070-001 28 78\",\n      \"country\" : \"swe\",\n      \"care_of\" : \"C/O Hakan Ostlund\"\n    },\n    \"customer\" : {\n      \"national_identification_number\" : \"19891021-0312\",\n      \"type\" : \"person\"\n    },\n    \"language\" : \"sv\",\n    \"currency\" : \"SEK\"\n  },\n  \"cart\" : {\n    \"total_tax_amount\" : 1206,\n    \"total_price_including_tax\" : 16278,\n    \"total_price_excluding_tax\" : 15072,\n    \"total_shipping_amount_excluding_tax\" : 0,\n    \"total_surcharge_amount_excluding_tax\" : 0,\n    \"total_discount_amount_excluding_tax\" : 0,\n    \"subtotal\" : 15072,\n    \"total_store_credit\" : 0,\n    \"items\" : [ {\n      \"type\" : \"physical\",\n      \"reference\" : \"jkwedq9f6t\",\n      \"name\" : \"Mediokra Betong Lampa. Tangentbord\",\n      \"quantity\" : 1,\n      \"unit_price\" : 16278,\n      \"total_tax_amount\" : 1206,\n      \"tax_rate\" : 800,\n      \"total_price_including_tax\" : 16278,\n      \"total_price_excluding_tax\" : 15072,\n      \"product_url\" : \"http://aufderharluettgen.info/haven\",\n      \"image_url\" : \"https://s3-eu-west-1.amazonaws.com/s3.example.net/my/system-test/images/7.jpg\"\n    } ]\n  },\n  \"available_payment_methods\" : [ {\n    \"id\" : \"-1\",\n    \"type\" : \"invoice\",\n    \"data\" : {\n      \"days\" : 14\n    }\n  } ],\n  \"options\" : {\n    \"allow_separate_shipping_address\" : false,\n    \"date_of_birth_mandatory\" : false,\n    \"national_identification_number_mandatory\" : false,\n    \"allowed_customer_types\" : [ \"person\" ],\n    \"payment_selector_on_load\" : false\n  },\n  \"allowed_billing_countries\" : [ \"and\", \"are\", \"atg\", \"aia\", \"alb\", \"arm\", \"ata\", \"arg\", \"asm\", \"aut\", \"aus\", \"abw\", \"ala\", \"aze\", \"brb\", \"bgd\", \"bel\", \"bfa\", \"bgr\", \"bhr\", \"ben\", \"blm\", \"bmu\", \"brn\", \"bol\", \"bes\", \"bra\", \"bhs\", \"btn\", \"bvt\", \"bwa\", \"blz\", \"can\", \"cck\", \"che\", \"cok\", \"chl\", \"cmr\", \"col\", \"cri\", \"cub\", \"cpv\", \"cuw\", \"cxr\", \"cyp\", \"cze\", \"deu\", \"dji\", \"dnk\", \"dma\", \"dom\", \"dza\", \"ecu\", \"est\", \"esh\", \"esp\", \"eth\", \"fin\", \"fji\", \"flk\", \"fsm\", \"fro\", \"fra\", \"gab\", \"gbr\", \"grd\", \"geo\", \"guf\", \"ggy\", \"gha\", \"gib\", \"grl\", \"gmb\", \"glp\", \"gnq\", \"grc\", \"sgs\", \"gtm\", \"gum\", \"hkg\", \"hmd\", \"hnd\", \"hrv\", \"hun\", \"idn\", \"irl\", \"isr\", \"imn\", \"ind\", \"iot\", \"isl\", \"ita\", \"jey\", \"jam\", \"jor\", \"jpn\", \"ken\", \"kgz\", \"khm\", \"kir\", \"com\", \"kna\", \"kor\", \"kwt\", \"cym\", \"kaz\", \"lca\", \"lie\", \"lka\", \"lso\", \"ltu\", \"lux\", \"lva\", \"mar\", \"mco\", \"mne\", \"maf\", \"mdg\", \"mhl\", \"mkd\", \"mli\", \"mng\", \"mac\", \"mnp\", \"mtq\", \"mrt\", \"msr\", \"mlt\", \"mus\", \"mdv\", \"mwi\", \"mex\", \"mys\", \"moz\", \"nam\", \"ncl\", \"ner\", \"nfk\", \"nga\", \"nic\", \"nld\", \"nor\", \"npl\", \"nru\", \"niu\", \"nzl\", \"omn\", \"pan\", \"per\", \"pyf\", \"phl\", \"pak\", \"pol\", \"spm\", \"pcn\", \"pri\", \"pse\", \"prt\", \"plw\", \"pry\", \"qat\", \"reu\", \"rou\", \"rwa\", \"sau\", \"slb\", \"syc\", \"swe\", \"sgp\", \"shn\", \"svn\", \"sjm\", \"svk\", \"sle\", \"smr\", \"sen\", \"sur\", \"stp\", \"slv\", \"sxm\", \"swz\", \"tca\", \"tcd\", \"atf\", \"tgo\", \"tha\", \"tjk\", \"tkl\", \"tls\", \"tkm\", \"ton\", \"tur\", \"tto\", \"tuv\", \"twn\", \"tza\", \"umi\", \"usa\", \"ury\", \"uzb\", \"vat\", \"vct\", \"ven\", \"vgb\", \"vir\", \"vnm\", \"wlf\", \"wsm\", \"myt\", \"zaf\", \"zmb\" ],\n  \"allowed_shipping_countries\" : [ \"and\", \"are\", \"atg\", \"aia\", \"alb\", \"arm\", \"ata\", \"arg\", \"asm\", \"aut\", \"aus\", \"abw\", \"ala\", \"aze\", \"brb\", \"bgd\", \"bel\", \"bfa\", \"bgr\", \"bhr\", \"ben\", \"blm\", \"bmu\", \"brn\", \"bol\", \"bes\", \"bra\", \"bhs\", \"btn\", \"bvt\", \"bwa\", \"blz\", \"can\", \"cck\", \"che\", \"cok\", \"chl\", \"cmr\", \"col\", \"cri\", \"cub\", \"cpv\", \"cuw\", \"cxr\", \"cyp\", \"cze\", \"deu\", \"dji\", \"dnk\", \"dma\", \"dom\", \"dza\", \"ecu\", \"est\", \"esh\", \"esp\", \"eth\", \"fin\", \"fji\", \"flk\", \"fsm\", \"fro\", \"fra\", \"gab\", \"gbr\", \"grd\", \"geo\", \"guf\", \"ggy\", \"gha\", \"gib\", \"grl\", \"gmb\", \"glp\", \"gnq\", \"grc\", \"sgs\", \"gtm\", \"gum\", \"hkg\", \"hmd\", \"hnd\", \"hrv\", \"hun\", \"idn\", \"irl\", \"isr\", \"imn\", \"ind\", \"iot\", \"isl\", \"ita\", \"jey\", \"jam\", \"jor\", \"jpn\", \"ken\", \"kgz\", \"khm\", \"kir\", \"com\", \"kna\", \"kor\", \"kwt\", \"cym\", \"kaz\", \"lca\", \"lie\", \"lka\", \"lso\", \"ltu\", \"lux\", \"lva\", \"mar\", \"mco\", \"mne\", \"maf\", \"mdg\", \"mhl\", \"mkd\", \"mli\", \"mng\", \"mac\", \"mnp\", \"mtq\", \"mrt\", \"msr\", \"mlt\", \"mus\", \"mdv\", \"mwi\", \"mex\", \"mys\", \"moz\", \"nam\", \"ncl\", \"ner\", \"nfk\", \"nga\", \"nic\", \"nld\", \"nor\", \"npl\", \"nru\", \"niu\", \"nzl\", \"omn\", \"pan\", \"per\", \"pyf\", \"phl\", \"pak\", \"pol\", \"spm\", \"pcn\", \"pri\", \"pse\", \"prt\", \"plw\", \"pry\", \"qat\", \"reu\", \"rou\", \"rwa\", \"sau\", \"slb\", \"syc\", \"swe\", \"sgp\", \"shn\", \"svn\", \"sjm\", \"svk\", \"sle\", \"smr\", \"sen\", \"sur\", \"stp\", \"slv\", \"sxm\", \"swz\", \"tca\", \"tcd\", \"atf\", \"tgo\", \"tha\", \"tjk\", \"tkl\", \"tls\", \"tkm\", \"ton\", \"tur\", \"tto\", \"tuv\", \"twn\", \"tza\", \"umi\", \"usa\", \"ury\", \"uzb\", \"vat\", \"vct\", \"ven\", \"vgb\", \"vir\", \"vnm\", \"wlf\", \"wsm\", \"myt\", \"zaf\", \"zmb\" ],\n  \"status\" : {\n    \"prescreened\" : false,\n    \"require_terms_consent\" : true\n  },\n  \"analytics_user_id\" : \"2EUwzTXiwfzWhYBUkPGxmjTIK9_mDMM7vDQo2wk_C7o=\",\n  \"merchant_urls\" : {\n    \"checkout\" : \"https://some-fourth-host.example.com/v1/redirect/checkout\",\n    \"confirmation\" : \"https://some-other-host.example.com/yaco/orders/570714bf-3c2b-452e-90cd-f7c5e552bb25/redirect?auth_token=otherStuffz\",\n    \"terms\" : \"https://some-fourth-host.example.com/v1/redirect/terms\"\n  }\n}",
          "comment": ""
        },
        "redirectURL": "",
        "headersSize": 445,
        "bodySize": 1714,
        "comment": ""
      },
      "cache": {},
      "timings": {
        "comment": "",
        "dns": 0,
        "connect": 105,
        "send": 7,
        "wait": 417,
        "receive": 2,
        "blocked": 0,
        "ssl": 62
      },
      "serverIPAddress": "10.225.41.52",
      "comment": "",
      "time": 532
    }, {
      "pageref": "Page 0",
      "startedDateTime": "2018-02-19T11:40:18.394Z",
      "request": {
        "method": "POST",
        "url": "https://some-other-host.example.com/yaco/orders/570714bf-3c2b-452e-90cd-f7c5e552bb25",
        "httpVersion": "HTTP/1.1",
        "cookies": [],
        "headers": [{
          "name": "Authorization",
          "value": "Checkout otherStuffz"
        }, {
          "name": "User-Agent",
          "value": "SysTest - perf"
        }, {
          "name": "Content-Type",
          "value": "application/vnd.checkout.client-order-v1+json"
        }, {
          "name": "Accept",
          "value": "application/vnd.checkout.server-order-v1+json"
        }, {
          "name": "Accept-Encoding",
          "value": "gzip;q=1.0,deflate;q=0.6,identity;q=0.3"
        }, {
          "name": "Host",
          "value": "some-other-host.example.com"
        }, {
          "name": "Content-Length",
          "value": "4774"
        }],
        "queryString": [],
        "postData": {
          "mimeType": "application/vnd.checkout.client-order-v1+json",
          "text": "{\"shared\":{\"challenge\":{\"email\":\"drop+b28643c0e7c74da6b6ff2f4131aa3d64+d0+gr@example.com\",\"postal_code\":\"10066\",\"country\":\"swe\"},\"billing_address\":{\"given_name\":\"Eva InvoiceGreenNewSpec\",\"family_name\":\"Anglund\",\"email\":\"drop+b28643c0e7c74da6b6ff2f4131aa3d64+d0+gr@example.com\",\"street_address\":\"Sveavägen 44, 11111 Stockholm, Sweden Eriks Gata gatan\",\"street_address2\":\"c/o C/O Hakan Ostlund\",\"postal_code\":\"10066\",\"city\":\"AlingHelsingstadfors\",\"phone\":\"070-001 28 78\",\"country\":\"swe\",\"care_of\":\"C/O Hakan Ostlund\"},\"customer\":{\"national_identification_number\":\"19891021-0312\",\"type\":\"person\"},\"language\":\"sv\",\"currency\":\"SEK\",\"selected_payment_method\":{\"id\":\"-1\",\"type\":\"invoice\",\"data\":{\"days\":14}}},\"cart\":{\"total_tax_amount\":1206,\"total_price_including_tax\":16278,\"total_price_excluding_tax\":15072,\"total_shipping_amount_excluding_tax\":0,\"total_surcharge_amount_excluding_tax\":0,\"total_discount_amount_excluding_tax\":0,\"subtotal\":15072,\"total_store_credit\":0,\"items\":[{\"type\":\"physical\",\"reference\":\"jkwedq9f6t\",\"name\":\"Mediokra Betong Lampa. Tangentbord\",\"quantity\":1,\"unit_price\":16278,\"total_tax_amount\":1206,\"tax_rate\":800,\"total_price_including_tax\":16278,\"total_price_excluding_tax\":15072,\"product_url\":\"http://aufderharluettgen.info/haven\",\"image_url\":\"https://s3-eu-west-1.amazonaws.com/s3.example.net/my/system-test/images/7.jpg\"}]},\"available_payment_methods\":[{\"id\":\"-1\",\"type\":\"invoice\",\"data\":{\"days\":14}}],\"options\":{\"allow_separate_shipping_address\":false,\"date_of_birth_mandatory\":false,\"national_identification_number_mandatory\":false,\"allowed_customer_types\":[\"person\"],\"payment_selector_on_load\":false},\"allowed_billing_countries\":[\"and\",\"are\",\"atg\",\"aia\",\"alb\",\"arm\",\"ata\",\"arg\",\"asm\",\"aut\",\"aus\",\"abw\",\"ala\",\"aze\",\"brb\",\"bgd\",\"bel\",\"bfa\",\"bgr\",\"bhr\",\"ben\",\"blm\",\"bmu\",\"brn\",\"bol\",\"bes\",\"bra\",\"bhs\",\"btn\",\"bvt\",\"bwa\",\"blz\",\"can\",\"cck\",\"che\",\"cok\",\"chl\",\"cmr\",\"col\",\"cri\",\"cub\",\"cpv\",\"cuw\",\"cxr\",\"cyp\",\"cze\",\"deu\",\"dji\",\"dnk\",\"dma\",\"dom\",\"dza\",\"ecu\",\"est\",\"esh\",\"esp\",\"eth\",\"fin\",\"fji\",\"flk\",\"fsm\",\"fro\",\"fra\",\"gab\",\"gbr\",\"grd\",\"geo\",\"guf\",\"ggy\",\"gha\",\"gib\",\"grl\",\"gmb\",\"glp\",\"gnq\",\"grc\",\"sgs\",\"gtm\",\"gum\",\"hkg\",\"hmd\",\"hnd\",\"hrv\",\"hun\",\"idn\",\"irl\",\"isr\",\"imn\",\"ind\",\"iot\",\"isl\",\"ita\",\"jey\",\"jam\",\"jor\",\"jpn\",\"ken\",\"kgz\",\"khm\",\"kir\",\"com\",\"kna\",\"kor\",\"kwt\",\"cym\",\"kaz\",\"lca\",\"lie\",\"lka\",\"lso\",\"ltu\",\"lux\",\"lva\",\"mar\",\"mco\",\"mne\",\"maf\",\"mdg\",\"mhl\",\"mkd\",\"mli\",\"mng\",\"mac\",\"mnp\",\"mtq\",\"mrt\",\"msr\",\"mlt\",\"mus\",\"mdv\",\"mwi\",\"mex\",\"mys\",\"moz\",\"nam\",\"ncl\",\"ner\",\"nfk\",\"nga\",\"nic\",\"nld\",\"nor\",\"npl\",\"nru\",\"niu\",\"nzl\",\"omn\",\"pan\",\"per\",\"pyf\",\"phl\",\"pak\",\"pol\",\"spm\",\"pcn\",\"pri\",\"pse\",\"prt\",\"plw\",\"pry\",\"qat\",\"reu\",\"rou\",\"rwa\",\"sau\",\"slb\",\"syc\",\"swe\",\"sgp\",\"shn\",\"svn\",\"sjm\",\"svk\",\"sle\",\"smr\",\"sen\",\"sur\",\"stp\",\"slv\",\"sxm\",\"swz\",\"tca\",\"tcd\",\"atf\",\"tgo\",\"tha\",\"tjk\",\"tkl\",\"tls\",\"tkm\",\"ton\",\"tur\",\"tto\",\"tuv\",\"twn\",\"tza\",\"umi\",\"usa\",\"ury\",\"uzb\",\"vat\",\"vct\",\"ven\",\"vgb\",\"vir\",\"vnm\",\"wlf\",\"wsm\",\"myt\",\"zaf\",\"zmb\"],\"allowed_shipping_countries\":[\"and\",\"are\",\"atg\",\"aia\",\"alb\",\"arm\",\"ata\",\"arg\",\"asm\",\"aut\",\"aus\",\"abw\",\"ala\",\"aze\",\"brb\",\"bgd\",\"bel\",\"bfa\",\"bgr\",\"bhr\",\"ben\",\"blm\",\"bmu\",\"brn\",\"bol\",\"bes\",\"bra\",\"bhs\",\"btn\",\"bvt\",\"bwa\",\"blz\",\"can\",\"cck\",\"che\",\"cok\",\"chl\",\"cmr\",\"col\",\"cri\",\"cub\",\"cpv\",\"cuw\",\"cxr\",\"cyp\",\"cze\",\"deu\",\"dji\",\"dnk\",\"dma\",\"dom\",\"dza\",\"ecu\",\"est\",\"esh\",\"esp\",\"eth\",\"fin\",\"fji\",\"flk\",\"fsm\",\"fro\",\"fra\",\"gab\",\"gbr\",\"grd\",\"geo\",\"guf\",\"ggy\",\"gha\",\"gib\",\"grl\",\"gmb\",\"glp\",\"gnq\",\"grc\",\"sgs\",\"gtm\",\"gum\",\"hkg\",\"hmd\",\"hnd\",\"hrv\",\"hun\",\"idn\",\"irl\",\"isr\",\"imn\",\"ind\",\"iot\",\"isl\",\"ita\",\"jey\",\"jam\",\"jor\",\"jpn\",\"ken\",\"kgz\",\"khm\",\"kir\",\"com\",\"kna\",\"kor\",\"kwt\",\"cym\",\"kaz\",\"lca\",\"lie\",\"lka\",\"lso\",\"ltu\",\"lux\",\"lva\",\"mar\",\"mco\",\"mne\",\"maf\",\"mdg\",\"mhl\",\"mkd\",\"mli\",\"mng\",\"mac\",\"mnp\",\"mtq\",\"mrt\",\"msr\",\"mlt\",\"mus\",\"mdv\",\"mwi\",\"mex\",\"mys\",\"moz\",\"nam\",\"ncl\",\"ner\",\"nfk\",\"nga\",\"nic\",\"nld\",\"nor\",\"npl\",\"nru\",\"niu\",\"nzl\",\"omn\",\"pan\",\"per\",\"pyf\",\"phl\",\"pak\",\"pol\",\"spm\",\"pcn\",\"pri\",\"pse\",\"prt\",\"plw\",\"pry\",\"qat\",\"reu\",\"rou\",\"rwa\",\"sau\",\"slb\",\"syc\",\"swe\",\"sgp\",\"shn\",\"svn\",\"sjm\",\"svk\",\"sle\",\"smr\",\"sen\",\"sur\",\"stp\",\"slv\",\"sxm\",\"swz\",\"tca\",\"tcd\",\"atf\",\"tgo\",\"tha\",\"tjk\",\"tkl\",\"tls\",\"tkm\",\"ton\",\"tur\",\"tto\",\"tuv\",\"twn\",\"tza\",\"umi\",\"usa\",\"ury\",\"uzb\",\"vat\",\"vct\",\"ven\",\"vgb\",\"vir\",\"vnm\",\"wlf\",\"wsm\",\"myt\",\"zaf\",\"zmb\"],\"status\":{\"prescreened\":false,\"require_terms_consent\":true},\"analytics_user_id\":\"2EUwzTXiwfzWhYBUkPGxmjTIK9_mDMM7vDQo2wk_C7o=\",\"merchant_urls\":{\"checkout\":\"https://some-fourth-host.example.com/v1/redirect/checkout\",\"confirmation\":\"https://some-other-host.example.com/yaco/orders/570714bf-3c2b-452e-90cd-f7c5e552bb25/redirect?auth_token=otherStuffz\",\"terms\":\"https://some-fourth-host.example.com/v1/redirect/terms\"},\"correlation_id\":\"a6c51342-b107-4463-a2a0-b530f1bac03e\"}",
          "comment": ""
        },
        "headersSize": 410,
        "bodySize": 4774,
        "comment": ""
      },
      "response": {
        "status": 200,
        "statusText": "OK",
        "httpVersion": "HTTP/1.1",
        "cookies": [],
        "headers": [{
          "name": "Cache-Control",
          "value": "max-age=0, no-cache, no-store"
        }, {
          "name": "Content-Encoding",
          "value": "gzip"
        }, {
          "name": "Content-Type",
          "value": "application/vnd.checkout.server-order-v1+json"
        }, {
          "name": "Date",
          "value": "Mon, 19 Feb 2018 11:40:11 GMT"
        }, {
          "name": "Correlation-Id",
          "value": "97fd2531-c0a8-4107-99af-0af60a67176a"
        }, {
          "name": "Pragma",
          "value": "no-cache"
        }, {
          "name": "Render-Time",
          "value": "1143"
        }, {
          "name": "Server",
          "value": "openresty"
        }, {
          "name": "Strict-Transport-Security",
          "value": "max-age=31536000; includeSubDomains"
        }, {
          "name": "Vary",
          "value": "Accept-Encoding"
        }, {
          "name": "Content-Length",
          "value": "1811"
        }, {
          "name": "Connection",
          "value": "keep-alive"
        }],
        "content": {
          "size": 6184,
          "mimeType": "application/vnd.checkout.server-order-v1+json",
          "text": "{\n  \"shared\" : {\n    \"challenge\" : {\n      \"email\" : \"drop+b28643c0e7c74da6b6ff2f4131aa3d64+d0+gr@example.com\",\n      \"postal_code\" : \"10066\",\n      \"country\" : \"swe\"\n    },\n    \"billing_address\" : {\n      \"given_name\" : \"Eva InvoiceGreenNewSpec\",\n      \"family_name\" : \"Anglund\",\n      \"email\" : \"drop+b28643c0e7c74da6b6ff2f4131aa3d64+d0+gr@example.com\",\n      \"street_address\" : \"Sveavägen 44, 11111 Stockholm, Sweden Eriks Gata gatan\",\n      \"street_address2\" : \"c/o C/O Hakan Ostlund\",\n      \"postal_code\" : \"10066\",\n      \"city\" : \"AlingHelsingstadfors\",\n      \"phone\" : \"070-001 28 78\",\n      \"country\" : \"swe\",\n      \"care_of\" : \"C/O Hakan Ostlund\"\n    },\n    \"customer\" : {\n      \"national_identification_number\" : \"19891021-0312\",\n      \"type\" : \"person\"\n    },\n    \"selected_payment_method\" : {\n      \"id\" : \"-1\",\n      \"type\" : \"invoice\",\n      \"data\" : {\n        \"days\" : 14\n      }\n    },\n    \"language\" : \"sv\",\n    \"currency\" : \"SEK\"\n  },\n  \"cart\" : {\n    \"total_tax_amount\" : 1206,\n    \"total_price_including_tax\" : 16278,\n    \"total_price_excluding_tax\" : 15072,\n    \"total_shipping_amount_excluding_tax\" : 0,\n    \"total_surcharge_amount_excluding_tax\" : 0,\n    \"total_discount_amount_excluding_tax\" : 0,\n    \"subtotal\" : 15072,\n    \"total_store_credit\" : 0,\n    \"items\" : [ {\n      \"type\" : \"physical\",\n      \"reference\" : \"jkwedq9f6t\",\n      \"name\" : \"Mediokra Betong Lampa. Tangentbord\",\n      \"quantity\" : 1,\n      \"unit_price\" : 16278,\n      \"total_tax_amount\" : 1206,\n      \"tax_rate\" : 800,\n      \"total_price_including_tax\" : 16278,\n      \"total_price_excluding_tax\" : 15072,\n      \"product_url\" : \"http://aufderharluettgen.info/haven\",\n      \"image_url\" : \"https://s3-eu-west-1.amazonaws.com/s3.example.net/my/system-test/images/7.jpg\"\n    } ]\n  },\n  \"authorized_payment_method\" : {\n    \"id\" : \"-1\",\n    \"type\" : \"invoice\",\n    \"data\" : {\n      \"days\" : 14\n    }\n  },\n  \"redirect_uri\" : \"https://some-other-host.example.com/yaco/orders/570714bf-3c2b-452e-90cd-f7c5e552bb25/redirect?auth_token=otherStuffz\",\n  \"options\" : {\n    \"allow_separate_shipping_address\" : false,\n    \"date_of_birth_mandatory\" : false,\n    \"national_identification_number_mandatory\" : false,\n    \"allowed_customer_types\" : [ \"person\" ],\n    \"payment_selector_on_load\" : false\n  },\n  \"preview_payment_methods\" : [ {\n    \"id\" : \"-1\",\n    \"type\" : \"invoice\",\n    \"data\" : {\n      \"days\" : 14\n    }\n  }, {\n    \"id\" : \"-1\",\n    \"type\" : \"credit_card\",\n    \"data\" : {\n      \"available_cards\" : [ \"VISA\", \"MASTER\" ],\n      \"allow_saved_card\" : false,\n      \"do_save_card\" : false\n    }\n  } ],\n  \"allowed_billing_countries\" : [ \"and\", \"are\", \"atg\", \"aia\", \"alb\", \"arm\", \"ata\", \"arg\", \"asm\", \"aut\", \"aus\", \"abw\", \"ala\", \"aze\", \"brb\", \"bgd\", \"bel\", \"bfa\", \"bgr\", \"bhr\", \"ben\", \"blm\", \"bmu\", \"brn\", \"bol\", \"bes\", \"bra\", \"bhs\", \"btn\", \"bvt\", \"bwa\", \"blz\", \"can\", \"cck\", \"che\", \"cok\", \"chl\", \"cmr\", \"col\", \"cri\", \"cub\", \"cpv\", \"cuw\", \"cxr\", \"cyp\", \"cze\", \"deu\", \"dji\", \"dnk\", \"dma\", \"dom\", \"dza\", \"ecu\", \"est\", \"esh\", \"esp\", \"eth\", \"fin\", \"fji\", \"flk\", \"fsm\", \"fro\", \"fra\", \"gab\", \"gbr\", \"grd\", \"geo\", \"guf\", \"ggy\", \"gha\", \"gib\", \"grl\", \"gmb\", \"glp\", \"gnq\", \"grc\", \"sgs\", \"gtm\", \"gum\", \"hkg\", \"hmd\", \"hnd\", \"hrv\", \"hun\", \"idn\", \"irl\", \"isr\", \"imn\", \"ind\", \"iot\", \"isl\", \"ita\", \"jey\", \"jam\", \"jor\", \"jpn\", \"ken\", \"kgz\", \"khm\", \"kir\", \"com\", \"kna\", \"kor\", \"kwt\", \"cym\", \"kaz\", \"lca\", \"lie\", \"lka\", \"lso\", \"ltu\", \"lux\", \"lva\", \"mar\", \"mco\", \"mne\", \"maf\", \"mdg\", \"mhl\", \"mkd\", \"mli\", \"mng\", \"mac\", \"mnp\", \"mtq\", \"mrt\", \"msr\", \"mlt\", \"mus\", \"mdv\", \"mwi\", \"mex\", \"mys\", \"moz\", \"nam\", \"ncl\", \"ner\", \"nfk\", \"nga\", \"nic\", \"nld\", \"nor\", \"npl\", \"nru\", \"niu\", \"nzl\", \"omn\", \"pan\", \"per\", \"pyf\", \"phl\", \"pak\", \"pol\", \"spm\", \"pcn\", \"pri\", \"pse\", \"prt\", \"plw\", \"pry\", \"qat\", \"reu\", \"rou\", \"rwa\", \"sau\", \"slb\", \"syc\", \"swe\", \"sgp\", \"shn\", \"svn\", \"sjm\", \"svk\", \"sle\", \"smr\", \"sen\", \"sur\", \"stp\", \"slv\", \"sxm\", \"swz\", \"tca\", \"tcd\", \"atf\", \"tgo\", \"tha\", \"tjk\", \"tkl\", \"tls\", \"tkm\", \"ton\", \"tur\", \"tto\", \"tuv\", \"twn\", \"tza\", \"umi\", \"usa\", \"ury\", \"uzb\", \"vat\", \"vct\", \"ven\", \"vgb\", \"vir\", \"vnm\", \"wlf\", \"wsm\", \"myt\", \"zaf\", \"zmb\" ],\n  \"allowed_shipping_countries\" : [ \"and\", \"are\", \"atg\", \"aia\", \"alb\", \"arm\", \"ata\", \"arg\", \"asm\", \"aut\", \"aus\", \"abw\", \"ala\", \"aze\", \"brb\", \"bgd\", \"bel\", \"bfa\", \"bgr\", \"bhr\", \"ben\", \"blm\", \"bmu\", \"brn\", \"bol\", \"bes\", \"bra\", \"bhs\", \"btn\", \"bvt\", \"bwa\", \"blz\", \"can\", \"cck\", \"che\", \"cok\", \"chl\", \"cmr\", \"col\", \"cri\", \"cub\", \"cpv\", \"cuw\", \"cxr\", \"cyp\", \"cze\", \"deu\", \"dji\", \"dnk\", \"dma\", \"dom\", \"dza\", \"ecu\", \"est\", \"esh\", \"esp\", \"eth\", \"fin\", \"fji\", \"flk\", \"fsm\", \"fro\", \"fra\", \"gab\", \"gbr\", \"grd\", \"geo\", \"guf\", \"ggy\", \"gha\", \"gib\", \"grl\", \"gmb\", \"glp\", \"gnq\", \"grc\", \"sgs\", \"gtm\", \"gum\", \"hkg\", \"hmd\", \"hnd\", \"hrv\", \"hun\", \"idn\", \"irl\", \"isr\", \"imn\", \"ind\", \"iot\", \"isl\", \"ita\", \"jey\", \"jam\", \"jor\", \"jpn\", \"ken\", \"kgz\", \"khm\", \"kir\", \"com\", \"kna\", \"kor\", \"kwt\", \"cym\", \"kaz\", \"lca\", \"lie\", \"lka\", \"lso\", \"ltu\", \"lux\", \"lva\", \"mar\", \"mco\", \"mne\", \"maf\", \"mdg\", \"mhl\", \"mkd\", \"mli\", \"mng\", \"mac\", \"mnp\", \"mtq\", \"mrt\", \"msr\", \"mlt\", \"mus\", \"mdv\", \"mwi\", \"mex\", \"mys\", \"moz\", \"nam\", \"ncl\", \"ner\", \"nfk\", \"nga\", \"nic\", \"nld\", \"nor\", \"npl\", \"nru\", \"niu\", \"nzl\", \"omn\", \"pan\", \"per\", \"pyf\", \"phl\", \"pak\", \"pol\", \"spm\", \"pcn\", \"pri\", \"pse\", \"prt\", \"plw\", \"pry\", \"qat\", \"reu\", \"rou\", \"rwa\", \"sau\", \"slb\", \"syc\", \"swe\", \"sgp\", \"shn\", \"svn\", \"sjm\", \"svk\", \"sle\", \"smr\", \"sen\", \"sur\", \"stp\", \"slv\", \"sxm\", \"swz\", \"tca\", \"tcd\", \"atf\", \"tgo\", \"tha\", \"tjk\", \"tkl\", \"tls\", \"tkm\", \"ton\", \"tur\", \"tto\", \"tuv\", \"twn\", \"tza\", \"umi\", \"usa\", \"ury\", \"uzb\", \"vat\", \"vct\", \"ven\", \"vgb\", \"vir\", \"vnm\", \"wlf\", \"wsm\", \"myt\", \"zaf\", \"zmb\" ],\n  \"status\" : {\n    \"prescreened\" : false,\n    \"require_terms_consent\" : true\n  },\n  \"analytics_user_id\" : \"2EUwzTXiwfzWhYBUkPGxmjTIK9_mDMM7vDQo2wk_C7o=\",\n  \"merchant_urls\" : {\n    \"checkout\" : \"https://some-fourth-host.example.com/v1/redirect/checkout\",\n    \"confirmation\" : \"https://some-other-host.example.com/yaco/orders/570714bf-3c2b-452e-90cd-f7c5e552bb25/redirect?auth_token=otherStuffz\",\n    \"terms\" : \"https://some-fourth-host.example.com/v1/redirect/terms\"\n  }\n}",
          "comment": ""
        },
        "redirectURL": "",
        "headersSize": 446,
        "bodySize": 1811,
        "comment": ""
      },
      "cache": {},
      "timings": {
        "comment": "",
        "dns": 0,
        "connect": 100,
        "send": 4,
        "wait": 1288,
        "receive": 1,
        "blocked": 0,
        "ssl": 61
      },
      "serverIPAddress": "10.225.41.52",
      "comment": "",
      "time": 1395
    }, {
      "pageref": "Page 0",
      "startedDateTime": "2018-02-19T11:40:19.713Z",
      "request": {
        "method": "CONNECT",
        "url": "https://a-third-host.example.com:3000",
        "httpVersion": "HTTP/1.1",
        "cookies": [],
        "headers": [],
        "queryString": [],
        "headersSize": 0,
        "bodySize": 0,
        "comment": ""
      },
      "response": {
        "status": 0,
        "statusText": "",
        "httpVersion": "unknown",
        "cookies": [],
        "headers": [],
        "content": {
          "size": 0,
          "mimeType": "",
          "comment": ""
        },
        "redirectURL": "",
        "headersSize": -1,
        "bodySize": -1,
        "comment": "",
        "_error": "Unable to connect to host"
      },
      "cache": {},
      "timings": {
        "comment": "",
        "dns": 32,
        "connect": 105,
        "send": 0,
        "wait": 0,
        "receive": 0,
        "blocked": 0,
        "ssl": -1
      },
      "serverIPAddress": "10.225.25.62",
      "comment": "",
      "time": 138
    }],
    "comment": ""
  }
}
