module go.k6.io/k6

go 1.19

require (
	github.com/Azure/go-ntlmssp v0.0.0-20221128193559-754e69321358
	github.com/DataDog/datadog-go v0.0.0-20180330214955-e67964b4021a
	github.com/PuerkitoBio/goquery v1.8.1
	github.com/Soontao/goHttpDigestClient v0.0.0-20170320082612-6d28bb1415c5
	github.com/andybalholm/brotli v1.0.5
	github.com/dop251/goja v0.0.0-20230216180835-5937a312edda
	github.com/fatih/color v1.14.1
	github.com/go-sourcemap/sourcemap v2.1.4-0.20211119122758-180fcef48034+incompatible
	github.com/golang/protobuf v1.5.2
	github.com/gorilla/websocket v1.5.0
	github.com/grafana/xk6-browser v0.8.1-0.20230207135343-cfd6a83dfc42
	github.com/grafana/xk6-output-prometheus-remote v0.1.0
	github.com/grafana/xk6-redis v0.1.1
	github.com/grafana/xk6-timers v0.1.2
	github.com/grafana/xk6-websockets v0.1.6
	github.com/influxdata/influxdb1-client v0.0.0-20190402204710-8ff2fc3824fc
	github.com/jhump/protoreflect v1.15.0
	github.com/klauspost/compress v1.16.0
	github.com/mailru/easyjson v0.7.7
	github.com/mattn/go-colorable v0.1.13
	github.com/mattn/go-isatty v0.0.17
	github.com/mccutchen/go-httpbin v1.1.2-0.20190116014521-c5cb2f4802fa
	github.com/mstoykov/atlas v0.0.0-20220811071828-388f114305dd
	github.com/mstoykov/envconfig v1.4.1-0.20220114105314-765c6d8c76f1
	github.com/nu7hatch/gouuid v0.0.0-20131221200532-179d4d0c4d8d
	github.com/pmezard/go-difflib v1.0.0
	github.com/serenize/snaker v0.0.0-20201027110005-a7ad2135616e
	github.com/sirupsen/logrus v1.9.0
	github.com/spf13/afero v1.1.2
	github.com/spf13/cobra v1.4.0
	github.com/spf13/pflag v1.0.5
	github.com/stretchr/testify v1.8.2
	github.com/tidwall/gjson v1.14.4
	github.com/tidwall/pretty v1.2.1
	go.uber.org/goleak v1.2.1
	golang.org/x/crypto v0.6.0
	golang.org/x/net v0.7.0
	golang.org/x/term v0.5.0
	golang.org/x/time v0.3.0
	google.golang.org/grpc v1.53.0
	google.golang.org/protobuf v1.28.2-0.20220831092852-f930b1dc76e8
	gopkg.in/guregu/null.v3 v3.3.0
	gopkg.in/yaml.v3 v3.0.1
)

require (
	github.com/andybalholm/cascadia v1.3.1 // indirect
	github.com/beorn7/perks v1.0.1 // indirect
	github.com/bufbuild/protocompile v0.2.1-0.20230123224550-da57cd758c2f // indirect
	github.com/cespare/xxhash/v2 v2.2.0 // indirect
	github.com/chromedp/cdproto v0.0.0-20221023212508-67ada9507fb2 // indirect
	github.com/chromedp/sysutil v1.0.0 // indirect
	github.com/davecgh/go-spew v1.1.1 // indirect
	github.com/dgryski/go-rendezvous v0.0.0-20200823014737-9f7001d12a5f // indirect
	github.com/dlclark/regexp2 v1.7.0 // indirect
	github.com/fsnotify/fsnotify v1.5.4 // indirect
	github.com/go-redis/redis/v8 v8.11.5 // indirect
	github.com/golang/snappy v0.0.4 // indirect
	github.com/inconshreveable/mousetrap v1.0.0 // indirect
	github.com/josharian/intern v1.0.0 // indirect
	github.com/matttproud/golang_protobuf_extensions v1.0.2-0.20181231171920-c182affec369 // indirect
	github.com/mstoykov/k6-taskqueue-lib v0.1.0 // indirect
	github.com/prometheus/client_golang v1.14.1-0.20221122130035-8b6e68085b10 // indirect
	github.com/prometheus/client_model v0.3.0 // indirect
	github.com/prometheus/common v0.37.0 // indirect
	github.com/prometheus/procfs v0.8.0 // indirect
	github.com/tidwall/match v1.1.1 // indirect
	go.buf.build/grpc/go/gogo/protobuf v1.4.9 // indirect
	go.buf.build/grpc/go/prometheus/prometheus v1.4.4 // indirect
	golang.org/x/sync v0.0.0-20220819030929-7fc1605a5dde // indirect
	golang.org/x/sys v0.5.0 // indirect
	golang.org/x/text v0.7.0 // indirect
	google.golang.org/genproto v0.0.0-20230110181048-76db0878b65f // indirect
)
