                      20                     -0.47193361
                   20.01                     -0.47027891
                   20.02                     -0.46870361
               20.029999                     -0.46720691
               20.039999                     -0.46578397
               20.049999                     -0.46443217
               20.059999                     -0.46314928
                   20.07                     -0.46193117
                   20.08                     -0.46077508
               20.089998                     -0.45967774
               20.099998                     -0.45863541
               20.109999                     -0.45764616
               20.120001                     -0.45670521
               20.130001                     -0.45580995
               20.139999                     -0.45495608
                   20.15                     -0.45414185
                   20.16                      -0.4533619
                   20.17                     -0.45261398
                   20.18                     -0.45189541
               20.189999                     -0.45120198
               20.199999                     -0.45053049
               20.209999                     -0.44987756
               20.219999                     -0.44924107
                   20.23                     -0.44861622
               20.239998                     -0.44800196
               20.249998                     -0.44739417
               20.259998                     -0.44679016
                   20.27                     -0.44618809
               20.280001                     -0.44558368
               20.290001                     -0.44497602
               20.299999                     -0.44436223
               20.309999                     -0.44373914
                   20.32                     -0.44310528
                   20.33                     -0.44245867
                   20.34                     -0.44179794
               20.349998                     -0.44111969
               20.359999                     -0.44042353
               20.369999                     -0.43970806
               20.379999                      -0.4389714
               20.389999                     -0.43821188
                    20.4                     -0.43742944
               20.409998                     -0.43662254
                   20.42                     -0.43579033
                   20.43                      -0.4349326
               20.440001                     -0.43404863
               20.450001                     -0.43313741
               20.459999                     -0.43220033
               20.469999                     -0.43123564
                   20.48                     -0.43024406
                   20.49                     -0.42922607
                    20.5                     -0.42818197
               20.509998                     -0.42711208
               20.519999                     -0.42601637
               20.529999                      -0.4248963
               20.539999                     -0.42375264
               20.549999                     -0.42258636
               20.559998                     -0.42139803
                   20.57                     -0.42018923
                   20.58                     -0.41896145
                   20.59                     -0.41771503
                    20.6                     -0.41645326
               20.610001                     -0.41517539
               20.619999                     -0.41388447
               20.629999                      -0.4125817
               20.639999                     -0.41126923
                   20.65                     -0.40994817
                   20.66                     -0.40862111
               20.669998                     -0.40728921
               20.679998                     -0.40595432
               20.689999                     -0.40461945
               20.699999                     -0.40328485
               20.710001                      -0.4019539
               20.720001                     -0.40062773
                   20.73                     -0.39930848
                   20.74                     -0.39799786
                   20.75                     -0.39669882
                   20.76                     -0.39541249
                   20.77                     -0.39414062
               20.779999                     -0.39288527
               20.789999                     -0.39164835
               20.799999                     -0.39043222
               20.809999                      -0.3892375
                   20.82                     -0.38806616
               20.829998                     -0.38691989
               20.839998                     -0.38580047
               20.849998                     -0.38470961
               20.860001                     -0.38364826
               20.870001                     -0.38261846
               20.879999                     -0.38161993
               20.889999                      -0.3806555
                    20.9                     -0.37972602
                   20.91                     -0.37883154
                   20.92                     -0.37797386
                   20.93                     -0.37715339
               20.939999                     -0.37637157
               20.949999                     -0.37562835
               20.959999                     -0.37492426
               20.969999                      -0.3742603
                   20.98                     -0.37363647
               20.989998                     -0.37305273
               20.999998                     -0.37251008
                   21.01                     -0.37200807
                   21.02                     -0.37154662
               21.030001                     -0.37112576
               21.040001                     -0.37074555
               21.049999                     -0.37040548
               21.059999                     -0.37010507
                   21.07                     -0.36984383
                   21.08                     -0.36962131
                   21.09                     -0.36943656
               21.099998                     -0.36928969
               21.109999                     -0.36917922
               21.119999                     -0.36910421
               21.129999                     -0.36906374
               21.139999                     -0.36905745
               21.149998                     -0.36908391
               21.159998                     -0.36914171
                   21.17                     -0.36922941
                   21.18                     -0.36934619
               21.190001                     -0.36949117
               21.199999                     -0.36966244
               21.209999                     -0.36985862
               21.219999                     -0.37007832
                   21.23                     -0.37032019
                   21.24                     -0.37058339
                   21.25                     -0.37086493
               21.259998                     -0.37116452
               21.269999                     -0.37148078
               21.279999                     -0.37181071
               21.289999                     -0.37215454
               21.299999                     -0.37250981
               21.309998                      -0.3728751
                   21.32                     -0.37324954
                   21.33                     -0.37363062
                   21.34                     -0.37401743
                   21.35                     -0.37440852
               21.360001                      -0.3748024
               21.369999                     -0.37519814
               21.379999                      -0.3755942
               21.389999                     -0.37598851
                    21.4                     -0.37638114
                   21.41                     -0.37676997
               21.419998                     -0.37715391
               21.429998                     -0.37753298
               21.439999                     -0.37790496
               21.449999                     -0.37826979
               21.460001                     -0.37862576
               21.469999                     -0.37897221
                   21.48                     -0.37930953
                   21.49                     -0.37963646
                    21.5                     -0.37995117
                   21.51                     -0.38025451
               21.519999                     -0.38054622
               21.529999                     -0.38082544
               21.539999                     -0.38109186
               21.549999                     -0.38134567
               21.559999                     -0.38158648
                   21.57                     -0.38181442
               21.579998                     -0.38203013
               21.589998                     -0.38223207
               21.599998                     -0.38242243
               21.610001                     -0.38260018
               21.620001                     -0.38276691
               21.629999                     -0.38292153
               21.639999                     -0.38306613
                   21.65                     -0.38320066
                   21.66                     -0.38332556
                   21.67                     -0.38344179
                   21.68                     -0.38355032
               21.689999                     -0.38365207
               21.699999                      -0.3837474
               21.709999                     -0.38383778
               21.719999                     -0.38392466
                   21.73                     -0.38400779
               21.739998                     -0.38408968
               21.749998                     -0.38417123
                   21.76                     -0.38425323
                   21.77                     -0.38433713
               21.780001                     -0.38442375
               21.789999                     -0.38451502
               21.799999                     -0.38461176
               21.809999                     -0.38471592
                   21.82                     -0.38482888
                   21.83                     -0.38495098
               21.839998                      -0.3850842
               21.849998                     -0.38522978
               21.859999                     -0.38538981
               21.869999                     -0.38556459
               21.879999                     -0.38575608
               21.889999                     -0.38596517
               21.899998                      -0.3861928
                   21.91                     -0.38644206
                   21.92                     -0.38671223
                   21.93                     -0.38700431
               21.940001                     -0.38732137
               21.949999                     -0.38766334
               21.959999                     -0.38803182
               21.969999                     -0.38842612
                   21.98                        -0.38885
                   21.99                     -0.38930234
                      22                     -0.38978482
               22.009998                     -0.39029784
               22.019999                     -0.39084321
               22.029999                     -0.39142031
               22.039999                     -0.39203029
               22.050001                     -0.39267379
               22.059999                     -0.39335186
                   22.07                     -0.39406425
                   22.08                     -0.39481144
                   22.09                     -0.39559366
                    22.1                     -0.39641151
               22.109999                     -0.39726523
               22.119999                     -0.39815483
               22.129999                     -0.39907997
               22.139999                     -0.40004089
                   22.15                     -0.40103827
               22.159998                     -0.40207106
               22.169998                     -0.40313857
               22.179998                     -0.40424145
               22.189999                     -0.40537982
               22.200001                     -0.40655171
               22.210001                     -0.40775791
               22.219999                      -0.4089967
                   22.23                     -0.41026903
                   22.24                     -0.41157342
                   22.25                     -0.41290918
                   22.26                      -0.4142762
               22.269999                     -0.41567275
               22.279999                     -0.41709892
               22.289999                     -0.41855316
               22.299999                     -0.42003444
               22.309999                      -0.4215432
                   22.32                     -0.42307703
               22.329998                     -0.42463517
               22.339998                     -0.42621745
                   22.35                     -0.42782256
               22.360001                     -0.42944905
               22.370001                     -0.43109595
               22.379999                     -0.43276272
               22.389999                     -0.43444797
                    22.4                     -0.43615078
                   22.41                      -0.4378699
                   22.42                     -0.43960482
               22.429998                     -0.44135399
               22.439999                     -0.44311735
               22.449999                     -0.44489251
               22.459999                     -0.44668003
               22.469999                     -0.44847829
               22.479998                     -0.45028677
               22.489998                     -0.45210313
                    22.5                     -0.45392886
                   22.51                     -0.45576266
                   22.52                     -0.45760273
               22.530001                     -0.45944938
               22.539999                     -0.46130217
               22.549999                     -0.46315972
               22.559999                     -0.46502278
                   22.57                     -0.46688991
                   22.58                     -0.46876148
               22.589998                     -0.47063745
               22.599998                     -0.47251702
               22.609999                     -0.47439994
               22.619999                     -0.47628671
               22.629999                     -0.47817755
               22.640001                     -0.48007212
                   22.65                     -0.48197086
                   22.66                     -0.48387387
                   22.67                     -0.48578145
                   22.68                     -0.48769495
               22.690001                     -0.48961316
               22.699999                     -0.49153897
               22.709999                     -0.49347096
               22.719999                     -0.49541051
                   22.73                      -0.4973587
                   22.74                     -0.49931734
               22.749998                     -0.50128526
               22.759998                     -0.50326506
               22.769999                     -0.50525784
               22.779999                     -0.50726395
               22.790001                     -0.50928553
               22.799999                     -0.51132325
               22.809999                     -0.51337833
                   22.82                     -0.51545241
                   22.83                     -0.51754773
                   22.84                      -0.5196649
                   22.85                     -0.52180558
               22.859999                     -0.52397161
               22.869999                     -0.52616488
               22.879999                     -0.52838574
               22.889999                     -0.53063741
                    22.9                     -0.53292109
               22.909998                     -0.53523968
               22.919998                     -0.53759272
               22.929998                     -0.53998337
               22.940001                     -0.54241333
               22.950001                       -0.544884
               22.960001                     -0.54739783
               22.969999                     -0.54995576
                   22.98                     -0.55256091
                   22.99                     -0.55521364
                      23                     -0.55791643
                   23.01                     -0.56067139
               23.019999                     -0.56348017
               23.029999                     -0.56634351
               23.039999                     -0.56926443
               23.049999                     -0.57224348
               23.059999                     -0.57528327
               23.069998                      -0.5783848
               23.079998                     -0.58154989
                   23.09                     -0.58477928
                    23.1                     -0.58807601
               23.110001                     -0.59143979
               23.119999                     -0.59487241
               23.129999                     -0.59837566
               23.139999                     -0.60195077
                   23.15                     -0.60559867
                   23.16                     -0.60932096
                   23.17                     -0.61311736
               23.179998                     -0.61698991
               23.189999                      -0.6209392
               23.199999                     -0.62496686
               23.209999                     -0.62907253
               23.219999                     -0.63325737
               23.229998                     -0.63752208
                   23.24                     -0.64186727
                   23.25                     -0.64629304
                   23.26                     -0.65080106
                   23.27                      -0.6553899
               23.280001                      -0.6600609
               23.289999                       -0.664815
               23.299999                     -0.66965015
               23.309999                     -0.67456921
                   23.32                     -0.67957068
                   23.33                     -0.68465427
               23.339998                     -0.68982069
               23.349998                     -0.69506995
               23.359999                      -0.7004016
               23.369999                     -0.70581614
               23.379999                      -0.7113119
               23.389999                      -0.7168892
                    23.4                     -0.72254901
                   23.41                     -0.72828961
                   23.42                     -0.73411152
                   23.43                     -0.74001398
               23.439999                     -0.74599616
               23.449999                     -0.75205966
               23.459999                     -0.75820062
               23.469999                      -0.7644229
                   23.48                     -0.77072368
                   23.49                     -0.77710235
               23.499998                     -0.78355989
               23.509998                     -0.79009594
               23.519999                     -0.79670978
               23.529999                     -0.80340107
               23.540001                     -0.81017095
               23.549999                     -0.81701784
               23.559999                     -0.82394242
                   23.57                     -0.83094456
                   23.58                     -0.83802536
                   23.59                     -0.84518361
                    23.6                     -0.85242028
               23.609999                     -0.85973583
               23.619999                     -0.86713086
               23.629999                     -0.87460575
               23.639999                     -0.88216164
                   23.65                      -0.8897992
               23.659998                      -0.8975182
               23.669998                     -0.90532119
               23.679998                     -0.91320924
               23.690001                     -0.92118377
               23.700001                     -0.92924526
               23.709999                     -0.93739649
               23.719999                     -0.94563834
                   23.73                     -0.95397325
                   23.74                      -0.9624032
                   23.75                     -0.97093002
               23.759998                      -0.9795577
               23.769999                     -0.98828666
               23.779999                     -0.99712006
               23.789999                      -1.0060626
               23.799999                      -1.0151154
               23.809999                      -1.0242817
               23.819998                       -1.033566
               23.829998                      -1.0429718
                   23.84                      -1.0525018
                   23.85                        -1.06216
               23.860001                       -1.071952
               23.869999                      -1.0818795
               23.879999                      -1.0919486
               23.889999                       -1.102164
                    23.9                      -1.1125289
                   23.91                      -1.1230492
                   23.92                        -1.13373
               23.929998                      -1.1445759
               23.939999                      -1.1555917
               23.949999                       -1.166784
               23.959999                      -1.1781569
               23.969999                      -1.1897183
               23.979998                      -1.2014714
                   23.99                      -1.2134227
                      24                      -1.2255791
                   24.01                      -1.2379462
                   24.02                      -1.2505309
               24.029999                      -1.2633377
               24.039999                      -1.2763746
               24.049999                      -1.2896471
               24.059999                      -1.3031623
                   24.07                      -1.3169258
               24.079998                      -1.3309449
               24.089998                      -1.3452264
               24.099998                      -1.3597758
               24.109999                       -1.374601
               24.119999                      -1.3897089
               24.130001                      -1.4051057
               24.139999                      -1.4207974
                   24.15                      -1.4367918
                   24.16                      -1.4530955
                   24.17                      -1.4697139
                   24.18                      -1.4866546
               24.189999                      -1.5039247
               24.199999                      -1.5215304
               24.209999                      -1.5394768
               24.219999                      -1.5577722
                   24.23                      -1.5764221
                   24.24                      -1.5954329
               24.249998                      -1.6148109
               24.259998                      -1.6345613
               24.269999                      -1.6546903
               24.280001                      -1.6752051
               24.290001                       -1.696111
               24.299999                       -1.717412
               24.309999                      -1.7391146
                   24.32                      -1.7612241
                   24.33                      -1.7837459
                   24.34                      -1.8066852
               24.349998                      -1.8300467
               24.359999                      -1.8538347
               24.369999                      -1.8780546
               24.379999                      -1.9027099
               24.389999                      -1.9278073
               24.399998                      -1.9533465
               24.409998                      -1.9793354
               24.419998                      -2.0057775
                   24.43                      -2.0326741
               24.440001                      -2.0600315
               24.450001                      -2.0878511
               24.459999                      -2.1161379
               24.469999                      -2.1448941
                   24.48                      -2.1741215
                   24.49                      -2.2038251
                    24.5                      -2.2340086
               24.509998                      -2.2646697
               24.519999                      -2.2958173
               24.529999                      -2.3274513
               24.539999                      -2.3595726
               24.549999                      -2.3921856
               24.559999                      -2.4252934
               24.569998                      -2.4588966
                   24.58                      -2.4929986
                   24.59                      -2.5276023
                    24.6                       -2.562709
               24.610001                      -2.5983224
               24.619999                      -2.6344442
               24.629999                      -2.6710799
               24.639999                      -2.7082281
                   24.65                      -2.7458955
                   24.66                      -2.7840842
               24.669998                       -2.822798
               24.679998                      -2.8620405
               24.689999                      -2.9018143
               24.699999                      -2.9421259
               24.709999                      -2.9829795
               24.719997                      -3.0243794
                   24.73                      -3.0663315
                   24.74                      -3.1088413
                   24.75                      -3.1519146
                   24.76                      -3.1955609
                   24.77                       -3.239783
               24.779999                       -3.284593
               24.789999                       -3.329997
               24.799999                      -3.3760037
               24.809999                      -3.4226238
                   24.82                      -3.4698677
               24.829998                      -3.5177436
               24.839998                      -3.5662658
               24.849998                      -3.6154475
               24.859999                      -3.6652994
               24.870001                      -3.7158378
               24.880001                      -3.7670754
               24.889999                      -3.8190288
                    24.9                      -3.8717134
                   24.91                      -3.9251472
                   24.92                      -3.9793506
                   24.93                      -4.0343389
               24.939999                      -4.0901358
               24.949999                      -4.1467601
               24.959999                      -4.2042346
               24.969999                      -4.2625833
                   24.98                       -4.321829
               24.989998                      -4.3819968
               24.999998                      -4.4431118
               25.009998                      -4.5052034
                   25.02                      -4.5682977
               25.030001                      -4.6324242
               25.039999                      -4.6976134
               25.049999                       -4.763896
               25.059999                      -4.8313026
                   25.07                      -4.8998674
                   25.08                      -4.9696258
                   25.09                      -5.0406097
               25.099998                      -5.1128564
               25.109999                      -5.1863992
               25.119999                        -5.26128
               25.129999                      -5.3375349
               25.139999                      -5.4152009
               25.149998                      -5.4943209
               25.159998                      -5.5749299
                   25.17                      -5.6570749
                   25.18                      -5.7407912
               25.190001                      -5.8261244
               25.200001                      -5.9131136
               25.209999                      -6.0017994
               25.219999                      -6.0922294
                   25.23                      -6.1844408
                   25.24                      -6.2784779
                   25.25                      -6.3743821
               25.259998                      -6.4721927
               25.269999                      -6.5719535
               25.279999                      -6.6737038
               25.289999                      -6.7774812
               25.299999                      -6.8833217
               25.309998                      -6.9912675
                   25.32                      -7.1013527
                   25.33                      -7.2136016
                   25.34                      -7.3280543
                   25.35                      -7.4447361
               25.359999                        -7.56367
               25.369999                      -7.6848788
               25.379999                      -7.8083816
               25.389999                       -7.934187
                    25.4                      -8.0623087
                   25.41                      -8.1927489
               25.419998                      -8.3255029
               25.429998                        -8.46056
               25.439999                      -8.5979008
               25.449999                      -8.7375066
               25.460001                      -8.8793347
               25.469999                      -9.0233412
                   25.48                      -9.1694656
                   25.49                       -9.317645
                    25.5                      -9.4677874
                   25.51                      -9.6197949
                   25.52                      -9.7735508
               25.529999                      -9.9289228
               25.539999                      -10.085755
               25.549999                       -10.24387
               25.559999                      -10.403069
                   25.57                      -10.563126
               25.579998                      -10.723797
               25.589998                      -10.884791
               25.599998                      -11.045806
               25.610001                      -11.206502
               25.620001                      -11.366503
               25.629999                      -11.525405
               25.639999                      -11.682774
                   25.65                      -11.838131
                   25.66                      -11.990973
                   25.67                      -12.140773
               25.679998                       -12.28696
               25.689999                      -12.428953
               25.699999                      -12.566149
               25.709999                      -12.697926
               25.719999                      -12.823663
                   25.73                      -12.942734
               25.739998                      -13.054534
               25.749998                      -13.158467
               25.759998                      -13.253989
                   25.77                      -13.340579
               25.780001                       -13.41778
               25.789999                      -13.485209
               25.799999                      -13.542536
               25.809999                      -13.589521
                   25.82                      -13.626022
                   25.83                      -13.651985
                   25.84                      -13.667434
               25.849998                      -13.672498
               25.859999                      -13.667396
               25.869999                      -13.652413
               25.879999                       -13.62792
               25.889999                       -13.59435
               25.899998                      -13.552195
               25.909998                      -13.501985
                   25.92                      -13.444281
                   25.93                      -13.379666
               25.940001                      -13.308746
               25.949999                      -13.232134
               25.959999                      -13.150401
               25.969999                      -13.064156
                   25.98                      -12.973942
                   25.99                      -12.880319
               25.999998                      -12.783799
               26.009998                      -12.684862
               26.019999                      -12.583965
               26.029999                      -12.481542
               26.039999                      -12.377977
               26.049999                       -12.27363
               26.059998                      -12.168834
                   26.07                       -12.06388
                   26.08                      -11.959054
                   26.09                      -11.854595
                    26.1                      -11.750711
               26.109999                      -11.647615
               26.119999                      -11.545467
               26.129999                      -11.444432
               26.139999                      -11.344631
                   26.15                      -11.246192
                   26.16                      -11.149216
               26.169998                      -11.053796
               26.179998                      -10.959996
               26.189999                       -10.86789
               26.199999                      -10.777537
               26.210001                      -10.688964
               26.219999                      -10.602225
                   26.23                      -10.517339
                   26.24                      -10.434335
                   26.25                      -10.353223
                   26.26                      -10.274019
               26.269999                      -10.196731
               26.279999                      -10.121356
               26.289999                      -10.047897
               26.299999                      -9.9763512
               26.309999                       -9.906709
               26.319998                       -9.838961
               26.329998                      -9.7730985
               26.339998                      -9.7091087
               26.349998                      -9.6469763
               26.360001                      -9.5866844
               26.370001                      -9.5282187
               26.379999                      -9.4715609
               26.389999                      -9.4166897
                    26.4                      -9.3635899
                   26.41                      -9.3122404
                   26.42                      -9.2626219
               26.429998                      -9.2147152
               26.439999                      -9.1684996
               26.449999                      -9.1239546
               26.459999                      -9.0810603
               26.469999                      -9.0397977
                   26.48                      -9.0001461
               26.489998                      -8.9620856
               26.499998                      -8.9255965
                   26.51                      -8.8906605
                   26.52                      -8.8572579
               26.530001                      -8.8253699
               26.539999                      -8.7949782
               26.549999                      -8.7660649
               26.559999                      -8.7386119
                   26.57                      -8.7126026
                   26.58                      -8.6880194
               26.589998                      -8.6648463
               26.599998                      -8.6430663
               26.609999                      -8.6226645
               26.619999                      -8.6036254
               26.629999                       -8.585933
               26.639997                      -8.5695749
               26.649998                      -8.5545352
                   26.66                      -8.5408007
                   26.67                      -8.5283589
                   26.68                       -8.517196
               26.690001                      -8.5072999
               26.699999                      -8.4986598
               26.709999                      -8.4912623
               26.719999                      -8.4850974
                   26.73                      -8.4801552
                   26.74                      -8.4764242
               26.749998                      -8.4738958
               26.759998                      -8.4725604
               26.769999                      -8.4724086
               26.779999                      -8.4734337
               26.789999                      -8.4756257
               26.800001                      -8.4789787
               26.809999                      -8.4834861
                   26.82                      -8.4891408
                   26.83                      -8.4959365
                   26.84                      -8.5038698
                   26.85                      -8.5129335
               26.859999                      -8.5231259
               26.869999                      -8.5344416
               26.879999                      -8.5468787
               26.889999                      -8.5604333
                    26.9                      -8.5751049
               26.909998                      -8.5908907
               26.919998                      -8.6077915
               26.929998                      -8.6258069
               26.939999                       -8.644938
               26.950001                      -8.6651863
               26.959999                      -8.6865513
               26.969999                      -8.7090394
                   26.98                      -8.7326528
                   26.99                      -8.7573963
                      27                      -8.7832772
                   27.01                      -8.8102959
               27.019999                      -8.8384654
               27.029999                      -8.8677885
               27.039999                      -8.8982794
               27.049999                      -8.9299469
               27.059999                      -8.9627969
               27.069998                      -8.9968452
               27.079998                      -9.0321073
               27.089998                      -9.0685909
                    27.1                      -9.1063183
               27.110001                      -9.1452994
               27.120001                      -9.1855536
               27.129999                      -9.2271026
               27.139999                      -9.2699651
                   27.15                        -9.31416
                   27.16                      -9.3597164
                   27.17                       -9.406652
               27.179998                      -9.4549959
               27.189999                       -9.504773
               27.199999                      -9.5560184
               27.209999                       -9.608757
               27.219999                      -9.6630258
               27.229998                      -9.7188515
               27.239998                      -9.7762763
                   27.25                       -9.835336
                   27.26                      -9.8960657
                   27.27                      -9.9585177
               27.279999                      -10.022727
               27.289999                      -10.088746
               27.299999                      -10.156617
               27.309999                      -10.226399
                   27.32                      -10.298135
                   27.33                      -10.371891
               27.339998                      -10.447721
               27.349998                      -10.525682
               27.359999                      -10.605847
               27.369999                      -10.688279
               27.379999                      -10.773042
               27.389997                      -10.860227
                    27.4                      -10.949904
                   27.41                      -11.042147
                   27.42                      -11.137049
                   27.43                      -11.234693
               27.440001                       -11.33519
               27.449999                      -11.438619
               27.459999                      -11.545094
               27.469999                      -11.654728
                   27.48                      -11.767632
                   27.49                      -11.883926
               27.499998                      -12.003733
               27.509998                      -12.127195
               27.519999                      -12.254453
               27.529999                      -12.385666
               27.540001                      -12.520961
               27.549999                       -12.66054
               27.559999                      -12.804567
                   27.57                      -12.953235
                   27.58                      -13.106737
                   27.59                      -13.265276
               27.599998                      -13.429104
               27.609999                      -13.598448
               27.619999                      -13.773579
               27.629999                      -13.954747
               27.639999                      -14.142263
                   27.65                      -14.336441
               27.659998                      -14.537627
               27.669998                      -14.746188
               27.679998                      -14.962501
               27.690001                      -15.187016
               27.700001                      -15.420182
               27.709999                      -15.662513
               27.719999                      -15.914572
                   27.73                      -16.176922
                   27.74                      -16.450214
                   27.75                      -16.735178
                   27.76                      -17.032614
               27.769999                      -17.343355
               27.779999                      -17.668366
               27.789999                      -18.008705
               27.799999                      -18.365541
               27.809999                      -18.740191
               27.819998                      -19.134032
               27.829998                      -19.548711
                   27.84                      -19.985986
                   27.85                      -20.447865
               27.860001                       -20.93651
               27.869999                      -21.454319
               27.879999                      -22.003894
               27.889999                      -22.587981
                    27.9                      -23.209358
                   27.91                      -23.870518
               27.919998                      -24.573484
               27.929998                       -25.31865
               27.939999                      -26.103342
               27.949999                      -26.919681
               27.959999                      -27.749866
               27.969999                      -28.560561
               27.979998                      -29.296259
                   27.99                      -29.877478
                      28                      -30.213625
                   28.01                      -30.237118
                   28.02                      -29.939822
               28.029999                       -29.37826
               28.039999                      -28.641242
               28.049999                      -27.812837
               28.059999                      -26.954224
                   28.07                      -26.103392
                   28.08                      -25.281043
               28.089998                      -24.497051
               28.099998                         -23.755
               28.109999                      -23.054932
               28.119999                      -22.395231
               28.129999                      -21.773435
               28.139999                      -21.186773
                   28.15                      -20.632485
                   28.16                      -20.107945
                   28.17                      -19.610686
                   28.18                      -19.138504
               28.189999                      -18.689337
               28.199999                      -18.261386
               28.209999                      -17.852999
               28.219999                      -17.462703
                   28.23                      -17.089179
               28.239998                      -16.731219
               28.249998                      -16.387749
               28.259998                      -16.057785
               28.269999                      -15.740478
               28.279999                      -15.434985
               28.290001                      -15.140596
               28.299999                      -14.856661
               28.309999                      -14.582547
                   28.32                      -14.317698
                   28.33                      -14.061617
                   28.34                      -13.813821
               28.349998                      -13.573887
               28.359999                       -13.34139
               28.369999                       -13.11599
               28.379999                      -12.897318
               28.389999                      -12.685071
                    28.4                      -12.478928
               28.409998                      -12.278634
               28.419998                      -12.083915
               28.429998                      -11.894539
               28.440001                      -11.710263
               28.450001                      -11.530883
               28.459999                      -11.356197
               28.469999                      -11.186023
                   28.48                      -11.020172
                   28.49                      -10.858482
                    28.5                      -10.700796
               28.509998                      -10.546959
               28.519999                      -10.396837
               28.529999                      -10.250295
               28.539999                      -10.107197
               28.549999                      -9.9674323
               28.559998                      -9.8308876
               28.569998                      -9.6974448
               28.579998                      -9.5670052
                   28.59                      -9.4394747
                    28.6                      -9.3147618
               28.610001                      -9.1927689
               28.619999                      -9.0734176
               28.629999                      -8.9566294
               28.639999                      -8.8423225
                   28.65                      -8.7304196
                   28.66                      -8.6208656
               28.669998                      -8.5135721
               28.679998                      -8.4084948
               28.689999                      -8.3055594
               28.699999                      -8.2047164
               28.709999                      -8.1059036
               28.719999                      -8.0090714
               28.729998                      -7.9141638
                   28.74                       -7.821136
                   28.75                       -7.729939
                   28.76                       -7.640529
                   28.77                      -7.5528578
               28.779999                      -7.4668954
               28.789999                      -7.3825888
               28.799999                      -7.2999053
               28.809999                       -7.218809
                   28.82                       -7.139264
               28.829998                      -7.0612384
               28.839998                      -6.9846948
               28.849998                      -6.9096071
               28.859999                      -6.8359421
               28.869999                      -6.7636722
               28.879997                      -6.6927694
               28.889999                       -6.623209
                    28.9                      -6.5549604
                   28.91                      -6.4880024
                   28.92                       -6.422313
                   28.93                      -6.3578631
               28.939999                      -6.2946359
               28.949999                      -6.2326064
               28.959999                      -6.1717569
               28.969999                      -6.1120657
                   28.98                      -6.0535134
               28.989998                      -5.9960823
               28.999998                      -5.9397531
               29.009998                      -5.8845087
               29.019999                      -5.8303329
               29.030001                      -5.7772089
               29.040001                      -5.7251197
               29.049999                      -5.6740524
               29.059999                      -5.6239898
                   29.07                      -5.5749178
                   29.08                      -5.5268238
                   29.09                       -5.479692
               29.099998                      -5.4335101
               29.109999                      -5.3882652
               29.119999                      -5.3439435
               29.129999                      -5.3005339
               29.139999                      -5.2580238
               29.149998                      -5.2164003
               29.159998                      -5.1756523
               29.169998                      -5.1357697
                   29.18                      -5.0967416
               29.190001                       -5.058556
               29.199999                       -5.021202
               29.209999                      -4.9846691
               29.219999                       -4.948948
                   29.23                      -4.9140279
                   29.24                      -4.8798993
                   29.25                      -4.8465519
               29.259998                      -4.8139765
               29.269999                      -4.7821629
               29.279999                      -4.7511022
               29.289999                      -4.7207853
               29.299999                      -4.6912028
               29.309998                      -4.6623449
               29.319998                      -4.6342037
                   29.33                      -4.6067699
                   29.34                       -4.580034
                   29.35                      -4.5539869
               29.360001                      -4.5286207
               29.369999                      -4.5039269
               29.379999                      -4.4798964
               29.389999                      -4.4565202
                    29.4                      -4.4337903
                   29.41                      -4.4116971
               29.419998                      -4.3902332
               29.429998                      -4.3693892
               29.439999                      -4.3491577
               29.449999                       -4.329528
               29.459999                      -4.3104932
               29.469997                      -4.2920442
                   29.48                      -4.2741723
                   29.49                       -4.256869
                    29.5                      -4.2401253
                   29.51                      -4.2239323
               29.519999                      -4.2082828
               29.529999                      -4.1931672
               29.539999                      -4.1785762
               29.549999                      -4.1645017
               29.559999                      -4.1509339
                   29.57                      -4.1378654
               29.579998                      -4.1252863
               29.589998                      -4.1131877
               29.599998                      -4.1015605
               29.609999                      -4.0903971
               29.620001                      -4.0796874
               29.629999                      -4.0694217
               29.639999                      -4.0595925
                   29.65                      -4.0501894
                   29.66                      -4.0412051
                   29.67                      -4.0326271
                   29.68                       -4.024451
               29.689999                       -4.016663
               29.699999                      -4.0092577
               29.709999                      -4.0022247
               29.719999                      -3.9955535
                   29.73                      -3.9892375
               29.739998                      -3.9832667
               29.749998                      -3.9776339
               29.759998                      -3.9723285
                   29.77                      -3.9673413
               29.780001                      -3.9626644
               29.789999                      -3.9582914
               29.799999                       -3.954212
               29.809999                      -3.9504177
                   29.82                      -3.9469016
                   29.83                      -3.9436558
               29.839998                      -3.9406721
               29.849998                      -3.9379433
               29.859999                      -3.9354632
               29.869999                      -3.9332225
               29.879999                      -3.9312172
               29.889999                      -3.9294403
               29.899998                      -3.9278852
               29.909998                      -3.9265449
                   29.92                      -3.9254169
                   29.93                      -3.9244941
               29.940001                      -3.9237729
               29.949999                      -3.9232491
               29.959999                      -3.9229181
               29.969999                      -3.9227766
                   29.98                      -3.9228217
                   29.99                      -3.9230501
                      30                       -3.923462