                      20                      -5.3736741
               20.011999                      -5.3688962
                  20.024                      -5.3643216
               20.035999                      -5.3599524
               20.047998                      -5.3557897
               20.059999                      -5.3518301
               20.071999                      -5.3480686
                  20.084                      -5.3444969
               20.095999                      -5.3411062
               20.107998                      -5.3378833
               20.120001                      -5.3348156
                  20.132                        -5.33189
               20.144001                      -5.3290906
                  20.156                      -5.3264014
               20.167999                      -5.3238073
                   20.18                      -5.3212943
               20.191999                      -5.3188484
               20.203999                      -5.3164561
                  20.216                      -5.3141053
               20.227999                      -5.3117867
               20.239998                      -5.3094943
               20.251999                      -5.3072202
               20.263998                      -5.3049641
               20.276001                      -5.3027221
                  20.288                      -5.3004981
               20.299999                      -5.2982969
                  20.312                       -5.296123
               20.323999                      -5.2939861
                  20.336                      -5.2918978
                  20.348                      -5.2898684
               20.359999                      -5.2879135
                  20.372                      -5.2860472
               20.383999                      -5.2842864
               20.395998                      -5.2826456
               20.407999                      -5.2811428
                   20.42                      -5.2797927
               20.431999                      -5.2786112
                  20.444                      -5.2776114
               20.455999                      -5.2768068
                  20.468                      -5.2762077
                   20.48                      -5.2758224
               20.491999                      -5.2756586
                  20.504                      -5.2757179
               20.515999                      -5.2760024
                  20.528                      -5.2765105
               20.539999                      -5.2772358
               20.551998                      -5.2781725
               20.564001                      -5.2793083
                  20.576                      -5.2806292
               20.587999                      -5.2821197
                    20.6                      -5.2837599
                  20.612                      -5.2855292
               20.623999                      -5.2874045
                  20.636                       -5.289361
               20.647999                      -5.2913705
                   20.66                      -5.2934087
               20.671999                      -5.2954451
               20.683998                      -5.2974539
               20.695999                      -5.2994066
               20.707998                      -5.3012759
               20.720001                      -5.3030375
                  20.732                       -5.304667
               20.743999                      -5.3061419
               20.756001                      -5.3074425
                  20.768                      -5.3085503
               20.779999                      -5.3094532
                  20.792                      -5.3101388
               20.803999                      -5.3105978
               20.815998                      -5.3108263
               20.827999                      -5.3108219
               20.839998                      -5.3105873
               20.851999                      -5.3101255
                  20.864                       -5.309447
               20.875999                      -5.3085593
                  20.888                      -5.3074772
                    20.9                      -5.3062174
               20.912001                       -5.304795
                  20.924                       -5.303232
               20.935999                      -5.3015479
                  20.948                      -5.2997642
               20.959999                      -5.2979021
               20.971998                      -5.2959854
               20.983999                      -5.2940361
               20.995998                       -5.292074
               21.007998                      -5.2901218
                   21.02                      -5.2881973
                  21.032                      -5.2863185
               21.044001                      -5.2845032
                  21.056                      -5.2827637
               21.067999                      -5.2811131
                   21.08                       -5.279561
               21.091999                      -5.2781153
                  21.104                      -5.2767818
               21.115999                      -5.2755638
               21.127998                      -5.2744618
               21.139999                      -5.2734746
               21.151999                      -5.2726011
                  21.164                      -5.2718345
               21.176001                      -5.2711701
                  21.188                      -5.2705995
               21.199999                      -5.2701142
                  21.212                       -5.269706
               21.223999                      -5.2693637
                  21.236                      -5.2690771
               21.247999                      -5.2688368
               21.259998                      -5.2686335
               21.271999                       -5.268455
               21.283998                      -5.2682956
                  21.296                      -5.2681467
               21.308001                      -5.2680006
                   21.32                      -5.2678532
               21.332001                      -5.2676985
                  21.344                      -5.2675372
               21.355999                      -5.2673656
                  21.368                      -5.2671843
               21.379999                      -5.2669965
               21.391998                      -5.2668041
               21.403999                      -5.2666131
               21.415998                      -5.2664294
               21.427999                       -5.266258
               21.439999                      -5.2661094
               21.451998                      -5.2659913
               21.464001                      -5.2659119
                  21.476                      -5.2658828
               21.488001                       -5.265911
                    21.5                      -5.2660086
               21.511999                      -5.2661846
                  21.524                      -5.2664458
               21.535999                      -5.2668025
               21.547998                      -5.2672606
               21.559999                      -5.2678271
               21.571999                      -5.2685079
               21.583998                      -5.2693047
               21.595999                      -5.2702229
                  21.608                      -5.2712616
               21.620001                      -5.2724216
                  21.632                      -5.2737018
               21.643999                      -5.2750997
                  21.656                      -5.2766124
               21.667999                       -5.278231
                   21.68                      -5.2799538
               21.691999                      -5.2817721
               21.703999                      -5.2836771
                  21.716                       -5.285663
               21.727999                      -5.2877188
               21.739998                       -5.289837
               21.752001                       -5.292008
                  21.764                       -5.294223
               21.775999                       -5.296474
                  21.788                      -5.2987528
               21.799999                       -5.301053
                  21.812                      -5.3033657
               21.823999                      -5.3056883
               21.835999                      -5.3080154
                  21.848                      -5.3103422
               21.859999                      -5.3126678
                  21.872                      -5.3149918
               21.883999                      -5.3173141
               21.895998                      -5.3196346
               21.908001                      -5.3219585
                   21.92                      -5.3242879
               21.931999                      -5.3266279
                  21.944                      -5.3289844
               21.955999                      -5.3313633
               21.967999                      -5.3337722
                   21.98                      -5.3362183
               21.991999                      -5.3387096
                  22.004                      -5.3412536
               22.015999                      -5.3438571
               22.027998                      -5.3465308
               22.039999                      -5.3492797
                  22.052                      -5.3521103
               22.064001                      -5.3550301
                  22.076                       -5.358044
               22.087999                      -5.3611562
                    22.1                      -5.3643707
                  22.112                      -5.3676891
               22.123999                      -5.3711131
                  22.136                      -5.3746442
               22.147999                      -5.3782805
               22.159998                      -5.3820197
               22.171999                      -5.3858604
               22.183998                      -5.3897972
               22.196001                      -5.3938261
                  22.208                      -5.3979421
               22.219999                      -5.4021377
                  22.232                      -5.4064073
               22.243999                      -5.4107447
               22.256001                      -5.4151411
                  22.268                      -5.4195899
               22.279999                      -5.4240838
                  22.292                      -5.4286173
               22.303999                      -5.4331817
               22.315998                      -5.4377723
               22.327999                      -5.4423835
               22.339998                      -5.4470111
               22.351999                      -5.4516513
                  22.364                      -5.4563006
               22.375999                      -5.4609573
                  22.388                       -5.465622
                    22.4                      -5.4702929
               22.411999                      -5.4749742
                  22.424                      -5.4796656
               22.435999                       -5.484371
                  22.448                      -5.4890952
               22.459999                      -5.4938417
               22.471998                      -5.4986189
               22.483999                      -5.5034297
                  22.496                      -5.5082825
               22.507999                      -5.5131842
                   22.52                      -5.5181398
                  22.532                      -5.5231599
               22.543999                      -5.5282483
                  22.556                      -5.5334124
               22.567999                      -5.5386588
                   22.58                       -5.543993
               22.591999                      -5.5494194
               22.603998                       -5.554944
               22.615999                      -5.5605676
               22.627998                      -5.5662944
               22.640001                      -5.5721265
                  22.652                      -5.5780621
                  22.664                      -5.5841023
               22.676001                      -5.5902467
                  22.688                      -5.5964915
               22.699999                      -5.6028351
                  22.712                      -5.6092714
               22.723999                      -5.6157983
               22.735998                      -5.6224087
               22.747999                      -5.6290979
               22.759998                      -5.6358591
               22.771999                      -5.6426863
               22.783998                      -5.6495748
                  22.796                      -5.6565153
               22.808001                      -5.6635039
                   22.82                      -5.6705337
               22.832001                      -5.6776001
                  22.844                      -5.6846974
               22.855999                       -5.691823
                  22.868                       -5.698971
               22.879999                       -5.706141
               22.891998                      -5.7133309
               22.903999                      -5.7205399
               22.915998                      -5.7277677
               22.927998                      -5.7350154
               22.940001                      -5.7422864
                  22.952                      -5.7495825
               22.964001                      -5.7569075
                  22.976                      -5.7642662
               22.987999                      -5.7716643
                      23                      -5.7791062
               23.011999                      -5.7865995
                  23.024                      -5.7941496
               23.035999                      -5.8017632
               23.047998                      -5.8094477
               23.059999                      -5.8172088
               23.071999                       -5.825054
               23.083998                      -5.8329877
               23.096001                      -5.8410178
                  23.108                      -5.8491467
               23.119999                      -5.8573802
                  23.132                      -5.8657214
               23.143999                      -5.8741735
                  23.156                      -5.8827367
               23.167999                      -5.8914141
               23.179998                      -5.9002038
               23.191999                      -5.9091059
               23.203999                      -5.9181192
                  23.216                      -5.9272397
               23.227999                      -5.9364647
                   23.24                      -5.9457901
               23.252001                      -5.9552104
                  23.264                      -5.9647222
               23.275999                      -5.9743183
                  23.288                      -5.9839934
               23.299999                       -5.993742
               23.311998                      -6.0035573
               23.323999                      -6.0134338
               23.335999                      -6.0233663
                  23.348                      -6.0333491
               23.359999                      -6.0433785
               23.371998                      -6.0534499
               23.384001                      -6.0635596
                  23.396                      -6.0737073
               23.408001                      -6.0838884
                   23.42                      -6.0941041
               23.431999                      -6.1043545
                  23.444                      -6.1146398
               23.455999                      -6.1249629
               23.467999                      -6.1353264
                   23.48                       -6.145734
               23.491999                      -6.1561905
               23.503998                      -6.1667014
               23.515999                      -6.1772721
               23.527998                      -6.1879084
               23.540001                      -6.1986178
                  23.552                      -6.2094064
               23.563999                      -6.2202814
                  23.576                      -6.2312492
               23.587999                      -6.2423168
                    23.6                      -6.2534905
                  23.612                      -6.2647762
               23.623999                      -6.2761791
                  23.636                      -6.2877037
               23.647999                      -6.2993537
               23.659998                      -6.3111325
               23.671999                      -6.3230419
                  23.684                       -6.335084
               23.695999                      -6.3472576
                  23.708                      -6.3595632
               23.719999                      -6.3719991
                  23.732                      -6.3845621
               23.743999                      -6.3972506
               23.755999                      -6.4100585
                  23.768                      -6.4229827
               23.779999                      -6.4360171
                  23.792                      -6.4491558
               23.803999                      -6.4623946
               23.815998                      -6.4757263
               23.828001                      -6.4891447
                   23.84                       -6.502644
               23.851999                      -6.5162186
                  23.864                      -6.5298631
               23.875999                      -6.5435729
               23.887999                      -6.5573429
                    23.9                      -6.5711707
               23.911999                      -6.5850546
                  23.924                      -6.5989907
               23.935999                      -6.6129804
               23.947998                      -6.6270225
               23.959999                      -6.6411193
               23.971998                      -6.6552717
               23.984001                      -6.6694849
                  23.996                      -6.6837622
               24.007999                      -6.6981081
                   24.02                       -6.712529
                  24.032                      -6.7270314
               24.043999                      -6.7416218
                  24.056                      -6.7563081
               24.067999                       -6.771098
               24.079998                      -6.7860003
               24.091999                      -6.8010203
               24.103998                      -6.8161678
               24.115999                      -6.8314497
                  24.128                      -6.8468721
               24.139999                      -6.8624418
                  24.152                      -6.8781648
                  24.164                      -6.8940447
               24.176001                      -6.9100868
                  24.188                      -6.9262923
               24.199999                      -6.9426643
                  24.212                      -6.9592039
               24.223999                      -6.9759095
               24.235998                      -6.9927808
               24.247999                      -7.0098162
               24.259998                      -7.0270106
               24.271997                      -7.0443607
                  24.284                      -7.0618626
                  24.296                       -7.079509
               24.308001                       -7.097295
                   24.32                      -7.1152144
               24.331999                      -7.1332592
                  24.344                      -7.1514274
               24.355999                      -7.1697033
                  24.368                      -7.1880873
               24.379999                      -7.2065747
               24.391998                      -7.2251553
               24.403999                      -7.2438253
               24.415998                      -7.2625838
               24.427998                      -7.2814265
               24.440001                      -7.3003478
                  24.452                      -7.3193567
               24.463999                      -7.3384442
                  24.476                      -7.3576137
               24.487999                      -7.3768725
                    24.5                      -7.3962171
               24.511999                      -7.4156637
               24.523998                      -7.4352081
               24.535999                      -7.4548621
               24.547998                      -7.4746317
               24.559999                      -7.4945306
               24.572001                      -7.5145603
                  24.584                      -7.5347334
               24.596001                       -7.555063
                  24.608                      -7.5755595
               24.619999                      -7.5962248
                  24.632                      -7.6170773
               24.643999                        -7.63812
               24.655998                      -7.6593619
               24.667999                      -7.6808095
               24.679998                      -7.7024748
               24.691999                      -7.7243575
               24.703999                      -7.7464583
               24.715998                      -7.7687915
               24.728001                      -7.7913511
                   24.74                      -7.8141375
               24.752001                      -7.8371502
                  24.764                      -7.8603877
               24.775999                      -7.8838455
                  24.788                      -7.9075195
               24.799999                       -7.931403
               24.811998                      -7.9554917
               24.823999                      -7.9797754
               24.835999                      -8.0042482
               24.847998                      -8.0289016
               24.859999                      -8.0537273
               24.871998                      -8.0787161
               24.884001                      -8.1038622
                  24.896                      -8.1291559
               24.907999                      -8.1545917
                   24.92                      -8.1801642
               24.931999                       -8.205868
                  24.944                      -8.2316998
               24.955999                      -8.2576566
               24.967999                      -8.2837406
                   24.98                      -8.3099505
               24.991999                      -8.3362894
               25.003998                       -8.362762
               25.016001                      -8.3893726
                  25.028                      -8.4161298
               25.039999                       -8.443044
                  25.052                      -8.4701225
               25.063999                      -8.4973797
                  25.076                      -8.5248264
               25.087999                      -8.5524753
               25.099998                      -8.5803419
                  25.112                      -8.6084399
               25.123999                      -8.6367841
                  25.136                      -8.6653883
               25.147999                      -8.6942672
               25.159998                      -8.7234343
               25.172001                      -8.7529006
                  25.184                      -8.7826785
               25.195999                      -8.8127783
                  25.208                      -8.8432082
               25.219999                      -8.8739757
               25.231998                      -8.9050855
               25.243999                      -8.9365416
               25.255999                      -8.9683441
                  25.268                       -9.000493
               25.279999                      -9.0329856
               25.291998                      -9.0658195
               25.303999                      -9.0989865
               25.315998                        -9.13248
               25.328001                      -9.1662907
                   25.34                      -9.2004101
               25.351999                      -9.2348235
                  25.364                      -9.2695234
               25.375999                      -9.3044967
               25.387999                      -9.3397299
                    25.4                      -9.3752121
               25.411999                      -9.4109337
               25.423998                      -9.4468827
               25.435999                      -9.4830522
               25.447998                      -9.5194343
               25.460001                      -9.5560254
                  25.472                      -9.5928197
               25.483999                      -9.6298196
                  25.496                      -9.6670244
               25.507999                      -9.7044384
                   25.52                       -9.742072
                  25.532                      -9.7799315
               25.543999                       -9.818031
                  25.556                      -9.8563866
               25.567999                      -9.8950138
               25.579998                      -9.9339317
               25.591999                      -9.9731654
               25.603998                      -10.012734
               25.615997                      -10.052665
                  25.628                      -10.092981
               25.639999                      -10.133709
                  25.652                      -10.174876
                  25.664                      -10.216506
               25.675999                      -10.258625
                  25.688                      -10.301255
               25.699999                      -10.344417
                  25.712                      -10.388134
               25.723999                      -10.432418
               25.735998                      -10.477288
               25.747999                      -10.522751
               25.759998                      -10.568817
               25.771999                      -10.615489
                  25.784                      -10.662768
                  25.796                      -10.710649
               25.807999                      -10.759126
                   25.82                      -10.808189
               25.831999                      -10.857823
                  25.844                       -10.90801
               25.855999                      -10.958729
               25.867998                      -11.009959
               25.879999                      -11.061674
               25.891998                      -11.113849
               25.904001                      -11.166455
                  25.916                      -11.219466
               25.927999                      -11.272854
               25.940001                      -11.326595
                  25.952                      -11.380665
               25.963999                      -11.435041
                  25.976                      -11.489707
               25.987999                      -11.544648
               25.999998                      -11.599854
               26.011999                      -11.655321
               26.023998                      -11.711051
               26.035999                      -11.767053
               26.047998                      -11.823338
               26.059998                      -11.879927
               26.072001                      -11.936847
                  26.084                      -11.994133
               26.096001                      -12.051823
                  26.108                      -12.109965
               26.119999                       -12.16861
                  26.132                      -12.227818
               26.143999                      -12.287649
               26.155998                       -12.34817
               26.167999                      -12.409454
               26.179998                      -12.471571
               26.191998                      -12.534597
               26.203999                      -12.598608
                  26.216                      -12.663677
               26.228001                      -12.729881
                   26.24                       -12.79729
               26.251999                      -12.865975
                  26.264                      -12.935999
               26.275999                      -13.007423
                  26.288                      -13.080301
               26.299999                      -13.154679
               26.311998                      -13.230597
               26.323999                      -13.308086
               26.335999                      -13.387166
               26.347998                      -13.467851
               26.360001                      -13.550141
                  26.372                      -13.634026
               26.383999                      -13.719486
                  26.396                      -13.806488
               26.407999                      -13.894988
                   26.42                      -13.984928
               26.431999                       -14.07624
               26.443998                      -14.168843
               26.455999                      -14.262642
               26.467999                      -14.357533
                   26.48                      -14.453399
               26.491999                      -14.550108
               26.503998                       -14.64752
               26.516001                      -14.745486
                  26.528                       -14.84384
               26.539999                      -14.942407
                  26.552                      -15.041006
               26.563999                      -15.139437
               26.575998                      -15.237499
               26.587999                      -15.334974
               26.599998                      -15.431636
                  26.612                       -15.52725
               26.623999                       -15.62157
               26.635998                      -15.714334
               26.647999                      -15.805277
                   26.66                       -15.89412
               26.672001                      -15.980568
                  26.684                      -16.064323
               26.695999                      -16.145069
                  26.708                      -16.222484
               26.719999                      -16.296233
               26.731998                      -16.365976
               26.743999                      -16.431365
               26.755999                      -16.492047
               26.767998                       -16.54767
               26.779999                       -16.59788
               26.791998                      -16.642339
               26.804001                      -16.680715
                  26.816                      -16.712696
               26.827999                      -16.737995
                   26.84                      -16.756357
               26.851999                      -16.767558
                  26.864                      -16.771428
               26.875999                      -16.767841
               26.887999                      -16.756725
                    26.9                      -16.738072
               26.911999                      -16.711933
               26.923998                      -16.678422
               26.935999                      -16.637723
               26.947998                      -16.590076
               26.959999                      -16.535785
                  26.972                      -16.475211
               26.983999                      -16.408765
                  26.996                      -16.336898
               27.007999                      -16.260108
               27.019999                      -16.178913
                  27.032                      -16.093859
               27.043999                      -16.005503
                  27.056                      -15.914413
               27.067999                      -15.821157
               27.079998                      -15.726296
               27.091999                      -15.630379
                  27.104                      -15.533945
               27.115999                      -15.437508
                  27.128                      -15.341562
               27.139999                      -15.246579
               27.151999                      -15.153002
                  27.164                      -15.061246
               27.175999                        -14.9717
                  27.188                      -14.884725
               27.199999                      -14.800657
               27.211998                        -14.7198
               27.223999                      -14.642439
               27.235998                      -14.568828
               27.248001                      -14.499202
                   27.26                      -14.433771
               27.271999                      -14.372723
                  27.284                      -14.316229
                  27.296                      -14.264441
               27.307999                      -14.217489
                   27.32                      -14.175492
               27.331999                       -14.13855
               27.343998                      -14.106748
               27.355999                      -14.080161
               27.367998                      -14.058847
               27.379999                      -14.042851
               27.391998                      -14.032211
               27.403999                      -14.026948
                  27.416                      -14.027076
               27.427999                      -14.032596
               27.440001                      -14.043497
                  27.452                      -14.059764
               27.463999                      -14.081364
                  27.476                       -14.10826
               27.487999                      -14.140404
               27.499998                      -14.177737
               27.511999                      -14.220191
               27.523998                      -14.267689
               27.535997                      -14.320147
                  27.548                       -14.37747
               27.559999                      -14.439554
               27.572001                       -14.50629
                  27.584                      -14.577559
               27.595999                      -14.653237
                  27.608                      -14.733195
               27.619999                      -14.817295
                  27.632                      -14.905398
               27.643999                      -14.997362
               27.655998                       -15.09304
               27.667999                       -15.19229
               27.679998                      -15.294966
               27.691998                      -15.400923
                  27.704                      -15.510039
                  27.716                      -15.622161
               27.727999                      -15.737168
                   27.74                      -15.854953
               27.751999                       -15.97541
                  27.764                      -16.098442
               27.775999                       -16.22397
               27.787998                       -16.35193
               27.799999                      -16.482276
               27.811998                      -16.614973
               27.823999                       -16.75001
               27.835999                       -16.88739
                  27.848                      -17.027139
               27.860001                      -17.169298
                  27.872                      -17.313927
               27.883999                      -17.461107
                  27.896                      -17.610934
               27.907999                      -17.763519
               27.919998                      -17.918994
               27.931999                      -18.077499
               27.943998                      -18.239191
               27.955999                      -18.404237
               27.967999                      -18.572814
               27.979998                      -18.745109
               27.992001                      -18.921314
                  28.004                      -19.101628
               28.016001                      -19.286255
                  28.028                      -19.475398
               28.039999                      -19.669267
                  28.052                      -19.868069
               28.063999                      -20.072012
               28.075998                      -20.281305
               28.087999                      -20.496154
               28.099998                      -20.716765
               28.111998                      -20.943344
               28.123999                      -21.176097
               28.135998                       -21.41523
               28.148001                      -21.660952
                   28.16                      -21.913473
               28.171999                      -22.173015
                  28.184                        -22.4398
               28.195999                      -22.714069
                  28.208                      -22.996075
               28.219999                       -23.28609
               28.231998                      -23.584408
               28.243999                      -23.891352
               28.255999                      -24.207278
               28.267998                      -24.532588
               28.279999                      -24.867719
                  28.292                      -25.213175
               28.303999                      -25.569505
                  28.316                      -25.937339
               28.327999                      -26.317373
                   28.34                      -26.710383
               28.351999                      -27.117229
               28.363998                      -27.538865
               28.375999                       -27.97632
               28.387999                      -28.430691
                    28.4                      -28.903146
               28.411999                      -29.394852
               28.423998                       -29.90692
               28.436001                      -30.440312
                  28.448                      -30.995676
               28.459999                      -31.573025
                  28.472                      -32.171391
               28.483999                      -32.788192
               28.495998                       -33.41827
               28.507999                      -34.052698
               28.519999                       -34.67711
                  28.532                      -35.270113
               28.543999                      -35.802039
               28.555998                      -36.235888
               28.567999                      -36.532199
               28.579998                      -36.657752
               28.592001                      -36.596194
                  28.604                      -36.354156
               28.615999                      -35.958768
                  28.628                      -35.448407
               28.639999                      -34.862338
               28.651999                      -34.234152
                  28.664                      -33.589224
               28.675999                      -32.945195
               28.687998                      -32.313467
               28.699999                      -31.700932
               28.711998                      -31.111392
               28.723999                      -30.546604
                  28.736                      -30.007043
               28.747999                       -29.49238
                   28.76                      -29.001803
               28.771999                      -28.534245
                  28.784                      -28.088497
                  28.796                        -27.6633
               28.807999                      -27.257408
                   28.82                      -26.869591
               28.831999                      -26.498678
               28.843998                      -26.143544
               28.855999                      -25.803138
               28.867998                      -25.476451
               28.879997                      -25.162556
                  28.892                      -24.860569
               28.903999                      -24.569664
                  28.916                      -24.289075
               28.927999                      -24.018078
               28.939999                      -23.756004
                  28.952                      -23.502223
               28.963999                      -23.256159
                  28.976                      -23.017272
               28.987999                      -22.785064
               28.999998                       -22.55908
               29.011999                        -22.3389
               29.023998                      -22.124144
               29.035999                      -21.914466
                  29.048                      -21.709555
               29.059999                       -21.50913
               29.071999                      -21.312946
                  29.084                      -21.120788
               29.095999                      -20.932464
                  29.108                      -20.747808
               29.119999                      -20.566682
               29.131998                      -20.388963
               29.143999                      -20.214552
               29.155998                      -20.043368
               29.167999                      -19.875337
                   29.18                      -19.710405
               29.191999                      -19.548524
                  29.204                      -19.389658
                  29.216                      -19.233769
               29.227999                      -19.080829
                   29.24                      -18.930812
               29.251999                      -18.783691
               29.263998                      -18.639434
               29.275999                      -18.498013
               29.287998                      -18.359396
               29.299999                      -18.223539
               29.311998                      -18.090403
               29.323997                      -17.959936
                  29.336                      -17.832082
                  29.348                      -17.706783
               29.360001                      -17.583966
                  29.372                      -17.463561
               29.383999                      -17.345489
                  29.396                      -17.229663
               29.407999                      -17.115996
               29.419998                      -17.004398
               29.431999                      -16.894769
               29.443998                      -16.787016
               29.455997                      -16.681039
               29.467999                      -16.576743
                   29.48                       -16.47403
               29.492001                      -16.372802
                  29.504                      -16.272975
               29.515999                      -16.174454
                  29.528                      -16.077161
               29.539999                      -15.981022
                  29.552                      -15.885962
               29.563999                      -15.791923
               29.575998                      -15.698847
               29.587999                      -15.606688
               29.599998                       -15.51541
               29.611998                      -15.424979
               29.624001                      -15.335373
                  29.636                      -15.246577
               29.647999                      -15.158587
                   29.66                      -15.071399
               29.671999                      -14.985021
                  29.684                      -14.899462
               29.695999                       -14.81474
               29.707998                      -14.730875
               29.719999                      -14.647889
               29.731998                      -14.565805
               29.743999                      -14.484652
               29.755999                      -14.404453
               29.767998                      -14.325232
               29.780001                      -14.247015
                  29.792                       -14.16982
               29.803999                      -14.093665
                  29.816                      -14.018561
               29.827999                       -13.94452
               29.839998                      -13.871545
               29.851999                      -13.799633
               29.863998                      -13.728777
               29.875999                      -13.658966
               29.887999                      -13.590184
               29.899998                      -13.522405
               29.911999                      -13.455602
                  29.924                      -13.389745
               29.936001                      -13.324793
                  29.948                      -13.260709
               29.959999                      -13.197448
                  29.972                      -13.134965
               29.983999                      -13.073212
               29.995998                       -13.01214
               30.007999                      -12.951703
               30.019999                      -12.891851
               30.031998                      -12.832539
               30.043999                      -12.773722
               30.055998                      -12.715357
               30.068001                       -12.65741
                   30.08                      -12.599844
               30.091999                      -12.542631
                  30.104                      -12.485746
               30.115999                      -12.429171
                  30.128                      -12.372892
               30.139999                      -12.316899
               30.151999                      -12.261191
                  30.164                      -12.205769
               30.175999                      -12.150642
               30.187998                       -12.09582
               30.199999                       -12.04132
               30.211998                      -11.987164
               30.223999                      -11.933371
                  30.236                      -11.879969
               30.247999                      -11.826984
                   30.26                      -11.774445
               30.271999                      -11.722379
               30.283998                      -11.670815
                  30.296                      -11.619779
               30.307999                      -11.569296
                   30.32                      -11.519389
               30.331999                      -11.470076
               30.343998                      -11.421375
               30.355999                      -11.373296
                  30.368                       -11.32585
               30.379999                      -11.279038
                  30.392                      -11.232858
               30.403999                      -11.187307
               30.415998                      -11.142373
               30.427999                       -11.09804
               30.439999                       -11.05429
                  30.452                      -11.011099
               30.463999                      -10.968443
               30.475998                      -10.926288
               30.487999                      -10.884605
               30.499998                      -10.843358
               30.512001                      -10.802513
                  30.524                      -10.762031
               30.535999                      -10.721878
                  30.548                      -10.682017
               30.559999                      -10.642415
               30.571999                      -10.603038
                  30.584                      -10.563855
               30.595999                      -10.524842
               30.607998                      -10.485974
               30.619999                      -10.447231
               30.631998                      -10.408599
               30.643999                      -10.370066
               30.655998                      -10.331627
               30.667999                      -10.293282
                   30.68                      -10.255032
               30.691999                      -10.216887
                  30.704                      -10.178857
                  30.716                       -10.14096
               30.727999                      -10.103215
                   30.74                      -10.065642
               30.751999                      -10.028274
               30.763998                      -9.9911285
               30.775999                      -9.9542406
               30.787998                      -9.9176334
               30.799997                      -9.8813396
                  30.812                      -9.8453852
               30.823999                      -9.8098008
                  30.836                      -9.7746024
                  30.848                      -9.7398223
               30.859999                      -9.7054735
                  30.872                      -9.6715739
               30.883999                      -9.6381327
                  30.896                      -9.6051623
               30.907999                      -9.5726601
               30.919998                      -9.5406283
               30.931999                      -9.5090611
               30.943998                      -9.4779479
               30.955997                      -9.4472762
                  30.968                      -9.4170227
                   30.98                      -9.3871712
               30.991999                      -9.3576981
                  31.004                      -9.3285664
               31.015999                      -9.2997552
                  31.028                      -9.2712284
               31.039999                      -9.2429546
               31.051998                      -9.2148954
               31.063999                      -9.1870236
               31.075998                      -9.1593027
               31.087999                      -9.1317032
               31.099998                      -9.1041946
                  31.112                      -9.0767532
               31.124001                      -9.0493547
                  31.136                        -9.02198
               31.147999                       -8.994613
                   31.16                      -8.9672443
               31.171999                       -8.939865
               31.183998                      -8.9124764
               31.195999                      -8.8850797
               31.207998                      -8.8576831
               31.219999                      -8.8302977
               31.231998                      -8.8029419
               31.243998                      -8.7756331
               31.256001                      -8.7483948
                  31.268                      -8.7212555
               31.280001                      -8.6942403
                  31.292                      -8.6673814
               31.303999                      -8.6407099
                  31.316                      -8.6142543
               31.327999                      -8.5880482
               31.339998                      -8.5621201
               31.351999                      -8.5364976
               31.363998                      -8.5112066
               31.375998                      -8.4862702
               31.387999                      -8.4617076
               31.399998                      -8.4375336
               31.412001                      -8.4137614
                  31.424                      -8.3903969
               31.435999                      -8.3674409
                  31.448                      -8.3448929
               31.459999                      -8.3227441
                  31.472                      -8.3009846
               31.483999                      -8.2795962
               31.495998                      -8.2585596
               31.507999                      -8.2378501
               31.519999                      -8.2174401
               31.531998                      -8.1973001
               31.543999                       -8.177396
                  31.556                      -8.1576941
               31.567999                        -8.13816
                   31.58                      -8.1187569
               31.591999                      -8.0994504
                  31.604                      -8.0802083
               31.615999                      -8.0609967
               31.627998                      -8.0417876
               31.639999                      -8.0225551
               31.651999                      -8.0032759
                  31.664                      -7.9839338
               31.675999                      -7.9645135
               31.687998                      -7.9450085
               31.700001                      -7.9254134
                  31.712                      -7.9057319
               31.723999                      -7.8859706
                  31.736                      -7.8661413
               31.747999                      -7.8462619
               31.759998                      -7.8263529
               31.771999                      -7.8064425
               31.783998                      -7.7865566
                  31.796                      -7.7667285
               31.807999                      -7.7469932
               31.819998                      -7.7273852
               31.831999                      -7.7079419
               31.843998                      -7.6887005
               31.856001                      -7.6696949
                  31.868                      -7.6509603
               31.879999                      -7.6325286
                  31.892                      -7.6144277
               31.903999                      -7.5966842
               31.915998                      -7.5793178
               31.927999                       -7.562347
               31.939999                      -7.5457808
               31.951998                      -7.5296275
               31.963999                      -7.5138856
               31.975998                      -7.4985521
               31.987999                      -7.4836154
                      32                      -7.4690604