                      20                     -0.48019726
                   20.01                     -0.47654408
                   20.02                     -0.47286172
               20.029999                     -0.46924501
               20.039999                     -0.46578523
               20.049999                     -0.46256467
               20.059999                     -0.45965222
                   20.07                     -0.45710206
                   20.08                     -0.45494878
               20.089998                     -0.45320836
               20.099998                     -0.45187652
               20.109999                     -0.45092805
               20.120001                     -0.45032168
               20.130001                      -0.4499988
               20.139999                     -0.44988901
                   20.15                     -0.44991379
                   20.16                     -0.44998985
                   20.17                     -0.45003453
                   20.18                     -0.44996864
               20.189999                     -0.44972129
               20.199999                     -0.44923474
               20.209999                     -0.44846609
               20.219999                     -0.44738858
                   20.23                     -0.44599366
               20.239998                     -0.44429275
               20.249998                     -0.44231449
               20.259998                     -0.44010204
                   20.27                     -0.43771481
               20.280001                     -0.43521914
               20.290001                     -0.43268893
               20.299999                     -0.43020245
               20.309999                     -0.42783319
                   20.32                     -0.42564946
                   20.33                     -0.42371251
                   20.34                     -0.42206818
               20.349998                     -0.42075016
               20.359999                     -0.41977585
               20.369999                     -0.41914348
               20.379999                     -0.41883891
               20.389999                     -0.41882903
                    20.4                     -0.41906972
               20.409998                     -0.41950571
                   20.42                      -0.4200731
                   20.43                     -0.42070648
               20.440001                     -0.42133897
               20.450001                     -0.42190808
               20.459999                     -0.42236006
               20.469999                      -0.4226507
                   20.48                     -0.42275337
                   20.49                     -0.42265431
                    20.5                     -0.42235843
               20.509998                     -0.42188965
               20.519999                     -0.42128746
               20.529999                     -0.42060896
               20.539999                     -0.41992225
               20.549999                     -0.41930799
               20.559998                     -0.41885069
                   20.57                     -0.41863753
                   20.58                     -0.41875456
                   20.59                     -0.41927933
                    20.6                     -0.42028143
               20.610001                     -0.42181222
               20.619999                     -0.42390898
               20.629999                     -0.42658651
               20.639999                     -0.42983976
                   20.65                     -0.43364035
                   20.66                     -0.43793803
               20.669998                      -0.4426616
               20.679998                     -0.44772026
               20.689999                     -0.45300712
               20.699999                     -0.45840318
               20.710001                     -0.46377979
               20.720001                     -0.46900527
                   20.73                     -0.47394793
                   20.74                     -0.47848258
                   20.75                     -0.48249441
                   20.76                     -0.48588285
                   20.77                     -0.48856599
               20.779999                     -0.49048428
               20.789999                     -0.49160185
               20.799999                     -0.49190515
               20.809999                     -0.49140691
                   20.82                     -0.49014281
               20.829998                     -0.48816853
               20.839998                     -0.48555725
               20.849998                     -0.48239649
               20.860001                     -0.47878425
               20.870001                     -0.47482222
               20.879999                     -0.47061308
               20.889999                     -0.46625744
                    20.9                     -0.46184694
                   20.91                     -0.45746306
                   20.92                     -0.45317457
                   20.93                     -0.44903591
               20.939999                     -0.44508473
               20.949999                     -0.44134336
               20.959999                     -0.43781808
               20.969999                     -0.43450298
                   20.98                     -0.43137817
               20.989998                     -0.42841566
               20.999998                     -0.42558127
                   21.01                     -0.42283445
                   21.02                     -0.42013751
               21.030001                     -0.41745353
               21.040001                     -0.41474954
               21.049999                      -0.4120006
               21.059999                     -0.40919149
                   21.07                     -0.40631581
                   21.08                     -0.40337766
                   21.09                     -0.40039298
               21.099998                      -0.3973839
               21.109999                     -0.39438542
               21.119999                     -0.39143525
               21.129999                     -0.38857681
               21.139999                      -0.3858552
               21.149998                     -0.38331506
               21.159998                     -0.38099763
                   21.17                     -0.37893884
                   21.18                     -0.37716638
               21.190001                         -0.3757
               21.199999                     -0.37454913
               21.209999                     -0.37371143
               21.219999                     -0.37317521
                   21.23                     -0.37291679
                   21.24                     -0.37290436
                   21.25                     -0.37309686
               21.259998                     -0.37344876
               21.269999                     -0.37390938
               21.279999                     -0.37442646
               21.289999                      -0.3749498
               21.299999                     -0.37543043
               21.309998                     -0.37582801
                   21.32                     -0.37610631
                   21.33                     -0.37624003
                   21.34                     -0.37621309
                   21.35                     -0.37602122
               21.360001                     -0.37566922
               21.369999                     -0.37517365
               21.379999                     -0.37455909
               21.389999                     -0.37385824
                    21.4                     -0.37310987
                   21.41                     -0.37235574
               21.419998                     -0.37163914
               21.429998                     -0.37100398
               21.439999                     -0.37048957
               21.449999                     -0.37013239
               21.460001                     -0.36995973
               21.469999                      -0.3699941
                   21.48                     -0.37024678
                   21.49                     -0.37072211
                    21.5                     -0.37141474
                   21.51                     -0.37231006
               21.519999                     -0.37338779
               21.529999                     -0.37461973
               21.539999                     -0.37597489
               21.549999                     -0.37741827
               21.559999                      -0.3789145
                   21.57                     -0.38042983
               21.579998                     -0.38193262
               21.589998                     -0.38339489
               21.599998                     -0.38479618
               21.610001                     -0.38612189
               21.620001                     -0.38736349
               21.629999                     -0.38852081
               21.639999                     -0.38959999
                   21.65                     -0.39061158
                   21.66                     -0.39157287
                   21.67                     -0.39250265
                   21.68                     -0.39342086
               21.689999                     -0.39435029
               21.699999                     -0.39530639
               21.709999                     -0.39630433
               21.719999                     -0.39735242
                   21.73                     -0.39845419
               21.739998                     -0.39960327
               21.749998                     -0.40078653
                   21.76                     -0.40198361
                   21.77                     -0.40316789
               21.780001                      -0.4043044
               21.789999                     -0.40535556
               21.799999                     -0.40628032
               21.809999                      -0.4070361
                   21.82                     -0.40758248
                   21.83                     -0.40788382
               21.839998                     -0.40790808
               21.849998                     -0.40763261
               21.859999                     -0.40704361
               21.869999                     -0.40613974
               21.879999                     -0.40492768
               21.889999                      -0.4034294
               21.899998                     -0.40167632
                   21.91                     -0.39971122
                   21.92                     -0.39758568
                   21.93                     -0.39535744
               21.940001                     -0.39309107
               21.949999                     -0.39085229
               21.959999                     -0.38870701
               21.969999                     -0.38671775
                   21.98                     -0.38494254
                   21.99                     -0.38343168
                      22                     -0.38222421
               22.009998                     -0.38135223
               22.019999                     -0.38082979
               22.029999                     -0.38066241
               22.039999                     -0.38084203
               22.050001                     -0.38134797
               22.059999                     -0.38214824
                   22.07                     -0.38320207
                   22.08                     -0.38446078
                   22.09                     -0.38587194
                    22.1                     -0.38737792
               22.109999                     -0.38892402
               22.119999                     -0.39045722
               22.129999                     -0.39192877
               22.139999                     -0.39329909
                   22.15                     -0.39453713
               22.159998                     -0.39562136
               22.169998                     -0.39654362
               22.179998                     -0.39730532
               22.189999                     -0.39791936
               22.200001                     -0.39840988
               22.210001                     -0.39880785
               22.219999                     -0.39915242
                   22.23                     -0.39948583
                   22.24                     -0.39985317
                   22.25                     -0.40029877
                   22.26                     -0.40086391
               22.269999                     -0.40158449
               22.279999                     -0.40249018
               22.289999                     -0.40360019
               22.299999                     -0.40492473
               22.309999                      -0.4064647
                   22.32                     -0.40820828
               22.329998                     -0.41013527
               22.339998                     -0.41221564
                   22.35                     -0.41441405
               22.360001                     -0.41668686
               22.370001                     -0.41898907
               22.379999                     -0.42127479
               22.389999                     -0.42349971
                    22.4                     -0.42562426
                   22.41                     -0.42761455
                   22.42                     -0.42944513
               22.429998                     -0.43110233
               22.439999                     -0.43258062
               22.449999                     -0.43388639
               22.459999                        -0.43504
               22.469999                     -0.43606725
               22.479998                     -0.43700633
               22.489998                     -0.43790182
                    22.5                     -0.43880174
                   22.51                     -0.43975828
                   22.52                     -0.44082166
               22.530001                     -0.44203992
               22.539999                      -0.4434565
               22.549999                      -0.4451049
               22.559999                     -0.44701058
                   22.57                     -0.44918727
                   22.58                      -0.4516373
               22.589998                     -0.45434998
               22.599998                     -0.45730276
               22.609999                     -0.46046243
               22.619999                      -0.4637857
               22.629999                     -0.46722047
               22.640001                     -0.47071136
                   22.65                     -0.47420038
                   22.66                     -0.47762828
                   22.67                     -0.48094013
                   22.68                     -0.48408708
               22.690001                     -0.48702793
               22.699999                     -0.48973345
               22.709999                     -0.49218646
               22.719999                     -0.49438242
                   22.73                     -0.49633084
                   22.74                     -0.49805471
               22.749998                     -0.49958837
               22.759998                     -0.50097651
               22.769999                     -0.50227308
               22.779999                     -0.50353589
               22.790001                     -0.50482734
               22.799999                     -0.50620723
               22.809999                     -0.50773413
                   22.82                     -0.50945797
                   22.83                      -0.5114218
                   22.84                     -0.51365787
                   22.85                      -0.5161845
               22.859999                     -0.51900699
               22.869999                     -0.52211881
               22.879999                     -0.52549921
               22.889999                     -0.52911426
                    22.9                     -0.53292233
               22.909998                     -0.53687335
               22.919998                     -0.54091065
               22.929998                     -0.54497823
               22.940001                     -0.54901956
               22.950001                     -0.55298281
               22.960001                     -0.55682344
               22.969999                     -0.56050844
                   22.98                     -0.56401634
                   22.99                     -0.56733872
                      23                     -0.57048302
                   23.01                     -0.57347075
               23.019999                     -0.57633605
               23.029999                     -0.57912627
               23.039999                     -0.58189843
               23.049999                     -0.58471668
               23.059999                     -0.58764925
               23.069998                     -0.59076276
               23.079998                     -0.59412241
                   23.09                     -0.59778654
                    23.1                     -0.60180301
               23.110001                     -0.60620602
               23.119999                     -0.61101629
               23.129999                     -0.61623951
               23.139999                     -0.62186055
                   23.15                     -0.62785123
                   23.16                     -0.63416717
                   23.17                     -0.64074943
               23.179998                     -0.64753045
               23.189999                     -0.65443248
               23.199999                     -0.66137847
               23.209999                     -0.66828882
               23.219999                     -0.67509381
               23.229998                     -0.68172961
                   23.24                     -0.68814966
                   23.25                     -0.69432215
                   23.26                     -0.70023731
                   23.27                     -0.70590476
               23.280001                     -0.71135688
               23.289999                     -0.71664737
               23.299999                     -0.72184969
               23.309999                       -0.727052
                   23.32                     -0.73235655
                   23.33                     -0.73787339
               23.339998                      -0.7437145
               23.349998                     -0.74999022
               23.359999                     -0.75680181
               23.369999                     -0.76423808
               23.379999                     -0.77236832
               23.389999                     -0.78124072
                    23.4                      -0.7908765
                   23.41                     -0.80126951
                   23.42                     -0.81238492
                   23.43                     -0.82416219
               23.439999                     -0.83651169
               23.449999                     -0.84932305
               23.459999                     -0.86247036
               23.469999                     -0.87581475
                   23.48                     -0.88921419
                   23.49                     -0.90253286
               23.499998                     -0.91564767
               23.509998                     -0.92845551
               23.519999                     -0.94088406
               23.529999                     -0.95289558
               23.540001                     -0.96449509
               23.549999                     -0.97573115
               23.559999                     -0.98669966
                   23.57                     -0.99754272
                   23.58                       -1.008444
                   23.59                      -1.0196254
                    23.6                      -1.0313414
               23.609999                      -1.0438663
               23.619999                       -1.057487
               23.629999                      -1.0724905
               23.639999                      -1.0891531
                   23.65                      -1.1077266
               23.659998                      -1.1284231
               23.669998                      -1.1514081
               23.679998                      -1.1767823
               23.690001                      -1.2045749
               23.700001                      -1.2347325
               23.709999                      -1.2671091
               23.719999                      -1.3014695
                   23.73                      -1.3374748
                   23.74                      -1.3746942
                   23.75                      -1.4126061
               23.759998                      -1.4506113
               23.769999                      -1.4880469
               23.779999                      -1.5242053
               23.789999                      -1.5583596
               23.799999                      -1.5897906
               23.809999                       -1.617816
               23.819998                      -1.6418185
               23.829998                      -1.6612732
                   23.84                      -1.6757755
                   23.85                      -1.6850539
               23.860001                      -1.6889844
               23.869999                       -1.687599
               23.879999                      -1.6810768
               23.889999                      -1.6697403
                    23.9                      -1.6540348
                   23.91                      -1.6345142
                   23.92                      -1.6118119
               23.929998                      -1.5866193
               23.939999                      -1.5596623
               23.949999                       -1.531677
               23.959999                        -1.50339
               23.969999                      -1.4754959
               23.979998                      -1.4486467
                   23.99                      -1.4234345
                      24                      -1.4003854
                   24.01                      -1.3799488
                   24.02                      -1.3624923
               24.029999                      -1.3482977
               24.039999                      -1.3375605
               24.049999                      -1.3303905
               24.059999                      -1.3268089
                   24.07                      -1.3267577
               24.079998                      -1.3300996
               24.089998                      -1.3366269
               24.099998                      -1.3460714
               24.109999                      -1.3581088
               24.119999                       -1.372378
               24.130001                      -1.3884868
               24.139999                      -1.4060323
                   24.15                      -1.4246086
                   24.16                      -1.4438263
                   24.17                      -1.4633218
                   24.18                      -1.4827728
               24.189999                      -1.5019044
               24.199999                      -1.5205006
               24.209999                      -1.5384068
               24.219999                      -1.5555348
                   24.23                      -1.5718565
                   24.24                      -1.5874048
               24.249998                      -1.6022691
               24.259998                      -1.6165814
               24.269999                      -1.6305118
               24.280001                      -1.6442586
               24.290001                      -1.6580335
               24.299999                      -1.6720548
               24.309999                      -1.6865361
                   24.32                      -1.7016782
                   24.33                      -1.7176614
                   24.34                      -1.7346372
               24.349998                      -1.7527264
               24.359999                      -1.7720161
               24.369999                      -1.7925568
               24.379999                       -1.814365
               24.389999                      -1.8374235
               24.399998                      -1.8616876
               24.409998                       -1.887086
               24.419998                      -1.9135307
                   24.43                      -1.9409198
               24.440001                      -1.9691488
               24.450001                      -1.9981116
               24.459999                       -2.027712
               24.469999                      -2.0578649
                   24.48                      -2.0885065
                   24.49                      -2.1195929
                    24.5                      -2.1511063
               24.509998                       -2.183054
               24.519999                      -2.2154657
               24.529999                      -2.2483979
               24.539999                      -2.2819287
               24.549999                      -2.3161471
               24.559999                      -2.3511579
               24.569998                      -2.3870713
                   24.58                      -2.4239988
                   24.59                      -2.4620476
                    24.6                      -2.5013153
               24.610001                      -2.5418854
               24.619999                      -2.5838258
               24.629999                      -2.6271801
               24.639999                      -2.6719736
                   24.65                      -2.7182097
                   24.66                      -2.7658677
               24.669998                      -2.8149084
               24.679998                      -2.8652755
               24.689999                      -2.9169016
               24.699999                      -2.9697052
               24.709999                      -3.0236066
               24.719997                      -3.0785281
                   24.73                      -3.1343937
                   24.74                      -3.1911428
                   24.75                      -3.2487309
                   24.76                      -3.3071321
                   24.77                      -3.3663421
               24.779999                      -3.4263846
               24.789999                      -3.4872982
               24.799999                      -3.5491539
               24.809999                      -3.6120374
                   24.82                      -3.6760566
               24.829998                      -3.7413268
               24.839998                      -3.8079828
               24.849998                      -3.8761547
               24.859999                      -3.9459764
               24.870001                      -4.0175733
               24.880001                      -4.0910663
               24.889999                      -4.1665517
                    24.9                      -4.2441207
                   24.91                      -4.3238315
                   24.92                      -4.4057287
                   24.93                      -4.4898337
               24.939999                      -4.5761412
               24.949999                      -4.6646361
               24.959999                      -4.7552758
               24.969999                      -4.8480133
                   24.98                      -4.9427924
               24.989998                      -5.0395503
               24.999998                      -5.1382283
               25.009998                      -5.2387771
                   25.02                      -5.3411558
               25.030001                      -5.4453468
               25.039999                      -5.5513476
               25.049999                      -5.6591799
               25.059999                      -5.7688954
                   25.07                      -5.8805662
                   25.08                      -5.9942962
                   25.09                      -6.1102083
               25.099998                      -6.2284455
               25.109999                      -6.3491707
               25.119999                       -6.472557
               25.129999                      -6.5987876
               25.139999                      -6.7280442
               25.149998                      -6.8605094
               25.159998                      -6.9963558
                   25.17                      -7.1357385
                   25.18                      -7.2788085
               25.190001                      -7.4256861
               25.200001                       -7.576482
               25.209999                      -7.7312677
               25.219999                      -7.8901127
                   25.23                      -8.0530605
                   25.24                      -8.2201284
                   25.25                      -8.3913362
               25.259998                      -8.5666894
               25.269999                      -8.7461805
               25.279999                      -8.9298287
               25.289999                       -9.117646
               25.299999                      -9.3096645
               25.309998                      -9.5059326
                   25.32                      -9.7065376
                   25.33                      -9.9115848
                   25.34                      -10.121225
                   25.35                       -10.33564
               25.359999                      -10.555043
               25.369999                      -10.779697
               25.379999                      -11.009887
               25.389999                      -11.245932
                    25.4                      -11.488187
                   25.41                      -11.737011
               25.419998                      -11.992792
               25.429998                       -12.25592
               25.439999                      -12.526775
               25.449999                      -12.805745
               25.460001                      -13.093181
               25.469999                      -13.389414
                   25.48                      -13.694739
                   25.49                       -14.00939
                    25.5                      -14.333538
                   25.51                      -14.667284
                   25.52                      -15.010615
               25.529999                      -15.363404
               25.539999                      -15.725369
               25.549999                      -16.096038
               25.559999                      -16.474705
                   25.57                      -16.860378
               25.579998                      -17.251691
               25.589998                      -17.646846
               25.599998                      -18.043478
               25.610001                      -18.438591
               25.620001                      -18.828402
               25.629999                      -19.208262
               25.639999                       -19.57262
                   25.65                       -19.91498
                   25.66                      -20.228086
                   25.67                      -20.504147
               25.679998                      -20.735379
               25.689999                      -20.914587
               25.699999                      -21.035938
               25.709999                      -21.095649
               25.719999                      -21.092539
                   25.73                      -21.028145
               25.739998                      -20.906549
               25.749998                      -20.733926
               25.759998                      -20.517663
                   25.77                      -20.265754
               25.780001                      -19.986116
               25.789999                      -19.686084
               25.799999                      -19.372172
               25.809999                      -19.049915
                   25.82                      -18.723879
                   25.83                      -18.397728
                   25.84                      -18.074296
               25.849998                      -17.755771
               25.859999                      -17.443727
               25.869999                      -17.139297
               25.879999                      -16.843243
               25.889999                      -16.556009
               25.899998                      -16.277828
               25.909998                       -16.00876
                   25.92                      -15.748715
                   25.93                      -15.497518
               25.940001                      -15.254928
               25.949999                      -15.020653
               25.959999                      -14.794376
               25.969999                      -14.575772
                   25.98                      -14.364515
                   25.99                      -14.160289
               25.999998                      -13.962799
               26.009998                      -13.771772
               26.019999                      -13.586953
               26.029999                      -13.408126
               26.039999                      -13.235098
               26.049999                       -13.06771
               26.059998                      -12.905821
                   26.07                      -12.749323
                   26.08                      -12.598125
                   26.09                       -12.45216
                    26.1                      -12.311367
               26.109999                      -12.175703
               26.119999                      -12.045129
               26.129999                      -11.919609
               26.139999                      -11.799107
                   26.15                       -11.68358
                   26.16                       -11.57298
               26.169998                      -11.467249
               26.179998                      -11.366312
               26.189999                      -11.270084
               26.199999                      -11.178464
               26.210001                      -11.091333
               26.219999                      -11.008554
                   26.23                      -10.929974
                   26.24                      -10.855427
                   26.25                      -10.784731
                   26.26                      -10.717692
               26.269999                      -10.654106
               26.279999                      -10.593763
               26.289999                       -10.53645
               26.299999                      -10.481955
               26.309999                      -10.430073
               26.319998                      -10.380608
               26.329998                      -10.333377
               26.339998                      -10.288218
               26.349998                      -10.244994
               26.360001                      -10.203596
               26.370001                      -10.163941
               26.379999                      -10.125988
               26.389999                      -10.089732
                    26.4                      -10.055202
                   26.41                      -10.022471
                   26.42                      -9.9916463
               26.429998                      -9.9628795
               26.439999                      -9.9363493
               26.449999                      -9.9122734
               26.459999                      -9.8908943
               26.469999                      -9.8724793
                   26.48                      -9.8573133
               26.489998                      -9.8456968
               26.499998                      -9.8379373
                   26.51                      -9.8343443
                   26.52                      -9.8352213
               26.530001                      -9.8408652
               26.539999                      -9.8515531
               26.549999                      -9.8675423
               26.559999                      -9.8890617
                   26.57                      -9.9163058
                   26.58                      -9.9494313
               26.589998                      -9.9885491
               26.599998                      -10.033719
               26.609999                      -10.084951
               26.619999                      -10.142191
               26.629999                      -10.205328
               26.639997                      -10.274183
               26.649998                       -10.34851
                   26.66                      -10.427996
                   26.67                      -10.512267
                   26.68                       -10.60088
               26.690001                      -10.693338
               26.699999                      -10.789094
               26.709999                       -10.88756
               26.719999                      -10.988122
                   26.73                      -11.090152
                   26.74                      -11.193023
               26.749998                      -11.296133
               26.759998                      -11.398912
               26.769999                      -11.500852
               26.779999                      -11.601516
               26.789999                      -11.700553
               26.800001                      -11.797707
               26.809999                      -11.892837
                   26.82                      -11.985898
                   26.83                       -12.07696
                   26.84                      -12.166188
                   26.85                      -12.253842
               26.859999                      -12.340251
               26.869999                      -12.425814
               26.879999                       -12.51096
               26.889999                      -12.596153
                    26.9                      -12.681859
               26.909998                      -12.768533
               26.919998                      -12.856606
               26.929998                      -12.946468
               26.939999                      -13.038465
               26.950001                      -13.132894
               26.959999                      -13.229978
               26.969999                      -13.329905
                   26.98                      -13.432798
                   26.99                      -13.538728
                      27                      -13.647743
                   27.01                      -13.759855
               27.019999                      -13.875066
               27.029999                      -13.993386
               27.039999                      -14.114837
               27.049999                      -14.239481
               27.059999                      -14.367429
               27.069998                      -14.498853
               27.079998                      -14.634008
               27.089998                      -14.773212
                    27.1                      -14.916898
               27.110001                      -15.065569
               27.120001                      -15.219824
               27.129999                      -15.380336
               27.139999                      -15.547864
                   27.15                      -15.723221
                   27.16                      -15.907265
                   27.17                      -16.100894
               27.179998                       -16.30502
               27.189999                      -16.520556
               27.199999                      -16.748377
               27.209999                      -16.989355
               27.219999                      -17.244268
               27.229998                      -17.513846
               27.239998                      -17.798736
                   27.25                      -18.099461
                   27.26                      -18.416448
                   27.27                      -18.749989
               27.279999                      -19.100259
               27.289999                      -19.467273
               27.299999                      -19.850947
               27.309999                      -20.251084
                   27.32                      -20.667391
                   27.33                      -21.099541
               27.339998                      -21.547236
               27.349998                      -22.010297
               27.359999                      -22.488737
               27.369999                      -22.982924
               27.379999                      -23.493774
               27.389997                      -24.022838
                    27.4                      -24.572594
                   27.41                      -25.146622
                   27.42                      -25.749938
                   27.43                      -26.389162
               27.440001                      -27.072898
               27.449999                      -27.812167
               27.459999                       -28.62075
               27.469999                      -29.515732
                   27.48                      -30.517731
                   27.49                      -31.650212
               27.499998                      -32.935313
               27.509998                      -34.378432
               27.519999                      -35.919357
               27.529999                      -37.309961
               27.540001                      -37.986682
               27.549999                      -37.444633
               27.559999                      -35.954899
                   27.57                      -34.151064
                   27.58                       -32.39451
                   27.59                      -30.797566
               27.599998                      -29.372889
               27.609999                      -28.104317
               27.619999                      -26.970489
               27.629999                      -25.951853
               27.639999                       -25.03188
                   27.65                      -24.197039
               27.659998                      -23.436299
               27.669998                      -22.740605
               27.679998                      -22.102393
               27.690001                      -21.515335
               27.700001                      -20.974005
               27.709999                       -20.47377
               27.719999                      -20.010532
                   27.73                      -19.580711
                   27.74                       -19.18109
                   27.75                      -18.808847
                   27.76                      -18.461323
               27.769999                      -18.136208
               27.779999                      -17.831325
               27.789999                      -17.544728
               27.799999                      -17.274614
               27.809999                      -17.019335
               27.819998                      -16.777369
               27.829998                      -16.547365
                   27.84                      -16.328035
                   27.85                      -16.118242
               27.860001                      -15.916921
               27.869999                      -15.723108
               27.879999                       -15.53593
               27.889999                       -15.35457
                    27.9                      -15.178295
                   27.91                      -15.006411
               27.919998                      -14.838286
               27.929998                      -14.673326
               27.939999                      -14.510999
               27.949999                      -14.350781
               27.959999                       -14.19223
               27.969999                      -14.034892
               27.979998                      -13.878414
                   27.99                      -13.722452
                      28                      -13.566722
                   28.01                      -13.411006
                   28.02                      -13.255151
               28.029999                      -13.099074
               28.039999                      -12.942756
               28.049999                      -12.786254
               28.059999                      -12.629709
                   28.07                      -12.473322
                   28.08                      -12.317364
               28.089998                      -12.162161
               28.099998                      -12.008095
               28.109999                      -11.855592
               28.119999                      -11.705098
               28.129999                      -11.557069
               28.139999                      -11.411966
                   28.15                      -11.270253
                   28.16                      -11.132358
                   28.17                      -10.998676
                   28.18                      -10.869579
               28.189999                       -10.74537
               28.199999                       -10.62632
               28.209999                      -10.512615
               28.219999                      -10.404399
                   28.23                       -10.30175
               28.239998                      -10.204683
               28.249998                      -10.113149
               28.259998                      -10.027036
               28.269999                       -9.946179
               28.279999                      -9.8703607
               28.290001                      -9.7993091
               28.299999                      -9.7327056
               28.309999                      -9.6702006
                   28.32                      -9.6114064
                   28.33                      -9.5558963
                   28.34                      -9.5032422
               28.349998                      -9.4529812
               28.359999                      -9.4046595
               28.369999                      -9.3578086
               28.379999                      -9.3119729
               28.389999                      -9.2667016
                    28.4                      -9.2215721
               28.409998                      -9.1761703
               28.419998                      -9.1301307
               28.429998                       -9.083099
               28.440001                      -9.0347697
               28.450001                      -8.9848702
               28.459999                      -8.9331727
               28.469999                      -8.8794818
                   28.48                      -8.8236556
                   28.49                      -8.7655813
                    28.5                      -8.7051849
               28.509998                      -8.6424407
               28.519999                      -8.5773456
               28.529999                      -8.5099366
               28.539999                      -8.4402826
               28.549999                      -8.3684741
               28.559998                      -8.2946364
               28.569998                      -8.2189062
               28.579998                      -8.1414526
                   28.59                      -8.0624549
                    28.6                      -7.9821073
               28.610001                      -7.9006199
               28.619999                      -7.8182058
               28.629999                      -7.7350917
               28.639999                      -7.6514959
                   28.65                      -7.5676441
                   28.66                      -7.4837505
               28.669998                      -7.4000278
               28.679998                      -7.3166709
               28.689999                      -7.2338673
               28.699999                       -7.151783
               28.709999                      -7.0705652
               28.719999                      -6.9903458
               28.729998                      -6.9112283
                   28.74                      -6.8332992
                   28.75                      -6.7566201
                   28.76                      -6.6812348
                   28.77                      -6.6071628
               28.779999                      -6.5344091
               28.789999                      -6.4629609
               28.799999                      -6.3927905
               28.809999                      -6.3238623
                   28.82                      -6.2561341
               28.829998                      -6.1895556
               28.839998                      -6.1240794
               28.849998                      -6.0596576
               28.859999                        -5.99625
               28.869999                      -5.9338193
               28.879997                      -5.8723397
               28.889999                       -5.811794
                    28.9                      -5.7521762
                   28.91                       -5.693492
                   28.92                      -5.6357535
                   28.93                      -5.5789836
               28.939999                      -5.5232136
               28.949999                      -5.4684797
               28.959999                      -5.4148182
               28.969999                      -5.3622695
                   28.98                      -5.3108707
               28.989998                      -5.2606528
               28.999998                      -5.2116438
               29.009998                      -5.1638597
               29.019999                      -5.1173092
               29.030001                      -5.0719895
               29.040001                      -5.0278849
               29.049999                      -4.9849701
               29.059999                      -4.9432075
                   29.07                       -4.902551
                   29.08                      -4.8629445
                   29.09                      -4.8243264
               29.099998                      -4.7866304
               29.109999                      -4.7497885
               29.119999                      -4.7137344
               29.129999                      -4.6784026
               29.139999                      -4.6437345
               29.149998                      -4.6096791
               29.159998                      -4.5761954
               29.169998                      -4.5432533
                   29.18                      -4.5108317
               29.190001                      -4.4789257
               29.199999                      -4.4475386
               29.209999                      -4.4166867
               29.219999                       -4.386394
                   29.23                       -4.356695
                   29.24                      -4.3276287
                   29.25                      -4.2992344
               29.259998                      -4.2715563
               29.269999                      -4.2446348
               29.279999                      -4.2185057
               29.289999                      -4.1931985
               29.299999                      -4.1687334
               29.309998                      -4.1451232
               29.319998                      -4.1223673
                   29.33                       -4.100452
                   29.34                      -4.0793559
                   29.35                      -4.0590439
               29.360001                      -4.0394721
               29.369999                      -4.0205885
               29.379999                      -4.0023342
               29.389999                      -3.9846478
                    29.4                      -3.9674647
                   29.41                      -3.9507239
               29.419998                      -3.9343676
               29.429998                      -3.9183464
               29.439999                      -3.9026174
               29.449999                      -3.8871508
               29.459999                      -3.8719291
               29.469997                       -3.856946
                   29.48                       -3.842212
                   29.49                      -3.8277462
                    29.5                      -3.8135822
                   29.51                      -3.7997647
               29.519999                      -3.7863427
               29.529999                      -3.7733735
               29.539999                      -3.7609173
               29.549999                      -3.7490313
               29.559999                       -3.737772
                   29.57                      -3.7271887
               29.579998                       -3.717322
               29.589998                       -3.708202
               29.599998                      -3.6998468
               29.609999                       -3.692261
               29.620001                      -3.6854366
               29.629999                      -3.6793487
               29.639999                      -3.6739638
                   29.65                       -3.669235
                   29.66                      -3.6651068
                   29.67                      -3.6615201
                   29.68                       -3.658408
               29.689999                      -3.6557085
               29.699999                      -3.6533584
               29.709999                      -3.6513049
               29.719999                      -3.6495029
                   29.73                      -3.6479207
               29.739998                      -3.6465404
               29.749998                      -3.6453609
               29.759998                      -3.6443962
                   29.77                      -3.6436774
               29.780001                      -3.6432498
               29.789999                      -3.6431737
               29.799999                      -3.6435192
               29.809999                      -3.6443654
                   29.82                       -3.645794
                   29.83                      -3.6478859
               29.839998                      -3.6507223
               29.849998                      -3.6543723
               29.859999                      -3.6588957
               29.869999                      -3.6643389
               29.879999                      -3.6707273
               29.889999                        -3.67807
               29.899998                      -3.6863539
               29.909998                      -3.6955461
                   29.92                      -3.7055935
                   29.93                      -3.7164243
               29.940001                       -3.727949
               29.949999                      -3.7400686
               29.959999                      -3.7526762
               29.969999                      -3.7656584
                   29.98                      -3.7789055
                   29.99                      -3.7923131
                      30                      -3.8057889