<?xml version="1.0" encoding="UTF-8" standalone="no"?>
<svg
   xmlns:dc="http://purl.org/dc/elements/1.1/"
   xmlns:cc="http://creativecommons.org/ns#"
   xmlns:rdf="http://www.w3.org/1999/02/22-rdf-syntax-ns#"
   xmlns:svg="http://www.w3.org/2000/svg"
   xmlns="http://www.w3.org/2000/svg"
   xmlns:xlink="http://www.w3.org/1999/xlink"
   xmlns:sodipodi="http://sodipodi.sourceforge.net/DTD/sodipodi-0.dtd"
   xmlns:inkscape="http://www.inkscape.org/namespaces/inkscape"
   width="100"
   height="100"
   viewBox="0 0 75 75"
   version="1.1"
   id="svg2"
   inkscape:version="0.92.4 5da689c313, 2019-01-14"
   sodipodi:docname="draft.svg">
  <metadata
     id="metadata13">
    <rdf:RDF>
      <cc:Work
         rdf:about="">
        <dc:format>image/svg+xml</dc:format>
        <dc:type
           rdf:resource="http://purl.org/dc/dcmitype/StillImage" />
        <dc:title />
      </cc:Work>
    </rdf:RDF>
  </metadata>
  <defs
     id="defs11">
    <linearGradient
       inkscape:collect="always"
       id="linearGradient829">
      <stop
         id="stop827"
         offset="0"
         style="stop-color:#c40fd1;stop-opacity:1" />
      <stop
         id="stop825"
         offset="1"
         style="stop-color:#8200f2;stop-opacity:1" />
    </linearGradient>
    <filter
       inkscape:collect="always"
       id="filter6888"
       style="color-interpolation-filters:sRGB">
      <feGaussianBlur
         inkscape:collect="always"
         stdDeviation="1.3970381"
         id="feGaussianBlur6890" />
    </filter>
    <filter
       inkscape:collect="always"
       id="filter7834"
       x="-0.16201019"
       width="1.3240204"
       y="-0.16198979"
       height="1.3239796"
       style="color-interpolation-filters:sRGB">
      <feGaussianBlur
         inkscape:collect="always"
         stdDeviation="1.214916"
         id="feGaussianBlur7836" />
    </filter>
    <linearGradient
       inkscape:collect="always"
       xlink:href="#linearGradient829"
       id="linearGradient831"
       x1="6.7134401"
       y1="13.799454"
       x2="23.043039"
       y2="13.799454"
       gradientUnits="userSpaceOnUse" />
  </defs>
  <sodipodi:namedview
     pagecolor="#cfd8dc"
     bordercolor="#666666"
     borderopacity="1"
     objecttolerance="10"
     gridtolerance="10"
     guidetolerance="10"
     inkscape:pageopacity="0"
     inkscape:pageshadow="2"
     inkscape:window-width="1244"
     inkscape:window-height="830"
     id="namedview9"
     showgrid="true"
     inkscape:zoom="6.83758"
     inkscape:cx="49.506754"
     inkscape:cy="29.642187"
     inkscape:window-x="354"
     inkscape:window-y="0"
     inkscape:window-maximized="0"
     inkscape:current-layer="g64"
     inkscape:pagecheckerboard="false">
    <inkscape:grid
       type="xygrid"
       id="grid20" />
  </sodipodi:namedview>
  <g
     transform="matrix(2.4798086,0,0,2.4804205,0.60481434,1.0215723)"
     id="g64">
    <path
       style="color:#000000;font-style:normal;font-variant:normal;font-weight:normal;font-stretch:normal;font-size:medium;line-height:normal;font-family:Sans;-inkscape-font-specification:Sans;text-indent:0;text-align:start;text-decoration:none;text-decoration-line:none;letter-spacing:normal;word-spacing:normal;text-transform:none;writing-mode:lr-tb;direction:ltr;baseline-shift:baseline;text-anchor:start;display:inline;overflow:visible;visibility:visible;opacity:0.2;fill:#000000;fill-opacity:1;fill-rule:nonzero;stroke:none;stroke-width:2;marker:none;filter:url(#filter7834);enable-background:accumulate"
       d="m 18.875,8.0000001 c -0.22185,0.024 -0.43465,0.12479 -0.59375,0.28125 l -3,2.9999999 C 14.45803,12.10447 13.06097,12.83811 11.875,13.3125 10.68903,13.78689 9.75,14.03125 9.75,14.03125 9.32443,14.14117 8.99981,14.56047 9,15 v 3 C 9,18.66667 8.54542,20.16769 8.0625,21.375 7.57958,22.58231 7.09375,23.5625 7.09375,23.5625 6.79771,24.17118 7.32316,25.00466 8,25 c -0.005,0.67684 0.82882,1.20229 1.4375,0.90625 0,0 0.98019,-0.48583 2.1875,-0.96875 C 12.83231,24.45458 14.33333,24 15,24 h 3 c 0.43953,1.9e-4 0.85883,-0.32443 0.96875,-0.75 0,0 0.24436,-0.93903 0.71875,-2.125 0.47439,-1.18597 1.20803,-2.58303 2.03125,-3.40625 l 3,-3 c 0.38424,-0.37177 0.38424,-1.06573 0,-1.4375 l -5,-4.9999999 c -0.21786,-0.21661 -0.53949,-0.32383 -0.84375,-0.28125 z"
       id="path7430"
       inkscape:connector-curvature="0"
       transform="matrix(0.90731977,0,0,0.90709594,0.35375643,-0.70568861)" />
    <path
       style="color:#000000;font-style:normal;font-variant:normal;font-weight:normal;font-stretch:normal;font-size:medium;line-height:normal;font-family:Sans;-inkscape-font-specification:Sans;text-indent:0;text-align:start;text-decoration:none;text-decoration-line:none;letter-spacing:normal;word-spacing:normal;text-transform:none;writing-mode:lr-tb;direction:ltr;baseline-shift:baseline;text-anchor:start;display:inline;overflow:visible;visibility:visible;opacity:0.6;fill:#000000;fill-opacity:1;fill-rule:nonzero;stroke:none;stroke-width:2;marker:none;filter:url(#filter6888);enable-background:accumulate"
       d="m 16.5,16 c 0.28799,0 0.5,0.21201 0.5,0.5 0,0.28799 -0.21201,0.5 -0.5,0.5 -0.0483,0 -0.12202,-0.0213 -0.15625,-0.0312 C 16.25215,16.9452 16.1571,16.9346 16.0625,16.9376 16.0585,16.83099 16.0373,16.72504 16,16.6251 c -0.0122,-0.0383 0,-0.0367 0,-0.125 0,-0.28799 0.21201,-0.5 0.5,-0.5 z"
       id="path7426"
       inkscape:connector-curvature="0"
       transform="matrix(0.90731977,0,0,0.90709594,0.35375643,-0.70568861)" />
    <path
       style="color:#000000;font-style:normal;font-variant:normal;font-weight:normal;font-stretch:normal;font-size:medium;line-height:normal;font-family:Sans;-inkscape-font-specification:Sans;text-indent:0;text-align:start;text-decoration:none;text-decoration-line:none;letter-spacing:normal;word-spacing:normal;text-transform:none;writing-mode:lr-tb;direction:ltr;baseline-shift:baseline;text-anchor:start;display:inline;overflow:visible;visibility:visible;fill:url(#linearGradient831);fill-opacity:1;fill-rule:nonzero;stroke:none;stroke-width:1.81441569;marker:none;enable-background:accumulate"
       d="m 17.479417,5.6439831 c -0.201289,0.02177 -0.394366,0.1131965 -0.538721,0.2551207 l -2.721959,2.7212877 c -0.746924,0.7467395 -2.014504,1.4122215 -3.090558,1.8425385 -1.076054,0.430317 -1.9280548,0.651975 -1.9280548,0.651975 -0.3861281,0.09971 -0.6806622,0.480054 -0.6804898,0.87875 v 2.721287 c 0,0.604734 -0.4124495,1.966303 -0.8506123,3.061449 -0.4381629,1.095146 -0.8789661,1.984273 -0.8789661,1.984273 -0.2686029,0.552131 0.2081483,1.308177 0.8222586,1.30395 -0.00454,0.613959 0.7520048,1.090592 1.3042722,0.822056 0,0 0.8893457,-0.440695 1.9847622,-0.87875 1.095416,-0.438054 2.457321,-0.850402 3.062204,-0.850402 h 2.721959 c 0.398795,1.72e-4 0.779234,-0.294289 0.878966,-0.680322 0,0 0.221713,-0.85179 0.652136,-1.927579 0.430424,-1.075788 1.09607,-2.343056 1.842994,-3.089795 l 2.721959,-2.721288 c 0.348629,-0.337231 0.348629,-0.96672 0,-1.303951 L 18.244968,5.8991038 C 18.047299,5.7026177 17.755478,5.6053589 17.479417,5.6439831 Z"
       id="path4690-8"
       inkscape:connector-curvature="0"
       sodipodi:nodetypes="ccssccsscccssccsscccc" />
    <path
       style="display:inline;fill:#161921;fill-opacity:1;stroke:none;stroke-width:0.90720785"
       d="M 17.592832,6.551079 14.870873,9.2723667 C 13.056233,11.086559 9.4269541,11.993655 9.4269541,11.993655 v 2.721287 c 0,1.814192 -1.8146395,5.442576 -1.8146395,5.442576 L 14.02026,13.751153 c -0.04148,-0.130286 -0.05671,-0.252826 -0.05671,-0.396855 0,-0.751465 0.609329,-1.360643 1.36098,-1.360643 0.751651,0 1.360979,0.609178 1.360979,1.360643 0,0.751466 -0.609328,1.360644 -1.360979,1.360644 -0.134674,0 -0.274102,-0.02023 -0.396953,-0.05669 l -6.4079456,6.406365 c 0,0 3.6292786,-1.814192 5.4439186,-1.814192 h 2.721959 c 0,0 0.90732,-3.628384 2.72196,-5.442576 l 2.721959,-2.721287 z"
       id="path4690"
       inkscape:connector-curvature="0"
       sodipodi:nodetypes="cscsccssssccscscc" />
  </g>
  <style
     id="style3"
     type="text/css"><![CDATA[
	.st0{fill:#4B4B4B;}
]]></style>
</svg>
