<?xml version="1.0" encoding="UTF-8" standalone="no"?>
<svg
   xmlns:dc="http://purl.org/dc/elements/1.1/"
   xmlns:cc="http://creativecommons.org/ns#"
   xmlns:rdf="http://www.w3.org/1999/02/22-rdf-syntax-ns#"
   xmlns:svg="http://www.w3.org/2000/svg"
   xmlns="http://www.w3.org/2000/svg"
   xmlns:xlink="http://www.w3.org/1999/xlink"
   xmlns:sodipodi="http://sodipodi.sourceforge.net/DTD/sodipodi-0.dtd"
   xmlns:inkscape="http://www.inkscape.org/namespaces/inkscape"
   width="100"
   height="100"
   viewBox="0 0 75 75"
   version="1.1"
   id="svg2"
   inkscape:version="0.92.4 5da689c313, 2019-01-14"
   sodipodi:docname="dnd-move.svg">
  <metadata
     id="metadata13">
    <rdf:RDF>
      <cc:Work
         rdf:about="">
        <dc:format>image/svg+xml</dc:format>
        <dc:type
           rdf:resource="http://purl.org/dc/dcmitype/StillImage" />
        <dc:title />
      </cc:Work>
    </rdf:RDF>
  </metadata>
  <defs
     id="defs11">
    <linearGradient
       inkscape:collect="always"
       id="linearGradient824">
      <stop
         id="stop822"
         offset="0"
         style="stop-color:#c40fd1;stop-opacity:1" />
      <stop
         id="stop820"
         offset="1"
         style="stop-color:#8200f2;stop-opacity:1" />
    </linearGradient>
    <filter
       inkscape:collect="always"
       id="filter7762"
       x="-0.17182922"
       width="1.3436584"
       y="-0.17137139"
       height="1.3427428"
       style="color-interpolation-filters:sRGB">
      <feGaussianBlur
         inkscape:collect="always"
         stdDeviation="1.2231563"
         id="feGaussianBlur7764" />
    </filter>
    <linearGradient
       inkscape:collect="always"
       xlink:href="#linearGradient824"
       id="linearGradient826"
       x1="7.1278691"
       y1="13.799484"
       x2="22.628622"
       y2="13.799484"
       gradientUnits="userSpaceOnUse" />
  </defs>
  <sodipodi:namedview
     pagecolor="#cfd8dc"
     bordercolor="#666666"
     borderopacity="1"
     objecttolerance="10"
     gridtolerance="10"
     guidetolerance="10"
     inkscape:pageopacity="0"
     inkscape:pageshadow="2"
     inkscape:window-width="1020"
     inkscape:window-height="698"
     id="namedview9"
     showgrid="true"
     inkscape:zoom="6.83758"
     inkscape:cx="46.319066"
     inkscape:cy="40.65445"
     inkscape:window-x="344"
     inkscape:window-y="0"
     inkscape:window-maximized="0"
     inkscape:current-layer="g64"
     inkscape:pagecheckerboard="false">
    <inkscape:grid
       type="xygrid"
       id="grid20" />
  </sodipodi:namedview>
  <g
     transform="matrix(2.4798086,0,0,2.4804205,0.60481434,1.0215723)"
     id="g64">
    <path
       transform="matrix(0.9073119,0,0,0.90708803,-83.231206,-2.2823404)"
       style="color:#000000;font-style:normal;font-variant:normal;font-weight:normal;font-stretch:normal;font-size:medium;line-height:normal;font-family:Sans;-inkscape-font-specification:Sans;text-indent:0;text-align:start;text-decoration:none;text-decoration-line:none;letter-spacing:normal;word-spacing:normal;text-transform:none;writing-mode:lr-tb;direction:ltr;baseline-shift:baseline;text-anchor:start;display:inline;overflow:visible;visibility:visible;opacity:0.2;fill:#000000;fill-opacity:1;fill-rule:nonzero;stroke:none;stroke-width:2;marker:none;filter:url(#filter7762);enable-background:accumulate"
       d="m 110.88222,10.16907 c -0.70624,0.0437 -1.26297,0.4091 -1.6875,0.90625 -0.75568,-0.75568 -1.56294,-0.66265 -1.8125,-0.65625 -0.93705,0.0569 -1.55625,0.6895 -1.9375,1.46875 -0.42937,-0.26033 -0.89508,-0.47704 -1.4375,-0.4375 -0.0104,-1.6e-4 -0.0208,-1.6e-4 -0.0312,0 -1.45408,0.13074 -2.44879,1.43826 -2.21875,2.875 v 0.0312 l 0.25,1.65625 c -0.0212,0.01 -0.042,0.0202 -0.0625,0.0312 -0.47965,0.36125 -1.20504,0.84696 -1.75,1.65625 -0.54496,0.80929 -0.81772,2.00394 -0.40625,3.3125 0.44925,1.42873 1.29271,2.91712 2.25,4.09375 0.47864,0.58831 0.99427,1.07367 1.53125,1.46875 0.53698,0.39508 1.0975,0.72336 1.8125,0.71875 l 8.8437,-0.0312 c 0.50339,9.4e-4 0.96849,-0.4351 1,-0.9375 0,0 1.9082,-3.2516 1.34375,-11.3125 v -0.0312 c -0.18896,-2.1661 -0.91281,-3.19713 -2.59375,-3.0938 -0.0109,6.7e-4 -0.0204,-8.1e-4 -0.0312,0 -0.251,0.0173 -0.43118,0.19681 -0.65625,0.28125 -0.27074,-1.15387 -1.14973,-2.08118 -2.40625,-2 z"
       id="path7444"
       inkscape:connector-curvature="0" />
    <path
       sodipodi:nodetypes="ccccccccccsssscccccscccc"
       inkscape:connector-curvature="0"
       id="path4236-1-58-5-6-0-3"
       d="M 17.373551,6.0348132 C 16.732772,6.0744529 16.227644,6.4059029 15.842463,6.8568617 15.156825,6.1713934 14.424389,6.2557798 14.19796,6.2615852 13.347762,6.3131985 12.785956,6.8870226 12.440043,7.5938703 12.050469,7.3577287 11.627926,7.1611531 11.135782,7.1970193 c -0.0094,-1.451e-4 -0.01887,-1.451e-4 -0.02831,0 C 9.7881695,7.3156181 8.8856567,8.5016478 9.0943759,9.8048974 v 0.028301 l 0.226828,1.5023646 c -0.019235,0.0091 -0.038107,0.01823 -0.056701,0.0283 -0.4351927,0.327686 -1.0933471,0.768269 -1.5877958,1.502365 -0.4944487,0.734098 -0.7419271,1.81775 -0.3685961,3.004729 0.4076105,1.295985 1.1728918,2.646085 2.0414518,3.713391 0.4342758,0.53365 0.9021132,0.973914 1.3893222,1.332285 0.487207,0.358373 0.995773,0.656152 1.644503,0.651971 l 8.023993,-0.0283 c 0.456732,8.53e-4 0.878723,-0.394674 0.907312,-0.850395 0,0 1.731334,-2.949487 1.219201,-10.261434 v -0.0283 c -0.171452,-1.9647973 -0.82821,-2.9000317 -2.353347,-2.8063029 -0.0099,6.084e-4 -0.01851,-7.341e-4 -0.02831,0 C 19.924504,7.609569 19.761024,7.7723949 19.556815,7.8489895 19.311169,6.8023276 18.513652,5.9611758 17.373596,6.0348132 Z"
       style="color:#000000;font-style:normal;font-variant:normal;font-weight:normal;font-stretch:normal;font-size:medium;line-height:normal;font-family:Sans;-inkscape-font-specification:Sans;text-indent:0;text-align:start;text-decoration:none;text-decoration-line:none;letter-spacing:normal;word-spacing:normal;text-transform:none;writing-mode:lr-tb;direction:ltr;baseline-shift:baseline;text-anchor:start;display:inline;overflow:visible;visibility:visible;fill:url(#linearGradient826);fill-opacity:1;fill-rule:nonzero;stroke:none;stroke-width:1.81439996;marker:none;enable-background:accumulate" />
    <path
       sodipodi:nodetypes="ccssccccccsccssccsscccssccc"
       inkscape:connector-curvature="0"
       id="path4236-1-58-5-6-0"
       d="M 14.251818,7.1809639 C 13.538771,7.224238 12.930027,7.913937 12.975911,8.626636 l 0.08791,1.2633015 c 0.02232,0.3211275 -0.277111,0.3882685 -0.311889,0.1417315 L 12.641726,9.250259 C 12.544232,8.576982 11.874358,8.038589 11.195697,8.0880519 10.44898,8.1551764 9.848611,8.9368867 9.9764972,9.6754559 l 0.4788158,2.9924391 c 0.0046,0.115176 -0.02831,0.708662 -0.02831,0.708662 L 9.8032284,12.100965 c -0.9111855,0.686094 -2.2365141,1.563466 -1.6260384,3.504443 0.7225106,2.297192 2.883183,5.064736 4.206207,5.056199 l 8.023985,-0.0283 c 1.552602,-3.439824 1.262798,-6.652684 1.247554,-8.929148 L 21.644896,10.19998 C 21.639496,9.3380662 21.086962,8.4354132 20.227184,8.4991912 19.645597,8.5324872 19.112226,8.9808996 18.97963,9.5480111 L 18.81958,10.40022 c -0.04772,0.254122 -0.132367,0.149589 -0.113414,-0.05669 l 0.179849,-1.9573832 c 0.04972,-0.7694198 -0.676419,-1.4953805 -1.446029,-1.4456721 -0.665259,0.041182 -1.249342,0.6381001 -1.275907,1.303939 l -0.151494,1.3621016 c -0.03539,0.318198 -0.235874,0.3260352 -0.255182,-0.028301 L 15.697882,8.4849936 C 15.669114,7.7624351 14.97372,7.1353652 14.251854,7.1810546 Z"
       style="display:inline;fill:#262d31;fill-opacity:1;stroke:none;stroke-width:0.90719998" />
    <path
       style="opacity:1;vector-effect:none;fill:#161921;fill-opacity:1;stroke-width:1.23066509;stroke-linecap:round;stroke-linejoin:round;stroke-miterlimit:4;stroke-dasharray:none;stroke-dashoffset:0;stroke-opacity:1;paint-order:markers fill stroke"
       d="M 39.310487,68.749931 C 35.204193,66.611502 29.121658,57.805178 27.792559,52.074217 c -0.558932,-2.410069 -0.35713,-3.963299 0.771734,-5.939865 0.816278,-1.429248 4.180633,-4.579273 4.608454,-4.314865 0.113995,0.07045 0.589609,0.928053 1.056919,1.905778 1.612733,3.374228 1.708689,2.120897 0.437162,-5.710041 -0.496272,-3.056382 -0.807929,-5.854152 -0.704553,-6.324821 0.237815,-1.082763 2.10274,-3.048704 3.138703,-3.308714 1.25414,-0.314769 2.764547,0.104919 3.869691,1.075249 1.00044,0.878397 1.323064,1.653199 1.80964,4.345962 0.156707,0.867229 0.387074,1.316255 0.675288,1.316255 0.363277,0 0.437444,-0.578956 0.437444,-3.414735 0,-3.006363 0.07318,-3.513581 0.611897,-4.241267 1.545894,-2.088146 3.941884,-2.720457 5.846984,-1.54304 1.563407,0.966238 2.082879,2.127382 2.317058,5.179179 0.187326,2.441214 0.47743,3.346527 0.927999,2.895958 0.0873,-0.0873 0.340112,-1.63245 0.5618,-3.433664 0.335219,-2.72364 0.533288,-3.445657 1.176623,-4.289112 1.37484,-1.802509 3.571322,-2.303785 5.348167,-1.220547 2.285232,1.393171 2.581981,2.426461 2.124807,7.398692 -0.349343,3.799502 -0.03472,5.232814 0.512374,2.33418 0.634962,-3.364174 2.163634,-5.077976 4.527515,-5.075822 1.656512,0.0015 2.891025,0.842691 3.70529,2.52474 0.675572,1.395542 0.684192,1.537674 0.698057,11.509252 0.01764,12.678822 -0.397717,15.817172 -3.071171,23.205625 L 68.26156,69.48804 54.468544,69.474421 40.675528,69.460802 Z"
       id="path818"
       inkscape:connector-curvature="0"
       transform="matrix(0.3024427,0,0,0.30236809,-0.24389557,-0.41185448)" />
  </g>
</svg>
