<?xml version="1.0" encoding="UTF-8" standalone="no"?>
<svg
   xmlns:dc="http://purl.org/dc/elements/1.1/"
   xmlns:cc="http://creativecommons.org/ns#"
   xmlns:rdf="http://www.w3.org/1999/02/22-rdf-syntax-ns#"
   xmlns:svg="http://www.w3.org/2000/svg"
   xmlns="http://www.w3.org/2000/svg"
   xmlns:xlink="http://www.w3.org/1999/xlink"
   xmlns:sodipodi="http://sodipodi.sourceforge.net/DTD/sodipodi-0.dtd"
   xmlns:inkscape="http://www.inkscape.org/namespaces/inkscape"
   width="100"
   height="100"
   viewBox="0 0 75 75"
   version="1.1"
   id="svg2"
   inkscape:version="0.92.4 5da689c313, 2019-01-14"
   sodipodi:docname="cell.svg">
  <metadata
     id="metadata13">
    <rdf:RDF>
      <cc:Work
         rdf:about="">
        <dc:format>image/svg+xml</dc:format>
        <dc:type
           rdf:resource="http://purl.org/dc/dcmitype/StillImage" />
        <dc:title />
      </cc:Work>
    </rdf:RDF>
  </metadata>
  <defs
     id="defs11">
    <linearGradient
       inkscape:collect="always"
       id="linearGradient821">
      <stop
         id="stop819"
         offset="0"
         style="stop-color:#c40fd1;stop-opacity:1" />
      <stop
         id="stop817"
         offset="1"
         style="stop-color:#8200f2;stop-opacity:1" />
    </linearGradient>
    <filter
       inkscape:collect="always"
       id="filter8318"
       x="-0.2220064"
       width="1.4440128"
       y="-0.2219936"
       height="1.4439873"
       style="color-interpolation-filters:sRGB">
      <feGaussianBlur
         inkscape:collect="always"
         stdDeviation="1.2025347"
         id="feGaussianBlur8320" />
    </filter>
    <linearGradient
       inkscape:collect="always"
       xlink:href="#linearGradient821"
       id="linearGradient823"
       x1="22.875129"
       y1="35.25"
       x2="52.124872"
       y2="35.25"
       gradientUnits="userSpaceOnUse" />
  </defs>
  <sodipodi:namedview
     pagecolor="#cfd8dc"
     bordercolor="#666666"
     borderopacity="1"
     objecttolerance="10"
     gridtolerance="10"
     guidetolerance="10"
     inkscape:pageopacity="0"
     inkscape:pageshadow="2"
     inkscape:window-width="1020"
     inkscape:window-height="698"
     id="namedview9"
     showgrid="true"
     inkscape:zoom="9.6697984"
     inkscape:cx="44.003706"
     inkscape:cy="53.543083"
     inkscape:window-x="344"
     inkscape:window-y="0"
     inkscape:window-maximized="0"
     inkscape:current-layer="svg2"
     inkscape:pagecheckerboard="false">
    <inkscape:grid
       type="xygrid"
       id="grid20" />
  </sodipodi:namedview>
  <path
     transform="matrix(2.2499801,0,0,2.2499801,16.3815,16.380655)"
     sodipodi:nodetypes="cccccccccccccccccccccccc"
     inkscape:connector-curvature="0"
     style="color:#000000;font-style:normal;font-variant:normal;font-weight:normal;font-stretch:normal;font-size:medium;line-height:normal;font-family:Sans;-inkscape-font-specification:Sans;text-indent:0;text-align:start;text-decoration:none;text-decoration-line:none;letter-spacing:normal;word-spacing:normal;text-transform:none;writing-mode:lr-tb;direction:ltr;baseline-shift:baseline;text-anchor:start;display:inline;overflow:visible;visibility:visible;opacity:0.2;fill:#000000;fill-opacity:1;fill-rule:nonzero;stroke:none;stroke-width:2;marker:none;filter:url(#filter8318);enable-background:accumulate"
     d="m 6.6985831,2.8868332 c -0.4584,0.0875 -0.82072,0.5334 -0.8125,1 v 2 h -2 c -0.52358,5e-5 -0.99995,0.47642 -1,1 v 4.9999998 c 5e-5,0.52358 0.47642,0.99995 1,1 h 2 v 2 c 5e-5,0.52358 0.47642,0.99995 1,1 h 4.9999999 c 0.52358,-5e-5 0.99995,-0.47642 1,-1 v -2 h 2 c 0.52358,-5e-5 0.99995,-0.47642 1,-1 V 6.8868332 c -5e-5,-0.52358 -0.47642,-0.99995 -1,-1 h -2 v -2 c -5e-5,-0.52358 -0.47642,-0.99995 -1,-1 H 6.8860831 c -0.0312,-10e-4 -0.0625,-10e-4 -0.0937,0 -0.0312,-10e-4 -0.0625,-10e-4 -0.0937,0 z"
     id="rect6496-1-9" />
  <path
     sodipodi:nodetypes="cccccccccccccccccccccccc"
     inkscape:connector-curvature="0"
     style="color:#000000;font-style:normal;font-variant:normal;font-weight:normal;font-stretch:normal;font-size:medium;line-height:normal;font-family:Sans;-inkscape-font-specification:Sans;text-indent:0;text-align:start;text-decoration:none;text-decoration-line:none;letter-spacing:normal;word-spacing:normal;text-transform:none;writing-mode:lr-tb;direction:ltr;baseline-shift:baseline;text-anchor:start;display:inline;overflow:visible;visibility:visible;fill:url(#linearGradient823);fill-opacity:1;fill-rule:nonzero;stroke:none;stroke-width:4.49996042;marker:none;enable-background:accumulate"
     d="m 31.453178,20.625992 c -1.031391,0.196873 -1.846604,1.200139 -1.828109,2.24998 v 4.49996 h -4.49996 c -1.178045,1.13e-4 -2.249866,1.071936 -2.24998,2.249981 v 11.249901 c 1.14e-4,1.178044 1.071935,2.249866 2.24998,2.24998 h 4.49996 v 4.49996 c 1.14e-4,1.178045 1.071936,2.249866 2.249981,2.24998 h 11.249901 c 1.178045,-1.14e-4 2.249869,-1.071935 2.24998,-2.24998 v -4.49996 h 4.49996 c 1.178045,-1.14e-4 2.24987,-1.071936 2.249981,-2.24998 V 29.625913 c -1.11e-4,-1.178045 -1.071936,-2.249868 -2.249981,-2.249981 h -4.49996 v -4.49996 c -1.11e-4,-1.178045 -1.071935,-2.249867 -2.24998,-2.24998 H 31.87505 c -0.0702,-0.0023 -0.140608,-0.0023 -0.210808,0 -0.0702,-0.0023 -0.140608,-0.0023 -0.210808,0 z"
     id="rect6496-1" />
  <path
     sodipodi:nodetypes="ccccccccccccc"
     inkscape:connector-curvature="0"
     style="display:inline;fill:#161921;fill-opacity:1;stroke:none;stroke-width:2.24998021"
     d="m 31.87505,22.875972 v 6.749941 h -6.749941 v 11.249901 h 6.749941 v 6.74994 h 11.249901 v -6.74994 h 6.74994 V 29.625913 h -6.74994 v -6.749941 z"
     id="rect6496" />
</svg>
