<?xml version="1.0" encoding="UTF-8" standalone="no"?>
<svg
   xmlns:dc="http://purl.org/dc/elements/1.1/"
   xmlns:cc="http://creativecommons.org/ns#"
   xmlns:rdf="http://www.w3.org/1999/02/22-rdf-syntax-ns#"
   xmlns:svg="http://www.w3.org/2000/svg"
   xmlns="http://www.w3.org/2000/svg"
   xmlns:xlink="http://www.w3.org/1999/xlink"
   xmlns:sodipodi="http://sodipodi.sourceforge.net/DTD/sodipodi-0.dtd"
   xmlns:inkscape="http://www.inkscape.org/namespaces/inkscape"
   width="100"
   height="100"
   viewBox="0 0 75 75"
   version="1.1"
   id="svg2"
   inkscape:version="0.92.4 5da689c313, 2019-01-14"
   sodipodi:docname="color-picker.svg">
  <metadata
     id="metadata13">
    <rdf:RDF>
      <cc:Work
         rdf:about="">
        <dc:format>image/svg+xml</dc:format>
        <dc:type
           rdf:resource="http://purl.org/dc/dcmitype/StillImage" />
        <dc:title />
      </cc:Work>
    </rdf:RDF>
  </metadata>
  <defs
     id="defs11">
    <linearGradient
       inkscape:collect="always"
       id="linearGradient822">
      <stop
         id="stop820"
         offset="0"
         style="stop-color:#c40fd1;stop-opacity:1" />
      <stop
         id="stop818"
         offset="1"
         style="stop-color:#8200f2;stop-opacity:1" />
    </linearGradient>
    <filter
       inkscape:collect="always"
       id="filter7898"
       x="-0.14587325"
       width="1.2917465"
       y="-0.14693058"
       height="1.2938612"
       style="color-interpolation-filters:sRGB">
      <feGaussianBlur
         inkscape:collect="always"
         stdDeviation="1.1439055"
         id="feGaussianBlur7900" />
    </filter>
    <linearGradient
       inkscape:collect="always"
       xlink:href="#linearGradient822"
       id="linearGradient824"
       x1="16.591568"
       y1="35.110231"
       x2="58.672886"
       y2="35.110231"
       gradientUnits="userSpaceOnUse" />
  </defs>
  <sodipodi:namedview
     pagecolor="#cfd8dc"
     bordercolor="#666666"
     borderopacity="1"
     objecttolerance="10"
     gridtolerance="10"
     guidetolerance="10"
     inkscape:pageopacity="0"
     inkscape:pageshadow="2"
     inkscape:window-width="1020"
     inkscape:window-height="698"
     id="namedview9"
     showgrid="true"
     inkscape:zoom="9.6697984"
     inkscape:cx="47.047882"
     inkscape:cy="53.860815"
     inkscape:window-x="344"
     inkscape:window-y="0"
     inkscape:window-maximized="0"
     inkscape:current-layer="svg2"
     inkscape:pagecheckerboard="false">
    <inkscape:grid
       type="xygrid"
       id="grid20" />
  </sodipodi:namedview>
  <path
     transform="matrix(2.2499988,0,0,2.2499988,10.150126,10.302487)"
     sodipodi:nodetypes="cssccccccccccccccsscc"
     inkscape:connector-curvature="0"
     style="color:#000000;font-style:normal;font-variant:normal;font-weight:normal;font-stretch:normal;font-size:medium;line-height:normal;font-family:Sans;-inkscape-font-specification:Sans;text-indent:0;text-align:start;text-decoration:none;text-decoration-line:none;letter-spacing:normal;word-spacing:normal;text-transform:none;writing-mode:lr-tb;direction:ltr;baseline-shift:baseline;text-anchor:start;display:inline;overflow:visible;visibility:visible;opacity:0.2;fill:#000000;fill-opacity:1;fill-rule:nonzero;stroke:none;stroke-width:2;marker:none;filter:url(#filter7898);enable-background:accumulate"
     d="m 16.655264,2.7454233 c -1.11293,-0.003 -2.09989,0.42584 -2.90625,1.03125 -0.80636,0.60541 -1.45394,1.37934 -1.875,2.1875 -0.40053,0.76876 -0.6222,1.56288 -0.4375,2.40625 -0.31392,-0.0527 -0.6506,0.0555 -0.875,0.28125 L 9.1552636,10.057923 c -0.38424,0.37177 -0.38424,1.06573 0,1.4375 -0.044,0.0279 -0.0859,0.0593 -0.125,0.0937 l -5.59375,5.625 c -0.38424,0.37177 -0.94674,2.70918 -0.5625,3.08095 l 1,1 c 0.37177,0.38424 2.75323,-0.13421 3.125,-0.51845 l 5.5937504,-5.625 c 0.0344,-0.0391 0.0658,-0.081 0.0937,-0.125 0.37177,0.38424 1.06573,0.38424 1.4375,0 l 1.40625,-1.40625 c 0.22577,-0.2244 0.33398,-0.56108 0.28125,-0.875 1.94915,0.32279 3.90966,-0.69 5,-2.34375 1.10208,-1.6715597 1.13643,-4.2073197 -0.84375,-6.1874997 -1.00706,-1.00706 -2.19957,-1.46548 -3.3125,-1.46875 z"
     id="path5412-0-3" />
  <path
     sodipodi:nodetypes="cssccccccccccccccccccsscc"
     inkscape:connector-curvature="0"
     id="path5412-2"
     d="m 47.62445,14.22962 c -2.504093,-0.0068 -4.724752,0.95814 -6.539061,2.320312 -1.814309,1.362171 -3.271363,3.103513 -4.218748,4.921872 -0.90119,1.729709 -1.399949,3.516478 -0.984374,5.414058 -0.70632,-0.11859 -1.463849,0.12486 -1.968749,0.632814 l -3.164062,3.164059 c -0.86454,0.836484 -0.86454,2.397893 0,3.234373 -0.099,0.06279 -0.19326,0.13344 -0.28125,0.21081 l -12.58593,12.656243 c -0.300623,0.330726 -0.499274,0.752871 -0.562499,1.195311 l -0.632814,3.023437 c -0.1602,0.71631 -0.0702,2.713454 -0.0702,2.713454 l 2.249999,2.249999 c 0,0 1.895243,0.07719 2.601562,-0.04161 l 3.16406,-0.492189 c 0.474864,-0.06885 0.925694,-0.29418 1.265624,-0.632811 L 38.48394,42.143509 c 0.0774,-0.08799 0.14805,-0.18225 0.21081,-0.28125 0.836484,0.86454 2.397893,0.86454 3.234377,0 L 45.093186,38.6982 c 0.507984,-0.5049 0.751454,-1.26243 0.632814,-1.968749 4.385583,0.726275 8.79673,-1.552499 11.249994,-5.273436 2.479678,-3.761023 2.556964,-9.46648 -1.898438,-13.921881 -2.265884,-2.265884 -4.949029,-3.297329 -7.453121,-3.304686 z"
     style="color:#000000;font-style:normal;font-variant:normal;font-weight:normal;font-stretch:normal;font-size:medium;line-height:normal;font-family:Sans;-inkscape-font-specification:Sans;text-indent:0;text-align:start;text-decoration:none;text-decoration-line:none;letter-spacing:normal;word-spacing:normal;text-transform:none;writing-mode:lr-tb;direction:ltr;baseline-shift:baseline;text-anchor:start;display:inline;overflow:visible;visibility:visible;fill:url(#linearGradient824);fill-opacity:1;fill-rule:nonzero;stroke:none;stroke-width:4.49999762;marker:none;enable-background:accumulate" />
  <path
     inkscape:connector-curvature="0"
     id="path4165"
     d="m 38.061955,26.604612 0.63281,2.531249 c 0.545715,2.182838 -3.164059,0 -3.164059,0 l -3.164062,3.164062 7.945309,7.945307 3.164063,-3.164059 c 0,0 -2.182838,-3.709777 0,-3.164063 l 2.531248,0.632814 c 6.609372,1.19531 15.164722,-7.68683 7.453121,-15.398429 -7.7116,-7.711601 -16.593744,3.064902 -15.39843,7.453119 z"
     style="display:inline;fill:#161921;fill-opacity:1;stroke:none;stroke-width:2.24999881" />
  <path
     sodipodi:nodetypes="cccccccccccc"
     inkscape:connector-curvature="0"
     id="path4163"
     d="m 36.585391,31.245235 -17.085929,17.156241 -0.632811,3.093748 2.249999,2.249999 3.164059,-0.5625 17.085933,-17.156241 z m 0.28125,2.953123 1.546874,1.546874 -9.703119,9.70312 -3.796873,0.703125 z"
     style="display:inline;fill:#161921;fill-opacity:1;stroke:none;stroke-width:2.24999881" />
</svg>
