<?xml version="1.0" encoding="UTF-8" standalone="no"?>
<svg
   xmlns:dc="http://purl.org/dc/elements/1.1/"
   xmlns:cc="http://creativecommons.org/ns#"
   xmlns:rdf="http://www.w3.org/1999/02/22-rdf-syntax-ns#"
   xmlns:svg="http://www.w3.org/2000/svg"
   xmlns="http://www.w3.org/2000/svg"
   xmlns:xlink="http://www.w3.org/1999/xlink"
   xmlns:sodipodi="http://sodipodi.sourceforge.net/DTD/sodipodi-0.dtd"
   xmlns:inkscape="http://www.inkscape.org/namespaces/inkscape"
   width="100"
   height="100"
   viewBox="0 0 75 75"
   version="1.1"
   id="svg2"
   inkscape:version="0.92.4 5da689c313, 2019-01-14"
   sodipodi:docname="wait-26.svg">
  <metadata
     id="metadata13">
    <rdf:RDF>
      <cc:Work
         rdf:about="">
        <dc:format>image/svg+xml</dc:format>
        <dc:type
           rdf:resource="http://purl.org/dc/dcmitype/StillImage" />
        <dc:title />
      </cc:Work>
    </rdf:RDF>
  </metadata>
  <defs
     id="defs11">
    <clipPath
       id="clip1">
      <path
         id="path4225"
         d="m 17,10 14,0 0,20 -14,0 m 0,-20"
         inkscape:connector-curvature="0" />
    </clipPath>
    <clipPath
       id="clip2">
      <path
         id="path4228"
         d="m 41.895,19.992 c 0,10.582 -8.02,19.16 -17.895,19.16 -9.875,0 -17.891,-8.574 -17.891,-19.16 0,-10.586 8.02,-19.16 17.891,-19.16 9.879,0 17.895,8.574 17.895,19.16 m 0,0"
         inkscape:connector-curvature="0" />
    </clipPath>
    <clipPath
       id="clip1-2">
      <path
         inkscape:connector-curvature="0"
         d="m 17,10 14,0 0,20 -14,0 m 0,-20"
         id="path4225-0" />
    </clipPath>
    <clipPath
       id="clip2-2">
      <path
         inkscape:connector-curvature="0"
         d="m 41.895,19.992 c 0,10.582 -8.02,19.16 -17.895,19.16 -9.875,0 -17.891,-8.574 -17.891,-19.16 0,-10.586 8.02,-19.16 17.891,-19.16 9.879,0 17.895,8.574 17.895,19.16 m 0,0"
         id="path4228-3" />
    </clipPath>
    <clipPath
       id="clip1-29">
      <path
         inkscape:connector-curvature="0"
         d="m 17,10 14,0 0,20 -14,0 m 0,-20"
         id="path4225-3" />
    </clipPath>
    <clipPath
       id="clip2-1">
      <path
         inkscape:connector-curvature="0"
         d="m 41.895,19.992 c 0,10.582 -8.02,19.16 -17.895,19.16 -9.875,0 -17.891,-8.574 -17.891,-19.16 0,-10.586 8.02,-19.16 17.891,-19.16 9.879,0 17.895,8.574 17.895,19.16 m 0,0"
         id="path4228-9" />
    </clipPath>
    <clipPath
       id="clip1-2-4">
      <path
         id="path4225-0-7"
         d="m 17,10 14,0 0,20 -14,0 m 0,-20"
         inkscape:connector-curvature="0" />
    </clipPath>
    <clipPath
       id="clip2-2-8">
      <path
         id="path4228-3-4"
         d="m 41.895,19.992 c 0,10.582 -8.02,19.16 -17.895,19.16 -9.875,0 -17.891,-8.574 -17.891,-19.16 0,-10.586 8.02,-19.16 17.891,-19.16 9.879,0 17.895,8.574 17.895,19.16 m 0,0"
         inkscape:connector-curvature="0" />
    </clipPath>
    <filter
       height="1.3408"
       y="-0.17039999"
       width="1.3408"
       x="-0.17039999"
       id="filter879"
       style="color-interpolation-filters:sRGB"
       inkscape:collect="always">
      <feGaussianBlur
         id="feGaussianBlur881"
         stdDeviation="1.3845"
         inkscape:collect="always" />
    </filter>
  </defs>
  <sodipodi:namedview
     pagecolor="#cfd8dc"
     bordercolor="#666666"
     borderopacity="1"
     objecttolerance="10"
     gridtolerance="10"
     guidetolerance="10"
     inkscape:pageopacity="0"
     inkscape:pageshadow="2"
     inkscape:window-width="1366"
     inkscape:window-height="701"
     id="namedview9"
     showgrid="true"
     inkscape:zoom="4.4360433"
     inkscape:cx="-3.1526776"
     inkscape:cy="21.905638"
     inkscape:window-x="0"
     inkscape:window-y="0"
     inkscape:window-maximized="1"
     inkscape:current-layer="g64"
     inkscape:pagecheckerboard="false">
    <inkscape:grid
       type="xygrid"
       id="grid20" />
  </sodipodi:namedview>
  <g
     transform="matrix(2.4798086,0,0,2.4804205,0.60481434,1.0215723)"
     id="g64">
    <path
       inkscape:connector-curvature="0"
       id="path865"
       d="M 12,2.2499997 A 9.7505686,9.7505686 0 0 0 2.2499999,12 9.7505686,9.7505686 0 0 0 12,21.749999 9.7505686,9.7505686 0 0 0 21.749999,12 9.7505686,9.7505686 0 0 0 12,2.2499997 Z"
       style="opacity:0.19599998;fill:#000000;fill-opacity:0.94901961;stroke-width:0.87318522;filter:url(#filter879)"
       transform="matrix(1.2097777,0,0,1.2094793,0.36090682,0.19279832)" />
    <path
       style="opacity:0.96040009;fill:#262d31;fill-opacity:0.94901961;stroke-width:1.05622959"
       d="M 14.878238,2.9141264 A 11.79602,11.793111 0 0 0 3.0829065,14.706549 11.79602,11.793111 0 0 0 14.878238,26.498972 11.79602,11.793111 0 0 0 26.673571,14.706549 11.79602,11.793111 0 0 0 14.878238,2.9141264 Z"
       id="path856"
       inkscape:connector-curvature="0" />
    <path
       inkscape:connector-curvature="0"
       id="path3800"
       d="m 24.802625,12.669868 -9.924386,2.036682 2.037213,9.921921 A 10.131889,10.12939 0 0 0 24.80262,12.669876 Z"
       style="opacity:0.96040009;fill:#c40fd1;fill-opacity:1;stroke-width:0.90722138" />
    <path
       style="opacity:0.96040009;fill:#c40fd1;fill-opacity:1;stroke-width:0.90722138"
       d="M 23.634446,9.6115799 14.878239,14.70655 9.7819734,5.9525013 A 10.131889,10.12939 0 0 1 23.634438,9.6115722 Z"
       id="path3802"
       inkscape:connector-curvature="0" />
    <path
       inkscape:connector-curvature="0"
       id="path3804"
       d="M 8.0925163,22.227807 14.878239,14.70655 7.3551275,7.9225002 A 10.131889,10.12939 0 0 0 8.0925299,22.227813 Z"
       style="opacity:0.96040009;fill:#c40fd1;fill-opacity:1;stroke-width:0.90722138" />
    <path
       style="opacity:0.98000004;fill:#c40fd1;fill-opacity:1;stroke-width:0.90722138"
       d="m 12.238983,24.485632 2.639256,-9.779082 9.781486,2.638601 a 10.131889,10.12939 0 0 1 -12.42074,7.140479 z"
       id="path3795"
       inkscape:connector-curvature="0" />
    <image
       y="0.19279832"
       x="0.36090681"
       id="image1298"
       xlink:href="data:image/png;base64,iVBORw0KGgoAAAANSUhEUgAAAMgAAADICAYAAACtWK6eAAAaFElEQVR4Xu1dCZRVxZmuuu/1SnfT 3fQGKIgszU6QRXHFnASjRJwQEUeN0m3EGI9xmTPqZDCiyYnkmOBCiMRxGZ2JIjDSgCzdmJGMmiEj 0ICSiN0gCrShWfoB/fZ3b81/HzR2w1vq3Vt3e/e/53Bizqv/r/q/v76u+9f9/ypK8EEEEIGkCFDE BhFABJIjgATB2YEIpEAACYLTAxFAguAcQAS0IYAriDbcUMolCCBBXOJoNFMbAkgQbbihlEsQQIK4 xNFopjYEkCDacEMplyCABHGJo9FMbQggQbThhlIuQQAJ4hJHo5naEECCaMMNpVyCABLEJY5GM7Uh gATRhhtKuQQBJIhLHI1makMACaINN5RyCQJIEJc4Gs3UhgASRBtuKOUSBJAgLnE0mqkNASSINtxQ yiUIIEFc4mg0UxsCSBBtuKGUSxBAgrjE0WimNgSQINpwQymXIIAEcYmj0UxtCCBBtOGGUi5BAAni EkejmdoQQIJoww2lXIIAEsQER497bXd/KUoHE48yhDAyCLocDv/K4V8BobSQEAb/aCE4o0QdDmPk EPyPL/6PsuPQpoMS6lMY64B2+xRG9kjUv3t73Xi1DT4GIoAEEQju/DUTCnfHZs0MRcqmh1jpxJBc XuOLDPADyEAAIx7qY4ztZoTsBSK1MoW2ygrbk6d0tm69e2LAiB7dphMJosPj8xqvHNRycsacgFzx zaBSPtwfrSmPsfwemMos108YhTlszsMoOU4U8j4jyibmIZt23DHiM3N6zs5ekCCZ+pUR+v3lL9wL pKj3xQaMiSkFnlQqFJYTYkyKZdqNqPbq6xqTyBoqed9ovn3wFlF63aIHCcLp6RuWLrk9zCruORHt f1GU9crhFCOK4okw4o3wtjeyHZBlNzj8jZgsLd9519ADRvaVLbqRIKk8uWyZ53oSeOJ4ZOCPg3Kf Ui1OV1cPdRXRImuUDLzvwZsYeV+h0puKFGjYefs4v1F9OV0vEiSBB+tX1Rf7IpMWHg6NuCWklBfo cjKjCsQhtg2Y4Y2xgzL2bLuvcMmBh84P6rI1C4WRIN2cev+aWQP2B69cdDgy9jshuYz7NSrdvJCV vM50baz+HVaVr2AbecGOL2v/g8ynlsVMVuNwdv9IEEDkvnVD8toDdy/+KjTpjqBcnjLo1uJAWcmB FURStMiaLsNIq8zIz3fUD2uA7y+m7b6Zbidnh64nyK0rH7/tUHDS4uPRAcWcmGXczOqdrIwHDAIK JX+SlfD9H9eP3atFPltkXEuQO1Y/OepI4MKlh8OjRjEifNHoMT8U5oky5g07bdLArlcYtogXdp6Q Frb+ZKjjxi8Cb1cS5Kblv3m8LXTxvLBSYiwzTnvIjjtZmUwe9Us9JezRbXXDN2Qilw1tXUWQWcv+ uSaojG08FB47BnKaTPQf7GQp9t3J4gaC0t+3Hyv4mZt2u8ycJdx+MKLhLSuf+MHBziteDCgVeUbo T6czJuf6aRYEvbCa7IpS6bZP5gzdk87mbPg96wkya9esXGXX1asPBC+ephBhO7cZ+x52suAbgyRn LGhDASDJSUalh7fPGfoHGw5P6JCymiDXL/v5oGD0G5uPxwZWCkVNgzIFgnQGwboGUduKwOf41w4f K3w4m1+5spYgs5b9ckp7+OJ3A0qlvi/hgqanSg6VJILU2UYNbAe/u31O7UzbDEjwQLKSILOX/3rm weAlS8OsxCsYLx3qqAyBelalcsCrVjAaY9/+5K7hO3UAY2vRrCPIDW8teeRQ6KJfyqRnXYblXoCa kHhtSJY88I1EgcrGuh131q7MEpMSmpFVBPmHZS++ejA4+Q4Ihm3pM7OLp4wEAVaP+c11tQuN7MMO urOGIDe89dLTbaGJ/2RXcqjOdmLKSaJJqgbnzXNq77PDBDZ6DFlBkO++9dqT7aGx84xOGdHrDDsV T2m1BVaOzVLk5HSoec+qHblkeDieIDOXv/gv+/2Tf0GoZHtbnJ5yAieytNIombb17tojWgnmNDnb T6pUgH5vxZIftfknL1aI1xl2QGArszzbFk+lwhpWjhPU65m67QdDWp02yfWM1xkTK4GFM9789xnt 0dFvQ+Brz4g8iVecUDx19tAZYVHClNnN9SPf1TPZnCjrSILMX3dxiU8Zunlrxw9roSTWUTY4qnjq 9IxmCnuw+c7hLztxgusds6Mml2rsfAaleRunroBqt29FlSK65ehdBb7oBY5ZRZy3k0Vf2VY37AG9 E82p8o4jyONNVz8B24wPdgGuKDnkY98/5reFJtjoq3ny6eCk4ik1jcQTPjnbLTtWibzmKIL8rOmq 78Fu1WuJDGk9cU1uS+e1uebWeWT+d9ExO1mwY3WiU5oKlYQnMrcyeyQcQ5Cfrr9irNfj3Qh1TkmT Dw8Fx3m3+27LVxjwxLaP/YunYMfqCOxYTXPbjpVjV5BZy4hnZNnVm8Bx49LN+xOR86UtR+cWQKKi bclv5+IpdceKEs/0bXVDN6fD2g2/23YSdQf/sXev/jEcQLOA1yFhuRSC97kFJ2L9bRm827l4ChIQ 79teX5vwNZYX/2xqZ3uCPN50WT9GcrfAq1VRJsDD9wbyiW+2LYN3uxZPQYbuM831tY9ngnO2t7U9 QR5rmvom1HJP1+oIOwbvdtzJAnKsbP5yWB2cquiMA+60TogM5WxNkHmNU2+UJPpKhjad09xuwTtj FO65sU/xFMR2Ow93FH47m0tntc4h2xLk+XXjK0M5RV8E4VA3meg/K9ZWwbuNiqdg5Tggy9I0vA4h MYVsS5DXN05cup/0ukkdNvzFVWKUhmDt17X82yl4t0PxlBtKZrWuHF1ytiTIG++Orj6olO6PUE+P r+Myk6IyJXAhDSRea3zU4H17x+0F7eHRppyqmGyYdkg5kRVyR7aXzGqcJmfEbEmQNzeOb9hLSmYk Mg5eCWAZoRFYUXTc2kTJpydm5H7e+U3LviiqZ/WqwbpeB2qVhzSSp+A0kqe0yrtFznYEOb16HIDV I+VfeCAKkykN64lP2gKTvDt9N+fDFWmm+9vKY4DiO1b1tVC7j086BGxHkLcax61olUq5z1mC1USW GQ3DX0RN8UlHeLBn67E7C+DewXRYif3douIptWQWdqxuwB0rPnfaiiAvr6ot9uVXHAlJ3ozPCNUT n8CNtXTrkbmFnXK1qXiYXTyl7lhJUXKlm0pm+WiQvJWpEyLdYJdv/MbTn5HecDKJtuf0a1cEXrsy freH65zJNlhJjkaGmha8m1k8pZbMwiFv12XzIW/aZk1qKVsRZEnj5LajUkGNXkPj28Ik/tqV0WHR UItFdvluytsfmJLxCqZlzGbtZKmHvBEi3+jGklktfukuYxuCNDaOvHgLrfhfqBTUa9MZeYhPYhCf RDKNT77wX5Hz1+Mz4ZoEY3MdIScrAsG6jt04PqiAHY9ur6v9HV9rbGVLgixrGr+hhZZMM8I9MUai CpEiUInI/f3kSGi4p7mjriDG8o0YUlynOcVT7i6Z1es8cX+udYxk2Z/PK2jrHNjhp17DvkvE4xP4 fgJbw9zxSWe0Rvro6N0Fxh0MYWzxFJbM6piUp0VtQZCGplFP7KIVj+k3J72GTOMT9WCI5mNz8o0K 3g0rnsKS2fSTgaOFLQjyn40Tmr+QitJWC3LYw91EjU/UQJ4nbcXI4N2I4iksmeWeBmkb2oIgzzVd GuqkOYa9XiVFAWZS/LULtoV54hMjgndFgZuniLiUEyyZTTvnM2pgOUGa1g2Z9lFOf0uvF84kbUV0 8C66eMrNh7xlNPM5G1tOkBWN45bulkrjae1WP/G0FfX7SZq0epHBu8jiKYWxF7bXD3/EahyzqX/L CfJy06SDf6eFfe0EKk/airBTHQUVT8XvCtw37EYsmRU7kywlyKpVFcV/Kxjhk214dQFPWr2oUx31 Fk+pJbMnT0rXuf2QN7HUOKXNUoKs2DDm3t2e8kVGGCZK56ltYQJf45OX/eo9GEJPyom6YyXHpCux ZFaUx3vqsZQgbzaOX7pXKrFF/JEOXgUOWojHJ0nS6vUcDKG1eEotmaVEugEPeUvnPe2/W0qQV5sm 7GqjRSO0D998yVTxidaDIbQWT2HJrPH+t5Qgi5su8floXonxZortIVVavaaDITQUT2HJrFifJtNm GUHegzrX/9t4eThGPZaNQS/EydJWtBwMkUnxFJbM6vUcv7xlk9MOHwj5YUrdMnFafWYHQ/AWT2HJ rCiv8emxjCArN4z99V89ZQ/xDdMZrRKl1fMeDMGzk4Uls+bPA8sIsrRp/No9tORa8002tsdEaSs8 B0Oku0MdD3kz1m+2i0Feb5yweb9UNNkas43v9ez4RD0YovlofdIrGVIVT6kls3AtQR0e8ma8387u wbIV5NXGiZ+2Sb2GmW+yuT12T6tPHbwnL56C1WN+c13tQnNHjr2pCFhGEDvmYBk2JU6n1Z86DTJ5 8J6oeArS8F9rnlN7n2FjQ8UpEbCMIL9vnOw7IhU47huInvnUPT5JFLxDTlaAQGpLVx/qjpUUOTnd zbfM6sFbhKxlBPlt05TQcZprfpGUCNR06uhKqz8aHky7n+rYYycLSmahen4aHvKmE2yd4pYRZGHj pXJQyrGsf524CRFX01ZOyhVR9T5F9VTHruIp9ZA3uGV2Kt4yKwRmXUosm6ALNl6hyAafO6ULGZOE 1deuECuIbDl2l/dIeBiRWc4JwpTZeMibSQ5I0411BGkCglBjD2azB8R8o4DVQ9numx3ce/KqB5rv HP4ynxS2MhoBywjydNPlMbjiwLUM8TKF9GFhpZKE5EpYQyqVsFT592in0pA3tXz15zuNdjzq50PA MoIsbLosGoQXbb5hOrkVI6UsqvQhIaVKASLQkFzFQvD/4aBHmXoYYzmwc6VexEj8q4oDcoe0uLxh D9aV28TllhHkuaYp4U6aa8oh0WZhnc9irILAqgAEgJVBUYlQBf+bCyw4MwY44wcWD5UU3u7gh3fm RcMfFYbhcNQjpataBsNv3MekmmWfG/uxkCAWnYUlwMsSzPByWBUqukigEkEKySVKNNmkluDc0xyi ACnouR9nlSBl/uW9/Sx6yh2MxaaXr/r8fQFDRRU6EbCMIIuaLgmeoHlwgrq9nyKY9JVw05u6KsBq wGBVkPvAKgHvRukGDkdlUy+DbSngRMpYK/TngnDkb/lnzgwG1W+Ur2r5UboO8HfjEbCMIP/WOKm9 XSqsMN5Evh5y1KCZhOPxQQUEzTUQPFeRoJIPJ7HxaTjdClaJrriCB9zYYY8SXFMcgOTG7t10Rn2+ YVWbDndm1Dc2Fo4Ajw+Fd6oqfL3pol37abHp9egU/jyXwm0IaoxQCUFzNQTNQAiljKnXiGh8ksQV 6bQBkWjgnWK/3J5zzv2KksLu6b269Q/pdODvxiKgeU7oHZaR94F0ja0AXo+q1KBZ3UolYdhKjb8m yV4x8a+kxhRqbJEoruDBJ7bXGwu8VxxK1Bbezz4obWi9jkcPtjEOAcsI0tA4evEuqc89Ikw755sC rAjVEDf0gl0lEfq76eCOK9L1C8Qi/hW9/UqnlHiMsLx4FGlwyZrPjqTThb8bh4BlBFm/fsSD27xV v8nMtKTfFBQqmgrdB5ZhXMFjU3h7fiS8tSDl9WsSY4/2XtWKV6fxAGpQG8sI8sfGIddvlvqvSmZX vhJTd4+UCvW1iJ76pqDGDT2+KRgESlytxriCZ0hKJ2zrwurB5HTws4/LGlov49GJbYxBIJ2HjOkV tL66bFRNW2lFmwfKH8qVyNcpF0CEGgici8S/HvHYojuu4OkkuKkwFN2TByeapn+YErscU0/S42RU C8sIohr0xfrz/3IeCZi+k3UWmPG4gsCVs/GUD4MfdVs3sLokwNsNlKO/gKknvGiJb2cpQeR15c/C tc/14s3i0AhxBbxHQXzfM+WDQ1JzE/WTSmAt5Fsl2NZNqlRNPTnQUku3Eu7LRzUPEAXPQcBSgsTW ld1KqfSCaX6BuIIoRF0pgBzm1+NHP82NBj/sFc7UXkWJfb/P6s83ZiqH7fUjYClB2NriYYqUu0W/ GSk1mBJXpLNBgf2qeGAeTLKtm0IBpp6kQ9e4360lCFwfq2wob4E/5pWCTTQ1ruAZe2hLfiSyI/W2 bgo9mHrCA7IBbSwliGqPsr7P2/AJ41tCbLMgruAZt+yTlEBDSSD9tm5ybZh6woO0+DaWE0ReXw7n 89L5OkyToNgoXl9hRVzBM+5AY69g7EAufDvX/mDqiXbs9EhaThCNcQiF3accOAYESGHvwvbYAa8c aCwO6nFSXBZTT3RDqEWB5QRRBx3bUP4hZXRMGgNUUnghGxfSyZ1xqYi6reuHVyulw3tOtq4WZ2Hq iRbU9MnYgiCpXrNOfacw93uFPki/lg7vgjLazVBGK+zB1BNhUHIqsgVBErxm2T6uSIfv2WW06drz /o6pJ7xIiWlnC4Kopshry3fArm+tE+IKHujPLqPlkeFpg6knPCiJa2MbgoR+W/1BzkD5UnGmWacp vq37Nmzr9iyjFTMgTD0RgyOnFvsQZEH/6d6RoTUUyvOc/KhltKHGokD0oL5t3VQYYOqJeTPEVrMx +kr1QalS7mue+eJ7SlVGK6o3TD0RhWR6PbYiiH9B/3n5o8JPph+2PVukLaMVN2xMPRGHZUpNtiII m0tyYldVHZdKlHyT7BfazZnTEYVqTawMU09MABm6sBVBVJNDC2tW5AyNzTTHfHG9xMto3/76dERx mhNrwtQToxE+pd92BAn+ou/AnFHRPZBZ5aiT3zMpoxXiWvW8XxobV9awb58QfagkIQK2I4g6yvCL 1Wu9fWXH3KGeaRmtsLmosPllq1vx9lthgJ6ryJYEOfl8TWV+39gBKR+ydG3+aCqjFWYTpp4IgzKJ IlsSRB1r4Pma3+UNitn+AGetZbSiHIupJ6KQTBbrGatfs3a2jHii0Uqfp4T10qzEYEE9ZbSihoap J6KQdBhB1OF2/qrmkYKRsaeMhUC7dp1ltNo77i6JqSdicHTaK1bXeO36dV1EGa0oz0LK1y3lK1ve EaUP9XyNgG1jkK4hRpZUjZOqla122/YVUUYrcCL+V1lDS51AfajqNAK2J0g8YF9Y/VzeUPk+u3hN WBmtOIMw9UQclj00OYIg6ojDL1a1ePsqgw3CgVut6DJa7o7TNMTUE1FI9tTjGIIE59dc4B0Z2y0V WPttRHwZrRjHYuqJGBzP1uIYgsRftRb0ezh3ZHiBVTUjRpXRCnEtpp4IgdHRBFEHH1lcvckzQL7S EDTSKDWqjFaYLZh6IgzKLkWOWkHUQbP5xBvpV7PH2zd2vnA0Uig0tIxWmCGYeiIMytOKHEcQddyd 91dV504kezylSqFoQBLpM6OMVpQdmHoiCslTehxJEHXgwX/td7l3TPS/pV7q6YrGPmaU0YqyAFNP RCHpcILESfJE31tzxkZfh4+IhhHdxDJaMZ7F1BMxODr5Fas7AqGn+i3yjgrfa9TOlplltKI8i6kn opB08CtWD5I803eJ98LIXCqJXUjMLqMV51aCqSeCwBQ7owQNSoua0KLqZ70DYj8RSRLTy2i1GJ5Y BlNPBGGZNQRR8RBJEsvKaAU5FlNPxACZVQQ5Q5KBsfshJoGLq7Q96rZu4J1if0a30WrryjApTD0R A23WEUSFJfJS9bNSFbxuaTzGNNKSEwv9T1FIDMQWacHUEyHAZyVBVGTCL1TdKlUqr0p5cO1zBo8d ymgzGG7KprCKPFXa0GrbikxRdhqpJ2sJEifJs1VjpSrynlSslPGCaIsyWt7Bpm3HWsoaWiekbYYN kiKQ1QRRrWaLSVEkv/ov3ip5RLp5EN/WVe8yl7MHFkw9Sef11L9nz0xIg0NwUd83cgZEbk61DRz4 Y2Eoti8vpg9Se0lj6ok+f7iGICpMoWcqr/X0oa9LZUqfs2GzYRmtPs92SWPqiS4cXUWQ+CvXfCIF ivq9lHtB5HYI4OPn/9q1jFaXZ7sJY+qJdiRdR5AuqDof6j/OO0h52zsgMij2WV40+GEvgbfRaneI QZKYeqIRWNcSJL5yQC6af17/B2J78uawoGeQRgydIIapJxq95GqCnHlNn0q8vt6Db6FE+im8jvTT iKWtxTD1RJt7kCDdcNs/5byCouqCuYSxhwil3N9OtEFvrhSmnmjDGwmSALcvpg8oK/bmPgKpKj+E n3O1QWszKUw90eQQJEgK2Ni1Q/J8Ocp0Qj31ULNoyUkqmryaRAhTTzJHEwnCidnx7144lHk8dzHK bobYvpRTzGbN2J8g9eR6mw3K1sNBgmToHjaL5B4LD7rKQ73TgCzXAFkuyFCFuc0Z2wlJzWsZia2H +wy3m9u583tDguj0obqyKF76HcKka+A1bAqos/rauChsMnxACV0XZaE1lav3t+k00dXiSBCB7ldj liN5bDTk14+BCToavrOMhRVmFHRRLLCbs1SxfdDHNkgH2MYkti3i9zfXNB3yG9efuzQjQUzw9/EZ g4cwIg1ihJ0vSbSfzJT+QKB+sOKcB3WP/RilZ10zx3yUUT+8wqkTvRO+aB4HR7XDf7eDjkPw34cY k76icvjj0rVfdphggmu7QIK41vVoOA8CSBAelLCNaxFAgrjW9Wg4DwJIEB6UsI1rEUCCuNb1aDgP AkgQHpSwjWsRQIK41vVoOA8CSBAelLCNaxFAgrjW9Wg4DwJIEB6UsI1rEUCCuNb1aDgPAkgQHpSw jWsRQIK41vVoOA8CSBAelLCNaxFAgrjW9Wg4DwJIEB6UsI1rEUCCuNb1aDgPAkgQHpSwjWsRQIK4 1vVoOA8CSBAelLCNaxFAgrjW9Wg4DwJIEB6UsI1rEUCCuNb1aDgPAkgQHpSwjWsRQIK41vVoOA8C SBAelLCNaxFAgrjW9Wg4DwJIEB6UsI1rEUCCuNb1aDgPAkgQHpSwjWsR+H8dCXpusEXr1gAAAABJ RU5ErkJggg== "
       preserveAspectRatio="none"
       height="29.027504"
       width="29.034664"
       style="opacity:0" />
    <path
       style="opacity:1;vector-effect:none;fill:#161921;fill-opacity:1;stroke:#161921;stroke-width:0.10492772;stroke-linecap:butt;stroke-linejoin:round;stroke-miterlimit:4;stroke-dasharray:none;stroke-dashoffset:0;stroke-opacity:1"
       d="M 45.764789,88.681229 C 30.338827,86.784548 17.834011,76.600402 13.052804,62.040006 10.466108,54.162639 10.489024,45.6177 13.118221,37.646477 c 0.954408,-2.893581 3.30977,-7.535935 5.09172,-10.035639 1.758135,-2.466297 4.887072,-5.8237 7.153785,-7.676132 11.778293,-9.625613 28.141147,-11.5311087 41.703831,-4.856516 10.92196,5.375016 18.464619,15.16313 21.113376,27.398846 0.446337,2.06181 0.51306,3.020897 0.517537,7.439062 0.0058,5.686827 -0.289485,7.710384 -1.796026,12.309442 -4.416546,13.48252 -16.245567,23.670349 -30.317202,26.110904 -2.568676,0.445505 -8.47152,0.633596 -10.820453,0.344785 z m 9.952705,-5.614844 c 6.720117,-1.151001 12.567923,-4.134585 17.56364,-8.961073 5.094606,-4.922024 8.335636,-10.908467 9.711901,-17.938653 0.594518,-3.036898 0.695178,-8.255075 0.215482,-11.170441 -0.295125,-1.793637 -0.332014,-1.870798 -0.834079,-1.744789 -1.614224,0.405145 -31.283786,6.430021 -31.34808,6.365727 -0.04239,-0.04239 6.17996,-3.720449 13.827438,-8.173473 7.647475,-4.453023 13.938105,-8.201366 13.979173,-8.329651 0.04107,-0.128286 -0.40835,-0.956066 -0.998709,-1.839511 C 69.533743,18.853194 53.701445,13.426557 39.452858,18.119013 c -1.600902,0.527221 -6.311931,2.715792 -6.311931,2.93229 0,0.07405 3.652865,6.411984 8.117477,14.084297 4.464611,7.672314 8.088924,13.978215 8.054024,14.013114 -0.0349,0.0349 -5.437634,-4.79396 -12.006078,-10.730797 C 30.737907,32.48108 25.262284,27.62386 25.1383,27.624095 c -0.123985,2.25e-4 -0.693527,0.577955 -1.26565,1.283822 -3.295925,4.066412 -5.808758,9.482788 -6.894423,14.860833 -0.629812,3.119893 -0.570809,9.807885 0.11348,12.862959 1.025722,4.579434 2.686831,8.586866 4.960319,11.96679 1.275448,1.896169 4.55952,5.756808 5.179147,6.088421 0.357646,0.191407 1.915551,-1.444781 11.446282,-12.021436 6.067761,-6.733649 11.04975,-12.229581 11.071089,-12.213183 0.02135,0.01639 -1.879849,7.130187 -4.22486,15.808416 -2.34501,8.678232 -4.22244,15.891137 -4.172064,16.028681 0.07634,0.208447 2.226216,0.703694 4.638595,1.068556 1.845708,0.279156 7.360172,0.113862 9.727279,-0.291569 z"
       id="path842"
       inkscape:connector-curvature="0"
       transform="matrix(0.3024427,0,0,0.30236809,-0.24389557,-0.41185448)" />
  </g>
  <style
     id="style3"
     type="text/css"><![CDATA[
	.st0{fill:#4B4B4B;}
]]></style>
  <style
     type="text/css"
     id="style3-2"><![CDATA[
	.st0{fill:#4B4B4B;}
]]></style>
  <style
     type="text/css"
     id="style3-6"><![CDATA[
	.st0{fill:#4B4B4B;}
]]></style>
  <style
     id="style3-2-1"
     type="text/css"><![CDATA[
	.st0{fill:#4B4B4B;}
]]></style>
</svg>
