[]

LA VILLA DE COLIMA DE LA NUEVA ESPAÑA
SIGLO XVI

VOLUMEN I      (CAJAS 1-11)

[]

Inicio | Búsquedas | Siglas y bibliografía | Cartografía | Créditos | Más información

[]

Búsqueda rápida

+:-----------------------------------------------------------------------------------------------------------------------------------------------------------------------------------------------------------------------------------------------------------------------------------------------------------------------------------------------------------------------------------------------------------------------------------------------------------------------------------------------------------------------------------------------------------------------------------------------------------------------------------------------------------------------------------------------------------------------------------------------------------------------------------------------------------------------------------------------------------------------------------------------------------------------------------------------------------------------------------------------------------------------------------------------------------------------------------------------------------------------------------------------------------------------------------------------------:+------------------------------------------:+
| Fecha:                                                                                                                                                                                                                                                                                                                                                                                                                                                                                                                                                                                                                                                                                                                                                                                                                                                                                                                                                                                                                                                                                                                                                                                                | Ubicación física del documento original:  |
| 1562 Octubre, 28                                                                                                                                                                                                                                                                                                                                                                                                                                                                                                                                                                                                                                                                                                                                                                                                                                                                                                                                                                                                                                                                                                                                                                                      | CAJA A-3, EXP. 11, 9 FF.                  |
|                                                                                                                                                                                                                                                                                                                                                                                                                                                                                                                                                                                                                                                                                                                                                                                                                                                                                                                                                                                                                                                                                                                                                                                                       | Archivo Histórico del Municipio de Colima |
+-------------------------------------------------------------------------------------------------------------------------------------------------------------------------------------------------------------------------------------------------------------------------------------------------------------------------------------------------------------------------------------------------------------------------------------------------------------------------------------------------------------------------------------------------------------------------------------------------------------------------------------------------------------------------------------------------------------------------------------------------------------------------------------------------------------------------------------------------------------------------------------------------------------------------------------------------------------------------------------------------------------------------------------------------------------------------------------------------------------------------------------------------------------------------------------------------------+-------------------------------------------+
| 74. 1562. Octubre, 28.                                                                                                                                                                                                                                                                                                                                                                                                                                                                                                                                                                                                                                                                                                                                                                                                                                                                                                                                                                                                                                                                                                                                                                                |                                           |
|                                                                                                                                                                                                                                                                                                                                                                                                                                                                                                                                                                                                                                                                                                                                                                                                                                                                                                                                                                                                                                                                                                                                                                                                       |                                           |
| Posesión dada a Juan Fernández Ladrillero sobre una huerta de cacao en el pueblo de Xicotlan.                                                                                                                                                                                                                                                                                                                                                                                                                                                                                                                                                                                                                                                                                                                                                                                                                                                                                                                                                                                                                                                                                                         |                                           |
|                                                                                                                                                                                                                                                                                                                                                                                                                                                                                                                                                                                                                                                                                                                                                                                                                                                                                                                                                                                                                                                                                                                                                                                                       |                                           |
| Ante el alcalde mayor Diego Núñez de Guzmán,^([1]) "Melchor Pérez y Juan Fernández Ladrillero, vecinos desta Villa, ante V.m. parecemos y decimos que nosotros tenemos en compañía una huerta de cacao y término del pueblo de Xicotlan, en la cual yo, el dicho Melchor Pérez tengo las once partes y yo, el dicho Juan Fernández las nueve; y porque ha tiempo que yo el dicho Juan Fernández Ladrillero las compré las dichas nueve partes al dicho Melchor Pérez, fuímos convenidos y concertados que las partiésemos y dividiésemos cada y cuando, que por lo cual quierdemos [sic]^([2]) fuese recibido según consta y parece por esta escritura de concierto, firmada de nuestros nombres, de que hacemos presentación. Y porque agora pasado el día de Todos Santos, de común consentimiento de ambos a dos, la queremos partir y devidir para que cada uno de nos conozca lo que es suyo. Por tanto, pedimos y suplicamos a V.m. se halle presente a la dicha partición, nombrando una persona". Y de este modo, "nos meta a cada uno de nos en la posesión de lo que a cada uno cupiere", que "estamos prestos de pagar los salarios que V.m. nombrare a las personas que fueren al sitio". |                                           |
|                                                                                                                                                                                                                                                                                                                                                                                                                                                                                                                                                                                                                                                                                                                                                                                                                                                                                                                                                                                                                                                                                                                                                                                                       |                                           |
| Con fecha de 1° de julio de 1562, Melchor Pérez, vecino de Colima, da carta de venta a favor de Juan Fernández Ladrillero por "las nueve partes de cacao que yo hube de los menores hijos de Juan de Aguilar, difunto, según e como yo la hube e compré, e por el dicho precio". Dice también el vendedor "que estaré e residiré en la dicha guerta hasta la Navidad que viene de sesenta y tres años" [1563]. Testigos: Pero Ruiz, Pedro de Figueroa, Antonio Díaz^([3]) y Simón Arias.^([4])                                                                                                                                                                                                                                                                                                                                                                                                                                                                                                                                                                                                                                                                                                        |                                           |
|                                                                                                                                                                                                                                                                                                                                                                                                                                                                                                                                                                                                                                                                                                                                                                                                                                                                                                                                                                                                                                                                                                                                                                                                       |                                           |
| Fechada el 27 de octubre de 1562 y ante Diego Veedor, escribano, se firma escritura de concierto entre Melchor Pérez y Ana Martel, por una parte, y por la otra Juan Fernández Ladrillero, vecinos de la Villa de Colima. Dice Melchor Pérez que compró la dicha huerta de cacao en pública almoneda de los menores hijos de Juan de Aguilar, difunto, marido que fue de Ana Martel.                                                                                                                                                                                                                                                                                                                                                                                                                                                                                                                                                                                                                                                                                                                                                                                                                  |                                           |
|                                                                                                                                                                                                                                                                                                                                                                                                                                                                                                                                                                                                                                                                                                                                                                                                                                                                                                                                                                                                                                                                                                                                                                                                       |                                           |
| El 11 de noviembre de 1562, estando en la Huerta de Xicotlan, el alcalde mayor Diego Núñez de Guzmán dio posesión a Diego de Velasco y Álvaro de Grijalba, personas nombradas por los dichos Melchor Pérez y Juan Fernández Ladrillero, de las partes de la huerta contenidas en la petición.                                                                                                                                                                                                                                                                                                                                                                                                                                                                                                                                                                                                                                                                                                                                                                                                                                                                                                         |                                           |
|                                                                                                                                                                                                                                                                                                                                                                                                                                                                                                                                                                                                                                                                                                                                                                                                                                                                                                                                                                                                                                                                                                                                                                                                       |                                           |
| Se levantó la memoria de las casas de cacao existentes en la Huerta de Xicotlan: 3,032 casas de cacao tuvo el cuarto de Amatitlan; el cuarto de Abajo —de Amatitlan al monte—, tuvo 3,455 casas; el cuarto de Abajo —del rancho a la sierra—, que todos tres se riegan con una acequia, 3,130 casas; el cuarto de los Naranjos, 3914 casas; el cuarto del Pedregal, 3,600 casas; el cuarto de la Ciénaga, 3,124 casas; el cuarto de Xicotlan, 843 casas; el cuarto del Algodón, 843.^([5])                                                                                                                                                                                                                                                                                                                                                                                                                                                                                                                                                                                                                                                                                                            |                                           |
|                                                                                                                                                                                                                                                                                                                                                                                                                                                                                                                                                                                                                                                                                                                                                                                                                                                                                                                                                                                                                                                                                                                                                                                                       |                                           |
| El 15 de noviembre, Juan Fernández Ladrillero tomó posesión de las nueve partes de la huerta.                                                                                                                                                                                                                                                                                                                                                                                                                                                                                                                                                                                                                                                                                                                                                                                                                                                                                                                                                                                                                                                                                                         |                                           |
|                                                                                                                                                                                                                                                                                                                                                                                                                                                                                                                                                                                                                                                                                                                                                                                                                                                                                                                                                                                                                                                                                                                                                                                                       |                                           |
| Caja A–3, exp. 11, 9 ff.                                                                                                                                                                                                                                                                                                                                                                                                                                                                                                                                                                                                                                                                                                                                                                                                                                                                                                                                                                                                                                                                                                                                                                              |                                           |
|                                                                                                                                                                                                                                                                                                                                                                                                                                                                                                                                                                                                                                                                                                                                                                                                                                                                                                                                                                                                                                                                                                                                                                                                       |                                           |
|                                                                                                                                                                                                                                                                                                                                                                                                                                                                                                                                                                                                                                                                                                                                                                                                                                                                                                                                                                                                                                                                                                                                                                                                       |                                           |
|                                                                                                                                                                                                                                                                                                                                                                                                                                                                                                                                                                                                                                                                                                                                                                                                                                                                                                                                                                                                                                                                                                                                                                                                       |                                           |
| ---------------                                                                                                                                                                                                                                                                                                                                                                                                                                                                                                                                                                                                                                                                                                                                                                                                                                                                                                                                                                                                                                                                                                                                                                                       |                                           |
|                                                                                                                                                                                                                                                                                                                                                                                                                                                                                                                                                                                                                                                                                                                                                                                                                                                                                                                                                                                                                                                                                                                                                                                                       |                                           |
| (1) Con toda seguridad estuvo agregado a este expediente el documento fechado "en la Villa de Sant Sebastián de la Provincia de Colima, de esta Nueva España", el 26 de octubre de 1562, que reproduce y transcribe Sevilla del Río (1973), 161 y 214. Obsérvese que existen algunas diferencias redaccionales entre uno y otro. Por otra parte, sorprende la designación de Colima como Villa de San Sebastián que, a partir de fines de la década de los treinta, había caído en desuso.                                                                                                                                                                                                                                                                                                                                                                                                                                                                                                                                                                                                                                                                                                            |                                           |
|                                                                                                                                                                                                                                                                                                                                                                                                                                                                                                                                                                                                                                                                                                                                                                                                                                                                                                                                                                                                                                                                                                                                                                                                       |                                           |
| (2) Por                                                                                                                                                                                                                                                                                                                                                                                                                                                                                                                                                                                                                                                                                                                                                                                                                                                                                                                                                                                                                                                                                                                                                                                               |                                           |
|                                                                                                                                                                                                                                                                                                                                                                                                                                                                                                                                                                                                                                                                                                                                                                                                                                                                                                                                                                                                                                                                                                                                                                                                       |                                           |
| queremos.                                                                                                                                                                                                                                                                                                                                                                                                                                                                                                                                                                                                                                                                                                                                                                                                                                                                                                                                                                                                                                                                                                                                                                                             |                                           |
|                                                                                                                                                                                                                                                                                                                                                                                                                                                                                                                                                                                                                                                                                                                                                                                                                                                                                                                                                                                                                                                                                                                                                                                                       |                                           |
| (3) Sin ulteriores noticias de este Antonio Díaz.                                                                                                                                                                                                                                                                                                                                                                                                                                                                                                                                                                                                                                                                                                                                                                                                                                                                                                                                                                                                                                                                                                                                                     |                                           |
|                                                                                                                                                                                                                                                                                                                                                                                                                                                                                                                                                                                                                                                                                                                                                                                                                                                                                                                                                                                                                                                                                                                                                                                                       |                                           |
| (4) Arias casó al menos en dos ocasiones y en ambas tuvo descendencia, primero con Inés Arias y luego con María Lorenzo. Tenía manada de yeguas: infra, regº 273 y residía en Popoyutla: IV, regº 816. En 1589 ya había fallecido: Romero de Solís, Andariegos y pobladores... (2001), 45.                                                                                                                                                                                                                                                                                                                                                                                                                                                                                                                                                                                                                                                                                                                                                                                                                                                                                                            |                                           |
|                                                                                                                                                                                                                                                                                                                                                                                                                                                                                                                                                                                                                                                                                                                                                                                                                                                                                                                                                                                                                                                                                                                                                                                                       |                                           |
| (5) Este párrafo, empero, resulta de gran interés para conocer cómo se nombraban las diversas partes de la huerta, su situación y características generales, y el número de casas de cacao en ellas existente. Llamamos la atención sobre el Cuarto de los Naranjos, bien porque en él hubiera plantados estos cítricos —apenas mencionados en la documentación conservada del siglo XVI en Colima— o porque anteriormente allí los hubo del tiempo que los trajo Francisco Cortés, quien introdujo asimismo el plátano y la caña dulce: Romero de Solís, Relaciones de la Provincia de Amula, 21. Noticias también sobre frutales, la proporciona una escritura protocolizada ante el escribano Juan de la Torre el 2 de abril de 1542, por la cual Manuel de Cáceres "se desistía y se desistió de una estancia e sitio que tiene en esta Villa, dentro del término della, poblada tal cual está sacando unos naranjos que tiene, e piñas; [...] e la cede e traspasa a Alonso Lorenzo, vecino desta Villa, que estaba presente, para que sea suya propia": Sevilla del Río (1973), 92 (subrayados nuestros).                                                                                       |                                           |
+-------------------------------------------------------------------------------------------------------------------------------------------------------------------------------------------------------------------------------------------------------------------------------------------------------------------------------------------------------------------------------------------------------------------------------------------------------------------------------------------------------------------------------------------------------------------------------------------------------------------------------------------------------------------------------------------------------------------------------------------------------------------------------------------------------------------------------------------------------------------------------------------------------------------------------------------------------------------------------------------------------------------------------------------------------------------------------------------------------------------------------------------------------------------------------------------------------+-------------------------------------------+

Documento(s) original(es)

Archivo no encontrado (CAJAS/CAJA3/EXP11/009V.jpg)

[]
1F

[]
1V

[]
2F

[]
2V

[]
3F

[]
3V

[]
4F

[]
4V

[]
5F

[]
5V

[]
6F

[]
6V

[]
7F

[]
7V

[]
8F

[]
8V

[]
9F

Proyecto interinstitucional del Archivo Histórico del Municipio de Colima y la Universidad de Colima,
realizado bajo los auspicios del fondo Ramón Álvarez-Buylla de Aldana.

------------------------------------------------------------------------

ISBN 978-968-7412-85-6
® Derechos Reservados 2008. Archivo Histórico del Municipio de Colima.

1,078 visitas
