+----------------------------------------------------------------------------------------------------------------------------------------------------------------------------------------------------------------------------------------------------------------------------------------------------------------------------------------+-----------------------+-----------------------+
| []                                                                                                                                                                                                                                                                                                                                     |                       |                       |
|                                                                                                                                                                                                                                                                                                                                        |                       |                       |
| +-----------------------------------+:-------------------------------------:+                                                                                                                                                                                                                                                          |                       |                       |
| | []                                | LA VILLA DE COLIMA DE LA NUEVA ESPAÑA |                                                                                                                                                                                                                                                          |                       |                       |
| |                                   | SIGLO XVI                             |                                                                                                                                                                                                                                                          |                       |                       |
| |                                   |                                       |                                                                                                                                                                                                                                                          |                       |                       |
| |                                   | VOLUMEN II      (CAJAS 12-20)         |                                                                                                                                                                                                                                                          |                       |                       |
| +-----------------------------------+---------------------------------------+                                                                                                                                                                                                                                                          |                       |                       |
+----------------------------------------------------------------------------------------------------------------------------------------------------------------------------------------------------------------------------------------------------------------------------------------------------------------------------------------+-----------------------+-----------------------+
| +------------------------------------------------------------------------+---------------------------+-----------------------+                                                                                                                                                                                                         |                       |                       |
| | Inicio | Búsqueda | Siglas y bibliografía | Créditos | Más información | (consulta las cajas 1-11) |    [ES]               |                                                                                                                                                                                                         |                       |                       |
| +------------------------------------------------------------------------+---------------------------+-----------------------+                                                                                                                                                                                                         |                       |                       |
+----------------------------------------------------------------------------------------------------------------------------------------------------------------------------------------------------------------------------------------------------------------------------------------------------------------------------------------+-----------------------+-----------------------+
| Búsqueda rápida                                                                                                                                                                                                                                                                                                                        |                       |                       |
|                                                                                                                                                                                                                                                                                                                                        |                       |                       |
| +:-------------------:+-----------------+:----------------------------------------:+----------------:+                                                                                                                                                                                                                                 |                       |                       |
| | Documento de fecha: |                 | Ubicación física del documento original: | [] [] []        |                                                                                                                                                                                                                                 |                       |                       |
| |                     |                 |                                          |                 |                                                                                                                                                                                                                                 |                       |                       |
| | 1595. Agosto, 30    |                 | Caja 12, exp. 8, ff. 66 fte-66vta.       |                 |                                                                                                                                                                                                                                 |                       |                       |
| |                     |                 |                                          |                 |                                                                                                                                                                                                                                 |                       |                       |
| |                     |                 | Nota(s): Antes ff. 53 fte y vta.         |                 |                                                                                                                                                                                                                                 |                       |                       |
| +---------------------+-----------------+------------------------------------------+-----------------+                                                                                                                                                                                                                                 |                       |                       |
|                                                                                                                                                                                                                                                                                                                                        |                       |                       |
|   ------------- ----------------------------------------------------------                                                                                                                                                                                                                                                             |                       |                       |
|   Resumen:      María de Villalobos da poder a Francisco y Juan Preciado                                                                                                                                                                                                                                                               |                       |                       |
|   ------------- ----------------------------------------------------------                                                                                                                                                                                                                                                             |                       |                       |
|                                                                                                                                                                                                                                                                                                                                        |                       |                       |
|   ----------------------------------- ------------------------------------------------------------------------------------------------------------------------------------------------------------------------------------------------------------------------------------------------------------------------------------------------ |                       |                       |
|   Contenido:                          María de Villalobos, esposa de Francisco Preciado, otorga a éste y a su cuñado Juan Preciado, poder general para “acudir a la defensa de mis hijos e hijos de Juan de Grijalba, mi primer marido, atento [que] aquéllos quieren estar conmigo, e la defensa de una negra de la dicha mi hija”.   |                       |                       |
|                                       Testigos: Rodrigo de Velasco, Francisco de Rojas y Juan Méndez de Sotomayor, vecinos de Colima.                                                                                                                                                                                                  |                       |                       |
|                                       Escribano: Cristóbal Hernández de Tene.                                                                                                                                                                                                                                                          |                       |                       |
|                                                                                                                                                                                                                                                                                                                                        |                       |                       |
|   ----------------------------------- ------------------------------------------------------------------------------------------------------------------------------------------------------------------------------------------------------------------------------------------------------------------------------------------------ |                       |                       |
|                                                                                                                                                                                                                                                                                                                                        |                       |                       |
|   ---------------------------------------------------------------------------------------------------                                                                                                                                                                                                                                  |                       |                       |
|    Documento(s) original(es)                                                                                                                                                                                                                                                                                                           |                       |                       |
|   --------------------------- ------- ------- ------- ------- ------- ------- ------- ------- -------                                                                                                                                                                                                                                  |                       |                       |
|               []                []                                                                                                                                                                                                                                                                                                     |                       |                       |
|               66f               66v                                                                                                                                                                                                                                                                                                    |                       |                       |
|                                                                                                                                                                                                                                                                                                                                        |                       |                       |
|   ---------------------------------------------------------------------------------------------------                                                                                                                                                                                                                                  |                       |                       |
+----------------------------------------------------------------------------------------------------------------------------------------------------------------------------------------------------------------------------------------------------------------------------------------------------------------------------------------+-----------------------+-----------------------+
| +----------------------------------------------------------------------------+------------------------------------------------+                                                                                                                                                                                                        |                       |                       |
| | ISBN 978-607-701-024-1                                                     |   ---- ---- ---- ---- ---- ---- ---- ---- ---- |                                                                                                                                                                                                        |                       |                       |
| | © Derechos Reservados 2013. Archivo Histórico del Municipio de Colima. [*] |   []        []        []        []        []   |                                                                                                                                                                                                        |                       |                       |
| |                                                                            |   ---- ---- ---- ---- ---- ---- ---- ---- ---- |                                                                                                                                                                                                        |                       |                       |
| +----------------------------------------------------------------------------+------------------------------------------------+                                                                                                                                                                                                        |                       |                       |
| |                                                                            |                                                |                                                                                                                                                                                                        |                       |                       |
| +----------------------------------------------------------------------------+------------------------------------------------+                                                                                                                                                                                                        |                       |                       |
+----------------------------------------------------------------------------------------------------------------------------------------------------------------------------------------------------------------------------------------------------------------------------------------------------------------------------------------+-----------------------+-----------------------+

615 visitas
