+-------------------------------------------------------------------------------------------------------------------------------------------------------------------------------------------------------------------------------------------------------------------------------------------------------------------------------------------------------------------------------------------------------------------------------------------------------------------------------------------------------------------------------------------------------------------------------------------------------------------------------------------------------------------------------------------------------------------------------------+---------------------------------------+-----------------------+
| []                                                                                                                                                                                                                                                                                                                                                                                                                                                                                                                                                                                                                                                                                                                                  | LA VILLA DE COLIMA DE LA NUEVA ESPAÑA | []                    |
|                                                                                                                                                                                                                                                                                                                                                                                                                                                                                                                                                                                                                                                                                                                                     | SIGLO XVI                             |                       |
|                                                                                                                                                                                                                                                                                                                                                                                                                                                                                                                                                                                                                                                                                                                                     |                                       |                       |
|                                                                                                                                                                                                                                                                                                                                                                                                                                                                                                                                                                                                                                                                                                                                     | VOLUMEN I      (CAJAS 1-11)           |                       |
+-------------------------------------------------------------------------------------------------------------------------------------------------------------------------------------------------------------------------------------------------------------------------------------------------------------------------------------------------------------------------------------------------------------------------------------------------------------------------------------------------------------------------------------------------------------------------------------------------------------------------------------------------------------------------------------------------------------------------------------+---------------------------------------+-----------------------+
| Inicio | Búsquedas | Siglas y bibliografía | Cartografía | Créditos | Más información                                                                                                                                                                                                                                                                                                                                                                                                                                                                                                                                                                                                                                               |                                       | []                    |
+-------------------------------------------------------------------------------------------------------------------------------------------------------------------------------------------------------------------------------------------------------------------------------------------------------------------------------------------------------------------------------------------------------------------------------------------------------------------------------------------------------------------------------------------------------------------------------------------------------------------------------------------------------------------------------------------------------------------------------------+---------------------------------------+-----------------------+
| Búsqueda rápida                                                                                                                                                                                                                                                                                                                                                                                                                                                                                                                                                                                                                                                                                                                     |                                       |                       |
|                                                                                                                                                                                                                                                                                                                                                                                                                                                                                                                                                                                                                                                                                                                                     |                                       |                       |
| +:-----------------------------------------------------------------------------------------------------------------------------------------------------------------------------------------------------------------------------------------------------------------------------------------------------------------------------------------------------------------------------------------------------------------------------------------------------------------------------------------------------------------------------------------------------------------------------------------------------------------------------------------------------------------------------------:+------------------------------------------:+ |                                       |                       |
| | Fecha:                                                                                                                                                                                                                                                                                                                                                                                                                                                                                                                                                                                                                                                                              | Ubicación física del documento original:  | |                                       |                       |
| | 1563 Diciembre, 14                                                                                                                                                                                                                                                                                                                                                                                                                                                                                                                                                                                                                                                                  | CAJA A-4, EXP. 3, 5 FF.                   | |                                       |                       |
| |                                                                                                                                                                                                                                                                                                                                                                                                                                                                                                                                                                                                                                                                                     | Archivo Histórico del Municipio de Colima | |                                       |                       |
| +-------------------------------------------------------------------------------------------------------------------------------------------------------------------------------------------------------------------------------------------------------------------------------------------------------------------------------------------------------------------------------------------------------------------------------------------------------------------------------------------------------------------------------------------------------------------------------------------------------------------------------------------------------------------------------------+-------------------------------------------+ |                                       |                       |
| | 87. 1563. Diciembre, 14.                                                                                                                                                                                                                                                                                                                                                                                                                                                                                                                                                                                                                                                            |                                           | |                                       |                       |
| |                                                                                                                                                                                                                                                                                                                                                                                                                                                                                                                                                                                                                                                                                     |                                           | |                                       |                       |
| | Barrios y estancias del pueblo de Xuchcoatlan.                                                                                                                                                                                                                                                                                                                                                                                                                                                                                                                                                                                                                                      |                                           | |                                       |                       |
| |                                                                                                                                                                                                                                                                                                                                                                                                                                                                                                                                                                                                                                                                                     |                                           | |                                       |                       |
| | "En el pueblo de Xuchcoatlan,^([1]) provincia desta Nueva España, que está encomendado a Su Majestad", y ante el muy magnífico señor Juan del Hierro, alcalde mayor del dicho pueblo y provincia, y en presencia del Baltasar de Alcalá, escribano de su juzgado, comparecieron "don Pedro de Mendoza, su gobernador, y Juan de los Ángeles y Pablo de Cuellar, alcaldes, y otros munchos principales; y mediante Alonso Rodríguez Bejarano, intérprete, presentaron un mandamiento de Su Señoría Ilustrísima, pidiendo cumplimiento de él".                                                                                                                                        |                                           | |                                       |                       |
| |                                                                                                                                                                                                                                                                                                                                                                                                                                                                                                                                                                                                                                                                                     |                                           | |                                       |                       |
| | El alcalde nombró seguidamente por escribano "para entender en esta visita, a mí el dicho Baltasar de Alcalá, que presente estaba, y para ello tomó e rescibió de mí juramento en forma debida". Luego Juan del Hierro designó por intérprete para esta visita a Alonso Rodríguez Bejarano.                                                                                                                                                                                                                                                                                                                                                                                         |                                           | |                                       |                       |
| |                                                                                                                                                                                                                                                                                                                                                                                                                                                                                                                                                                                                                                                                                     |                                           | |                                       |                       |
| | Más tarde, el alcalde mayor "mandó a los dichos señores alcaldes e mayordomos desta dicha provincia, que presentes estaban, exhiban la tasación que tienen de los tributos que dan a Su Majestad, para que, vista, provéa en el caso, en lo que toca al repartimiento de sus tributos, lo que convenga; e los susodichos, mediante el dicho intérprete, dijeron que la tasación en que fueron tasados por Diego Ramírez^([2]) es: que den a Su Majestad, cada año, veinte y una cargas de mantas y así lo han tenido y tienen de costumbre hacer, e que no les había dado testimonio de la dicha tasación el dicho Diego Ramírez".                                                  |                                           | |                                       |                       |
| |                                                                                                                                                                                                                                                                                                                                                                                                                                                                                                                                                                                                                                                                                     |                                           | |                                       |                       |
| | Mandó el alcalde mayor a don Pedro de Mendoza, gobernador, y a Juan de los Ángeles y a Pablo de Cuellar, alcaldes, y a los demás principales y chinantlatos^([3]) "desta provincia de Xuchcoatlan, que presentes estaban, que dentro de cinco días primeros siguientes hagan venir ante él todos los principales e chinantlatos, e traigan todos los papeles e pinturas que tienen de la gente e tributos della sin quedar ninguno, para que, visto, proceda en el caso haciendo justicia". A esto respondieron los susodichos que estaban prestos de así lo hacer.                                                                                                                 |                                           | |                                       |                       |
| |                                                                                                                                                                                                                                                                                                                                                                                                                                                                                                                                                                                                                                                                                     |                                           | |                                       |                       |
| | Al día siguiente se presentaron alcaldes, principales y chinantlatos ante don Juan del Hierro. Por el intérprete dijeron que "ellos han venido en cumplimiento de lo que les fue mandado por el dicho señor alcalde mayor; que se les mande lo que deban hacer, que están prestos de lo cumplir".                                                                                                                                                                                                                                                                                                                                                                                   |                                           | |                                       |                       |
| |                                                                                                                                                                                                                                                                                                                                                                                                                                                                                                                                                                                                                                                                                     |                                           | |                                       |                       |
| | Viendo Juan del Hierro que estaban presentes todos los principales, "mandó a todos y a cada uno dellos por sí digan e declaren, bien e fielmente, los barrios y estancias que tiene esta dicha provincia de Xuchcoatlan, sin que en ello haya fraude ni engaño alguno, y que exhiban los papeles y pinturas que tienen, so pena de privación de sus cargos y de destierro desta dicha provincia por dos años precisos, y de perder y que pierdan las estancias y barrios que a su cargo tienen". Contestaron todos que estaban prestos de así lo hacer so la dicha pena.                                                                                                            |                                           | |                                       |                       |
| |                                                                                                                                                                                                                                                                                                                                                                                                                                                                                                                                                                                                                                                                                     |                                           | |                                       |                       |
| | "Declaración de las estancias e barrios que tiene esta dicha provincia de Xuchcoatlan", con los nombres de sus principales.                                                                                                                                                                                                                                                                                                                                                                                                                                                                                                                                                         |                                           | |                                       |                       |
| |                                                                                                                                                                                                                                                                                                                                                                                                                                                                                                                                                                                                                                                                                     |                                           | |                                       |                       |
| | Xuchcoatlan, de que es chinantlato Martín Quiahuitl.                                                                                                                                                                                                                                                                                                                                                                                                                                                                                                                                                                                                                                |                                           | |                                       |                       |
| |                                                                                                                                                                                                                                                                                                                                                                                                                                                                                                                                                                                                                                                                                     |                                           | |                                       |                       |
| | La estancia de Xalamelco, de que es chinantlato Miguel Atonal.                                                                                                                                                                                                                                                                                                                                                                                                                                                                                                                                                                                                                      |                                           | |                                       |                       |
| |                                                                                                                                                                                                                                                                                                                                                                                                                                                                                                                                                                                                                                                                                     |                                           | |                                       |                       |
| | La estancia de Tenexco, de que es chinantlato Juan Xicaque.                                                                                                                                                                                                                                                                                                                                                                                                                                                                                                                                                                                                                         |                                           | |                                       |                       |
| |                                                                                                                                                                                                                                                                                                                                                                                                                                                                                                                                                                                                                                                                                     |                                           | |                                       |                       |
| | Canauhtlan, de que es chinantlato Alonso Hastecatl.                                                                                                                                                                                                                                                                                                                                                                                                                                                                                                                                                                                                                                 |                                           | |                                       |                       |
| |                                                                                                                                                                                                                                                                                                                                                                                                                                                                                                                                                                                                                                                                                     |                                           | |                                       |                       |
| | La estancia de Coatitlan, de que es chinantlato Tomás Atli.                                                                                                                                                                                                                                                                                                                                                                                                                                                                                                                                                                                                                         |                                           | |                                       |                       |
| |                                                                                                                                                                                                                                                                                                                                                                                                                                                                                                                                                                                                                                                                                     |                                           | |                                       |                       |
| | La estancia de Acomulco, de que es chinantlato Martín... [?].                                                                                                                                                                                                                                                                                                                                                                                                                                                                                                                                                                                                                       |                                           | |                                       |                       |
| |                                                                                                                                                                                                                                                                                                                                                                                                                                                                                                                                                                                                                                                                                     |                                           | |                                       |                       |
| | Xaltlan, estancia de que es chinantlato Agustín Xahuatexte.                                                                                                                                                                                                                                                                                                                                                                                                                                                                                                                                                                                                                         |                                           | |                                       |                       |
| |                                                                                                                                                                                                                                                                                                                                                                                                                                                                                                                                                                                                                                                                                     |                                           | |                                       |                       |
| | La estancia de Michatlan, de que es chinantlato Juan Autla; tiene a sí sujetas las estancias siguientes: la estancia de Tozancoac, de que es chinantlato Marcos Sochil; la estancia de Cuahtlamayan, de que es chinantlato Nentequi.                                                                                                                                                                                                                                                                                                                                                                                                                                                |                                           | |                                       |                       |
| |                                                                                                                                                                                                                                                                                                                                                                                                                                                                                                                                                                                                                                                                                     |                                           | |                                       |                       |
| | La estancia de Molancochin, de que es chinantlato Domingo Tomás; tiene a sí sujeta una estancia que se llama Mixtlan, de que es chinantlato Alonso Yenotl.                                                                                                                                                                                                                                                                                                                                                                                                                                                                                                                          |                                           | |                                       |                       |
| |                                                                                                                                                                                                                                                                                                                                                                                                                                                                                                                                                                                                                                                                                     |                                           | |                                       |                       |
| | Papachtlan, de que es chinantlato Martín Coachin; tiene una estancia que se llama Apaxaco, de que es chinantlato Agustín Xicoatl.                                                                                                                                                                                                                                                                                                                                                                                                                                                                                                                                                   |                                           | |                                       |                       |
| |                                                                                                                                                                                                                                                                                                                                                                                                                                                                                                                                                                                                                                                                                     |                                           | |                                       |                       |
| | Cuyametlan, de que es chinantlato Francisco Moquihuix.                                                                                                                                                                                                                                                                                                                                                                                                                                                                                                                                                                                                                              |                                           | |                                       |                       |
| |                                                                                                                                                                                                                                                                                                                                                                                                                                                                                                                                                                                                                                                                                     |                                           | |                                       |                       |
| | La estancia de Colhuacan, de que es chinantlato Diego Xoxuya.                                                                                                                                                                                                                                                                                                                                                                                                                                                                                                                                                                                                                       |                                           | |                                       |                       |
| |                                                                                                                                                                                                                                                                                                                                                                                                                                                                                                                                                                                                                                                                                     |                                           | |                                       |                       |
| | La estancia de Xalteco, de que es chinantlato Domingo Cuamín; tiene una estancia que se llama Mecapala, de que es chinantlato Francisco Achol.                                                                                                                                                                                                                                                                                                                                                                                                                                                                                                                                      |                                           | |                                       |                       |
| |                                                                                                                                                                                                                                                                                                                                                                                                                                                                                                                                                                                                                                                                                     |                                           | |                                       |                       |
| | La estancia de Tlachco, de que es chinantlato Martín Tecocoa; tiene tres estancias que son las siguientes: Ahuacatlan, de que es chinantlato Mixihuic; Pahuizchola, de que es chinantlato Martín Paya; Culteucalco, de que es chinantlato Juan Apa.                                                                                                                                                                                                                                                                                                                                                                                                                                 |                                           | |                                       |                       |
| |                                                                                                                                                                                                                                                                                                                                                                                                                                                                                                                                                                                                                                                                                     |                                           | |                                       |                       |
| | La estancia de Chichichayotla, de que es chinantlato Gaspar Paxol; tiene a sí sujetas seis estancias que están repartidas en tres barrios que es lo siguiente: el barrio de Nexpan, de que es chinantlato Gonzalo Xuchitl; Toncotlan, barrio de ques chinantlato Francisco Tonco; la estancia de Colyola, de que es chinantlato Domingo Coatl; la estancia de Cotonco, de que es chinantlato Domingo Tochin; la estancia de Tecpaco, de que es chinantlato Francisco Mama; la estancia de Atliceca, de que es chinantlato Alonso Xicotlan; la estancia de Chalco, de que es chinantlato Baltasar Quatlican; la estancia de Acochichictlan, de que es chinantlato Mateo Xite... [?]. |                                           | |                                       |                       |
| |                                                                                                                                                                                                                                                                                                                                                                                                                                                                                                                                                                                                                                                                                     |                                           | |                                       |                       |
| | La estancia de Xesmatlan, de que es chinantlato Diego Huichilhua.                                                                                                                                                                                                                                                                                                                                                                                                                                                                                                                                                                                                                   |                                           | |                                       |                       |
| |                                                                                                                                                                                                                                                                                                                                                                                                                                                                                                                                                                                                                                                                                     |                                           | |                                       |                       |
| | La estancia Cuauhmitlan, de que es chinantlato Agustín Xitl.                                                                                                                                                                                                                                                                                                                                                                                                                                                                                                                                                                                                                        |                                           | |                                       |                       |
| |                                                                                                                                                                                                                                                                                                                                                                                                                                                                                                                                                                                                                                                                                     |                                           | |                                       |                       |
| | Camotlan, de que es chinantlato Alonso Coatl.                                                                                                                                                                                                                                                                                                                                                                                                                                                                                                                                                                                                                                       |                                           | |                                       |                       |
| |                                                                                                                                                                                                                                                                                                                                                                                                                                                                                                                                                                                                                                                                                     |                                           | |                                       |                       |
| | Caxizoquizo, de que es chinantlato Martín Timal.                                                                                                                                                                                                                                                                                                                                                                                                                                                                                                                                                                                                                                    |                                           | |                                       |                       |
| |                                                                                                                                                                                                                                                                                                                                                                                                                                                                                                                                                                                                                                                                                     |                                           | |                                       |                       |
| | Nexpan, de que es chinantlato Martín Tecochitl".                                                                                                                                                                                                                                                                                                                                                                                                                                                                                                                                                                                                                                    |                                           | |                                       |                       |
| |                                                                                                                                                                                                                                                                                                                                                                                                                                                                                                                                                                                                                                                                                     |                                           | |                                       |                       |
| | El alcalde mayor, vista la cuenta de los barrios y estancias, ordenó que declararan bajo juramento y so la dicha pena "si tienen más barrios y estancias". Respondieron que habían declarado bien y fielmente y que no tenían más. Luego el alcalde mandó a los mismos que dijeran "clara e abiertamente la gente que tienen en los dichos barrios y estancias, casados, viudos, viudas, solteros e solteras, recién casados e recién venidos, sin quedar ninguno, so pena de privación de los cargos que tienen y de destierro por dos años precisos de toda esta provincia".                                                                                                      |                                           | |                                       |                       |
| |                                                                                                                                                                                                                                                                                                                                                                                                                                                                                                                                                                                                                                                                                     |                                           | |                                       |                       |
| | Todos los presentes respondieron que estaban prestos de hacer y cumplir lo que se les mandaba.                                                                                                                                                                                                                                                                                                                                                                                                                                                                                                                                                                                      |                                           | |                                       |                       |
| |                                                                                                                                                                                                                                                                                                                                                                                                                                                                                                                                                                                                                                                                                     |                                           | |                                       |                       |
| | Caja A–4, exp. 3, 5 ff.                                                                                                                                                                                                                                                                                                                                                                                                                                                                                                                                                                                                                                                             |                                           | |                                       |                       |
| |                                                                                                                                                                                                                                                                                                                                                                                                                                                                                                                                                                                                                                                                                     |                                           | |                                       |                       |
| |                                                                                                                                                                                                                                                                                                                                                                                                                                                                                                                                                                                                                                                                                     |                                           | |                                       |                       |
| |                                                                                                                                                                                                                                                                                                                                                                                                                                                                                                                                                                                                                                                                                     |                                           | |                                       |                       |
| | ---------------                                                                                                                                                                                                                                                                                                                                                                                                                                                                                                                                                                                                                                                                     |                                           | |                                       |                       |
| |                                                                                                                                                                                                                                                                                                                                                                                                                                                                                                                                                                                                                                                                                     |                                           | |                                       |                       |
| | (1) Sochicoatlan: véase Gerhard (1986), 249-251. Se trata del mismo alcalde mayor Juan del Hierro que figuró en el regº 73. La única explicación que hallamos para que en el acervo de nuestro Archivo se conserve este documento, es que el escribano Baltasar de Alcalá estuvo al servicio de este alcalde mayor y, cuando se vino a avecindar a Colima, se la trajo consigo. A este propósito: supra, regº 73.                                                                                                                                                                                                                                                                   |                                           | |                                       |                       |
| |                                                                                                                                                                                                                                                                                                                                                                                                                                                                                                                                                                                                                                                                                     |                                           | |                                       |                       |
| | (2) El mismo que estuvo en Colima en 1551 con motivo del amojononamiento de los límites jusridiccionales de los obispados de Michoacán y Nueva Galicia: Hillerkuss (1994), 49-104..                                                                                                                                                                                                                                                                                                                                                                                                                                                                                                 |                                           | |                                       |                       |
| |                                                                                                                                                                                                                                                                                                                                                                                                                                                                                                                                                                                                                                                                                     |                                           | |                                       |                       |
| | (3) Tal vez se refiera a quienes hablaban la lengua zapoteca propia de Chinantla, pueblo de Acatlan, Puebla: Cabrera (1984), 73.                                                                                                                                                                                                                                                                                                                                                                                                                                                                                                                                                    |                                           | |                                       |                       |
| +-------------------------------------------------------------------------------------------------------------------------------------------------------------------------------------------------------------------------------------------------------------------------------------------------------------------------------------------------------------------------------------------------------------------------------------------------------------------------------------------------------------------------------------------------------------------------------------------------------------------------------------------------------------------------------------+-------------------------------------------+ |                                       |                       |
|                                                                                                                                                                                                                                                                                                                                                                                                                                                                                                                                                                                                                                                                                                                                     |                                       |                       |
|   ---------------------------------------------------------------------------------------------------                                                                                                                                                                                                                                                                                                                                                                                                                                                                                                                                                                                                                               |                                       |                       |
|    Documento(s) original(es)                                                                                                                                                                                                                                                                                                                                                                                                                                                                                                                                                                                                                                                                                                        |                                       |                       |
|   --------------------------- ------- ------- ------- ------- ------- ------- ------- ------- -------                                                                                                                                                                                                                                                                                                                                                                                                                                                                                                                                                                                                                               |                                       |                       |
|               []                []      []      []      []      []      []      []      []      []                                                                                                                                                                                                                                                                                                                                                                                                                                                                                                                                                                                                                                  |                                       |                       |
|               1F                1V      2F      2V      3F      3V      4F      4V      5F      5V                                                                                                                                                                                                                                                                                                                                                                                                                                                                                                                                                                                                                                  |                                       |                       |
|                                                                                                                                                                                                                                                                                                                                                                                                                                                                                                                                                                                                                                                                                                                                     |                                       |                       |
|   ---------------------------------------------------------------------------------------------------                                                                                                                                                                                                                                                                                                                                                                                                                                                                                                                                                                                                                               |                                       |                       |
+-------------------------------------------------------------------------------------------------------------------------------------------------------------------------------------------------------------------------------------------------------------------------------------------------------------------------------------------------------------------------------------------------------------------------------------------------------------------------------------------------------------------------------------------------------------------------------------------------------------------------------------------------------------------------------------------------------------------------------------+---------------------------------------+-----------------------+
| Proyecto interinstitucional del Archivo Histórico del Municipio de Colima y la Universidad de Colima,                                                                                                                                                                                                                                                                                                                                                                                                                                                                                                                                                                                                                               |                                       |                       |
| realizado bajo los auspicios del fondo Ramón Álvarez-Buylla de Aldana.                                                                                                                                                                                                                                                                                                                                                                                                                                                                                                                                                                                                                                                              |                                       |                       |
|                                                                                                                                                                                                                                                                                                                                                                                                                                                                                                                                                                                                                                                                                                                                     |                                       |                       |
| ------------------------------------------------------------------------                                                                                                                                                                                                                                                                                                                                                                                                                                                                                                                                                                                                                                                            |                                       |                       |
|                                                                                                                                                                                                                                                                                                                                                                                                                                                                                                                                                                                                                                                                                                                                     |                                       |                       |
| ISBN 978-968-7412-85-6                                                                                                                                                                                                                                                                                                                                                                                                                                                                                                                                                                                                                                                                                                              |                                       |                       |
| ® Derechos Reservados 2008. Archivo Histórico del Municipio de Colima.                                                                                                                                                                                                                                                                                                                                                                                                                                                                                                                                                                                                                                                              |                                       |                       |
+-------------------------------------------------------------------------------------------------------------------------------------------------------------------------------------------------------------------------------------------------------------------------------------------------------------------------------------------------------------------------------------------------------------------------------------------------------------------------------------------------------------------------------------------------------------------------------------------------------------------------------------------------------------------------------------------------------------------------------------+---------------------------------------+-----------------------+

1,078 visitas
