[]

LA VILLA DE COLIMA DE LA NUEVA ESPAÑA
SIGLO XVI

VOLUMEN I      (CAJAS 1-11)

[]

Inicio | Búsquedas | Siglas y bibliografía | Cartografía | Créditos | Más información

[]

Búsqueda rápida

+:----------------------------------------------------------------------------------------------------------------------------------------------------------------------------------------------------------------------------------------------------------------------------------------------------------------------------------------------------------------------------------------------------------------------------------------------------------------------------------------------------------------------------------------------------------------------------------------------------------------------------------------------------------------------------------------------------------------------------------------------------------------------------------------------------------------------------------------------------------------------------------------------------------------------------------------------------------------------------------------------------------------------------------------------------------------------------------------------------------------------------------------------------------------------------------------------------------------------------------------------------------------------------------------------------------------------------:+------------------------------------------:+
| Fecha:                                                                                                                                                                                                                                                                                                                                                                                                                                                                                                                                                                                                                                                                                                                                                                                                                                                                                                                                                                                                                                                                                                                                                                                                                                                                                                                       | Ubicación física del documento original:  |
| 1557 Abril, 29                                                                                                                                                                                                                                                                                                                                                                                                                                                                                                                                                                                                                                                                                                                                                                                                                                                                                                                                                                                                                                                                                                                                                                                                                                                                                                               | CAJA A-3, EXP. 4, 10 FF.                  |
|                                                                                                                                                                                                                                                                                                                                                                                                                                                                                                                                                                                                                                                                                                                                                                                                                                                                                                                                                                                                                                                                                                                                                                                                                                                                                                                              | Archivo Histórico del Municipio de Colima |
+------------------------------------------------------------------------------------------------------------------------------------------------------------------------------------------------------------------------------------------------------------------------------------------------------------------------------------------------------------------------------------------------------------------------------------------------------------------------------------------------------------------------------------------------------------------------------------------------------------------------------------------------------------------------------------------------------------------------------------------------------------------------------------------------------------------------------------------------------------------------------------------------------------------------------------------------------------------------------------------------------------------------------------------------------------------------------------------------------------------------------------------------------------------------------------------------------------------------------------------------------------------------------------------------------------------------------+-------------------------------------------+
| 66. 1557. Abril, 29.                                                                                                                                                                                                                                                                                                                                                                                                                                                                                                                                                                                                                                                                                                                                                                                                                                                                                                                                                                                                                                                                                                                                                                                                                                                                                                         |                                           |
|                                                                                                                                                                                                                                                                                                                                                                                                                                                                                                                                                                                                                                                                                                                                                                                                                                                                                                                                                                                                                                                                                                                                                                                                                                                                                                                              |                                           |
| Provança de Alonso de Ávalos en el pleito que tratan con él los indios de Tuxpan, por los daños y perjuicios que reciben del ganado de su Estancia Miahuatlan.                                                                                                                                                                                                                                                                                                                                                                                                                                                                                                                                                                                                                                                                                                                                                                                                                                                                                                                                                                                                                                                                                                                                                               |                                           |
|                                                                                                                                                                                                                                                                                                                                                                                                                                                                                                                                                                                                                                                                                                                                                                                                                                                                                                                                                                                                                                                                                                                                                                                                                                                                                                                              |                                           |
| Pero López de Herrera, en nombre de Alonso Dávalos,^([1]) vecino de la Ciudad de México, ante el alcalde mayor Alonso Sánchez de Toledo, hace presentación de una Real Provisión de la Audiencia de México y de un interrogatorio para el examen de los testigos en el pleito, de una parte, el licenciado Maldonado, fiscal de la Real Audiencia, por los indios de Tuspa, y por la otra Alonso Dávalos, sobre una Estancia Miahuatlan, en los términos de Xilotlan.                                                                                                                                                                                                                                                                                                                                                                                                                                                                                                                                                                                                                                                                                                                                                                                                                                                        |                                           |
|                                                                                                                                                                                                                                                                                                                                                                                                                                                                                                                                                                                                                                                                                                                                                                                                                                                                                                                                                                                                                                                                                                                                                                                                                                                                                                                              |                                           |
| Traslado de la carta poder otorgada por Alonso Dávalos en México el 21 de marzo de 1557, en favor de Pero López de Herrera, Cristóbal Díaz, Martín Fernández y Diego Veedor, ante el escribano Cristóbal Rodríguez Bilbao y los testigos Juan de Acuña,^([2]) Juan de Ávalos^([3]) y Francisco González, vecinos de México.                                                                                                                                                                                                                                                                                                                                                                                                                                                                                                                                                                                                                                                                                                                                                                                                                                                                                                                                                                                                  |                                           |
|                                                                                                                                                                                                                                                                                                                                                                                                                                                                                                                                                                                                                                                                                                                                                                                                                                                                                                                                                                                                                                                                                                                                                                                                                                                                                                                              |                                           |
| Traslado de la Real Provisión de la Audiencia de México, fechada el 18 de marzo de 1557, emanada a solicitud de Alonso Dávalos, para el examen de los testigos que moran fuera de la Corte. Sigue el interrogatorio con las preguntas a hacer a los testigos de parte de Alonso Dávalos "en el pleito que con él se ha tratado y trata por parte de los indios de Tuspa, sobre la estancia de ganado que tiene poblada en los términos de Xilotlan, llamada Miauatlan, que pende en esta Real Audiencia en grado de apelación, nulidad e agravio de la sentencia que contra el dicho Alonso Dávalos, Alonso Dávila,^([4]) corregidor del dicho pueblo de Tuspa, dio e pronunció".                                                                                                                                                                                                                                                                                                                                                                                                                                                                                                                                                                                                                                            |                                           |
|                                                                                                                                                                                                                                                                                                                                                                                                                                                                                                                                                                                                                                                                                                                                                                                                                                                                                                                                                                                                                                                                                                                                                                                                                                                                                                                              |                                           |
| Interrogatorio                                                                                                                                                                                                                                                                                                                                                                                                                                                                                                                                                                                                                                                                                                                                                                                                                                                                                                                                                                                                                                                                                                                                                                                                                                                                                                               |                                           |
|                                                                                                                                                                                                                                                                                                                                                                                                                                                                                                                                                                                                                                                                                                                                                                                                                                                                                                                                                                                                                                                                                                                                                                                                                                                                                                                              |                                           |
| "Primeramente, si conocen a las partes y a Francisco de Sayavedra, hermano del dicho Alonso Dávalos,^([5]) y si tiene noticia de la dicha estancia de ganados llamada Miauatlan, y de los dichos pueblos de Tuspa y Xilotlan".                                                                                                                                                                                                                                                                                                                                                                                                                                                                                                                                                                                                                                                                                                                                                                                                                                                                                                                                                                                                                                                                                               |                                           |
|                                                                                                                                                                                                                                                                                                                                                                                                                                                                                                                                                                                                                                                                                                                                                                                                                                                                                                                                                                                                                                                                                                                                                                                                                                                                                                                              |                                           |
| Si saben los testigos que "podrá haber veinte años, poco más o menos, que el dicho Alonso Dávalos, por el dicho Francisco de Sayavedra, su hermano, e por su gente e criados, pobló la dicha Estancia Miauatlan con ganado mayor e hizo en ella casas y corrales, estando como estaba todo el término della y mucha más cantidad, yerma y despoblada, y llena de arcabucos^([6]) espesos y cerrados que se criaban muy gran copia e número de tigres, lobos y leones, que a los indios naturales de los dichos pueblos y de otros comarcanos que allí pasaban caminando, hacían muchos daños, hiriéndolos y matándolos, y no osaban ir sin juntarse para caminar muchos en cuadrillas".                                                                                                                                                                                                                                                                                                                                                                                                                                                                                                                                                                                                                                      |                                           |
|                                                                                                                                                                                                                                                                                                                                                                                                                                                                                                                                                                                                                                                                                                                                                                                                                                                                                                                                                                                                                                                                                                                                                                                                                                                                                                                              |                                           |
| Si saben los testigos que "en el tiempo que ansí la dicha estancia se pobló, no se tenía ni tuvo por costumbre para poblar y fundar estancias de ganados, de pedirse título ni licencia alguna, salvo los pobladores advertir e mirar que las tomasen y poblasen en partes sin perjuicio".                                                                                                                                                                                                                                                                                                                                                                                                                                                                                                                                                                                                                                                                                                                                                                                                                                                                                                                                                                                                                                   |                                           |
|                                                                                                                                                                                                                                                                                                                                                                                                                                                                                                                                                                                                                                                                                                                                                                                                                                                                                                                                                                                                                                                                                                                                                                                                                                                                                                                              |                                           |
| Si saben que "antes que la dicha estancia del dicho Alonso Dávalos se poblase, a una legua poco más o menos della, en los mismos términos, se pobló otra estancia de ganado mayor por Alonso de Arévalo, vecino de Colima, que la tuvo poblada dos años poco más o menos, a cabo de los cuales la despobló por no poder sufrir los daños que las dichas animalias [sic]^([7]) en ellos hacían y hicieron, y sacó las dos tercias partes del ganado que metió".^([8])                                                                                                                                                                                                                                                                                                                                                                                                                                                                                                                                                                                                                                                                                                                                                                                                                                                         |                                           |
|                                                                                                                                                                                                                                                                                                                                                                                                                                                                                                                                                                                                                                                                                                                                                                                                                                                                                                                                                                                                                                                                                                                                                                                                                                                                                                                              |                                           |
| Si saben que después que pobló Dávalos la Estancia Miahuatlan, "ha procurado y procura con muy gran recado de gente, perros y otros aparejos, allanar mucha parte de los dicho arcabucos y matar y consumir las dichas bestias fieras, e hasta agora le ha costado y cuesta allí en de otros muchos gastos, más de dos mil cabezas de ganado ^([9]) que le han comido e muerto los dichos animales". Sobre estas mismas fieras, se pregunta a los testigos si saben que "se han mantenido y mantienen y sustentan de los dichos ganados y se ceban en ellos sin hacer daño a los naturales de los dichos pueblos y a los demás que por ellos pasan y caminan sin el miedo y riesgo que antes tenían y corrían". Por este motivo, a causa de tener poblada la estancia, "los indios y naturales de los dichos pueblos, y todos los demás que por allí caminan, pasan muy más seguros y sin aventurar las vidas según las aventuraban y perdían" antes, y también, "ansimismo se han aprovechado y aprovechan de los dichos ganados". Por consecuencia, "si la dicha estancia de ganados se despoblase y quitase del dicho término y lugar, necesariamente los dichos tigres, leones y lobos se multiplicarían y aumentarían, y los dichos naturales recibirían los daños que solían recibir antes que se fundase ni poblase". |                                           |
|                                                                                                                                                                                                                                                                                                                                                                                                                                                                                                                                                                                                                                                                                                                                                                                                                                                                                                                                                                                                                                                                                                                                                                                                                                                                                                                              |                                           |
| De la estancia, se dice, que "cae y está puesta en los términos del dicho pueblo de Xilotlan, y estará della desviado el dicho pueblo de Tuspa y las sementeras que los indios de él hacen, cuatro leguas y más trecho y distancia, y por la parte del dicho pueblo de Tuspa la cerca un río grande que, por partes, no se le halla fondo ni se puede vadear y se pasa con balsas".^([10])                                                                                                                                                                                                                                                                                                                                                                                                                                                                                                                                                                                                                                                                                                                                                                                                                                                                                                                                   |                                           |
|                                                                                                                                                                                                                                                                                                                                                                                                                                                                                                                                                                                                                                                                                                                                                                                                                                                                                                                                                                                                                                                                                                                                                                                                                                                                                                                              |                                           |
| Además, "dende el dicho río van por otro lado y parte, cercando toda la dicha estancia, un puerto y cordilleras de sierras muy agrias y ásperas y de gran altura, que los dichos ganados por ninguna vía las pueden pasar ni pasan, ni después que en ellas se poblaron y metieron, las han pasado, las cuales llegan hasta tornar a dar en el dicho río, por manera que aunque junto a las dichas sierras los dichos indios e otros cualesquier estuvieran poblados con sus sementeras, ningún perjuicio les hicieran ni podrían recibir ellas, como no lo han recibido en algunos platanales que de siete u ocho años a esta parte están puestos en las isletas del dicho río". También, "la dicha estancia ha tenido y tiene sóla una entrada para meter y sacar el ganado della, y es tan estrecha que con un palo de una braza se cierra y tapa, y cerrada como todas las demás partes están cercadas del dicho río y sus barrancas de a doscientas y a trescientas brazas, y cordilleras de sierras, es imposible que, aunque no hubiese guarda alguna que anduviese con el dicho ganado, pudiese ni pueda salir ni ha salido a hacer daño a los naturales del dicho pueblo de Tuspa, ni a sus sementeras ni granjerías".                                                                                              |                                           |
|                                                                                                                                                                                                                                                                                                                                                                                                                                                                                                                                                                                                                                                                                                                                                                                                                                                                                                                                                                                                                                                                                                                                                                                                                                                                                                                              |                                           |
| Por estos motivos, "cuando de la dicha estancia por mandado del dicho Alonso Dávalos se ha sacado o saca algunas reses, se ha hecho y hace con mucho trabajo y dificultad, y con mucha gente de pie y de caballo, y lo mismo se hacía y se hizo al tiempo de poblalla". De ello resulta que "en toda esta Nueva España, ni en alguna otra parte de lo descubierto, no ha habido ni hay estancia de ganados que tan sin perjuicio, ni tan apartada de hacer daño, ni tan cerrada y guardada para no lo poder causar éste".                                                                                                                                                                                                                                                                                                                                                                                                                                                                                                                                                                                                                                                                                                                                                                                                    |                                           |
|                                                                                                                                                                                                                                                                                                                                                                                                                                                                                                                                                                                                                                                                                                                                                                                                                                                                                                                                                                                                                                                                                                                                                                                                                                                                                                                              |                                           |
| Por otro lado, "los indios del dicho pueblo de Tuspa, antes de llegar al dicho río, barrancas y cordilleras de sierras, hacia la dicha estancia, tienen muy gran copia y cantidad de tierras que podrían labrar y regar, y no las labran ni han labrado por tener otras muchas de las que se han aprovechado y aprovechan". En cambio, "los indios del dicho pueblo de Miauatlan están más cerca e la dicha estancia que los del dicho pueblo de Tuspa, y no se han quejado ni quejan ni pedido cosa alguna, por no recibir ni han recibido daño alguno; y si los prencipales del dicho pueblo de Tuspa se han puesto en quejarse de la dicha estancia, diciendo estar en su perjuicio, ha sido y es por haber sido inducidos y ersuadidos de personas que han querido y quieren mal al dicho lonso Dávalos, sin causa justa. Los testigos digan lo que saben quién impuso e indució o indujo a los dichos indios".                                                                                                                                                                                                                                                                                                                                                                                                          |                                           |
|                                                                                                                                                                                                                                                                                                                                                                                                                                                                                                                                                                                                                                                                                                                                                                                                                                                                                                                                                                                                                                                                                                                                                                                                                                                                                                                              |                                           |
| El alcalde mayor Alonso Sánchez de Toledo, vista la Provisión, dispuso que López de Herrera presentara sus testigos, lo que hizo el demandante en nombre de Alonso Dávalos, llamando a declarar a Alonso Carrillo,^([11]) Juan Fernández El Viejo y a Diego Veedor, vecinos de la Villa de Colima, quienes prestaron juramento dando fe del mismo Diego de Mendoza, Garci Garcés y Francisco de epeda, vecinos también de Colima, ante el escribano Pero Sánchez.                                                                                                                                                                                                                                                                                                                                                                                                                                                                                                                                                                                                                                                                                                                                                                                                                                                            |                                           |
|                                                                                                                                                                                                                                                                                                                                                                                                                                                                                                                                                                                                                                                                                                                                                                                                                                                                                                                                                                                                                                                                                                                                                                                                                                                                                                                              |                                           |
| Al día siguiente, López de Herrera firmaba de hacer recibido de manos del escribano Pero Sánchez los originales de la carta poder otorgada por Alonso Dávalos, la Real Provisión y el interrogatorio de los testigos.                                                                                                                                                                                                                                                                                                                                                                                                                                                                                                                                                                                                                                                                                                                                                                                                                                                                                                                                                                                                                                                                                                        |                                           |
|                                                                                                                                                                                                                                                                                                                                                                                                                                                                                                                                                                                                                                                                                                                                                                                                                                                                                                                                                                                                                                                                                                                                                                                                                                                                                                                              |                                           |
| Caja A–3, exp. 4, 10 ff.                                                                                                                                                                                                                                                                                                                                                                                                                                                                                                                                                                                                                                                                                                                                                                                                                                                                                                                                                                                                                                                                                                                                                                                                                                                                                                     |                                           |
|                                                                                                                                                                                                                                                                                                                                                                                                                                                                                                                                                                                                                                                                                                                                                                                                                                                                                                                                                                                                                                                                                                                                                                                                                                                                                                                              |                                           |
|                                                                                                                                                                                                                                                                                                                                                                                                                                                                                                                                                                                                                                                                                                                                                                                                                                                                                                                                                                                                                                                                                                                                                                                                                                                                                                                              |                                           |
|                                                                                                                                                                                                                                                                                                                                                                                                                                                                                                                                                                                                                                                                                                                                                                                                                                                                                                                                                                                                                                                                                                                                                                                                                                                                                                                              |                                           |
| ---------------                                                                                                                                                                                                                                                                                                                                                                                                                                                                                                                                                                                                                                                                                                                                                                                                                                                                                                                                                                                                                                                                                                                                                                                                                                                                                                              |                                           |
|                                                                                                                                                                                                                                                                                                                                                                                                                                                                                                                                                                                                                                                                                                                                                                                                                                                                                                                                                                                                                                                                                                                                                                                                                                                                                                                              |                                           |
| (1) El encomendero de la mitad de los Pueblos de Ávalos, Alonso de Ávalos El Viejo, tenía empero por vecindad la Ciudad de México, donde ocupó incluso cargos y oficios públicos: regidor de México, en 1526: Boyd–Bowman (1968), II, regº 1467; AN 940, 1049, 1056, 1199, 1247; alcalde de sastres y calceteros en México, etcétera.                                                                                                                                                                                                                                                                                                                                                                                                                                                                                                                                                                                                                                                                                                                                                                                                                                                                                                                                                                                        |                                           |
|                                                                                                                                                                                                                                                                                                                                                                                                                                                                                                                                                                                                                                                                                                                                                                                                                                                                                                                                                                                                                                                                                                                                                                                                                                                                                                                              |                                           |
| (2) Este vecino de México debe ser el mismo Juan de Acuña que, cinco años antes, el 19 de enero de 1552, recibió poder de "Alonso de Ávalos, estante al presente en este pueblo de Cocula que es desta Nueva España": Romero de Solís, Protocolos... (1999), regº 115.                                                                                                                                                                                                                                                                                                                                                                                                                                                                                                                                                                                                                                                                                                                                                                                                                                                                                                                                                                                                                                                       |                                           |
|                                                                                                                                                                                                                                                                                                                                                                                                                                                                                                                                                                                                                                                                                                                                                                                                                                                                                                                                                                                                                                                                                                                                                                                                                                                                                                                              |                                           |
| (3) Poco después Juan de Ávalos o Dávalos, como también lo registramos en otras ocasiones, cambió su residencia y vino a los Pueblos de Ávalos: infra, regº 76. Según Hillerkuss (1997), 118, era hermano de Alonso de Ávalos El Mozo y Francisco de Saavedra Sandoval y estaba casado con Petronila de Ayala, viuda del conquistador Juan de Samaniego.                                                                                                                                                                                                                                                                                                                                                                                                                                                                                                                                                                                                                                                                                                                                                                                                                                                                                                                                                                     |                                           |
|                                                                                                                                                                                                                                                                                                                                                                                                                                                                                                                                                                                                                                                                                                                                                                                                                                                                                                                                                                                                                                                                                                                                                                                                                                                                                                                              |                                           |
| (4) Quiza deba identificarse con Alonso de Ávila, natural de Puebla de Montalbán (Toledo), quien fue justicia en Motines: Icaza (1969), I, nº 142; Warren (1989), 147.                                                                                                                                                                                                                                                                                                                                                                                                                                                                                                                                                                                                                                                                                                                                                                                                                                                                                                                                                                                                                                                                                                                                                       |                                           |
|                                                                                                                                                                                                                                                                                                                                                                                                                                                                                                                                                                                                                                                                                                                                                                                                                                                                                                                                                                                                                                                                                                                                                                                                                                                                                                                              |                                           |
| (5) No debemos prestarnos a confusión con los aquí mencionados. A inicios de la colonización en el occidente, figuras sobresalientes fueron dos hermanos: Hernando de Saavedra y Alonso de Ávalos o Dávalos, familiares muy cercanos de Hernán Cortés. Al primero, comisionó don Hernando para cuidar sus intereses en las minas de Tamazula hasta que le acompañó a las Hibueras, donde le nombró por lugarteniente. El segundo —Alonso de Ávalos El Viejo— cuidó de los intereses de Cortés y de su hermano consolidando aquella región que, desde entonces, tomó el nombre de Pueblos de Ávalos. A partir de la muerte de Hernán Cortés, le ayudó en esta tarea su sobrino Alonso de Ávalos El Mozo quien casara con María Delgadillo, compartiendo propiedad y beneficios con su hermano Francisco de Saavedra: Rodolfo Fernández, "Ambito regional, haciendas y grupos de intereses", en: Ávila Palafox–Martínez Assad–Meyer (Coords.) (1992), 35-40.                                                                                                                                                                                                                                                                                                                                                                   |                                           |
|                                                                                                                                                                                                                                                                                                                                                                                                                                                                                                                                                                                                                                                                                                                                                                                                                                                                                                                                                                                                                                                                                                                                                                                                                                                                                                                              |                                           |
| (6) Arcabuco: monte espeso y lleno de maleza.                                                                                                                                                                                                                                                                                                                                                                                                                                                                                                                                                                                                                                                                                                                                                                                                                                                                                                                                                                                                                                                                                                                                                                                                                                                                                |                                           |
|                                                                                                                                                                                                                                                                                                                                                                                                                                                                                                                                                                                                                                                                                                                                                                                                                                                                                                                                                                                                                                                                                                                                                                                                                                                                                                                              |                                           |
| (7) Aunque exista la palabra animalias como equivalente a exequias, aquí, el sentido obvio es de alimañas, acepción también registrada por Boyd–Bowman (1971), 63.                                                                                                                                                                                                                                                                                                                                                                                                                                                                                                                                                                                                                                                                                                                                                                                                                                                                                                                                                                                                                                                                                                                                                           |                                           |
|                                                                                                                                                                                                                                                                                                                                                                                                                                                                                                                                                                                                                                                                                                                                                                                                                                                                                                                                                                                                                                                                                                                                                                                                                                                                                                                              |                                           |
| (8) Durante algún tiempo, Miahuatlan y el resto de las encomiendas que Alonso de Arévalo poseía por el rumbo, tomaron el nombre de Pueblos de Arévalo.                                                                                                                                                                                                                                                                                                                                                                                                                                                                                                                                                                                                                                                                                                                                                                                                                                                                                                                                                                                                                                                                                                                                                                       |                                           |
|                                                                                                                                                                                                                                                                                                                                                                                                                                                                                                                                                                                                                                                                                                                                                                                                                                                                                                                                                                                                                                                                                                                                                                                                                                                                                                                              |                                           |
| (9) Lebrón aseguraba que Alonso de Ávalos, en su Estancia de Miaguatlan, "tierras de Tuspa", tenía "dos mil cabezas de novillos": Lebrón (1979), 66.                                                                                                                                                                                                                                                                                                                                                                                                                                                                                                                                                                                                                                                                                                                                                                                                                                                                                                                                                                                                                                                                                                                                                                         |                                           |
|                                                                                                                                                                                                                                                                                                                                                                                                                                                                                                                                                                                                                                                                                                                                                                                                                                                                                                                                                                                                                                                                                                                                                                                                                                                                                                                              |                                           |
| (10) A pesar del silencio de Lebrón de Quiñones que no lo tiene en cuenta, Xilotlan pocos años antes de su visita quedaba "en Colima", estando ya para entonces bajo la Corona, como lo asienta la SV 797 que, cuando lo describe, dice entre otras cosas: "el asiento de este pueblo está entre sierras de poca agua, y essa es ruyn, es tierra seca y caliente: coxese oro en ella en las quebradas de las sierras [...] no es tierra para estançias ni para grangerías de cosas de Castilla [...]. Es tierra muy áspera y que no se puede andar a cauallo; no es tierra de minas de plata: ay oro y por ser agra no se labran". Sus términos colindaban con Tepalcatepec y Apapatlan.                                                                                                                                                                                                                                                                                                                                                                                                                                                                                                                                                                                                                                     |                                           |
|                                                                                                                                                                                                                                                                                                                                                                                                                                                                                                                                                                                                                                                                                                                                                                                                                                                                                                                                                                                                                                                                                                                                                                                                                                                                                                                              |                                           |
| (11) Se trata de Alonso Carrillo de Guzmán El Viejo.                                                                                                                                                                                                                                                                                                                                                                                                                                                                                                                                                                                                                                                                                                                                                                                                                                                                                                                                                                                                                                                                                                                                                                                                                                                                         |                                           |
+------------------------------------------------------------------------------------------------------------------------------------------------------------------------------------------------------------------------------------------------------------------------------------------------------------------------------------------------------------------------------------------------------------------------------------------------------------------------------------------------------------------------------------------------------------------------------------------------------------------------------------------------------------------------------------------------------------------------------------------------------------------------------------------------------------------------------------------------------------------------------------------------------------------------------------------------------------------------------------------------------------------------------------------------------------------------------------------------------------------------------------------------------------------------------------------------------------------------------------------------------------------------------------------------------------------------------+-------------------------------------------+

Documento(s) original(es)

Archivo no encontrado (CAJAS/CAJA3/EXP4/001V.jpg)

[]
1F

[]
2F

[]
2V

[]
3F

[]
3V

[]
4F

[]
4V

[]
5F

[]
5V

[]
6F

[]
6V

[]
7F

[]
7V

[]
8F

[]
8V

[]
9F

[]
9V

[]
10F

[]
10V

Proyecto interinstitucional del Archivo Histórico del Municipio de Colima y la Universidad de Colima,
realizado bajo los auspicios del fondo Ramón Álvarez-Buylla de Aldana.

------------------------------------------------------------------------

ISBN 978-968-7412-85-6
® Derechos Reservados 2008. Archivo Histórico del Municipio de Colima.

1,078 visitas
