+---------------------------------------------------------------------------------------------------------------------------------------------------------------------------------------------------------------------------------------------------------------------------------------------------------------------------------------------------------------------------+-----------------------+-----------------------+
| []                                                                                                                                                                                                                                                                                                                                                                        |                       |                       |
|                                                                                                                                                                                                                                                                                                                                                                           |                       |                       |
| +-----------------------------------+:-------------------------------------:+                                                                                                                                                                                                                                                                                             |                       |                       |
| | []                                | LA VILLA DE COLIMA DE LA NUEVA ESPAÑA |                                                                                                                                                                                                                                                                                             |                       |                       |
| |                                   | SIGLO XVI                             |                                                                                                                                                                                                                                                                                             |                       |                       |
| |                                   |                                       |                                                                                                                                                                                                                                                                                             |                       |                       |
| |                                   | VOLUMEN II      (CAJAS 12-20)         |                                                                                                                                                                                                                                                                                             |                       |                       |
| +-----------------------------------+---------------------------------------+                                                                                                                                                                                                                                                                                             |                       |                       |
+---------------------------------------------------------------------------------------------------------------------------------------------------------------------------------------------------------------------------------------------------------------------------------------------------------------------------------------------------------------------------+-----------------------+-----------------------+
| +------------------------------------------------------------------------+---------------------------+-----------------------+                                                                                                                                                                                                                                            |                       |                       |
| | Inicio | Búsqueda | Siglas y bibliografía | Créditos | Más información | (consulta las cajas 1-11) |    [ES]               |                                                                                                                                                                                                                                            |                       |                       |
| +------------------------------------------------------------------------+---------------------------+-----------------------+                                                                                                                                                                                                                                            |                       |                       |
+---------------------------------------------------------------------------------------------------------------------------------------------------------------------------------------------------------------------------------------------------------------------------------------------------------------------------------------------------------------------------+-----------------------+-----------------------+
| Búsqueda rápida                                                                                                                                                                                                                                                                                                                                                           |                       |                       |
|                                                                                                                                                                                                                                                                                                                                                                           |                       |                       |
| +:--------------------:+-----------------+:----------------------------------------:+----------------:+                                                                                                                                                                                                                                                                   |                       |                       |
| | Documento de fecha:  |                 | Ubicación física del documento original: | [] [] []        |                                                                                                                                                                                                                                                                   |                       |                       |
| |                      |                 |                                          |                 |                                                                                                                                                                                                                                                                   |                       |                       |
| | 1595. Septiembre, 28 |                 | Caja 12, exp. 8, f. 69                   |                 |                                                                                                                                                                                                                                                                   |                       |                       |
| |                      |                 |                                          |                 |                                                                                                                                                                                                                                                                   |                       |                       |
| |                      |                 | Nota(s): Antes ff. 56 fte y vta.         |                 |                                                                                                                                                                                                                                                                   |                       |                       |
| +----------------------+-----------------+------------------------------------------+-----------------+                                                                                                                                                                                                                                                                   |                       |                       |
|                                                                                                                                                                                                                                                                                                                                                                           |                       |                       |
|   ------------- -----------------------------------------------------------------------------------                                                                                                                                                                                                                                                                       |                       |                       |
|   Resumen:      Juana María, india natural de Cocula, dice estar cansada de servir a Juan Cornejo                                                                                                                                                                                                                                                                         |                       |                       |
|   ------------- -----------------------------------------------------------------------------------                                                                                                                                                                                                                                                                       |                       |                       |
|                                                                                                                                                                                                                                                                                                                                                                           |                       |                       |
|   ----------------------------------- ----------------------------------------------------------------------------------------------------------------------------------------------------------------------------------------------------------------------------------------------------------------------------------------------------------------------------------- |                       |                       |
|   Contenido:                          Ante Cristóbal de Silva, justicia mayor en la Villa de Colima, comparece Juana María, india casada con Gonzalo Pablo, naturales de Cocula.                                                                                                                                                                                          |                       |                       |
|                                       Juana María dice que no quiere seguir al servicio de Juan Cornejo, por estar cansada, lo que declaró mediante Pero Gómez, intérprete.                                                                                                                                                                                               |                       |                       |
|                                       Cristóbal de Silva mandó que hacer cuenta de lo que se le debe, a razón de un peso cada mes.                                                                                                                                                                                                                                        |                       |                       |
|                                       Hecha la cuenta, resulta que Juana María debe nueve pesos y tres tomines.                                                                                                                                                                                                                                                           |                       |                       |
|                                       Cristóbal de Silva, entonces, mandó que Juana María, quedando en depósito, “sirva al dicho Juan Cornejo la cantidad de los nueve pesos y tres tomines”, a razón de diez tomines mensuales.                                                                                                                                          |                       |                       |
|                                       Por otra parte, ordena que siga en el servicio de Cornejo “hasta que el dicho su marido venga por ella, y se sepa si es muerto o vivo, para lo cual mandó al dicho Juan Cornejo enviar, a costa de la dicha india, al pueblo de Cocula o a otra parte donde sepa que esté, dándola aviso cómo la dicha su mujer está en su casa”.   |                       |                       |
|                                       El escribano Cristóbal Hernández de Tene, por mandado de la Justicia, notificó este auto a las partes.                                                                                                                                                                                                                              |                       |                       |
|                                                                                                                                                                                                                                                                                                                                                                           |                       |                       |
|   ----------------------------------- ----------------------------------------------------------------------------------------------------------------------------------------------------------------------------------------------------------------------------------------------------------------------------------------------------------------------------------- |                       |                       |
|                                                                                                                                                                                                                                                                                                                                                                           |                       |                       |
|   ---------------------------------------------------------------------------------------------------                                                                                                                                                                                                                                                                     |                       |                       |
|    Documento(s) original(es)                                                                                                                                                                                                                                                                                                                                              |                       |                       |
|   --------------------------- ------- ------- ------- ------- ------- ------- ------- ------- -------                                                                                                                                                                                                                                                                     |                       |                       |
|               []                []                                                                                                                                                                                                                                                                                                                                        |                       |                       |
|               69f               69v                                                                                                                                                                                                                                                                                                                                       |                       |                       |
|                                                                                                                                                                                                                                                                                                                                                                           |                       |                       |
|   ---------------------------------------------------------------------------------------------------                                                                                                                                                                                                                                                                     |                       |                       |
+---------------------------------------------------------------------------------------------------------------------------------------------------------------------------------------------------------------------------------------------------------------------------------------------------------------------------------------------------------------------------+-----------------------+-----------------------+
| +----------------------------------------------------------------------------+------------------------------------------------+                                                                                                                                                                                                                                           |                       |                       |
| | ISBN 978-607-701-024-1                                                     |   ---- ---- ---- ---- ---- ---- ---- ---- ---- |                                                                                                                                                                                                                                           |                       |                       |
| | © Derechos Reservados 2013. Archivo Histórico del Municipio de Colima. [*] |   []        []        []        []        []   |                                                                                                                                                                                                                                           |                       |                       |
| |                                                                            |   ---- ---- ---- ---- ---- ---- ---- ---- ---- |                                                                                                                                                                                                                                           |                       |                       |
| +----------------------------------------------------------------------------+------------------------------------------------+                                                                                                                                                                                                                                           |                       |                       |
| |                                                                            |                                                |                                                                                                                                                                                                                                           |                       |                       |
| +----------------------------------------------------------------------------+------------------------------------------------+                                                                                                                                                                                                                                           |                       |                       |
+---------------------------------------------------------------------------------------------------------------------------------------------------------------------------------------------------------------------------------------------------------------------------------------------------------------------------------------------------------------------------+-----------------------+-----------------------+

615 visitas
