+-------------------------------------------------------------------------------------------------------------------------------------------------------------------------------------------------------------------------------------------------------------------------------------------------------------------------------------+-----------------------+-----------------------+
| []                                                                                                                                                                                                                                                                                                                                  |                       |                       |
|                                                                                                                                                                                                                                                                                                                                     |                       |                       |
| +-----------------------------------+:-------------------------------------:+                                                                                                                                                                                                                                                       |                       |                       |
| | []                                | LA VILLA DE COLIMA DE LA NUEVA ESPAÑA |                                                                                                                                                                                                                                                       |                       |                       |
| |                                   | SIGLO XVI                             |                                                                                                                                                                                                                                                       |                       |                       |
| |                                   |                                       |                                                                                                                                                                                                                                                       |                       |                       |
| |                                   | VOLUMEN II      (CAJAS 12-20)         |                                                                                                                                                                                                                                                       |                       |                       |
| +-----------------------------------+---------------------------------------+                                                                                                                                                                                                                                                       |                       |                       |
+-------------------------------------------------------------------------------------------------------------------------------------------------------------------------------------------------------------------------------------------------------------------------------------------------------------------------------------+-----------------------+-----------------------+
| +------------------------------------------------------------------------+-------------------------------+-----------------------+                                                                                                                                                                                                  |                       |                       |
| | Inicio | Búsqueda | Siglas y bibliografía | Créditos | Más información | Vol. I (1-11) Vol. II (12-20) |    [ES]               |                                                                                                                                                                                                  |                       |                       |
| +------------------------------------------------------------------------+-------------------------------+-----------------------+                                                                                                                                                                                                  |                       |                       |
+-------------------------------------------------------------------------------------------------------------------------------------------------------------------------------------------------------------------------------------------------------------------------------------------------------------------------------------+-----------------------+-----------------------+
| Búsqueda rápida                                                                                                                                                                                                                                                                                                                     |                       |                       |
|                                                                                                                                                                                                                                                                                                                                     |                       |                       |
| +:-------------------:+-----------------+:----------------------------------------:+----------------:+                                                                                                                                                                                                                              |                       |                       |
| | Documento de fecha: |                 | Ubicación física del documento original: | [] [] []        |                                                                                                                                                                                                                              |                       |                       |
| |                     |                 |                                          |                 |                                                                                                                                                                                                                              |                       |                       |
| | 1598. Julio, 4      |                 | Caja 26, exp. 49, ff. 74 vta-75 fte.     |                 |                                                                                                                                                                                                                              |                       |                       |
| +---------------------+-----------------+------------------------------------------+-----------------+                                                                                                                                                                                                                              |                       |                       |
|                                                                                                                                                                                                                                                                                                                                     |                       |                       |
|   ------------- ---------------------------------------------------------------------------------------------------------------------------------                                                                                                                                                                                   |                       |                       |
|   Resumen:      Francisco López de Avecilla dona a su nieto Juan unas tierras que están pegadas a las casas de su morada en la Villa de Colima.                                                                                                                                                                                     |                       |                       |
|   ------------- ---------------------------------------------------------------------------------------------------------------------------------                                                                                                                                                                                   |                       |                       |
|                                                                                                                                                                                                                                                                                                                                     |                       |                       |
|   ----------------------------------- --------------------------------------------------------------------------------------------------------------------------------------------------------------------------------------------------------------------------------------------------------------------------------------------- |                       |                       |
|   Contenido:                          Francisco López Avecilla, vecino de la Villa de Colima, dice por la presente carta que tiene “mucha obligación a Juan López de Avecilla,^([1]) hijo de Juan López de Avecilla, su hijo, por ser mi nieto y buenos servicios que me ha hecho.                                                  |                       |                       |
|                                       “Atento a lo cual y para en parte de la satisfacción dellos, le doy unas tierras que yo he y tengo pegadas a las casas de mi morada, hacia el río que por detrás de ellas pasa,^([2]) según y cómo el Cabildo y Regimiento me hizo merced dellas, de las cuales le hago gracia y donación”.   |                       |                       |
|                                       Testigos: el alcalde ordinario Cristóbal Hernández de Tene, alférez real García Martínez y Juan Martínez de Olalde, vecinos.                                                                                                                                                                  |                       |                       |
|                                       Pasó ante el escribano público Toribio de Casso.                                                                                                                                                                                                                                              |                       |                       |
|                                                                                                                                                                                                                                                                                                                                     |                       |                       |
|   ----------------------------------- --------------------------------------------------------------------------------------------------------------------------------------------------------------------------------------------------------------------------------------------------------------------------------------------- |                       |                       |
|                                                                                                                                                                                                                                                                                                                                     |                       |                       |
| (1) Juan López de Avecilla El Mozo.                                                                                                                                                                                                                                                                                                 |                       |                       |
|                                                                                                                                                                                                                                                                                                                                     |                       |                       |
| (2) Por la descripción, pareciera que se trata del Río Chiquito.                                                                                                                                                                                                                                                                    |                       |                       |
|                                                                                                                                                                                                                                                                                                                                     |                       |                       |
|   ---------------------------------------------------------------------------------------------------                                                                                                                                                                                                                               |                       |                       |
|    Documento(s) original(es)                                                                                                                                                                                                                                                                                                        |                       |                       |
|   --------------------------- ------- ------- ------- ------- ------- ------- ------- ------- -------                                                                                                                                                                                                                               |                       |                       |
|               []                                                                                                                                                                                                                                                                                                                    |                       |                       |
|               75f                                                                                                                                                                                                                                                                                                                   |                       |                       |
|                                                                                                                                                                                                                                                                                                                                     |                       |                       |
|   ---------------------------------------------------------------------------------------------------                                                                                                                                                                                                                               |                       |                       |
+-------------------------------------------------------------------------------------------------------------------------------------------------------------------------------------------------------------------------------------------------------------------------------------------------------------------------------------+-----------------------+-----------------------+
| +----------------------------------------------------------------------------+-----------------------------------------------:+                                                                                                                                                                                                     |                       |                       |
| | ISBN 978-607-701-024-1                                                     |   ---- ---- ---- ---- ---- ---- ---- ---- ---- |                                                                                                                                                                                                     |                       |                       |
| | © Derechos Reservados 2013. Archivo Histórico del Municipio de Colima. [*] |   []        []        []        []        []   |                                                                                                                                                                                                     |                       |                       |
| |                                                                            |   ---- ---- ---- ---- ---- ---- ---- ---- ---- |                                                                                                                                                                                                     |                       |                       |
| +----------------------------------------------------------------------------+------------------------------------------------+                                                                                                                                                                                                     |                       |                       |
| |                                                                            |                                                |                                                                                                                                                                                                     |                       |                       |
| +----------------------------------------------------------------------------+------------------------------------------------+                                                                                                                                                                                                     |                       |                       |
+-------------------------------------------------------------------------------------------------------------------------------------------------------------------------------------------------------------------------------------------------------------------------------------------------------------------------------------+-----------------------+-----------------------+

636 visitas
