+---------------------------------------------------------------------------------------------------------------------------------------------------------------------------------------------------------------------------------------------------------------------------------------------------------------------------------------------------------------------------------------------------------------------------------------------------------------------------------------------------------------------------------------------------+-----------------------+-----------------------+
| []                                                                                                                                                                                                                                                                                                                                                                                                                                                                                                                                                |                       |                       |
|                                                                                                                                                                                                                                                                                                                                                                                                                                                                                                                                                   |                       |                       |
| +-----------------------------------+:-------------------------------------:+                                                                                                                                                                                                                                                                                                                                                                                                                                                                     |                       |                       |
| | []                                | LA VILLA DE COLIMA DE LA NUEVA ESPAÑA |                                                                                                                                                                                                                                                                                                                                                                                                                                                                     |                       |                       |
| |                                   | SIGLO XVI                             |                                                                                                                                                                                                                                                                                                                                                                                                                                                                     |                       |                       |
| |                                   |                                       |                                                                                                                                                                                                                                                                                                                                                                                                                                                                     |                       |                       |
| |                                   | VOLUMEN II      (CAJAS 12-20)         |                                                                                                                                                                                                                                                                                                                                                                                                                                                                     |                       |                       |
| +-----------------------------------+---------------------------------------+                                                                                                                                                                                                                                                                                                                                                                                                                                                                     |                       |                       |
+---------------------------------------------------------------------------------------------------------------------------------------------------------------------------------------------------------------------------------------------------------------------------------------------------------------------------------------------------------------------------------------------------------------------------------------------------------------------------------------------------------------------------------------------------+-----------------------+-----------------------+
| +------------------------------------------------------------------------+-------------------------------+-----------------------+                                                                                                                                                                                                                                                                                                                                                                                                                |                       |                       |
| | Inicio | Búsqueda | Siglas y bibliografía | Créditos | Más información | Vol. I (1-11) Vol. II (12-20) |    [ES]               |                                                                                                                                                                                                                                                                                                                                                                                                                |                       |                       |
| +------------------------------------------------------------------------+-------------------------------+-----------------------+                                                                                                                                                                                                                                                                                                                                                                                                                |                       |                       |
+---------------------------------------------------------------------------------------------------------------------------------------------------------------------------------------------------------------------------------------------------------------------------------------------------------------------------------------------------------------------------------------------------------------------------------------------------------------------------------------------------------------------------------------------------+-----------------------+-----------------------+
| Búsqueda rápida                                                                                                                                                                                                                                                                                                                                                                                                                                                                                                                                   |                       |                       |
|                                                                                                                                                                                                                                                                                                                                                                                                                                                                                                                                                   |                       |                       |
| +:-------------------:+-----------------+:----------------------------------------:+----------------:+                                                                                                                                                                                                                                                                                                                                                                                                                                            |                       |                       |
| | Documento de fecha: |                 | Ubicación física del documento original: | [] [] []        |                                                                                                                                                                                                                                                                                                                                                                                                                                            |                       |                       |
| |                     |                 |                                          |                 |                                                                                                                                                                                                                                                                                                                                                                                                                                            |                       |                       |
| | 1598. Mayo, 22      |                 | Caja 26, exp. 35, ff. 49 vta-53 fte.     |                 |                                                                                                                                                                                                                                                                                                                                                                                                                                            |                       |                       |
| +---------------------+-----------------+------------------------------------------+-----------------+                                                                                                                                                                                                                                                                                                                                                                                                                                            |                       |                       |
|                                                                                                                                                                                                                                                                                                                                                                                                                                                                                                                                                   |                       |                       |
|   ------------- ----------------------------------------------------------------------------------------------------------------------------------------------------------------------                                                                                                                                                                                                                                                                                                                                                            |                       |                       |
|   Resumen:      Juan Ramírez de Alarcón impone un censo sobre todos sus bienes en favor de Juan Agustín de la Puerta, administrador de los bienes del Padre Francisco Ruiz, difunto.                                                                                                                                                                                                                                                                                                                                                              |                       |                       |
|   ------------- ----------------------------------------------------------------------------------------------------------------------------------------------------------------------                                                                                                                                                                                                                                                                                                                                                            |                       |                       |
|                                                                                                                                                                                                                                                                                                                                                                                                                                                                                                                                                   |                       |                       |
|   ----------------------------------- ----------------------------------------------------------------------------------------------------------------------------------------------------------------------------------------------------------------------------------------------------------------------------------------------------------------------------------------------------------------------------------------------------------------------------------------------------------------------------------------------------------- |                       |                       |
|   Contenido:                          Juan Ramírez de Alarcón se obligó de pagar a Juan Agustín de la Puerta, administrador de los bienes del Padre Francisco Ruiz, difunto, 136 pesos y 3 tomines de oro común, de censo y tributo en cada un año, “como a persona que tiene poder del Deán y Cabildo sede vacante de la Santa Iglesia Catedral de Mechoacan”,^([1]) por 1,900 pesos del dicho oro en reales de plata que del dicho Juan Agustín de la Puerta ha recibido de contado que se imponen “sobre todos mis bienes muebles y raíces”.   |                       |                       |
|                                       En especial, “sobre las casas de mi morada que son en esta dicha Villa, linde con la Plaza della, por la una parte; y por la otra, el río^([2]) que pasa por detrás de la iglesia; y por la una ladera, la iglesia desta dicha Villa; y por atrás, casas de Jerónimo de Ávalos,^([3]) vecino desta dicha Villa”.                                                                                                                                                                                            |                       |                       |
|                                       “Y sobre la güerta de cacao que hoy y tengo en el Valle de Caxitlan, en esta Provincia, linde con Güerta de cacao de Álvaro de Grijalba, difunto, y [de] Antonio de Velasco, por la una parte, y por la otra, Güerta de cacao de Gaspar Román, y por la una parte, Camino Real que va de Tecolapa al pueblo de Caxitlan, y por detrás della el Río de Caxitlan”.                                                                                                                                            |                       |                       |
|                                       “Y sobre otra güerta de cacao que yo he y tengo en el pueblo de Zinacamitlan,^([4]) desta Provincia, linde con el dicho pueblo por la una parte y, por las demás, términos y exidos dicho pueblo”.                                                                                                                                                                                                                                                                                                          |                       |                       |
|                                       “Y sobre las estancias de ganado mayor que yo he y tengo pobladas en esta Provincia, llamadas la una, La Güerta, y la otra, la Estancia Grande, linde con el Río Grande de Tlaxinastla y con Estancias de los herederos de Alonso Lorenzo, difunto, y de Cristóbal Hernández de Tene, con todos los ganados”.                                                                                                                                                                                               |                       |                       |
|                                       Testigos: Sebastián de Alcega, Antonio Gómez Maya^([5]) y Gaspar de Espino,^([6]) vecinos y estantes.                                                                                                                                                                                                                                                                                                                                                                                                       |                       |                       |
|                                       Pasó ante el escribano público Toribio de Casso.                                                                                                                                                                                                                                                                                                                                                                                                                                                            |                       |                       |
|                                                                                                                                                                                                                                                                                                                                                                                                                                                                                                                                                   |                       |                       |
|   ----------------------------------- ----------------------------------------------------------------------------------------------------------------------------------------------------------------------------------------------------------------------------------------------------------------------------------------------------------------------------------------------------------------------------------------------------------------------------------------------------------------------------------------------------------- |                       |                       |
|                                                                                                                                                                                                                                                                                                                                                                                                                                                                                                                                                   |                       |                       |
| (1) El cabildo catedralicio de Valladolid.                                                                                                                                                                                                                                                                                                                                                                                                                                                                                                        |                       |                       |
|                                                                                                                                                                                                                                                                                                                                                                                                                                                                                                                                                   |                       |                       |
| (2) Río Chiquito.                                                                                                                                                                                                                                                                                                                                                                                                                                                                                                                                 |                       |                       |
|                                                                                                                                                                                                                                                                                                                                                                                                                                                                                                                                                   |                       |                       |
| (3) Noticias sobre Jerónimo de Ávalos: supra, regº 963.                                                                                                                                                                                                                                                                                                                                                                                                                                                                                           |                       |                       |
|                                                                                                                                                                                                                                                                                                                                                                                                                                                                                                                                                   |                       |                       |
| (4) A la letra, Çinacamitlan, huerta y pueblo situado en la comarca llamada Pueblos de Arévalo: Romero de Solís, Los pueblos de Colima… (2015).                                                                                                                                                                                                                                                                                                                                                                                                   |                       |                       |
|                                                                                                                                                                                                                                                                                                                                                                                                                                                                                                                                                   |                       |                       |
| (5) De Antonio Gómez Maya, vecino de Toluca, a quien por cierto no registramos en Romero de Solís, Andariegos… (2001), tenemos diversas referencias: compra en junio de 1598 a Juan Ramírez de Alarcón 27 potros y 347 a Cristóbal de Silva: infra, reg° 1024 y 1032. Por otra escritura, Ramírez de Alarcón da poder al vecino de México Juan Rodríguez de León para cobrarle cantidad de pesos de una transacción de la que no nos ha quedado memoria: infra, reg° 1062.                                                                        |                       |                       |
|                                                                                                                                                                                                                                                                                                                                                                                                                                                                                                                                                   |                       |                       |
| (6) Única referencia al estante Gaspar de Espino, a quien tampoco registramos en Romero de Solís, Andariegos… (2001).                                                                                                                                                                                                                                                                                                                                                                                                                             |                       |                       |
|                                                                                                                                                                                                                                                                                                                                                                                                                                                                                                                                                   |                       |                       |
|   ---------------------------------------------------------------------------------------------------                                                                                                                                                                                                                                                                                                                                                                                                                                             |                       |                       |
|    Documento(s) original(es)                                                                                                                                                                                                                                                                                                                                                                                                                                                                                                                      |                       |                       |
|   --------------------------- ------- ------- ------- ------- ------- ------- ------- ------- -------                                                                                                                                                                                                                                                                                                                                                                                                                                             |                       |                       |
|               []                []      []      []      []      []      []      []                                                                                                                                                                                                                                                                                                                                                                                                                                                                |                       |                       |
|               49v               50f     50v     51f     51v     52f     52v     53f                                                                                                                                                                                                                                                                                                                                                                                                                                                               |                       |                       |
|                                                                                                                                                                                                                                                                                                                                                                                                                                                                                                                                                   |                       |                       |
|   ---------------------------------------------------------------------------------------------------                                                                                                                                                                                                                                                                                                                                                                                                                                             |                       |                       |
+---------------------------------------------------------------------------------------------------------------------------------------------------------------------------------------------------------------------------------------------------------------------------------------------------------------------------------------------------------------------------------------------------------------------------------------------------------------------------------------------------------------------------------------------------+-----------------------+-----------------------+
| +----------------------------------------------------------------------------+-----------------------------------------------:+                                                                                                                                                                                                                                                                                                                                                                                                                   |                       |                       |
| | ISBN 978-607-701-024-1                                                     |   ---- ---- ---- ---- ---- ---- ---- ---- ---- |                                                                                                                                                                                                                                                                                                                                                                                                                   |                       |                       |
| | © Derechos Reservados 2013. Archivo Histórico del Municipio de Colima. [*] |   []        []        []        []        []   |                                                                                                                                                                                                                                                                                                                                                                                                                   |                       |                       |
| |                                                                            |   ---- ---- ---- ---- ---- ---- ---- ---- ---- |                                                                                                                                                                                                                                                                                                                                                                                                                   |                       |                       |
| +----------------------------------------------------------------------------+------------------------------------------------+                                                                                                                                                                                                                                                                                                                                                                                                                   |                       |                       |
| |                                                                            |                                                |                                                                                                                                                                                                                                                                                                                                                                                                                   |                       |                       |
| +----------------------------------------------------------------------------+------------------------------------------------+                                                                                                                                                                                                                                                                                                                                                                                                                   |                       |                       |
+---------------------------------------------------------------------------------------------------------------------------------------------------------------------------------------------------------------------------------------------------------------------------------------------------------------------------------------------------------------------------------------------------------------------------------------------------------------------------------------------------------------------------------------------------+-----------------------+-----------------------+

636 visitas
