[]

LA VILLA DE COLIMA DE LA NUEVA ESPAÑA
SIGLO XVI

VOLUMEN I      (CAJAS 1-11)

[]

Inicio | Búsquedas | Siglas y bibliografía | Cartografía | Créditos | Más información

[]

Búsqueda rápida

+:-----------------------------------------------------------------------------------------------------------------------------------------------------------------------------------------------------------------------------------------------------------------------------------------------------------------------------------------------------------------------------------------------------------------------------------------------------------------------------------------------------------------------------------------------------------------------------------------------------------------------------------------------------------------------------------------------------------------------------------------------------------------------------------------------------------------------------------------------------------------------------------------------------:+------------------------------------------:+
| Fecha:                                                                                                                                                                                                                                                                                                                                                                                                                                                                                                                                                                                                                                                                                                                                                                                                                                                                                                | Ubicación física del documento original:  |
| 1583 Enero, 10                                                                                                                                                                                                                                                                                                                                                                                                                                                                                                                                                                                                                                                                                                                                                                                                                                                                                        | CAJA A-8, EXP. 19, FF. 66-75.             |
|                                                                                                                                                                                                                                                                                                                                                                                                                                                                                                                                                                                                                                                                                                                                                                                                                                                                                                       | Archivo Histórico del Municipio de Colima |
+-------------------------------------------------------------------------------------------------------------------------------------------------------------------------------------------------------------------------------------------------------------------------------------------------------------------------------------------------------------------------------------------------------------------------------------------------------------------------------------------------------------------------------------------------------------------------------------------------------------------------------------------------------------------------------------------------------------------------------------------------------------------------------------------------------------------------------------------------------------------------------------------------------+-------------------------------------------+
| 286. 1583. Enero, 10.                                                                                                                                                                                                                                                                                                                                                                                                                                                                                                                                                                                                                                                                                                                                                                                                                                                                                 |                                           |
|                                                                                                                                                                                                                                                                                                                                                                                                                                                                                                                                                                                                                                                                                                                                                                                                                                                                                                       |                                           |
| Tutela de Elvira Domínguez en Álvaro de Herrera.                                                                                                                                                                                                                                                                                                                                                                                                                                                                                                                                                                                                                                                                                                                                                                                                                                                      |                                           |
|                                                                                                                                                                                                                                                                                                                                                                                                                                                                                                                                                                                                                                                                                                                                                                                                                                                                                                       |                                           |
| Baltasar de Alcalá, alcalde ordinario de la Villa de Colima, dijo que "por cuanto en poder de Luisa de León, vecina desta Villa, estaba una muchacha y su hija, llamada Elvira, e hija de Juan Domínguez, su marido que es difunto, la cual dicha huérfana tiene necesidad de tutor e curador que le procure los bienes que le pertenecen", sobre todo, porque su madre se ha casado, y ésta y su marido cobran y gastan sus bienes; en consecuencia, y para este efecto, nombraba por tutor y curador de la dicha menor, a Álvaro de Herrera, vecino de Colima.(1)                                                                                                                                                                                                                                                                                                                                   |                                           |
|                                                                                                                                                                                                                                                                                                                                                                                                                                                                                                                                                                                                                                                                                                                                                                                                                                                                                                       |                                           |
| Notificado del auto Herrera, prestó juramento y nombró por su fiador a Martín Ruiz, vecino de la Villa, siendo testigos Juan de Iniestra, Juan Ramírez de Alarcón y Juan de Salinas, vecinos de Colima.                                                                                                                                                                                                                                                                                                                                                                                                                                                                                                                                                                                                                                                                                               |                                           |
|                                                                                                                                                                                                                                                                                                                                                                                                                                                                                                                                                                                                                                                                                                                                                                                                                                                                                                       |                                           |
| El 11 de enero, Álvaro de Herrera pedía una escritura de censo a favor de su menor más los corridos. El alcalde así lo mandó notificar a Luisa de León, disponiendo asimismo que lo hiciera saber a Isabel de Arévalo, para que ésta acudiese con los réditos del censo con Álvaro de Herrera.(2)                                                                                                                                                                                                                                                                                                                                                                                                                                                                                                                                                                                                     |                                           |
|                                                                                                                                                                                                                                                                                                                                                                                                                                                                                                                                                                                                                                                                                                                                                                                                                                                                                                       |                                           |
| El escribano Francisco López hizo las notificaciones, siendo testigos entre otros Baltasar Rodríguez, Diego Mejía y Juan Agustín de la Puerta, vecinos de Colima.                                                                                                                                                                                                                                                                                                                                                                                                                                                                                                                                                                                                                                                                                                                                     |                                           |
|                                                                                                                                                                                                                                                                                                                                                                                                                                                                                                                                                                                                                                                                                                                                                                                                                                                                                                       |                                           |
| El 1° de febrero, Herrera decía que Juan Domínguez por una cláusula de su testamento había mejorado a su hija Elvira, con "un negrito que, agora al presente, tiene en su poder Luisa de León"; pide Herrera se saque traslado de la cláusula y "otrosí pido que para averiguación y partición de los bienes que hay del dicho Juan Domínguez, pertenecientes a la dicha mi menor", Su Merced mande al escribano, le dé el inventario y almoneda de aquéllos. Así lo dispuso el alcalde, aclarando que el escribano le prestara por tres días los autos solicitados.                                                                                                                                                                                                                                                                                                                                  |                                           |
|                                                                                                                                                                                                                                                                                                                                                                                                                                                                                                                                                                                                                                                                                                                                                                                                                                                                                                       |                                           |
| El 5 de marzo Álvaro de Herrera decía que no se había hecho aún la partición y división de los bienes pertenecientes a los tres hijos del difunto Domínguez; "antes los han dejado vender la Justicia y justicias, sin que haya habido claridad dello e a quien le perteneciese, y agora es menester que haya claridad de quién los tiene y la Justicia vea a quien le pertenece, ansí por herencia como por mejora". Solicita también que tomen cuentas a Luisa de León y a Juan de Salinas, tutor de los hijos varones del difunto Juan Domínguez. Agrega que Luisa de León tiene en su poder "muchos más bienes de los que le pertenecen", según los recibos e inventario, además que "agora se ha casado [por] tercera vez con Diego Hernández Rubio(3) y se quieren ir a la Ciudad de México". Pide se les mande que "no se vayan hasta estar conmigo a derecho, para hacer las dichas cuentas". |                                           |
|                                                                                                                                                                                                                                                                                                                                                                                                                                                                                                                                                                                                                                                                                                                                                                                                                                                                                                       |                                           |
| El alcalde Baltasar de Alcalá ordenó que Herrera diera información de los sucesivos matrimonios de Luisa de León y de que pretendía irse fuera de la Villa.                                                                                                                                                                                                                                                                                                                                                                                                                                                                                                                                                                                                                                                                                                                                           |                                           |
|                                                                                                                                                                                                                                                                                                                                                                                                                                                                                                                                                                                                                                                                                                                                                                                                                                                                                                       |                                           |
| Álvaro de Herrera presentó por testigo a Juan de Espinoza,(4) estante, de más de 40 años de edad. Declaró haber oído a Diego Hernández Rubio y a Luisa de León decir "que están de camino para se ir a vivir a la Ciudad de México, para lo cual el dicho Diego Hernández le ha visto que anda vendiendo la casa que tiene, y se la vendía a este testigo y a Juan de la Vega, vecino desta Villa".(5)                                                                                                                                                                                                                                                                                                                                                                                                                                                                                                |                                           |
|                                                                                                                                                                                                                                                                                                                                                                                                                                                                                                                                                                                                                                                                                                                                                                                                                                                                                                       |                                           |
| Luego Herrera presentó por segundo testigo a Juan Hermoso, residente en esta dicha Villa, mayor de 50 años de edad; dice que sabe que Diego Hernández y su esposa quieren irse a vivir a México, y que por ello anda Diego Hernández vendiendo su casa, y que oyó decir a Francisco Ramírez, vecino de esta Villa, que "había vendido un pabellón a la [mujer] de Diego de Monroy".(6)                                                                                                                                                                                                                                                                                                                                                                                                                                                                                                                |                                           |
|                                                                                                                                                                                                                                                                                                                                                                                                                                                                                                                                                                                                                                                                                                                                                                                                                                                                                                       |                                           |
| El alcalde Baltasar de Alcalá, habiendo visto los autos del inventario y remate, más la información dada por Álvaro de Herrera, mandó que la menor Elvira Domínguez fuera dada y entregada a su tutor, junto con el esclavo llamado Jerónimo, y se notificase a Luisa de León que no podía abandonar la Villa hasta ponerse a derecho con Herrera; asimismo dispuso que Luisa de León, Álvaro de Herrera y Juan de Salinas "hagan cuenta e división e partición de los dichos bienes, que ansí dejó el dicho Juan Domínguez".                                                                                                                                                                                                                                                                                                                                                                         |                                           |
|                                                                                                                                                                                                                                                                                                                                                                                                                                                                                                                                                                                                                                                                                                                                                                                                                                                                                                       |                                           |
| Para cumplimiento de lo proveído por el alcalde, el alguacil mayor de esta Villa Juan Muñoz junto con el escribano Francisco López fueron a las casas de la morada de Luisa de León, "e tomó al dicho muchacho negro, e lo dio y entregó al dicho Álvaro de Herrera, el cual lo recibió y llevó en su poder, de lo cual doy fe; y [a] la dicha muchacha menor, la dicha su madre no la quiso dar, y se fue con el dicho negrillo, siendo testigos Pablo Hernández e Pedro Gómez, vecinos de esta Villa".                                                                                                                                                                                                                                                                                                                                                                                              |                                           |
|                                                                                                                                                                                                                                                                                                                                                                                                                                                                                                                                                                                                                                                                                                                                                                                                                                                                                                       |                                           |
| Luego se le notificó que debía asentarse a cuentas con Herrera; lo mismo hizo el escribano a Juan de Salinas y a Álvaro de Herrera, siendo testigos los vecinos Cristóbal Hernández de Tene, Juan Agustín de la Puerta y Juan Muñoz.                                                                                                                                                                                                                                                                                                                                                                                                                                                                                                                                                                                                                                                                  |                                           |
|                                                                                                                                                                                                                                                                                                                                                                                                                                                                                                                                                                                                                                                                                                                                                                                                                                                                                                       |                                           |
| El 16 de marzo, después de una nueva petición de Álvaro de Herrera, éste con Juan de Salinas y Diego Hernández Rubio acordaron designar "terceros contadores y partidores de los bienes de los dichos menores". Herrera nombró de su parte a Cristóbal Hernández de Tene; Juan de Salinas por la suya a Juan de Iniesta; y Diego Hernández Rubio por tercer contador a Pedro Lobato del Canto,(7) quienes aceptaron la comisión y el alcalde Baltasar de Alcalá les tomó juramento.                                                                                                                                                                                                                                                                                                                                                                                                                   |                                           |
|                                                                                                                                                                                                                                                                                                                                                                                                                                                                                                                                                                                                                                                                                                                                                                                                                                                                                                       |                                           |
| Luego les mandó que "se asienten a hacer las dichas cuentas de partición", ocupándose en ellas "tres horas de la tarde y que se empiecen desde hoy dicho día en adelante para que, fechas e conclusas, se traigan e presenten ante Su Merced para que, vistas, provea en el caso lo que convenga a justicia, e ansí lo proveyó e mandó e lo firmó. Baltasar de Alcalá. Ante mí, Francisco López, escribano público".                                                                                                                                                                                                                                                                                                                                                                                                                                                                                  |                                           |
|                                                                                                                                                                                                                                                                                                                                                                                                                                                                                                                                                                                                                                                                                                                                                                                                                                                                                                       |                                           |
| Caja A–8, exp. 19, ff. 66-75.                                                                                                                                                                                                                                                                                                                                                                                                                                                                                                                                                                                                                                                                                                                                                                                                                                                                         |                                           |
|                                                                                                                                                                                                                                                                                                                                                                                                                                                                                                                                                                                                                                                                                                                                                                                                                                                                                                       |                                           |
|                                                                                                                                                                                                                                                                                                                                                                                                                                                                                                                                                                                                                                                                                                                                                                                                                                                                                                       |                                           |
|                                                                                                                                                                                                                                                                                                                                                                                                                                                                                                                                                                                                                                                                                                                                                                                                                                                                                                       |                                           |
| ---------------                                                                                                                                                                                                                                                                                                                                                                                                                                                                                                                                                                                                                                                                                                                                                                                                                                                                                       |                                           |
|                                                                                                                                                                                                                                                                                                                                                                                                                                                                                                                                                                                                                                                                                                                                                                                                                                                                                                       |                                           |
| (1) Por error, aquí se nombra a la menor "Juana". El auto de discernimiento de la tutela: supra, ver nota a este propósito al regº 285.                                                                                                                                                                                                                                                                                                                                                                                                                                                                                                                                                                                                                                                                                                                                                               |                                           |
|                                                                                                                                                                                                                                                                                                                                                                                                                                                                                                                                                                                                                                                                                                                                                                                                                                                                                                       |                                           |
| (2) Infra, regº 287.                                                                                                                                                                                                                                                                                                                                                                                                                                                                                                                                                                                                                                                                                                                                                                                                                                                                                  |                                           |
|                                                                                                                                                                                                                                                                                                                                                                                                                                                                                                                                                                                                                                                                                                                                                                                                                                                                                                       |                                           |
| (3) Como ya se explicó, de hecho, era el cuarto marido de Luisa León: supra, regº 281 y 282.                                                                                                                                                                                                                                                                                                                                                                                                                                                                                                                                                                                                                                                                                                                                                                                                          |                                           |
|                                                                                                                                                                                                                                                                                                                                                                                                                                                                                                                                                                                                                                                                                                                                                                                                                                                                                                       |                                           |
| (4) No debe ser confundido con el vecino Juan de Espinosa El Mozo.                                                                                                                                                                                                                                                                                                                                                                                                                                                                                                                                                                                                                                                                                                                                                                                                                                    |                                           |
|                                                                                                                                                                                                                                                                                                                                                                                                                                                                                                                                                                                                                                                                                                                                                                                                                                                                                                       |                                           |
| (5) De hecho, fueron a residir a Villa de la Purificación.                                                                                                                                                                                                                                                                                                                                                                                                                                                                                                                                                                                                                                                                                                                                                                                                                                            |                                           |
|                                                                                                                                                                                                                                                                                                                                                                                                                                                                                                                                                                                                                                                                                                                                                                                                                                                                                                       |                                           |
| (6) Se refiere a Beatriz Núñez: Romero de Solís, Andariegos… (2001), y 359-360.                                                                                                                                                                                                                                                                                                                                                                                                                                                                                                                                                                                                                                                                                                                                                                                                                       |                                           |
|                                                                                                                                                                                                                                                                                                                                                                                                                                                                                                                                                                                                                                                                                                                                                                                                                                                                                                       |                                           |
| (7) Lobato adquirió cierto renombre cuando, en 1585, el arzobispo y virrey Pedro Moya de Contreras dio por merced a él, al vecino Antonio del Castillo y a Hernando de Santotis, "tener trato y granjería y pesquería de perlas" en las costas de la Mar del Sur "desde el puerto de Navidad hasta la California". Además se otorgó licencia para construir una fragata y una lancha y emplear mano de obra indígena. Cuando el pirata Cavendish atacó el puerto de la Navidad, en septiembre de 1587, destruyó los navíos que estaban labrándose con lo que el proyecto fracasó: Mathes (1965), I, 14. Más información, en: Romero de Solís, Andariegos… (2001), 244-245.                                                                                                                                                                                                                            |                                           |
+-------------------------------------------------------------------------------------------------------------------------------------------------------------------------------------------------------------------------------------------------------------------------------------------------------------------------------------------------------------------------------------------------------------------------------------------------------------------------------------------------------------------------------------------------------------------------------------------------------------------------------------------------------------------------------------------------------------------------------------------------------------------------------------------------------------------------------------------------------------------------------------------------------+-------------------------------------------+

Documento(s) original(es)

Archivo no encontrado (CAJAS/CAJA8/EXP19/066F.jpg)

Archivo no encontrado (CAJAS/CAJA8/EXP19/066V.jpg)

Archivo no encontrado (CAJAS/CAJA8/EXP19/067F.jpg)

Archivo no encontrado (CAJAS/CAJA8/EXP19/067V.jpg)

Archivo no encontrado (CAJAS/CAJA8/EXP19/068F.jpg)

Archivo no encontrado (CAJAS/CAJA8/EXP19/068V.jpg)

Archivo no encontrado (CAJAS/CAJA8/EXP19/069F.jpg)

Archivo no encontrado (CAJAS/CAJA8/EXP19/069V.jpg)

Archivo no encontrado (CAJAS/CAJA8/EXP19/070F.jpg)

Archivo no encontrado (CAJAS/CAJA8/EXP19/070V.jpg)

Archivo no encontrado (CAJAS/CAJA8/EXP19/071F.jpg)

Archivo no encontrado (CAJAS/CAJA8/EXP19/071V.jpg)

Archivo no encontrado (CAJAS/CAJA8/EXP19/072F.jpg)

Archivo no encontrado (CAJAS/CAJA8/EXP19/072V.jpg)

Archivo no encontrado (CAJAS/CAJA8/EXP19/073F.jpg)

Archivo no encontrado (CAJAS/CAJA8/EXP19/073V.jpg)

Archivo no encontrado (CAJAS/CAJA8/EXP19/074F.jpg)

Archivo no encontrado (CAJAS/CAJA8/EXP19/074V.jpg)

Archivo no encontrado (CAJAS/CAJA8/EXP19/075F.jpg)

Archivo no encontrado (CAJAS/CAJA8/EXP19/075V.jpg)

Proyecto interinstitucional del Archivo Histórico del Municipio de Colima y la Universidad de Colima,
realizado bajo los auspicios del fondo Ramón Álvarez-Buylla de Aldana.

------------------------------------------------------------------------

ISBN 978-968-7412-85-6
® Derechos Reservados 2008. Archivo Histórico del Municipio de Colima.

1,078 visitas
