[]

LA VILLA DE COLIMA DE LA NUEVA ESPAÑA
SIGLO XVI

VOLUMEN I      (CAJAS 1-11)

[]

Inicio | Búsquedas | Siglas y bibliografía | Cartografía | Créditos | Más información

[]

Búsqueda rápida

+:-----------------------------------------------------------------------------------------------------------------------------------------------------------------------------------------------------------------------------------------------------------------------------------------------------------------------------------------------------------------------------------------------------------------------------------------------------------------------------------------------------------------------------------------------------------------------------------------------------------------------------------------------------------------------------------------------------------------------------------------------------------------------------------------------------------------------------------------------------------------------------------------------------------------------------------------------------------------------------------------------------------------------------------------------:+------------------------------------------:+
| Fecha:                                                                                                                                                                                                                                                                                                                                                                                                                                                                                                                                                                                                                                                                                                                                                                                                                                                                                                                                                                                                                                          | Ubicación física del documento original:  |
| 1575 Mayo, 12                                                                                                                                                                                                                                                                                                                                                                                                                                                                                                                                                                                                                                                                                                                                                                                                                                                                                                                                                                                                                                   | CAJA A-7, EXP. 19, 8 FF.                  |
|                                                                                                                                                                                                                                                                                                                                                                                                                                                                                                                                                                                                                                                                                                                                                                                                                                                                                                                                                                                                                                                 | Archivo Histórico del Municipio de Colima |
+-------------------------------------------------------------------------------------------------------------------------------------------------------------------------------------------------------------------------------------------------------------------------------------------------------------------------------------------------------------------------------------------------------------------------------------------------------------------------------------------------------------------------------------------------------------------------------------------------------------------------------------------------------------------------------------------------------------------------------------------------------------------------------------------------------------------------------------------------------------------------------------------------------------------------------------------------------------------------------------------------------------------------------------------------+-------------------------------------------+
| 256. 1575. Mayo, 12.                                                                                                                                                                                                                                                                                                                                                                                                                                                                                                                                                                                                                                                                                                                                                                                                                                                                                                                                                                                                                            |                                           |
|                                                                                                                                                                                                                                                                                                                                                                                                                                                                                                                                                                                                                                                                                                                                                                                                                                                                                                                                                                                                                                                 |                                           |
| Pero López de Herrera contra Andrés Jácome, mudo, por robo de dos machos y dos caballos.                                                                                                                                                                                                                                                                                                                                                                                                                                                                                                                                                                                                                                                                                                                                                                                                                                                                                                                                                        |                                           |
|                                                                                                                                                                                                                                                                                                                                                                                                                                                                                                                                                                                                                                                                                                                                                                                                                                                                                                                                                                                                                                                 |                                           |
| Ante el alcalde mayor Martín de Montúfar y de los testigos Alonso Carrillo y Mateo de Berlanga, el vecino Pero López de Herrera dice haber dado "queja criminal de Andrés Jácome, mudo,^([1]) ante la justicia mayor desta Villa, sobre haberme hurtado dos machos y dos caballos".                                                                                                                                                                                                                                                                                                                                                                                                                                                                                                                                                                                                                                                                                                                                                             |                                           |
|                                                                                                                                                                                                                                                                                                                                                                                                                                                                                                                                                                                                                                                                                                                                                                                                                                                                                                                                                                                                                                                 |                                           |
| Asegura López de Herrera que Julián de Frías, tutor y curador de Andrés Jácome, "porque no prosiguiese en la dicha querella", dijo que "me daría y pagaría cuarenta pesos en reales y un macho de la hacienda y réditos del dicho Andrés Jácome, su menor, y el cual macho me dio y entregó luego porque no siguiese la dicha querella, y los dichos cuarenta pesos quedó me los daría luego como el dicho Julián de Frías volviese a esta Villa de la Ciudad de México, donde decía que iba con el dicho su menor". Dice López de Herrera que se los ha pedido muchas veces "y no me los ha querido pagar, poniendo que no me los puede pagar". Concluye López de Herrera: "A V.m. pido y suplico mande parecer ante sí a Juan Ramírez de Alarcón y a Cristóbal de Silva", para que bajo juramento declaren si oyeron decir a Frías lo susodicho, y una vez que hayan declarado estos testigos, "V.m. mande parecer ante sí al dicho Julián de Frías" a confirmar sus dichos y luego "mandalle me devuelva y pague los dichos cuarenta pesos". |                                           |
|                                                                                                                                                                                                                                                                                                                                                                                                                                                                                                                                                                                                                                                                                                                                                                                                                                                                                                                                                                                                                                                 |                                           |
| El 10 de agosto el escribano Francisco López notificó esta petición a Frías, siendo testigos Juan Ramírez de Alarcón y Hernando de Gamboa, vecinos de Colima.                                                                                                                                                                                                                                                                                                                                                                                                                                                                                                                                                                                                                                                                                                                                                                                                                                                                                   |                                           |
|                                                                                                                                                                                                                                                                                                                                                                                                                                                                                                                                                                                                                                                                                                                                                                                                                                                                                                                                                                                                                                                 |                                           |
| El 13 de agosto prestó declaración Juan Ramírez de Alarcón, quien dijo tener más de 40 años de edad. "Puede haber catorce o quince meses, poco más o menos, que Andrés Jácome, mudo, vino a esta Villa y Pero López de Herrera le pedía le pagase ciertas mulas que le había hurtado", y Julián de Frías le dio a López de Herrera un macho, concertándose ambos en que el tutor le daría 40 pesos, "e que puede haber un mes, poco más o menos, que el dicho Pero López de Herrera envió al dicho Julián de Frías que le diese una botija de vino" a cuenta de lo que adeudaba; respondióle Julián de Frías que no quería, porque el vino era suyo, y lo que había quedado en pagar por el mudo, "había de ser en cacao y no en reales".                                                                                                                                                                                                                                                                                                       |                                           |
|                                                                                                                                                                                                                                                                                                                                                                                                                                                                                                                                                                                                                                                                                                                                                                                                                                                                                                                                                                                                                                                 |                                           |
| El mismo día atestiguó Cristóbal de Silva, de 30 años de edad. Dijo que oyó decir a Frías que había de pagar a López de Herrera "por el mudo" 40 pesos "en cobrándolos de los bienes del dicho mudo por razón de que el dicho Pero López de Herrera había dado una querella del dicho mudo por ciertos machos e mular", y que se habían concertado en que Frías daría un macho y 40 pesos, habiéndole dado luego el macho.                                                                                                                                                                                                                                                                                                                                                                                                                                                                                                                                                                                                                      |                                           |
|                                                                                                                                                                                                                                                                                                                                                                                                                                                                                                                                                                                                                                                                                                                                                                                                                                                                                                                                                                                                                                                 |                                           |
| También dio testimonio el escribano Francisco López de Avecilla, quien dijo tener más de 40 años de edad. Declaró que "puede haber ocho días, poco más o menos, que estando este testigo en casa del señor alcalde mayor, enviaron a llamar al dicho Julián de Frías, e venido que vino, el dicho Pero López le dijo le pagase los cuarenta pesos que quedó de darle por el mudo, y el dicho Julián de Frías dijo que no le debía nada; e desde a rato le tornó a decir que si los quería en cacao o en una dita de las que deben al mudo, que se lo daría, y el dicho Pero López respondió que no quería si no en reales".                                                                                                                                                                                                                                                                                                                                                                                                                     |                                           |
|                                                                                                                                                                                                                                                                                                                                                                                                                                                                                                                                                                                                                                                                                                                                                                                                                                                                                                                                                                                                                                                 |                                           |
| El escribano, por orden del alcalde mayor, fue a las casas de la morada de Julián de Frías a tomarle juramento, quien así lo hizo. "Lo que pasa de este caso es que, puesto caso que este declarante dijese que pagaría por el dicho mudo, sentiendo, pareciendo e constando deberlos el dicho mudo, lo cual no parece como por el proceso del dicho mudo consta e parece, e que él no debe cosa ninguna, no embargante que el dicho mudo dio al dicho Pero López de Herrera un macho e dos caballos que dijo haberle alcanzado Juan Ramírez en las cuentas que con él tuvo en favor del dicho, el cual lo aclare con juramento, y pide al señor alcalde mayor haga que declare y lo mismo el dicho Pero López, e asimismo dijo que si dijo que se los pagaría en cacao o en una dita por el dicho mudo, fue entendiendo que lo debía el dicho mudo, y de otra manera no está obligado a pagar cosa alguna".                                                                                                                                    |                                           |
|                                                                                                                                                                                                                                                                                                                                                                                                                                                                                                                                                                                                                                                                                                                                                                                                                                                                                                                                                                                                                                                 |                                           |
| Oída esta declaración, el alcalde mayor mandó que Julián de Frías "no salga desta Villa en manera alguna hasta que dé e pague al dicho Pero López de Herrera cuarenta pesos de los bienes del dicho mudo".                                                                                                                                                                                                                                                                                                                                                                                                                                                                                                                                                                                                                                                                                                                                                                                                                                      |                                           |
|                                                                                                                                                                                                                                                                                                                                                                                                                                                                                                                                                                                                                                                                                                                                                                                                                                                                                                                                                                                                                                                 |                                           |
| El 31 de octubre, ante los testigos Juan López de Avecilla y Francisco de Burgos, vecinos de Colima, el escribano Francisco López notificó este auto a Frías, que de inmediato presentó un escrito oponiéndose a lo mandado por el alcalde mayor y pidiendo lo revocara, porque de no hacerlo, estaba dispuesto a apelar a la Real Audiencia que reside en la Ciudad de México.                                                                                                                                                                                                                                                                                                                                                                                                                                                                                                                                                                                                                                                                 |                                           |
|                                                                                                                                                                                                                                                                                                                                                                                                                                                                                                                                                                                                                                                                                                                                                                                                                                                                                                                                                                                                                                                 |                                           |
| El 2 de noviembre contestó el alcalde mayor, diciendo que él no era "letrado ni hay con quien se aconsejar en el caso en esta Villa, y que por reverencia y obediencia de los señores presidente e oidores, ante quien apela el dicho Julián de Frías, que le otorgaba e otorgó la dicha apelación, y se le dé testimonio con todo lo actuado y así mismo del dicho proceso que pide sin quedar cosa alguna, para que los señores presidente e oidores lo vean y provean lo que fueren servidos, con que dentro de cuarenta días traiga la mejora". Frías y López de Herrera fueron notificados de este auto, siendo testigos Francisco de Burgos, Diego de Contreras, Hernando de Gamboa y Cristóbal de Silva, vecinos todos de la Villa de Colima.                                                                                                                                                                                                                                                                                            |                                           |
|                                                                                                                                                                                                                                                                                                                                                                                                                                                                                                                                                                                                                                                                                                                                                                                                                                                                                                                                                                                                                                                 |                                           |
| El 22 de agosto de 1577, Pero López de Herrera recordaba que "en el pleito que trato con Julián de Frías, tutor y curador que a la sazón era de Andrés Jácome, mudo, sobre cuarenta pesos que el susodicho me debe, digo que como consta por una sentencia y auto del alcalde mayor don Martín de Montúfar", debía pagármelos, pero Frías "apeló del auto ante la Real Audiencia", pero "con tal que dentro de cuarenta días trujese mejora, donde no que le daba por condenado". Pide justicia, mandándosele a Frías a pagar los 40 pesos, "atento estar bien alegado y bien sentenciado, porque la parte contraria no ha traído mejora y lo hace de malicia".                                                                                                                                                                                                                                                                                                                                                                                 |                                           |
|                                                                                                                                                                                                                                                                                                                                                                                                                                                                                                                                                                                                                                                                                                                                                                                                                                                                                                                                                                                                                                                 |                                           |
| El teniente de alcalde mayor Álvaro de Grijalba mandó a Julián de Frías a presentar en el término de "tercero día" la mejora que tiene de la dicha apelación". Notificado Frías, respondió que "al tiempo que fue condenado el dicho menor en los dichos cuarenta pesos, él apeló como tutor que era e sacó el proceso e lo dio al dicho su menor para que lo presentase, e luego dejó la tutela", pasando a Francisco López de Avecilla, "que a él acuda por la mejora". Testigos: Juan Fernández El Viejo y Juan Preciado, vecinos de Colima. Pasó ante Baltasar de Alcalá, escribano.                                                                                                                                                                                                                                                                                                                                                                                                                                                        |                                           |
|                                                                                                                                                                                                                                                                                                                                                                                                                                                                                                                                                                                                                                                                                                                                                                                                                                                                                                                                                                                                                                                 |                                           |
| Notificado Francisco López de Avecilla, "tutor que al presente es del dicho mudo", quien dijo "que agora viene a su noticia este negocio e que se le dé término competente para ello".                                                                                                                                                                                                                                                                                                                                                                                                                                                                                                                                                                                                                                                                                                                                                                                                                                                          |                                           |
|                                                                                                                                                                                                                                                                                                                                                                                                                                                                                                                                                                                                                                                                                                                                                                                                                                                                                                                                                                                                                                                 |                                           |
| El 29 de agosto insistió en su petición López de Herrera, alegando que el término ha transcurrido sin que presenten ni Frías ni López de Avecilla la mejora. Constándole esto al teniente de alcalde mayor, mandó que diera fianza López de Herrera. El vecino Miguel de Rivera se constituyó en su fiador, siendo testigos Martín Ruiz, Juan Fernández El Viejo y Francisco López, vecinos de Colima.                                                                                                                                                                                                                                                                                                                                                                                                                                                                                                                                                                                                                                          |                                           |
|                                                                                                                                                                                                                                                                                                                                                                                                                                                                                                                                                                                                                                                                                                                                                                                                                                                                                                                                                                                                                                                 |                                           |
| El 4 de diciembre de 1579, ante Cristóbal de Silva, teniente de alcalde mayor, "Catalina Botello, viuda mujer que fui de Pero López de Herrera, difunto, como tutora y curadora de mis hijos y en su nombre", recuerda la demanda que su esposo puso contra Andrés Jácome, mudo, y Julián de Frías su tutor, por la que fueron condenados a pagar al demandante ciertos pesos de oro; más tarde, por auto de Álvaro de Grijalba, teniente de esta Villa, fue mandado dar fianza. Ahora, pide, que para que se le den y paguen los pesos debidos, "V.m. me mande dar su mandamiento para que Francisco López Avecilla, como tutor y curador del dicho mudo, me los dé e pague".                                                                                                                                                                                                                                                                                                                                                                  |                                           |
|                                                                                                                                                                                                                                                                                                                                                                                                                                                                                                                                                                                                                                                                                                                                                                                                                                                                                                                                                                                                                                                 |                                           |
| El teniente de alcalde mayor dio entonces mandamiento para que López de Avecilla pagara a Catalina Botello los 40 pesos adeudados.                                                                                                                                                                                                                                                                                                                                                                                                                                                                                                                                                                                                                                                                                                                                                                                                                                                                                                              |                                           |
|                                                                                                                                                                                                                                                                                                                                                                                                                                                                                                                                                                                                                                                                                                                                                                                                                                                                                                                                                                                                                                                 |                                           |
| Caja A–7, exp. 19, 8 ff.                                                                                                                                                                                                                                                                                                                                                                                                                                                                                                                                                                                                                                                                                                                                                                                                                                                                                                                                                                                                                        |                                           |
|                                                                                                                                                                                                                                                                                                                                                                                                                                                                                                                                                                                                                                                                                                                                                                                                                                                                                                                                                                                                                                                 |                                           |
|                                                                                                                                                                                                                                                                                                                                                                                                                                                                                                                                                                                                                                                                                                                                                                                                                                                                                                                                                                                                                                                 |                                           |
|                                                                                                                                                                                                                                                                                                                                                                                                                                                                                                                                                                                                                                                                                                                                                                                                                                                                                                                                                                                                                                                 |                                           |
| ---------------                                                                                                                                                                                                                                                                                                                                                                                                                                                                                                                                                                                                                                                                                                                                                                                                                                                                                                                                                                                                                                 |                                           |
|                                                                                                                                                                                                                                                                                                                                                                                                                                                                                                                                                                                                                                                                                                                                                                                                                                                                                                                                                                                                                                                 |                                           |
| (1) El mudo Andrés Jácome era hijo de Maese Andrés Jácome de Mónaco o Ginovés, el cual a su vez tuvo otro hijo mulato llamado Antón o Antonio Domínguez, esclavo de Gaspar Rodríguez, vecino de las minas de Taxco: supra, regº 184.                                                                                                                                                                                                                                                                                                                                                                                                                                                                                                                                                                                                                                                                                                                                                                                                            |                                           |
+-------------------------------------------------------------------------------------------------------------------------------------------------------------------------------------------------------------------------------------------------------------------------------------------------------------------------------------------------------------------------------------------------------------------------------------------------------------------------------------------------------------------------------------------------------------------------------------------------------------------------------------------------------------------------------------------------------------------------------------------------------------------------------------------------------------------------------------------------------------------------------------------------------------------------------------------------------------------------------------------------------------------------------------------------+-------------------------------------------+

Documento(s) original(es)

Archivo no encontrado (CAJAS/CAJA7/EXP19/005V.jpg)

[]
1F

[]
1V

[]
2F

[]
2V

[]
3F

[]
3V

[]
4F

[]
4V

[]
5F

[]
6F

[]
6V

[]
7F

[]
7V

[]
8F

[]
8V

Proyecto interinstitucional del Archivo Histórico del Municipio de Colima y la Universidad de Colima,
realizado bajo los auspicios del fondo Ramón Álvarez-Buylla de Aldana.

------------------------------------------------------------------------

ISBN 978-968-7412-85-6
® Derechos Reservados 2008. Archivo Histórico del Municipio de Colima.

1,078 visitas
