[]

LA VILLA DE COLIMA DE LA NUEVA ESPAÑA
SIGLO XVI

VOLUMEN I      (CAJAS 1-11)

[]

Inicio | Búsquedas | Siglas y bibliografía | Cartografía | Créditos | Más información

[]

Búsqueda rápida

+:-----------------------------------------------------------------------------------------------------------------------------------------------------------------------------------------------------------------------------------------------------------------------------------------------------------------------------------------------------------------------------------------------------------------------------------------------------------------------------------------------------------------------------------------------------------------------------------------------------------------------------------------------------------------------------------------------------------------------------------------------------------------------------------------------------------------------------------------------------------------------------------------------------------------------------------------------------------------------------------------------------------------------------------------------------------------------------------------------------------------------------------------------------------------------------------------------------------------------------------------------------------------------------------------------------------------------------------------------------------------------------------------------------------------:+------------------------------------------:+
| Fecha:                                                                                                                                                                                                                                                                                                                                                                                                                                                                                                                                                                                                                                                                                                                                                                                                                                                                                                                                                                                                                                                                                                                                                                                                                                                                                                                                                                                                            | Ubicación física del documento original:  |
| 1570 Agosto, 4                                                                                                                                                                                                                                                                                                                                                                                                                                                                                                                                                                                                                                                                                                                                                                                                                                                                                                                                                                                                                                                                                                                                                                                                                                                                                                                                                                                                    | CAJA A-6, EXP. 14, FF. 1-6.               |
|                                                                                                                                                                                                                                                                                                                                                                                                                                                                                                                                                                                                                                                                                                                                                                                                                                                                                                                                                                                                                                                                                                                                                                                                                                                                                                                                                                                                                   | Archivo Histórico del Municipio de Colima |
+-------------------------------------------------------------------------------------------------------------------------------------------------------------------------------------------------------------------------------------------------------------------------------------------------------------------------------------------------------------------------------------------------------------------------------------------------------------------------------------------------------------------------------------------------------------------------------------------------------------------------------------------------------------------------------------------------------------------------------------------------------------------------------------------------------------------------------------------------------------------------------------------------------------------------------------------------------------------------------------------------------------------------------------------------------------------------------------------------------------------------------------------------------------------------------------------------------------------------------------------------------------------------------------------------------------------------------------------------------------------------------------------------------------------+-------------------------------------------+
| 227. 1570. Agosto, 4.                                                                                                                                                                                                                                                                                                                                                                                                                                                                                                                                                                                                                                                                                                                                                                                                                                                                                                                                                                                                                                                                                                                                                                                                                                                                                                                                                                                             |                                           |
|                                                                                                                                                                                                                                                                                                                                                                                                                                                                                                                                                                                                                                                                                                                                                                                                                                                                                                                                                                                                                                                                                                                                                                                                                                                                                                                                                                                                                   |                                           |
| Diego de Mendoza retira la querella criminal puesta contra Gonzalo de Cáceres, Martín de Monjaraz, Juan Portugués y Antón, negro.                                                                                                                                                                                                                                                                                                                                                                                                                                                                                                                                                                                                                                                                                                                                                                                                                                                                                                                                                                                                                                                                                                                                                                                                                                                                                 |                                           |
|                                                                                                                                                                                                                                                                                                                                                                                                                                                                                                                                                                                                                                                                                                                                                                                                                                                                                                                                                                                                                                                                                                                                                                                                                                                                                                                                                                                                                   |                                           |
| El muy magnífico señor Juan Fernández,^([1]) corregidor del pueblo de Alima, y ante el escribano Diego del Castillo, deposita en Juan de Arévalo, estante en este pueblo, diversos bienes propiedad de Gonzalo de Cáceres, y que fueron "un caballo castaño y una silla estradiota vieja con sus estribos y una espada y cinco costales de jerga que se hallaron y secretaron"[sic].^([2])                                                                                                                                                                                                                                                                                                                                                                                                                                                                                                                                                                                                                                                                                                                                                                                                                                                                                                                                                                                                                        |                                           |
|                                                                                                                                                                                                                                                                                                                                                                                                                                                                                                                                                                                                                                                                                                                                                                                                                                                                                                                                                                                                                                                                                                                                                                                                                                                                                                                                                                                                                   |                                           |
| El mismo día y ante el corregidor de Alima se presentó Ruy López, estante en la Huerta de Mexcala y que es de Gonzalo de Cáceres y Martín de Monjaraz, diciendo "que durante el tiempo que ha que está en la dicha huerta por mandado del dicho señor corregidor,^([3]) ha cogido della cinco almudes de cacao por escoger, lo que trujo ante el dicho señor corregidor para que lo mande depositar con los demás bienes", y juró "no haber cogido más cacao del dicho".                                                                                                                                                                                                                                                                                                                                                                                                                                                                                                                                                                                                                                                                                                                                                                                                                                                                                                                                          |                                           |
|                                                                                                                                                                                                                                                                                                                                                                                                                                                                                                                                                                                                                                                                                                                                                                                                                                                                                                                                                                                                                                                                                                                                                                                                                                                                                                                                                                                                                   |                                           |
| El 11 de agosto, Juan de Arévalo se constituyó en depositario de este cacao.                                                                                                                                                                                                                                                                                                                                                                                                                                                                                                                                                                                                                                                                                                                                                                                                                                                                                                                                                                                                                                                                                                                                                                                                                                                                                                                                      |                                           |
|                                                                                                                                                                                                                                                                                                                                                                                                                                                                                                                                                                                                                                                                                                                                                                                                                                                                                                                                                                                                                                                                                                                                                                                                                                                                                                                                                                                                                   |                                           |
| El 9 de octubre siguiente, Juan Fernández Lázaro,^([4]) corregidor del pueblo de Alima que es en la provincia de Colima de la Nueva España, por no haber a la sazón escribano ante quien pasen los negocios y pleitos así civiles como criminales que en este dicho pueblo hay, en servicio de Su Majestad y ejecución de su Real Justicia, dijo que convenía nombrar escribano, para lo cual designó a Pero Ruiz, estante al presente en dicho pueblo, como tal escribano. Ruiz juró su oficio estando como testigos Pedro de Arévalo, Francisco Preciado y Juan López, estantes en Alima.                                                                                                                                                                                                                                                                                                                                                                                                                                                                                                                                                                                                                                                                                                                                                                                                                       |                                           |
|                                                                                                                                                                                                                                                                                                                                                                                                                                                                                                                                                                                                                                                                                                                                                                                                                                                                                                                                                                                                                                                                                                                                                                                                                                                                                                                                                                                                                   |                                           |
| Ese mismo día, Martín Ruiz de Monjaraz y Gonzalo de Cáceres presentaron ante el corregidor "tres escriptos de perdón" y uno más donde decian que "a nuestra noticia ha venido que Diego de Mendoza e Isabel de Monjaraz y Elvira Ruiz dieron contra nosotros cierta querella criminal ante V. m., e para que se sepa y entienda que las dichas querellas que así dieron contra nosotros e para purgar nuestra inocencia e se vea la poca culpa que nosotros tenemos y resulta de las dichas querellas, nosotros nos presentamos ante V.m. por presos haciendo como hacemos presentación destas tres escrituras en que por ellas los susodichos Diego de Mendoza, Isabel de Monjaraz y Elvira Ruiz se acallan de las querellas que contra nosotros ante V.m. dieron". Piden, por consecuencia, que el corregidor les dé por libres de lo que contra ellos se había pedido, "condenando a las partes contrarias en costas".                                                                                                                                                                                                                                                                                                                                                                                                                                                                                         |                                           |
|                                                                                                                                                                                                                                                                                                                                                                                                                                                                                                                                                                                                                                                                                                                                                                                                                                                                                                                                                                                                                                                                                                                                                                                                                                                                                                                                                                                                                   |                                           |
| El corregidor recibió los escritos y les notificó que "los había e hubo por presos", y como en el pueblo de Alima "no hay cárcel ni prisiones, les daba e dio por cárcel e prisión las casas de la comunidad deste dicho pueblo", mandándoles que las tuvieran por tal cárcel "so pena de docientos pesos de oro de minas para la Cámara e Fisco de Su Majestad"; de lo cual fueron notifidos siendo testigos Francisco Preciado y Juan López, estantes en Alima.                                                                                                                                                                                                                                                                                                                                                                                                                                                                                                                                                                                                                                                                                                                                                                                                                                                                                                                                                 |                                           |
|                                                                                                                                                                                                                                                                                                                                                                                                                                                                                                                                                                                                                                                                                                                                                                                                                                                                                                                                                                                                                                                                                                                                                                                                                                                                                                                                                                                                                   |                                           |
| Se anexa el escrito de "apartamiento de querella" de Diego de Mendoza, fechado en la Villa de Colima desta Nueva España el 7 de agosto de 1570,^([5]) y presentado ante el alcalde mayor de la misma Jerónimo Flores, donde decía que "podrá haber dos meses poco más o menos", cuando él había puesto una querella criminal ante el corregidor de Alima y su partido Juan Fernández Lázaro contra Gonzalo de Cáceres y Martín Ruiz de Monjaraz, Juan Portugués, negro, y Antón, negro, "por le haber entrado a matar los susodichos en una huerta de cacao de Isabel de Monjaraz, llamada Zalaguacan, estando él quieto e pacífico hablando con ella, los cuales le descalabraron". Sin embargo, "por servicio de Dios Nuestro Señor e porque algunas personas a quien debe respeto se lo han rogado", perdonaba las injurias recibidas de los susodichos. Pedía al corregidor de Alima que les remita y perdone y no proceda contra ellos. Testigos: el Padre Francisco Ruiz, clérigo vicario del dicho pueblo de Tecolapa, Diego de Velasco y Juan de Iniesta, vecinos de Colima. Pasó ante Baltasar de Alcalá.                                                                                                                                                                                                                                                                                                |                                           |
|                                                                                                                                                                                                                                                                                                                                                                                                                                                                                                                                                                                                                                                                                                                                                                                                                                                                                                                                                                                                                                                                                                                                                                                                                                                                                                                                                                                                                   |                                           |
| El corregidor tuvo por recibido el escrito de apartamiento de querella y a Diego de Mendoza por apartado e no parte de la dicha querella", pero tomaba e tomó en nombre de la Real Justicia esta causa de oficio para hacer en ella justicia.                                                                                                                                                                                                                                                                                                                                                                                                                                                                                                                                                                                                                                                                                                                                                                                                                                                                                                                                                                                                                                                                                                                                                                     |                                           |
|                                                                                                                                                                                                                                                                                                                                                                                                                                                                                                                                                                                                                                                                                                                                                                                                                                                                                                                                                                                                                                                                                                                                                                                                                                                                                                                                                                                                                   |                                           |
| Caja A–6, exp. 14, ff. 1-6.                                                                                                                                                                                                                                                                                                                                                                                                                                                                                                                                                                                                                                                                                                                                                                                                                                                                                                                                                                                                                                                                                                                                                                                                                                                                                                                                                                                       |                                           |
|                                                                                                                                                                                                                                                                                                                                                                                                                                                                                                                                                                                                                                                                                                                                                                                                                                                                                                                                                                                                                                                                                                                                                                                                                                                                                                                                                                                                                   |                                           |
|                                                                                                                                                                                                                                                                                                                                                                                                                                                                                                                                                                                                                                                                                                                                                                                                                                                                                                                                                                                                                                                                                                                                                                                                                                                                                                                                                                                                                   |                                           |
|                                                                                                                                                                                                                                                                                                                                                                                                                                                                                                                                                                                                                                                                                                                                                                                                                                                                                                                                                                                                                                                                                                                                                                                                                                                                                                                                                                                                                   |                                           |
| ---------------                                                                                                                                                                                                                                                                                                                                                                                                                                                                                                                                                                                                                                                                                                                                                                                                                                                                                                                                                                                                                                                                                                                                                                                                                                                                                                                                                                                                   |                                           |
|                                                                                                                                                                                                                                                                                                                                                                                                                                                                                                                                                                                                                                                                                                                                                                                                                                                                                                                                                                                                                                                                                                                                                                                                                                                                                                                                                                                                                   |                                           |
| (1) Supra, regº 226. Este regº con el anterior y el que le sigue, forman una unidad temática.                                                                                                                                                                                                                                                                                                                                                                                                                                                                                                                                                                                                                                                                                                                                                                                                                                                                                                                                                                                                                                                                                                                                                                                                                                                                                                                     |                                           |
|                                                                                                                                                                                                                                                                                                                                                                                                                                                                                                                                                                                                                                                                                                                                                                                                                                                                                                                                                                                                                                                                                                                                                                                                                                                                                                                                                                                                                   |                                           |
| (2) Por "secrestaron", es decir, embargaron. La expresión es conocida por Boyd–Bowman (1971), 842.                                                                                                                                                                                                                                                                                                                                                                                                                                                                                                                                                                                                                                                                                                                                                                                                                                                                                                                                                                                                                                                                                                                                                                                                                                                                                                                |                                           |
|                                                                                                                                                                                                                                                                                                                                                                                                                                                                                                                                                                                                                                                                                                                                                                                                                                                                                                                                                                                                                                                                                                                                                                                                                                                                                                                                                                                                                   |                                           |
| (3) Se trata de Ruy López Tenorio, a quien el corregidor nombró administrador de la huerta embargada. López Tenorio, español, al parecer, siempre vivió por esta región de Motines: véase infra, regº 254. Entre las estancias y huertas que Manuel de Cáceres benefició, estuvo ésta de Mexcala, cercana a una pequeña comunidad indígena puesta ya en tiempos de la visita de Lebrón de Quiñones en la Corona: Lebrón (1979), 38, de la que sin embargo no informa de manera expresa la Suma de Visitas, sino indirectamente, cuando dice: "Assí mismo están otras dos estançias a quince y a çinco leguas de Colima que son del dicho Manuel de Cáceres, que no se dizen sus nombres y tienen sesenta y vn tributarios, que dan treynta y seis mantas e dos sementeras: en partes tienen buenas tierras estas dos estançias": SV 178. Los Monjaraz también tuvieron intereses allí —como lo expresa el expediente al decir que "la Huerta de Mexcala [...] es de Gonzalo de Cáceres y Martín de Monjaraz"—; a Pedro de Bobadilla, esposo de Francisca Ruiz de Monjaraz, le embargó el alcalde mayor Alonso Sánchez de Figueroa "una huerta de cacao que se llama Mescala", en 1566, de la que con toda probabilidad la dueña era su esposa, que la heredaría de su padre Martín de Monjaraz El Viejo (supra, regº 122) y la Huerta de Zapotlan era de Andrés de Segura y de su mujer, Elvira Ruiz de Monjaraz. |                                           |
|                                                                                                                                                                                                                                                                                                                                                                                                                                                                                                                                                                                                                                                                                                                                                                                                                                                                                                                                                                                                                                                                                                                                                                                                                                                                                                                                                                                                                   |                                           |
| (4) Es la primera vez que aparece el corregidor de Alima y su partido con nombre y apellidos completos; véase lo anotado a este propósito: supra, regº 226.                                                                                                                                                                                                                                                                                                                                                                                                                                                                                                                                                                                                                                                                                                                                                                                                                                                                                                                                                                                                                                                                                                                                                                                                                                                       |                                           |
|                                                                                                                                                                                                                                                                                                                                                                                                                                                                                                                                                                                                                                                                                                                                                                                                                                                                                                                                                                                                                                                                                                                                                                                                                                                                                                                                                                                                                   |                                           |
| (5) Los escritos correspondientes de Isabel de Monjaraz y Elvira Ruiz se hallan en el regº 228.                                                                                                                                                                                                                                                                                                                                                                                                                                                                                                                                                                                                                                                                                                                                                                                                                                                                                                                                                                                                                                                                                                                                                                                                                                                                                                                   |                                           |
+-------------------------------------------------------------------------------------------------------------------------------------------------------------------------------------------------------------------------------------------------------------------------------------------------------------------------------------------------------------------------------------------------------------------------------------------------------------------------------------------------------------------------------------------------------------------------------------------------------------------------------------------------------------------------------------------------------------------------------------------------------------------------------------------------------------------------------------------------------------------------------------------------------------------------------------------------------------------------------------------------------------------------------------------------------------------------------------------------------------------------------------------------------------------------------------------------------------------------------------------------------------------------------------------------------------------------------------------------------------------------------------------------------------------+-------------------------------------------+

Documento(s) original(es)

Archivo no encontrado (CAJAS/CAJA6/EXP14/002V.jpg)

Archivo no encontrado (CAJAS/CAJA6/EXP14/003V.jpg)

Archivo no encontrado (CAJAS/CAJA6/EXP14/006V.jpg)

[]
1F

[]
1V

[]
2F

[]
3F

[]
4F

[]
4V

[]
5F

[]
5V

[]
6F

Proyecto interinstitucional del Archivo Histórico del Municipio de Colima y la Universidad de Colima,
realizado bajo los auspicios del fondo Ramón Álvarez-Buylla de Aldana.

------------------------------------------------------------------------

ISBN 978-968-7412-85-6
® Derechos Reservados 2008. Archivo Histórico del Municipio de Colima.

1,078 visitas
