[]

LA VILLA DE COLIMA DE LA NUEVA ESPAÑA
SIGLO XVI

VOLUMEN I      (CAJAS 1-11)

[]

Inicio | Búsquedas | Siglas y bibliografía | Cartografía | Créditos | Más información

[]

Búsqueda rápida

+:--------------------------------------------------------------------------------------------------------------------------------------------------------------------------------------------------------------------------------------------------------------------------------------------------------------------------------------------------------------------------------------------------------------------------------------------------------------------------------------------------------------------------------------------------------------------------------------------------------------------------------------------------------------------------------------------------------------------------------------------------------------------------------------------------------------------------------------------------------------------------------------------------------------------------------------------------------------------------------------------------------------------------------------------------------------------------------------------------------------------------------------------------------------------------------------------------------------------------------------------------------------------------------------------------------------------------------------------------------------------------------------------------------------------------------------------------------------------------------------------------------------------------------------------------------------------------------------------------------------------------------------------------------------------------------------------------------------------------------------------------------------------------------------------------------------------------------------:+------------------------------------------:+
| Fecha:                                                                                                                                                                                                                                                                                                                                                                                                                                                                                                                                                                                                                                                                                                                                                                                                                                                                                                                                                                                                                                                                                                                                                                                                                                                                                                                                                                                                                                                                                                                                                                                                                                                                                                                                                                                                                                 | Ubicación física del documento original:  |
| 1556 Abril, 7                                                                                                                                                                                                                                                                                                                                                                                                                                                                                                                                                                                                                                                                                                                                                                                                                                                                                                                                                                                                                                                                                                                                                                                                                                                                                                                                                                                                                                                                                                                                                                                                                                                                                                                                                                                                                          | CAJA A-3, EXP. 2, FF. 1-9.                |
|                                                                                                                                                                                                                                                                                                                                                                                                                                                                                                                                                                                                                                                                                                                                                                                                                                                                                                                                                                                                                                                                                                                                                                                                                                                                                                                                                                                                                                                                                                                                                                                                                                                                                                                                                                                                                                        | Archivo Histórico del Municipio de Colima |
+----------------------------------------------------------------------------------------------------------------------------------------------------------------------------------------------------------------------------------------------------------------------------------------------------------------------------------------------------------------------------------------------------------------------------------------------------------------------------------------------------------------------------------------------------------------------------------------------------------------------------------------------------------------------------------------------------------------------------------------------------------------------------------------------------------------------------------------------------------------------------------------------------------------------------------------------------------------------------------------------------------------------------------------------------------------------------------------------------------------------------------------------------------------------------------------------------------------------------------------------------------------------------------------------------------------------------------------------------------------------------------------------------------------------------------------------------------------------------------------------------------------------------------------------------------------------------------------------------------------------------------------------------------------------------------------------------------------------------------------------------------------------------------------------------------------------------------------+-------------------------------------------+
| 59. 1556. Abril, 7.                                                                                                                                                                                                                                                                                                                                                                                                                                                                                                                                                                                                                                                                                                                                                                                                                                                                                                                                                                                                                                                                                                                                                                                                                                                                                                                                                                                                                                                                                                                                                                                                                                                                                                                                                                                                                    |                                           |
|                                                                                                                                                                                                                                                                                                                                                                                                                                                                                                                                                                                                                                                                                                                                                                                                                                                                                                                                                                                                                                                                                                                                                                                                                                                                                                                                                                                                                                                                                                                                                                                                                                                                                                                                                                                                                                        |                                           |
| Diego de Ávila, a nombre de su esposa Estebanía de Cervera, pide que Diego Morán, su suegro, se asiente a cuentas como albacea de los bienes de Juan de Cervera y María de Lorenzo.                                                                                                                                                                                                                                                                                                                                                                                                                                                                                                                                                                                                                                                                                                                                                                                                                                                                                                                                                                                                                                                                                                                                                                                                                                                                                                                                                                                                                                                                                                                                                                                                                                                    |                                           |
|                                                                                                                                                                                                                                                                                                                                                                                                                                                                                                                                                                                                                                                                                                                                                                                                                                                                                                                                                                                                                                                                                                                                                                                                                                                                                                                                                                                                                                                                                                                                                                                                                                                                                                                                                                                                                                        |                                           |
| Diego de Ávila, nombrado curador ad litem de Estebanía de Cervera, su esposa, dice que Juan de Cervera, tío de Estebanía, falleció y le heredó ciertos bienes, cuyo albacea es Diego Morán, padre de Estebanía, quien es también albacea de los bienes dejados por María de Lorenzo, su primera mujer, madre de Estebanía de Cervera.                                                                                                                                                                                                                                                                                                                                                                                                                                                                                                                                                                                                                                                                                                                                                                                                                                                                                                                                                                                                                                                                                                                                                                                                                                                                                                                                                                                                                                                                                                  |                                           |
|                                                                                                                                                                                                                                                                                                                                                                                                                                                                                                                                                                                                                                                                                                                                                                                                                                                                                                                                                                                                                                                                                                                                                                                                                                                                                                                                                                                                                                                                                                                                                                                                                                                                                                                                                                                                                                        |                                           |
| Ávila quiere averiguar qué bienes de los que están en poder de Morán pertenecen a su esposa. Por ello ruega al alcalde ordinario Hernando de Gamboa que mande comparecer ante sí a Morán y que éste exhiba los testamentos, almonedas, inventarios y demás recaudos que tuviere, tocantes a ambos difuntos, y le dé cuenta a él, Diego de Ávila, de lo perteneciente a su mujer.                                                                                                                                                                                                                                                                                                                                                                                                                                                                                                                                                                                                                                                                                                                                                                                                                                                                                                                                                                                                                                                                                                                                                                                                                                                                                                                                                                                                                                                       |                                           |
|                                                                                                                                                                                                                                                                                                                                                                                                                                                                                                                                                                                                                                                                                                                                                                                                                                                                                                                                                                                                                                                                                                                                                                                                                                                                                                                                                                                                                                                                                                                                                                                                                                                                                                                                                                                                                                        |                                           |
| En posteriores peticiones, Ávila dice Diego Morán echó a censo 100 pesos de minas sobre haciendas de Cifontes,^([1]) y después en Juan de la Torre; por otra parte, pide cuentas a Morán de 240 pesos de minas que cobró de Juan de Arana, vecino de Colima; también de otros 150 pesos de minas que largó a Juan de Arana y que no pudo hacerlo por ser bienes de menores; igualmente quiere que le pague el censo y los réditos de 410 pesos de minas que Morán no cobró por descuido y negligencia. Ávila dice que las casas de la morada de Diego Morán en esta Villa no son suyas, sino de Estebanía de Cervera una tercera parte, por ser la mitad de las dichas casas de María Lorenzo, así como también la tercera parte de una estancia, y la tercera parte del ganado mayor y menor, yeguas, vacas, potros, puercos, que la madre de Estebanía de Cervera tenía en su poder. Debe de darle y entregarle por la misma razón la tercera parte de la huerta de cacao que tiene en el Valle de Caxitlan, "que se puso en vida de mi suegra".                                                                                                                                                                                                                                                                                                                                                                                                                                                                                                                                                                                                                                                                                                                                                                                     |                                           |
|                                                                                                                                                                                                                                                                                                                                                                                                                                                                                                                                                                                                                                                                                                                                                                                                                                                                                                                                                                                                                                                                                                                                                                                                                                                                                                                                                                                                                                                                                                                                                                                                                                                                                                                                                                                                                                        |                                           |
| Morán respondió diciendo que hacía presentación del testamento de su hermano Juan de Cervera, pero que María Lorenzo no hizo testamento alguno, "porque al tiempo que ella murió, ella y yo estábamos muy pobres, y si no era de ciertas yegüezuelas que teníamos, de que nos manteníamos y sustentábamos, otra cosa no teníamos"; pero para evitar que Diego de Ávila piense que le quiere llevar lo que de justicia pertenece a su hija, dice que hace presentación de una "memoria de los bienes que con ella recibí".                                                                                                                                                                                                                                                                                                                                                                                                                                                                                                                                                                                                                                                                                                                                                                                                                                                                                                                                                                                                                                                                                                                                                                                                                                                                                                              |                                           |
|                                                                                                                                                                                                                                                                                                                                                                                                                                                                                                                                                                                                                                                                                                                                                                                                                                                                                                                                                                                                                                                                                                                                                                                                                                                                                                                                                                                                                                                                                                                                                                                                                                                                                                                                                                                                                                        |                                           |
| "Declaración hecha por Diego Morán de lo que recibió en dote con María de Meltoro, hija de Alonso Lorenzo": dos yeguas de vientre, la una parida con una potranca; por fin y muerte de mi suegro Alonso Lorenzo, me cupieron en herencia otras tres yeguas, todas paridas, y un potro overo, el cual dejé por garañón de las yeguas, el cual vendí después con las yeguas a peso de tepuzque. Más me dieron con ella una saya de Perpiñán con tres ribetes de terciopelo, más medio verdugado de paño de color de pasa. Recibí un manto de estameña y seis camisas de la tierra, y cofias. Más me cupo por fin y muerte de Alonso Lorenzo, mi suegro, treinta pesos de tepuzque, dos esclavos indios: el uno destos me cupo la mitad, más medio solar, veinte ovejas, más otro medio solar, más media estancia". Agrega luego: "Iten una estancia de ganado que en ella habré cien yeguas". Y dice: "para esto que tengo declarado, pagué de mi bolsa cuando murió María Lorenzo, mi mujer, la misa y vigilia y novenario y la sepultura, ofrendadas de pan y vino y cera que se gastó, y más, cuando vine de México, hice el cabo de año como es uso y costumbre, y por haber veinte años, no tengo memoria de lo que costó esto y montó éstos. Más siete varas de ruán, que saqué de la tienda de García Rodríguez, de las cuales le hicieron dos camisas que le envié al Puerto,^([2]) la una que hizo Ana de la Zarza, mi mujer, y la otra Elvira Lorenzo".                                                                                                                                                                                                                                                                                                                                                                        |                                           |
|                                                                                                                                                                                                                                                                                                                                                                                                                                                                                                                                                                                                                                                                                                                                                                                                                                                                                                                                                                                                                                                                                                                                                                                                                                                                                                                                                                                                                                                                                                                                                                                                                                                                                                                                                                                                                                        |                                           |
| El 22 de mayo, Diego Morán solicitaba un término de 100 días, "para enviar a la Ciudad de México, a donde tengo mis letrados". El 10 de septiembre, Diego de Ávila, por cuanto Morán "no ha querido ni quiere hacer ningún conchavo, ni buena aveniencia, ni dar cuenta", pedía que el alcalde le mandara bajo penas graves que se asentara con él a cuentas.                                                                                                                                                                                                                                                                                                                                                                                                                                                                                                                                                                                                                                                                                                                                                                                                                                                                                                                                                                                                                                                                                                                                                                                                                                                                                                                                                                                                                                                                          |                                           |
|                                                                                                                                                                                                                                                                                                                                                                                                                                                                                                                                                                                                                                                                                                                                                                                                                                                                                                                                                                                                                                                                                                                                                                                                                                                                                                                                                                                                                                                                                                                                                                                                                                                                                                                                                                                                                                        |                                           |
| Caja A–3, exp. 2, ff. 1-9.                                                                                                                                                                                                                                                                                                                                                                                                                                                                                                                                                                                                                                                                                                                                                                                                                                                                                                                                                                                                                                                                                                                                                                                                                                                                                                                                                                                                                                                                                                                                                                                                                                                                                                                                                                                                             |                                           |
|                                                                                                                                                                                                                                                                                                                                                                                                                                                                                                                                                                                                                                                                                                                                                                                                                                                                                                                                                                                                                                                                                                                                                                                                                                                                                                                                                                                                                                                                                                                                                                                                                                                                                                                                                                                                                                        |                                           |
|                                                                                                                                                                                                                                                                                                                                                                                                                                                                                                                                                                                                                                                                                                                                                                                                                                                                                                                                                                                                                                                                                                                                                                                                                                                                                                                                                                                                                                                                                                                                                                                                                                                                                                                                                                                                                                        |                                           |
|                                                                                                                                                                                                                                                                                                                                                                                                                                                                                                                                                                                                                                                                                                                                                                                                                                                                                                                                                                                                                                                                                                                                                                                                                                                                                                                                                                                                                                                                                                                                                                                                                                                                                                                                                                                                                                        |                                           |
| ---------------                                                                                                                                                                                                                                                                                                                                                                                                                                                                                                                                                                                                                                                                                                                                                                                                                                                                                                                                                                                                                                                                                                                                                                                                                                                                                                                                                                                                                                                                                                                                                                                                                                                                                                                                                                                                                        |                                           |
|                                                                                                                                                                                                                                                                                                                                                                                                                                                                                                                                                                                                                                                                                                                                                                                                                                                                                                                                                                                                                                                                                                                                                                                                                                                                                                                                                                                                                                                                                                                                                                                                                                                                                                                                                                                                                                        |                                           |
| (1) Francisco Cifontes (Sifontes, Zifontes, Cifuentes), conquistador y vecino fundador de la Villa de Colima, vino a la Nueva España en compañía de Pánfilo de Narváez, y tomó parte en la conquista de México–Tenochtitlan, de donde escapó en la noche triste con una pierna atravesada "de una varada", para regresar más tarde a la conquista definitiva. En compañía de Gonzalo de Sandoval, hizo varias campañas, "y fué siempre cabo desquadra". Acompañó luego a Hernán Cortés en la conquista de Pánuco y, más tarde, participó en las entradas a los Yopes, Colima, Zacatula y Motín. "Ha sido algo provechado e tenido cargos en esta tierra, mantiene armas y caballo": VP 11; Icaza (1969), I, nº 91. Alonso de Estrada le hizo merced el 16 de diciembre de 1527 de tres pueblos: Tecuxuacan, Mazatlan y Tepetatipa, beneficiándose además de otros dos nombrados Mazatlanejo y Los Gualatacas, al parecer, sin título alguno, según informa el visitador Lebrón de Quiñones, quien agregaba que Cifuentes, "de siete años a esta parte", no residía en la Villa de Colima sino en las minas de Guachinango del Nuevo Reino de Galicia, aunque mantenía "una huerta junto a Caxitlan ya perdida de seis mil casas de cacao": Lebrón (1979), 54-55, 62 y 64. Quizá para las fechas cuando informaba Lebrón, había venido a menos el proyecto de Cifuentes de instalar un molino harinero para surtir la Villa de Colima; en efecto, el 2 de octubre de 1542, el virrey don Antonio de Mendoza le dio merced de una caballería más de tierra, junto a la que ya tenía en compañía de Juan Fernández El Viejo, y en donde tenía "hecho y edificado [...] un molino en el río que pasa por la dicha Villa": Reyes G. (1981), 48-49. ¿Acaso de aquí tomó nombre la llamada en ese tiempo Huerta del Molino?: infra, regº 107. |                                           |
|                                                                                                                                                                                                                                                                                                                                                                                                                                                                                                                                                                                                                                                                                                                                                                                                                                                                                                                                                                                                                                                                                                                                                                                                                                                                                                                                                                                                                                                                                                                                                                                                                                                                                                                                                                                                                                        |                                           |
| (2) Se refiere al Puerto de Santa María (Cádiz, España): al respecto, el testamento de Alonso Lorenzo de Meltoro: supra, regº 7. Ana de la Zarza, aquí aludida, era esposa de Diego Morán, y Elvira Lorenzo, su cuñada, esposa de Lázaro del Valle.                                                                                                                                                                                                                                                                                                                                                                                                                                                                                                                                                                                                                                                                                                                                                                                                                                                                                                                                                                                                                                                                                                                                                                                                                                                                                                                                                                                                                                                                                                                                                                                    |                                           |
+----------------------------------------------------------------------------------------------------------------------------------------------------------------------------------------------------------------------------------------------------------------------------------------------------------------------------------------------------------------------------------------------------------------------------------------------------------------------------------------------------------------------------------------------------------------------------------------------------------------------------------------------------------------------------------------------------------------------------------------------------------------------------------------------------------------------------------------------------------------------------------------------------------------------------------------------------------------------------------------------------------------------------------------------------------------------------------------------------------------------------------------------------------------------------------------------------------------------------------------------------------------------------------------------------------------------------------------------------------------------------------------------------------------------------------------------------------------------------------------------------------------------------------------------------------------------------------------------------------------------------------------------------------------------------------------------------------------------------------------------------------------------------------------------------------------------------------------+-------------------------------------------+

Documento(s) original(es)

Archivo no encontrado (CAJAS/CAJA3/EXP2/004V.jpg)

[]
1F

[]
1V

[]
2F

[]
2V

[]
3F

[]
3V

[]
4F

[]
5F

[]
5V

[]
6F

[]
6V

[]
7F

[]
7V

[]
8F

[]
8V

[]
9F

[]
9V

Proyecto interinstitucional del Archivo Histórico del Municipio de Colima y la Universidad de Colima,
realizado bajo los auspicios del fondo Ramón Álvarez-Buylla de Aldana.

------------------------------------------------------------------------

ISBN 978-968-7412-85-6
® Derechos Reservados 2008. Archivo Histórico del Municipio de Colima.

1,078 visitas
