+---------------------------------------------------------------------------------------------------------------------------------------------------------------------------------------------------------------------------------------------------------------------------------------------------------------------------------------------------------------------+-----------------------+-----------------------+
| []                                                                                                                                                                                                                                                                                                                                                                  |                       |                       |
|                                                                                                                                                                                                                                                                                                                                                                     |                       |                       |
| +-----------------------------------+:-------------------------------------:+                                                                                                                                                                                                                                                                                       |                       |                       |
| | []                                | LA VILLA DE COLIMA DE LA NUEVA ESPAÑA |                                                                                                                                                                                                                                                                                       |                       |                       |
| |                                   | SIGLO XVI                             |                                                                                                                                                                                                                                                                                       |                       |                       |
| |                                   |                                       |                                                                                                                                                                                                                                                                                       |                       |                       |
| |                                   | VOLUMEN II      (CAJAS 12-20)         |                                                                                                                                                                                                                                                                                       |                       |                       |
| +-----------------------------------+---------------------------------------+                                                                                                                                                                                                                                                                                       |                       |                       |
+---------------------------------------------------------------------------------------------------------------------------------------------------------------------------------------------------------------------------------------------------------------------------------------------------------------------------------------------------------------------+-----------------------+-----------------------+
| +------------------------------------------------------------------------+-------------------------------+-----------------------+                                                                                                                                                                                                                                  |                       |                       |
| | Inicio | Búsqueda | Siglas y bibliografía | Créditos | Más información | Vol. I (1-11) Vol. II (12-20) |    [ES]               |                                                                                                                                                                                                                                  |                       |                       |
| +------------------------------------------------------------------------+-------------------------------+-----------------------+                                                                                                                                                                                                                                  |                       |                       |
+---------------------------------------------------------------------------------------------------------------------------------------------------------------------------------------------------------------------------------------------------------------------------------------------------------------------------------------------------------------------+-----------------------+-----------------------+
| Búsqueda rápida                                                                                                                                                                                                                                                                                                                                                     |                       |                       |
|                                                                                                                                                                                                                                                                                                                                                                     |                       |                       |
| +:-------------------:+-----------------+:----------------------------------------:+----------------:+                                                                                                                                                                                                                                                              |                       |                       |
| | Documento de fecha: |                 | Ubicación física del documento original: | [] [] []        |                                                                                                                                                                                                                                                              |                       |                       |
| |                     |                 |                                          |                 |                                                                                                                                                                                                                                                              |                       |                       |
| | 1594. Octubre, 20   |                 | Caja 24, exp. 17, 2 ff.^([3])            |                 |                                                                                                                                                                                                                                                              |                       |                       |
| +---------------------+-----------------+------------------------------------------+-----------------+                                                                                                                                                                                                                                                              |                       |                       |
|                                                                                                                                                                                                                                                                                                                                                                     |                       |                       |
|   ------------- ---------------------------------------------------------------------------------------------                                                                                                                                                                                                                                                       |                       |                       |
|   Resumen:      Carta de obligación de pago que otorga Francisco Ortiz en favor de Diego Pérez de Espinosa.                                                                                                                                                                                                                                                         |                       |                       |
|   ------------- ---------------------------------------------------------------------------------------------                                                                                                                                                                                                                                                       |                       |                       |
|                                                                                                                                                                                                                                                                                                                                                                     |                       |                       |
|   ----------------------------------- ----------------------------------------------------------------------------------------------------------------------------------------------------------------------------------------------------------------------------------------------------------------------------------------------------------------------------- |                       |                       |
|   Contenido:                          Francisco Ortiz,^([1]) vecino de Colima, ante el escribano Toribio de Casso y siendo testigos Cristóbal Hernández de Tene, Jerónimo de Cervantes^([2]) y Pedro Gómez Machorro, vecinos y estantes, se obliga a pagar a Diego Pérez de Espinosa, vecino de Colima, 135 pesos de mercaderías que éste le vendió de su tienda.   |                       |                       |
|                                       Pagará en seis meses la mitad, y en otros seis meses el resto.                                                                                                                                                                                                                                                                |                       |                       |
|                                       Esta escritura fue presentada para su cobro ante Pedro Gómez Machorro, alcalde ordinario de la Villa en Colima, el 27 de octubre de 1597.                                                                                                                                                                                     |                       |                       |
|                                                                                                                                                                                                                                                                                                                                                                     |                       |                       |
|   ----------------------------------- ----------------------------------------------------------------------------------------------------------------------------------------------------------------------------------------------------------------------------------------------------------------------------------------------------------------------------- |                       |                       |
|                                                                                                                                                                                                                                                                                                                                                                     |                       |                       |
| (1) El vecino de Colima Francisco Ortiz estaba casado con Isabel de Cervera ó Vargas, hija de Diego Morán El Viejo y Ana de la Zarza; en diciembre de 1591, compraron un solar a espaldas de la iglesia mayor de Colima. Fue obligado de la carne y teniente de alguacil: Romero de Solís, Andariegos… (2001), 378.                                                 |                       |                       |
|                                                                                                                                                                                                                                                                                                                                                                     |                       |                       |
| (2) Jerónimo de Cervantes llegó a Colima en 1594 acompañando como notario apostólico al bachiller Sebastián de Valderrama, cura de Colima y visitador de testamentos y obras pías. Como todavía aparece de testigo en 1598, pareciera que se quedó a residir en esta Villa o se hizo vecino de ella: Romero de Solís, Andariegos… (2001), 109.                      |                       |                       |
|                                                                                                                                                                                                                                                                                                                                                                     |                       |                       |
| (3) Expediente deteriorado.                                                                                                                                                                                                                                                                                                                                         |                       |                       |
|                                                                                                                                                                                                                                                                                                                                                                     |                       |                       |
|   ---------------------------------------------------------------------------------------------------                                                                                                                                                                                                                                                               |                       |                       |
|    Documento(s) original(es)                                                                                                                                                                                                                                                                                                                                        |                       |                       |
|   --------------------------- ------- ------- ------- ------- ------- ------- ------- ------- -------                                                                                                                                                                                                                                                               |                       |                       |
|               []                []      []      []                                                                                                                                                                                                                                                                                                                  |                       |                       |
|               1f                1v      2f      2v                                                                                                                                                                                                                                                                                                                  |                       |                       |
|                                                                                                                                                                                                                                                                                                                                                                     |                       |                       |
|   ---------------------------------------------------------------------------------------------------                                                                                                                                                                                                                                                               |                       |                       |
+---------------------------------------------------------------------------------------------------------------------------------------------------------------------------------------------------------------------------------------------------------------------------------------------------------------------------------------------------------------------+-----------------------+-----------------------+
| +----------------------------------------------------------------------------+-----------------------------------------------:+                                                                                                                                                                                                                                     |                       |                       |
| | ISBN 978-607-701-024-1                                                     |   ---- ---- ---- ---- ---- ---- ---- ---- ---- |                                                                                                                                                                                                                                     |                       |                       |
| | © Derechos Reservados 2013. Archivo Histórico del Municipio de Colima. [*] |   []        []        []        []        []   |                                                                                                                                                                                                                                     |                       |                       |
| |                                                                            |   ---- ---- ---- ---- ---- ---- ---- ---- ---- |                                                                                                                                                                                                                                     |                       |                       |
| +----------------------------------------------------------------------------+------------------------------------------------+                                                                                                                                                                                                                                     |                       |                       |
| |                                                                            |                                                |                                                                                                                                                                                                                                     |                       |                       |
| +----------------------------------------------------------------------------+------------------------------------------------+                                                                                                                                                                                                                                     |                       |                       |
+---------------------------------------------------------------------------------------------------------------------------------------------------------------------------------------------------------------------------------------------------------------------------------------------------------------------------------------------------------------------+-----------------------+-----------------------+

636 visitas
