[]

LA VILLA DE COLIMA DE LA NUEVA ESPAÑA
SIGLO XVI

VOLUMEN I      (CAJAS 1-11)

[]

Inicio | Búsquedas | Siglas y bibliografía | Cartografía | Créditos | Más información

[]

Búsqueda rápida

+:------------------------------------------------------------------------------------------------------------------------------------------------------------------------------------------------------------------------------------------------------------------------------------------------------------------------------------------------------------------------------------------------------------------------------------------------------------------------------------------------------------------------------------------------------------------------------------------------------------------------------------------------------------------------------------------------------------------------------------------------------------------------------------------------:+------------------------------------------:+
| Fecha:                                                                                                                                                                                                                                                                                                                                                                                                                                                                                                                                                                                                                                                                                                                                                                                           | Ubicación física del documento original:  |
| 1577 Enero, 14                                                                                                                                                                                                                                                                                                                                                                                                                                                                                                                                                                                                                                                                                                                                                                                   | CAJA A-9, EXP. 6, FF. 1-5.                |
|                                                                                                                                                                                                                                                                                                                                                                                                                                                                                                                                                                                                                                                                                                                                                                                                  | Archivo Histórico del Municipio de Colima |
+--------------------------------------------------------------------------------------------------------------------------------------------------------------------------------------------------------------------------------------------------------------------------------------------------------------------------------------------------------------------------------------------------------------------------------------------------------------------------------------------------------------------------------------------------------------------------------------------------------------------------------------------------------------------------------------------------------------------------------------------------------------------------------------------------+-------------------------------------------+
| 295. 1577. Enero, 14.                                                                                                                                                                                                                                                                                                                                                                                                                                                                                                                                                                                                                                                                                                                                                                            |                                           |
|                                                                                                                                                                                                                                                                                                                                                                                                                                                                                                                                                                                                                                                                                                                                                                                                  |                                           |
| Ejecución de los menores de Juan de Aguilar contra Juan Fernández de Ocampo.                                                                                                                                                                                                                                                                                                                                                                                                                                                                                                                                                                                                                                                                                                                     |                                           |
|                                                                                                                                                                                                                                                                                                                                                                                                                                                                                                                                                                                                                                                                                                                                                                                                  |                                           |
| El alcalde mayor Pablo de Arriaga da mandamiento de ejecución al alguacil mayor de la Villa de Colima, para que requiera a Juan Fernández Lázaro de Ocampo,(1) vecino de Colima, "que luego dé y pague a Hernando de Solórzano treinta y ocho pesos y cuatro tomines de oro común, que el susodicho debe de censos corridos a los menores de Juan de Aguilar, que son de cuatro años y medio que se cumplieron" el 18 de diciembre de 1576, "los cuales dichos pesos de oro son que los ha de haber el dicho Hernando de Solórzano, por cuanto le cupieron en la partición que se hizo de los dichos bienes, entre él e su hermana, doña Magdalena de Solórzano, y si luego no vos los diere e pagare, le haréis entrega y ejecución en su persona y bienes, lo cual haréis conforme a derecho". |                                           |
|                                                                                                                                                                                                                                                                                                                                                                                                                                                                                                                                                                                                                                                                                                                                                                                                  |                                           |
| El 10 de abril, el alguacil mayor Tomás Herades requirió con este mandamiento a Juan Fernández de Ocampo; éste nombró por sus bienes "unos solares que tiene frontero de las casas de Juan Fernández, su padre, e dio por fiador de saneamiento a Hernán González, vecino desta Villa". Testigos: Diego Morán, Miguel de Rivera y Gaspar Hurtado, vecinos de Colima. Escribano: Francisco López.                                                                                                                                                                                                                                                                                                                                                                                                 |                                           |
|                                                                                                                                                                                                                                                                                                                                                                                                                                                                                                                                                                                                                                                                                                                                                                                                  |                                           |
| Hernando de Solórzano, entonces, pidió se diera el primer pregón de los bienes ejecutados, el cual se dio por voz de Antón, negro, pregonero nombrado, en altas voces, diciendo: "Si hay quién quiera comprar e poner en precio un solar que es frontero de las casas de Juan Fernández El Viejo, que es de Juan Fernández de Ocampo, el cual se vende, por bienes ejecutados, a pedimiento de Hernando de Solórzano, vecino desta Villa, por contía de treinta y ocho pesos y cuatro tomines de oro común e costas". Testigos, los vecinos Miguel de Rivera y Diego de Contreras.                                                                                                                                                                                                               |                                           |
|                                                                                                                                                                                                                                                                                                                                                                                                                                                                                                                                                                                                                                                                                                                                                                                                  |                                           |
| Solórzano mejoró la ejecución "en una manada de yeguas del dicho Juan Fernández, e las nombró por bienes suyos, e lo firmó de su nombre, y el dicho alguacil dijo que hacía en ellas la dicha ejecución e mejora".                                                                                                                                                                                                                                                                                                                                                                                                                                                                                                                                                                               |                                           |
|                                                                                                                                                                                                                                                                                                                                                                                                                                                                                                                                                                                                                                                                                                                                                                                                  |                                           |
| El 19 de abril se dio el segundo pregón, siendo testigos Rivera, Herades, Alonso de Sopuerta y Pedro Vázquez Montalbán, vecinos de Colima.                                                                                                                                                                                                                                                                                                                                                                                                                                                                                                                                                                                                                                                       |                                           |
|                                                                                                                                                                                                                                                                                                                                                                                                                                                                                                                                                                                                                                                                                                                                                                                                  |                                           |
| Solórzano decía el 27 de abril que, en el pleito que trata con Juan Fernández Lázaro de Ocampo, "el domingo se cumplían los días para dar el tercero pregón", pero por ser día domingo, "no se puede dar"; por ello, "pido y suplico a V.m., se dé el lunes", lo cual concedió el alcalde, dándose el 29 de abril por voz del negro Miguel pregonero nombrado, siendo testigos los vecinos Gonzalo Moreno y Juan de Salinas.                                                                                                                                                                                                                                                                                                                                                                     |                                           |
|                                                                                                                                                                                                                                                                                                                                                                                                                                                                                                                                                                                                                                                                                                                                                                                                  |                                           |
| Gaspar Hurtado, en nombre y con poder de Hernando de Solórzano, decía el 4 de mayo que "los pregones del derecho son ya pasados y días más"; por ello, urgía a Su Merced a que "mande avivar la voz del almoneda y hacer trance y remate".                                                                                                                                                                                                                                                                                                                                                                                                                                                                                                                                                       |                                           |
|                                                                                                                                                                                                                                                                                                                                                                                                                                                                                                                                                                                                                                                                                                                                                                                                  |                                           |
| El alcalde Juan Preciado dispuso que el escribano notificase de ello a la parte de Fernández de Ocampo.                                                                                                                                                                                                                                                                                                                                                                                                                                                                                                                                                                                                                                                                                          |                                           |
|                                                                                                                                                                                                                                                                                                                                                                                                                                                                                                                                                                                                                                                                                                                                                                                                  |                                           |
| Caja A–9, exp. 6, ff. 1-5.                                                                                                                                                                                                                                                                                                                                                                                                                                                                                                                                                                                                                                                                                                                                                                       |                                           |
|                                                                                                                                                                                                                                                                                                                                                                                                                                                                                                                                                                                                                                                                                                                                                                                                  |                                           |
|                                                                                                                                                                                                                                                                                                                                                                                                                                                                                                                                                                                                                                                                                                                                                                                                  |                                           |
|                                                                                                                                                                                                                                                                                                                                                                                                                                                                                                                                                                                                                                                                                                                                                                                                  |                                           |
| ---------------                                                                                                                                                                                                                                                                                                                                                                                                                                                                                                                                                                                                                                                                                                                                                                                  |                                           |
|                                                                                                                                                                                                                                                                                                                                                                                                                                                                                                                                                                                                                                                                                                                                                                                                  |                                           |
| (1) Es la primera vez que así es nombrado el hijo de Juan Fernández El Viejo; en registros anteriores fue llamado Fernández de Ocampo o bien Fernández Lázaro, como se explicó: supra, regº 269 y I, regº 226.                                                                                                                                                                                                                                                                                                                                                                                                                                                                                                                                                                                   |                                           |
+--------------------------------------------------------------------------------------------------------------------------------------------------------------------------------------------------------------------------------------------------------------------------------------------------------------------------------------------------------------------------------------------------------------------------------------------------------------------------------------------------------------------------------------------------------------------------------------------------------------------------------------------------------------------------------------------------------------------------------------------------------------------------------------------------+-------------------------------------------+

Documento(s) original(es)

Archivo no encontrado (CAJAS/CAJA9/EXP6/001V.jpg)

Archivo no encontrado (CAJAS/CAJA9/EXP6/002F.jpg)

[]
1F

[]
2V

[]
3F

[]
3V

[]
4F

[]
4V

[]
5F

[]
5V

Proyecto interinstitucional del Archivo Histórico del Municipio de Colima y la Universidad de Colima,
realizado bajo los auspicios del fondo Ramón Álvarez-Buylla de Aldana.

------------------------------------------------------------------------

ISBN 978-968-7412-85-6
® Derechos Reservados 2008. Archivo Histórico del Municipio de Colima.

1,078 visitas
