+--------------------------------------------------------------------------------------------------------------------------------------------------------------------------------------------------------------------------------------------------------------------------------------------------------------------------------------------------+-----------------------+-----------------------+
| []                                                                                                                                                                                                                                                                                                                                               |                       |                       |
|                                                                                                                                                                                                                                                                                                                                                  |                       |                       |
| +-----------------------------------+:-------------------------------------:+                                                                                                                                                                                                                                                                    |                       |                       |
| | []                                | LA VILLA DE COLIMA DE LA NUEVA ESPAÑA |                                                                                                                                                                                                                                                                    |                       |                       |
| |                                   | SIGLO XVI                             |                                                                                                                                                                                                                                                                    |                       |                       |
| |                                   |                                       |                                                                                                                                                                                                                                                                    |                       |                       |
| |                                   | VOLUMEN II      (CAJAS 12-20)         |                                                                                                                                                                                                                                                                    |                       |                       |
| +-----------------------------------+---------------------------------------+                                                                                                                                                                                                                                                                    |                       |                       |
+--------------------------------------------------------------------------------------------------------------------------------------------------------------------------------------------------------------------------------------------------------------------------------------------------------------------------------------------------+-----------------------+-----------------------+
| +------------------------------------------------------------------------+-------------------------------+-----------------------+                                                                                                                                                                                                               |                       |                       |
| | Inicio | Búsqueda | Siglas y bibliografía | Créditos | Más información | Vol. I (1-11) Vol. II (12-20) |    [ES]               |                                                                                                                                                                                                               |                       |                       |
| +------------------------------------------------------------------------+-------------------------------+-----------------------+                                                                                                                                                                                                               |                       |                       |
+--------------------------------------------------------------------------------------------------------------------------------------------------------------------------------------------------------------------------------------------------------------------------------------------------------------------------------------------------+-----------------------+-----------------------+
| Búsqueda rápida                                                                                                                                                                                                                                                                                                                                  |                       |                       |
|                                                                                                                                                                                                                                                                                                                                                  |                       |                       |
| +:-------------------:+-----------------+:----------------------------------------:+----------------:+                                                                                                                                                                                                                                           |                       |                       |
| | Documento de fecha: |                 | Ubicación física del documento original: | [] [] []        |                                                                                                                                                                                                                                           |                       |                       |
| |                     |                 |                                          |                 |                                                                                                                                                                                                                                           |                       |                       |
| | 1570. Agosto, 22    |                 | Caja 21, exp. 15, 1 f.^([3])             |                 |                                                                                                                                                                                                                                           |                       |                       |
| +---------------------+-----------------+------------------------------------------+-----------------+                                                                                                                                                                                                                                           |                       |                       |
|                                                                                                                                                                                                                                                                                                                                                  |                       |                       |
|   ------------- ------------------------------------------------------------------------------------                                                                                                                                                                                                                                             |                       |                       |
|   Resumen:      El menor Cristóbal Preciado solicita dineros para vestirse y mercar algunas cosas.                                                                                                                                                                                                                                               |                       |                       |
|   ------------- ------------------------------------------------------------------------------------                                                                                                                                                                                                                                             |                       |                       |
|                                                                                                                                                                                                                                                                                                                                                  |                       |                       |
|   ----------------------------------- -----------------------------------------------------------------------------------------------------------------------------------------------------------------------------------                                                                                                                        |                       |                       |
|   Contenido:                          Cristóbal Preciado,^([1]) hijo legítimo de Francisco Preciado, difunto, dice necesitar 45 pesos “para vestirme y mercar algunas cosas de que yo tengo necesidad para mi persona”.                                                                                                                          |                       |                       |
|                                       Pide al alcalde que mande a su tutor Juan Núñez de Alvarado^([2]) que de sus bienes se los dé. Así lo mandó el alcalde.                                                                                                                                                                                    |                       |                       |
|                                       Cristóbal Preciado, al día siguiente, firmaba haber recibido ese dinero y haberlo gastado en ropa y otras cosas que compró en la tienda de Juan de Salinas.                                                                                                                                                |                       |                       |
|                                                                                                                                                                                                                                                                                                                                                  |                       |                       |
|   ----------------------------------- -----------------------------------------------------------------------------------------------------------------------------------------------------------------------------------                                                                                                                        |                       |                       |
|                                                                                                                                                                                                                                                                                                                                                  |                       |                       |
| (1) Cristóbal Preciado, hijo de Francisco Preciado y Elvira de Arévalo, es de los pocos hijos de vecinos de Colima, de los que consta que dedicaron un tiempo de su vida a estudiar, primero en la Villa de Colima, y luego en Guadalajara: supra, I, reg° 194, 196-197. Casó con Isabel de Rojas: Romero de Solís, Andariegos… (2001), 410-411. |                       |                       |
|                                                                                                                                                                                                                                                                                                                                                  |                       |                       |
| (2) Juan Núñez de Alvarado era su cuñado, por cuanto estaba casado con su hermana Isabel de Arévalo.                                                                                                                                                                                                                                             |                       |                       |
|                                                                                                                                                                                                                                                                                                                                                  |                       |                       |
| (3) Antes en Sección B, caja 21, exp. 2.                                                                                                                                                                                                                                                                                                         |                       |                       |
|                                                                                                                                                                                                                                                                                                                                                  |                       |                       |
|   ---------------------------------------------------------------------------------------------------                                                                                                                                                                                                                                            |                       |                       |
|    Documento(s) original(es)                                                                                                                                                                                                                                                                                                                     |                       |                       |
|   --------------------------- ------- ------- ------- ------- ------- ------- ------- ------- -------                                                                                                                                                                                                                                            |                       |                       |
|               []                []                                                                                                                                                                                                                                                                                                               |                       |                       |
|               1f                1v                                                                                                                                                                                                                                                                                                               |                       |                       |
|                                                                                                                                                                                                                                                                                                                                                  |                       |                       |
|   ---------------------------------------------------------------------------------------------------                                                                                                                                                                                                                                            |                       |                       |
+--------------------------------------------------------------------------------------------------------------------------------------------------------------------------------------------------------------------------------------------------------------------------------------------------------------------------------------------------+-----------------------+-----------------------+
| +----------------------------------------------------------------------------+-----------------------------------------------:+                                                                                                                                                                                                                  |                       |                       |
| | ISBN 978-607-701-024-1                                                     |   ---- ---- ---- ---- ---- ---- ---- ---- ---- |                                                                                                                                                                                                                  |                       |                       |
| | © Derechos Reservados 2013. Archivo Histórico del Municipio de Colima. [*] |   []        []        []        []        []   |                                                                                                                                                                                                                  |                       |                       |
| |                                                                            |   ---- ---- ---- ---- ---- ---- ---- ---- ---- |                                                                                                                                                                                                                  |                       |                       |
| +----------------------------------------------------------------------------+------------------------------------------------+                                                                                                                                                                                                                  |                       |                       |
| |                                                                            |                                                |                                                                                                                                                                                                                  |                       |                       |
| +----------------------------------------------------------------------------+------------------------------------------------+                                                                                                                                                                                                                  |                       |                       |
+--------------------------------------------------------------------------------------------------------------------------------------------------------------------------------------------------------------------------------------------------------------------------------------------------------------------------------------------------+-----------------------+-----------------------+

636 visitas
