[]

LA VILLA DE COLIMA DE LA NUEVA ESPAÑA
SIGLO XVI

VOLUMEN I      (CAJAS 1-11)

[]

Inicio | Búsquedas | Siglas y bibliografía | Cartografía | Créditos | Más información

[]

Búsqueda rápida

+:-------------------------------------------------------------------------------------------------------------------------------------------------------------------------------------------------------------------------------------------------------------------------------------------------------------------------------------------------------------------------------------------------------------------------------------------------------------------------------------------------------------------------------------------------------------------------------------------------------------------------------------------------------------------------------------------------------------------------------------------------------------------------------------------------------------------------------------------------------------------------------------------------------------------------------------------------------------------------------------------------------------------------------------------------------------------------------------------------------------------------------------------------------------------------------------------------------------------------------------------------------------:+------------------------------------------:+
| Fecha:                                                                                                                                                                                                                                                                                                                                                                                                                                                                                                                                                                                                                                                                                                                                                                                                                                                                                                                                                                                                                                                                                                                                                                                                                                                        | Ubicación física del documento original:  |
| 1579 Junio, 20                                                                                                                                                                                                                                                                                                                                                                                                                                                                                                                                                                                                                                                                                                                                                                                                                                                                                                                                                                                                                                                                                                                                                                                                                                                | CAJA A-10, EXP. 17, 7 FF.                 |
|                                                                                                                                                                                                                                                                                                                                                                                                                                                                                                                                                                                                                                                                                                                                                                                                                                                                                                                                                                                                                                                                                                                                                                                                                                                               | Archivo Histórico del Municipio de Colima |
+---------------------------------------------------------------------------------------------------------------------------------------------------------------------------------------------------------------------------------------------------------------------------------------------------------------------------------------------------------------------------------------------------------------------------------------------------------------------------------------------------------------------------------------------------------------------------------------------------------------------------------------------------------------------------------------------------------------------------------------------------------------------------------------------------------------------------------------------------------------------------------------------------------------------------------------------------------------------------------------------------------------------------------------------------------------------------------------------------------------------------------------------------------------------------------------------------------------------------------------------------------------+-------------------------------------------+
| 383. 1579. Junio, 20.                                                                                                                                                                                                                                                                                                                                                                                                                                                                                                                                                                                                                                                                                                                                                                                                                                                                                                                                                                                                                                                                                                                                                                                                                                         |                                           |
|                                                                                                                                                                                                                                                                                                                                                                                                                                                                                                                                                                                                                                                                                                                                                                                                                                                                                                                                                                                                                                                                                                                                                                                                                                                               |                                           |
| Juan Muñoz presenta al cobro una memoria de lo que llevó de su tienda Pero Ruiz de Vilches, su compadre difunto.(1)                                                                                                                                                                                                                                                                                                                                                                                                                                                                                                                                                                                                                                                                                                                                                                                                                                                                                                                                                                                                                                                                                                                                           |                                           |
|                                                                                                                                                                                                                                                                                                                                                                                                                                                                                                                                                                                                                                                                                                                                                                                                                                                                                                                                                                                                                                                                                                                                                                                                                                                               |                                           |
| Ante el alcalde ordinario Cristóbal de Silva, el vecino Juan Muñoz dice: "Yo dí a Pero Ruiz de Vilches cincuenta y un pesos y cuatro tomines en mercadurías y ropa que le vendí, como parece por esta memoria de que hago presentación, y es ansí que a la sazón y tiempo que el dicho Pero Ruiz murió,(2) yo no estaba en esta Villa, el cual murió e no pudo testar, de cuya causa no aclaró lo que me debía, y por ser como era mi amigo y compadre, no me hizo cédula ni escritura dello. Pido y suplico a V.m., mande a Diego de Contreras, tutor de sus hijos, me los dé y pague de sus bienes, porque siendo necesario, daré información dello, sobre que pido justicia".                                                                                                                                                                                                                                                                                                                                                                                                                                                                                                                                                                              |                                           |
|                                                                                                                                                                                                                                                                                                                                                                                                                                                                                                                                                                                                                                                                                                                                                                                                                                                                                                                                                                                                                                                                                                                                                                                                                                                               |                                           |
|                                                                                                                                                                                                                                                                                                                                                                                                                                                                                                                                                                                                                                                                                                                                                                                                                                                                                                                                                                                                                                                                                                                                                                                                                                                               |                                           |
|                                                                                                                                                                                                                                                                                                                                                                                                                                                                                                                                                                                                                                                                                                                                                                                                                                                                                                                                                                                                                                                                                                                                                                                                                                                               |                                           |
| Memoria de lo que llevó mi compadre                                                                                                                                                                                                                                                                                                                                                                                                                                                                                                                                                                                                                                                                                                                                                                                                                                                                                                                                                                                                                                                                                                                                                                                                                           |                                           |
|                                                                                                                                                                                                                                                                                                                                                                                                                                                                                                                                                                                                                                                                                                                                                                                                                                                                                                                                                                                                                                                                                                                                                                                                                                                               |                                           |
| Pero Ruiz de Vilches                                                                                                                                                                                                                                                                                                                                                                                                                                                                                                                                                                                                                                                                                                                                                                                                                                                                                                                                                                                                                                                                                                                                                                                                                                          |                                           |
|                                                                                                                                                                                                                                                                                                                                                                                                                                                                                                                                                                                                                                                                                                                                                                                                                                                                                                                                                                                                                                                                                                                                                                                                                                                               |                                           |
| "Un par de zapatos de vaqueta, 6 tomines; dos pares de chapines de cuero, 4 pesos; unos alcorques,(3) 2 pesos; unos zapatos de cordobán, 1 peso 2 tomines; dos albardones,(4) 3 pesos; de yerbas secas, nueve tomines (1 peso, 1 tomín); dos varas y dos tercias de tafetán colorado, 8 pesos; dos arillos de oro, 2 pesos; tres docenas de loza de Mechuacan, 1 peso 4 tomines; unos botines en seis tomines; una Doctrina(5) en cuatro tomines; dos varas y media de tafetán negro en seis pesos y dos tomines; en este día un machete de Fregenal, 2 pesos; en este día una vara de ruán de cofre, 2 pesos; en veinte y ocho del dicho, de jabón, 1 peso 4 tomines; de especias, peso y medio; en este día media vara de ruán, 5 tomines; en este día vara y media de naual,(6) 1 peso 4 tomines; en este día vara y media de presilla, 1 peso 5 tomines; en este día vara y media de anjeo, 1 peso 5 tomines; en cuatro días de agosto, dí a Juan Gómez cinco pesos por un potro que le dio a Pedro Gómez Nájera por Pero Ruiz de Vilches; en este día cuatro varas de esguián,(7) que dí a mi compadre a peso vara (4 pesos)".                                                                                                                           |                                           |
|                                                                                                                                                                                                                                                                                                                                                                                                                                                                                                                                                                                                                                                                                                                                                                                                                                                                                                                                                                                                                                                                                                                                                                                                                                                               |                                           |
| Monta todo 51 pesos 4 tomines. Firma Juan Muñoz.                                                                                                                                                                                                                                                                                                                                                                                                                                                                                                                                                                                                                                                                                                                                                                                                                                                                                                                                                                                                                                                                                                                                                                                                              |                                           |
|                                                                                                                                                                                                                                                                                                                                                                                                                                                                                                                                                                                                                                                                                                                                                                                                                                                                                                                                                                                                                                                                                                                                                                                                                                                               |                                           |
| El alcalde tuvo por presentadas petición y memoria y mandó a Muñoz dar información.                                                                                                                                                                                                                                                                                                                                                                                                                                                                                                                                                                                                                                                                                                                                                                                                                                                                                                                                                                                                                                                                                                                                                                           |                                           |
|                                                                                                                                                                                                                                                                                                                                                                                                                                                                                                                                                                                                                                                                                                                                                                                                                                                                                                                                                                                                                                                                                                                                                                                                                                                               |                                           |
| El escribano Francisco López notificó a Diego de Contreras, tutor de los hijos y herederos de Pero Ruiz de Vilches, siendo testigos Miguel de Rivera y Andrés de Segura, vecinos de Colima; también notificó a Julián de Frías "como curador de los demás menores hijos de Pero Ruiz",(8) ante los vecinos Juan Bautista y Pero Vázquez.                                                                                                                                                                                                                                                                                                                                                                                                                                                                                                                                                                                                                                                                                                                                                                                                                                                                                                                      |                                           |
|                                                                                                                                                                                                                                                                                                                                                                                                                                                                                                                                                                                                                                                                                                                                                                                                                                                                                                                                                                                                                                                                                                                                                                                                                                                               |                                           |
| El alcalde comisionó al escribano Francisco López para recibir la información, juramentar y examinar los testigos que Muñoz presentó el 26 de julio.                                                                                                                                                                                                                                                                                                                                                                                                                                                                                                                                                                                                                                                                                                                                                                                                                                                                                                                                                                                                                                                                                                          |                                           |
|                                                                                                                                                                                                                                                                                                                                                                                                                                                                                                                                                                                                                                                                                                                                                                                                                                                                                                                                                                                                                                                                                                                                                                                                                                                               |                                           |
| El primer testigo fue Catalina Jiménez, viuda de Pero Ruiz de Vilches. Le fue presentada la carta cuenta y leídas las partidas, dijo que era verdad que su marido recibió en su presencia las partidas y a los precios declarados en la memoria, "y sabe que se lo debe y no se lo ha pagado, salvo que la partida de los «dos albardones» en tres pesos, no se la debe porque se los pagó, y la partida de la «Doctrina», que es un libro, que está presta de se lo tornar e dar, porque el dicho difunto no se sirvió de él, el cual, dice, se lo dio por cuatro tomines, y lo dará luego; y en la partida postrera, donde dice que le dio «cuatro varas de esguián», que no le dio más de tres varas, y tantas le debe con todo lo demás que dicho e aclarado tiene". No firmó porque no supo hacerlo. La testigo agregó: "Dijo que en la partida do dice de las «yerbas secas», no debe más de cinco tomines".                                                                                                                                                                                                                                                                                                                                            |                                           |
|                                                                                                                                                                                                                                                                                                                                                                                                                                                                                                                                                                                                                                                                                                                                                                                                                                                                                                                                                                                                                                                                                                                                                                                                                                                               |                                           |
| La siguiente testigo fue Isabel Jiménez,(9) sobrina de Catalina Jiménez, a quien se leyó la carta cuenta partida por partida; dijo que era verdad que Pero Ruiz debía a Muñoz los pesos contenidos en la dicha cuenta y memoria, "porque, en presencia desta testigo, el dicho Pero Ruiz recibió del dicho Juan Muñoz todo lo contenido en la dicha memoria y a los dichos precios, porque pasó en presencia desta testigo, porque a la sazón que el dicho Juan Muñoz se lo dio al dicho Pero Ruiz, estaba [ella] y vivía dentro, en su casa, y la mayor parte dello esta testigo lo dio al dicho Pero Ruiz por mano del dicho Juan Muñoz e por su mandado, salvo que en la partida postrera, do dice «cuatro varas de esguián», no se le deben más de tres varas, porque no era más; y la partida de los «dos albardones» no se le deben, porque el dicho difunto se los pagó; y en lo de la «Doctrina», sabe esta testigo que la dicha Catalina Jiménez quedó de dársela al dicho Juan Muñoz; y en la partida de las «yerbas verdes»,(10) esta testigo sabe que para las traer de México, se le dieron tres tomines al dicho Juan Muñoz y se le debe la resta dellas". La testigo no firmó porque no sabía hacerlo y dijo que tenía más de 18 años de edad. |                                           |
|                                                                                                                                                                                                                                                                                                                                                                                                                                                                                                                                                                                                                                                                                                                                                                                                                                                                                                                                                                                                                                                                                                                                                                                                                                                               |                                           |
| Por tercer testigo, Muñoz presentó a Francisca Ruiz de Monjaraz, hija del difunto Ruiz de Vilches que declaró ante su curador, Diego de Contreras. Dijo que lo que sabe de este caso y vio es que Muñoz "dio y vendió al dicho Pero Ruiz" los zapatos de vaqueta, los alcorques, los arillos de oro, la loza y el machete, "y no le dio otra cosa ni debe más el dicho Pero Ruiz, porque los chapines y los arillos se lo tornó a dar al dicho Juan Muñoz, y en lo de las «yerbas secas», que le dio al dicho Juan Muñoz tres tomines para que las comprase"; y que el resto lo tomó Catalina Jiménez y las pidió de Muñoz, "sin lo saber el dicho Pero Ruiz, y si otra cosa fuera, esta testigo lo supiera porque el dicho Pero Ruiz le mandaba a esta testigo, como hija suya, que trujese cualquier cosa que hubiese menester el dicho su padre de la dicha tienda del dicho Juan Muñoz, porque posaba dentro en su casa". No firmó porque dijo no sabía. Por ella, lo hizo Diego de Contreras.                                                                                                                                                                                                                                                            |                                           |
|                                                                                                                                                                                                                                                                                                                                                                                                                                                                                                                                                                                                                                                                                                                                                                                                                                                                                                                                                                                                                                                                                                                                                                                                                                                               |                                           |
| El 27 de julio, Muñoz pedía que se le pagase, ya que había dado información bastante.                                                                                                                                                                                                                                                                                                                                                                                                                                                                                                                                                                                                                                                                                                                                                                                                                                                                                                                                                                                                                                                                                                                                                                         |                                           |
|                                                                                                                                                                                                                                                                                                                                                                                                                                                                                                                                                                                                                                                                                                                                                                                                                                                                                                                                                                                                                                                                                                                                                                                                                                                               |                                           |
| El alcalde Silva, vista la información y deducidas las partidas ya pagadas, el 1° de agosto, fijó la cuenta en 43 pesos y 7 tomines de oro común, mandó al tutor Contreras pagar "al dicho Juan Muñoz los dichos cuarenta y tres pesos y siete tomines de oro común", y también que "se le dé y vuelva al dicho Juan Muñoz, el libro de la Doctrina Cristiana". Asimismo el alcalde dispuso que Muñoz "dé una fianza que se obligue a pagar los pesos de oro [por] si se mandaren tornar por juez competente".                                                                                                                                                                                                                                                                                                                                                                                                                                                                                                                                                                                                                                                                                                                                                |                                           |
|                                                                                                                                                                                                                                                                                                                                                                                                                                                                                                                                                                                                                                                                                                                                                                                                                                                                                                                                                                                                                                                                                                                                                                                                                                                               |                                           |
| Juan Muñoz, entonces, señaló por su fiador a Juan Ramírez Alarcón, vecino de Colima, quien se obligó por tal, siendo testigos de ello, el alcalde ordinario Cristóbal de Silva y los vecinos Agustín de la Puerta y Pero Vázquez.                                                                                                                                                                                                                                                                                                                                                                                                                                                                                                                                                                                                                                                                                                                                                                                                                                                                                                                                                                                                                             |                                           |
|                                                                                                                                                                                                                                                                                                                                                                                                                                                                                                                                                                                                                                                                                                                                                                                                                                                                                                                                                                                                                                                                                                                                                                                                                                                               |                                           |
| Caja A–10, exp. 17, 7 ff.                                                                                                                                                                                                                                                                                                                                                                                                                                                                                                                                                                                                                                                                                                                                                                                                                                                                                                                                                                                                                                                                                                                                                                                                                                     |                                           |
|                                                                                                                                                                                                                                                                                                                                                                                                                                                                                                                                                                                                                                                                                                                                                                                                                                                                                                                                                                                                                                                                                                                                                                                                                                                               |                                           |
|                                                                                                                                                                                                                                                                                                                                                                                                                                                                                                                                                                                                                                                                                                                                                                                                                                                                                                                                                                                                                                                                                                                                                                                                                                                               |                                           |
|                                                                                                                                                                                                                                                                                                                                                                                                                                                                                                                                                                                                                                                                                                                                                                                                                                                                                                                                                                                                                                                                                                                                                                                                                                                               |                                           |
| ---------------                                                                                                                                                                                                                                                                                                                                                                                                                                                                                                                                                                                                                                                                                                                                                                                                                                                                                                                                                                                                                                                                                                                                                                                                                                               |                                           |
|                                                                                                                                                                                                                                                                                                                                                                                                                                                                                                                                                                                                                                                                                                                                                                                                                                                                                                                                                                                                                                                                                                                                                                                                                                                               |                                           |
| (1) Un escribano, cuya letra parece ser de Francisco López de Avecilla, registra el expediente como "Demanda de Juan Muñoz contra los bienes de Pero Ruiz de Vilches"; así lo escribe en un pedazo de foja a cuyo reverso, con otra caligrafía, se lee: "[...] que a mi parte toca, aunque de solas oídas, Julián de Frías dirá quién yo soy y mis padres; de presente estoy ahora en esta ciudad con mi padre, que venimos a ella a un pleito de muncha importancia cual tenemos muncha esperanza habrá buen suceso, porque era sobre un negocio de más de cinco mil pesos de interés. Mi padre me ha persuadido que me vaya con mi mujer a Guaxaca, donde es nuestra patria. Yo, a petición y a ruego de María de Vargas y de mi hermano Juan López Avecilla...". Pareciera que el que esto escribe, fuera Francisco López de Avecilla El Mozo, de quien tenemos muy escasas noticias: Romero de Solís, Andariegos… (2001), 257.                                                                                                                                                                                                                                                                                                                            |                                           |
|                                                                                                                                                                                                                                                                                                                                                                                                                                                                                                                                                                                                                                                                                                                                                                                                                                                                                                                                                                                                                                                                                                                                                                                                                                                               |                                           |
| (2) Falleció en 1578: supra, regº 308.                                                                                                                                                                                                                                                                                                                                                                                                                                                                                                                                                                                                                                                                                                                                                                                                                                                                                                                                                                                                                                                                                                                                                                                                                        |                                           |
|                                                                                                                                                                                                                                                                                                                                                                                                                                                                                                                                                                                                                                                                                                                                                                                                                                                                                                                                                                                                                                                                                                                                                                                                                                                               |                                           |
| (3) Alcorque: calzado con suela de corcho o alpargata (Casares). La palabra no la registra Boyd–Bowman (1971).                                                                                                                                                                                                                                                                                                                                                                                                                                                                                                                                                                                                                                                                                                                                                                                                                                                                                                                                                                                                                                                                                                                                                |                                           |
|                                                                                                                                                                                                                                                                                                                                                                                                                                                                                                                                                                                                                                                                                                                                                                                                                                                                                                                                                                                                                                                                                                                                                                                                                                                               |                                           |
| (4) Aumentativo de albarda (Casares). Boyd–Bowman (1971) no registra "albardón" pero sí "albarda", palabra también documentada en el Archivo de la Villa de Colima: por ejemplo, supra, regº 307: "caballo de albarda"; regº 375: "bestias de albarda"; infra, regº 401: "aparejo con albarda".                                                                                                                                                                                                                                                                                                                                                                                                                                                                                                                                                                                                                                                                                                                                                                                                                                                                                                                                                               |                                           |
|                                                                                                                                                                                                                                                                                                                                                                                                                                                                                                                                                                                                                                                                                                                                                                                                                                                                                                                                                                                                                                                                                                                                                                                                                                                               |                                           |
| (5) Luego se explicita: "libro de la Doctrina Cristiana".                                                                                                                                                                                                                                                                                                                                                                                                                                                                                                                                                                                                                                                                                                                                                                                                                                                                                                                                                                                                                                                                                                                                                                                                     |                                           |
|                                                                                                                                                                                                                                                                                                                                                                                                                                                                                                                                                                                                                                                                                                                                                                                                                                                                                                                                                                                                                                                                                                                                                                                                                                                               |                                           |
| (6) Por lo que se dice, "naual" es un tipo de tela. Boyd–Bowman (1971), 618 documenta "naval" con un texto fechado en Puebla en 1562: "Yten por otra colcha de naval, haz y envés...".                                                                                                                                                                                                                                                                                                                                                                                                                                                                                                                                                                                                                                                                                                                                                                                                                                                                                                                                                                                                                                                                        |                                           |
|                                                                                                                                                                                                                                                                                                                                                                                                                                                                                                                                                                                                                                                                                                                                                                                                                                                                                                                                                                                                                                                                                                                                                                                                                                                               |                                           |
| (7) Boyd–Bowman (1971), 371 documenta la palabra con un texto poblano de 1556.                                                                                                                                                                                                                                                                                                                                                                                                                                                                                                                                                                                                                                                                                                                                                                                                                                                                                                                                                                                                                                                                                                                                                                                |                                           |
|                                                                                                                                                                                                                                                                                                                                                                                                                                                                                                                                                                                                                                                                                                                                                                                                                                                                                                                                                                                                                                                                                                                                                                                                                                                               |                                           |
| (8) Diego de Contreras fue tutor de Francisca Ruiz y Pero Ruiz de Vilches El Mozo, habidos con María de Monjaraz, y Frías de los que tuvo con Catalina Jiménez: supra, regº 308 y 309.                                                                                                                                                                                                                                                                                                                                                                                                                                                                                                                                                                                                                                                                                                                                                                                                                                                                                                                                                                                                                                                                        |                                           |
|                                                                                                                                                                                                                                                                                                                                                                                                                                                                                                                                                                                                                                                                                                                                                                                                                                                                                                                                                                                                                                                                                                                                                                                                                                                               |                                           |
| (9) Posiblemente se trate de la hija menor –también nombrada Elvira– del difunto escribano Diego Veedor e Isabel Jiménez, hermana de Catalina, viuda de Ruiz de Vilches.                                                                                                                                                                                                                                                                                                                                                                                                                                                                                                                                                                                                                                                                                                                                                                                                                                                                                                                                                                                                                                                                                      |                                           |
|                                                                                                                                                                                                                                                                                                                                                                                                                                                                                                                                                                                                                                                                                                                                                                                                                                                                                                                                                                                                                                                                                                                                                                                                                                                               |                                           |
| (10) Antes se dijo "yerbas secas".                                                                                                                                                                                                                                                                                                                                                                                                                                                                                                                                                                                                                                                                                                                                                                                                                                                                                                                                                                                                                                                                                                                                                                                                                            |                                           |
+---------------------------------------------------------------------------------------------------------------------------------------------------------------------------------------------------------------------------------------------------------------------------------------------------------------------------------------------------------------------------------------------------------------------------------------------------------------------------------------------------------------------------------------------------------------------------------------------------------------------------------------------------------------------------------------------------------------------------------------------------------------------------------------------------------------------------------------------------------------------------------------------------------------------------------------------------------------------------------------------------------------------------------------------------------------------------------------------------------------------------------------------------------------------------------------------------------------------------------------------------------------+-------------------------------------------+

Documento(s) original(es)

Archivo no encontrado (CAJAS/CAJA10/EXP17/002V.jpg)

[]
1F

[]
1V

[]
2F

[]
3F

[]
3V

[]
4F

[]
4V

[]
5F

[]
5V

[]
6F

[]
6V

[]
7F

[]
7V

Proyecto interinstitucional del Archivo Histórico del Municipio de Colima y la Universidad de Colima,
realizado bajo los auspicios del fondo Ramón Álvarez-Buylla de Aldana.

------------------------------------------------------------------------

ISBN 978-968-7412-85-6
® Derechos Reservados 2008. Archivo Histórico del Municipio de Colima.

1,078 visitas
