+---------------------------------------------------------------------------------------------------------------------------------------------------------------------------------------------------------------------------------------------------------------------------------------------------------------------------------------------------+-----------------------+-----------------------+
| []                                                                                                                                                                                                                                                                                                                                                |                       |                       |
|                                                                                                                                                                                                                                                                                                                                                   |                       |                       |
| +-----------------------------------+:-------------------------------------:+                                                                                                                                                                                                                                                                     |                       |                       |
| | []                                | LA VILLA DE COLIMA DE LA NUEVA ESPAÑA |                                                                                                                                                                                                                                                                     |                       |                       |
| |                                   | SIGLO XVI                             |                                                                                                                                                                                                                                                                     |                       |                       |
| |                                   |                                       |                                                                                                                                                                                                                                                                     |                       |                       |
| |                                   | VOLUMEN II      (CAJAS 12-20)         |                                                                                                                                                                                                                                                                     |                       |                       |
| +-----------------------------------+---------------------------------------+                                                                                                                                                                                                                                                                     |                       |                       |
+---------------------------------------------------------------------------------------------------------------------------------------------------------------------------------------------------------------------------------------------------------------------------------------------------------------------------------------------------+-----------------------+-----------------------+
| +------------------------------------------------------------------------+-------------------------------+-----------------------+                                                                                                                                                                                                                |                       |                       |
| | Inicio | Búsqueda | Siglas y bibliografía | Créditos | Más información | Vol. I (1-11) Vol. II (12-20) |    [ES]               |                                                                                                                                                                                                                |                       |                       |
| +------------------------------------------------------------------------+-------------------------------+-----------------------+                                                                                                                                                                                                                |                       |                       |
+---------------------------------------------------------------------------------------------------------------------------------------------------------------------------------------------------------------------------------------------------------------------------------------------------------------------------------------------------+-----------------------+-----------------------+
| Búsqueda rápida                                                                                                                                                                                                                                                                                                                                   |                       |                       |
|                                                                                                                                                                                                                                                                                                                                                   |                       |                       |
| +:-------------------:+-----------------+:----------------------------------------:+----------------:+                                                                                                                                                                                                                                            |                       |                       |
| | Documento de fecha: |                 | Ubicación física del documento original: | [] [] []        |                                                                                                                                                                                                                                            |                       |                       |
| |                     |                 |                                          |                 |                                                                                                                                                                                                                                            |                       |                       |
| | 1592. Enero, 2      |                 | Caja 24, exp. 9, 3 ff.                   |                 |                                                                                                                                                                                                                                            |                       |                       |
| +---------------------+-----------------+------------------------------------------+-----------------+                                                                                                                                                                                                                                            |                       |                       |
|                                                                                                                                                                                                                                                                                                                                                   |                       |                       |
|   ------------- --------------------------------------------------------------------                                                                                                                                                                                                                                                              |                       |                       |
|   Resumen:      Juan Cornejo reclama una mula de su recua que se le había perdido.                                                                                                                                                                                                                                                                |                       |                       |
|   ------------- --------------------------------------------------------------------                                                                                                                                                                                                                                                              |                       |                       |
|                                                                                                                                                                                                                                                                                                                                                   |                       |                       |
|   ----------------------------------- ----------------------------------------------------------------------------------------------------------------------------------------------------------------------------------------------------------------------------------------------------------------------------------------------------------- |                       |                       |
|   Contenido:                          Ante Álvaro de Herrera, alcalde ordinario, el vecino Juan Cornejo dijo que hacía cuarenta días había perdido una mula de su recua, castaña oscura, del hierro de Juan Fernández de Ocampo y del dicho Juan Cornejo en el pescuezo, y que la tiene un indio de Tuspa que, al presente, está en esta Villa.   |                       |                       |
|                                       Pide le sea devuelta.                                                                                                                                                                                                                                                                                       |                       |                       |
|                                       Para la información, Juan Cornejo presentó por testigos a Gonzalo de Herrera, vecino de Colima, y a Sebastián de Alvarado, indio ladino en castilla y residente en Colima.                                                                                                                                  |                       |                       |
|                                       Diego Lorenzo, indio de Tuspa, dijo mediante el intérprete Pedro Ruiz de Vilches, que la mula es de Francisco Lorenzo, indio de Tuspa, su pariente, que se la dio junto con otras “que trajo a esta Provincia para llevarlas cargadas de sal”.                                                              |                       |                       |
|                                       El alcalde se la mandó entregar a Juan Cornejo.                                                                                                                                                                                                                                                             |                       |                       |
|                                       La mula tenía en el anca izquierda un hierro de Juan Fernández de Ocampo y en la espalda izquierda el propio hierro de venta.^([1])                                                                                                                                                                         |                       |                       |
|                                       Diego Lorenzo pidió, entonces, testimonio en forma y autorizado para en guarda de su derecho, lo cual así lo proveyó el alcalde al escribano Toribio de Casso.                                                                                                                                              |                       |                       |
|                                                                                                                                                                                                                                                                                                                                                   |                       |                       |
|   ----------------------------------- ----------------------------------------------------------------------------------------------------------------------------------------------------------------------------------------------------------------------------------------------------------------------------------------------------------- |                       |                       |
|                                                                                                                                                                                                                                                                                                                                                   |                       |                       |
| (1) Aparece un dibujo del fierro al margen.                                                                                                                                                                                                                                                                                                       |                       |                       |
|                                                                                                                                                                                                                                                                                                                                                   |                       |                       |
|   ---------------------------------------------------------------------------------------------------                                                                                                                                                                                                                                             |                       |                       |
|    Documento(s) original(es)                                                                                                                                                                                                                                                                                                                      |                       |                       |
|   --------------------------- ------- ------- ------- ------- ------- ------- ------- ------- -------                                                                                                                                                                                                                                             |                       |                       |
|               []                []      []      []      []                                                                                                                                                                                                                                                                                        |                       |                       |
|               1f                1v      2f      2v      3f                                                                                                                                                                                                                                                                                        |                       |                       |
|                                                                                                                                                                                                                                                                                                                                                   |                       |                       |
|   ---------------------------------------------------------------------------------------------------                                                                                                                                                                                                                                             |                       |                       |
+---------------------------------------------------------------------------------------------------------------------------------------------------------------------------------------------------------------------------------------------------------------------------------------------------------------------------------------------------+-----------------------+-----------------------+
| +----------------------------------------------------------------------------+-----------------------------------------------:+                                                                                                                                                                                                                   |                       |                       |
| | ISBN 978-607-701-024-1                                                     |   ---- ---- ---- ---- ---- ---- ---- ---- ---- |                                                                                                                                                                                                                   |                       |                       |
| | © Derechos Reservados 2013. Archivo Histórico del Municipio de Colima. [*] |   []        []        []        []        []   |                                                                                                                                                                                                                   |                       |                       |
| |                                                                            |   ---- ---- ---- ---- ---- ---- ---- ---- ---- |                                                                                                                                                                                                                   |                       |                       |
| +----------------------------------------------------------------------------+------------------------------------------------+                                                                                                                                                                                                                   |                       |                       |
| |                                                                            |                                                |                                                                                                                                                                                                                   |                       |                       |
| +----------------------------------------------------------------------------+------------------------------------------------+                                                                                                                                                                                                                   |                       |                       |
+---------------------------------------------------------------------------------------------------------------------------------------------------------------------------------------------------------------------------------------------------------------------------------------------------------------------------------------------------+-----------------------+-----------------------+

636 visitas
