[]

LA VILLA DE COLIMA DE LA NUEVA ESPAÑA
SIGLO XVI

VOLUMEN I      (CAJAS 1-11)

[]

Inicio | Búsquedas | Siglas y bibliografía | Cartografía | Créditos | Más información

[]

Búsqueda rápida

+:-------------------------------------------------------------------------------------------------------------------------------------------------------------------------------------------------------------------------------------------------------------------------------------------------------------------------------------------------------------------------------------------------------------------------------------------------------------------------------------------------------------------------------------------------------------------------------------------------------------------------------------------------------------------------------------------------------------------------------------------------------------------------------------------------------------------------------------------------------------------------------------------------------------------------------------------------------------------------------------------------------------------------------------------------------------------------------------------------------------------------------------------------------------------------------------------------------------------------------------------------------------------------------------------------------------------------------------------------------------------------------------------------------------------------------------------------------------:+------------------------------------------:+
| Fecha:                                                                                                                                                                                                                                                                                                                                                                                                                                                                                                                                                                                                                                                                                                                                                                                                                                                                                                                                                                                                                                                                                                                                                                                                                                                                                                                                                                                                                                                        | Ubicación física del documento original:  |
| 1563 Octubre, 7                                                                                                                                                                                                                                                                                                                                                                                                                                                                                                                                                                                                                                                                                                                                                                                                                                                                                                                                                                                                                                                                                                                                                                                                                                                                                                                                                                                                                                               | CAJA A-3, EXP. 16, FF. 1-6.               |
|                                                                                                                                                                                                                                                                                                                                                                                                                                                                                                                                                                                                                                                                                                                                                                                                                                                                                                                                                                                                                                                                                                                                                                                                                                                                                                                                                                                                                                                               | Archivo Histórico del Municipio de Colima |
+---------------------------------------------------------------------------------------------------------------------------------------------------------------------------------------------------------------------------------------------------------------------------------------------------------------------------------------------------------------------------------------------------------------------------------------------------------------------------------------------------------------------------------------------------------------------------------------------------------------------------------------------------------------------------------------------------------------------------------------------------------------------------------------------------------------------------------------------------------------------------------------------------------------------------------------------------------------------------------------------------------------------------------------------------------------------------------------------------------------------------------------------------------------------------------------------------------------------------------------------------------------------------------------------------------------------------------------------------------------------------------------------------------------------------------------------------------------+-------------------------------------------+
| 81. 1563. Octubre, 7.                                                                                                                                                                                                                                                                                                                                                                                                                                                                                                                                                                                                                                                                                                                                                                                                                                                                                                                                                                                                                                                                                                                                                                                                                                                                                                                                                                                                                                         |                                           |
|                                                                                                                                                                                                                                                                                                                                                                                                                                                                                                                                                                                                                                                                                                                                                                                                                                                                                                                                                                                                                                                                                                                                                                                                                                                                                                                                                                                                                                                               |                                           |
| Andrés de Segura da cuentas de la tutela de los bienes del menor Gonzalo de Cáceres.                                                                                                                                                                                                                                                                                                                                                                                                                                                                                                                                                                                                                                                                                                                                                                                                                                                                                                                                                                                                                                                                                                                                                                                                                                                                                                                                                                          |                                           |
|                                                                                                                                                                                                                                                                                                                                                                                                                                                                                                                                                                                                                                                                                                                                                                                                                                                                                                                                                                                                                                                                                                                                                                                                                                                                                                                                                                                                                                                               |                                           |
| El alcalde ordinario Juan de la Torre manda a Andrés de Segura como tutor y curador de la persona y bienes de Gonzalo de Cáceres, hijo de Manuel de Cáceres, difunto, le dé cuenta. El escribano Diego Veedor así se lo notificó, siendo testigos de ambos autos, Juan de Aztiguieta y Diego Morán, vecinos de Colima.                                                                                                                                                                                                                                                                                                                                                                                                                                                                                                                                                                                                                                                                                                                                                                                                                                                                                                                                                                                                                                                                                                                                        |                                           |
|                                                                                                                                                                                                                                                                                                                                                                                                                                                                                                                                                                                                                                                                                                                                                                                                                                                                                                                                                                                                                                                                                                                                                                                                                                                                                                                                                                                                                                                               |                                           |
| "Parece que en veinte e dos días del mes de diciembre del año pasado de mil e quinientos e sesenta y un años" [1561], el alcalde Diego de Velasco le tomó cuentas de la dicha tutela. Ahora, y en presencia del escribano Diego Veedor, se le hacen los siguientes                                                                                                                                                                                                                                                                                                                                                                                                                                                                                                                                                                                                                                                                                                                                                                                                                                                                                                                                                                                                                                                                                                                                                                                            |                                           |
|                                                                                                                                                                                                                                                                                                                                                                                                                                                                                                                                                                                                                                                                                                                                                                                                                                                                                                                                                                                                                                                                                                                                                                                                                                                                                                                                                                                                                                                               |                                           |
| Cargos                                                                                                                                                                                                                                                                                                                                                                                                                                                                                                                                                                                                                                                                                                                                                                                                                                                                                                                                                                                                                                                                                                                                                                                                                                                                                                                                                                                                                                                        |                                           |
|                                                                                                                                                                                                                                                                                                                                                                                                                                                                                                                                                                                                                                                                                                                                                                                                                                                                                                                                                                                                                                                                                                                                                                                                                                                                                                                                                                                                                                                               |                                           |
| Primeramente: una obligación de Juan de Segovia, escribano, de 77 pesos de oro común; un conocimiento reconocido de Diego de Angulo por 210 pesos de oro común que debía éste a Gonzalo de Cáceres de tributos de indios; una carta de censo del mismo Diego de Angulo por 200 pesos de oro que están a censo que corre desde el 8 de junio de 1559; otra carta de censo contra Juan de Arana de 1,601 pesos de principal; un negro que se llamó Alonso^([1]) y todas las yeguas y vacas que el menor tiene en su estancia; una carta de censo de Luis de Monjaraz^([2]) por 700 pesos de oro común que gana cada año setenta pesos, hecha el 27 de septiembre de 1561; 100 pesos de oro común de 20 potros vendidos en pública almoneda a Tomás Herades El Mozo, a 5 pesos cada uno; 5 pesos de la venta de un potro a Pero Ruiz; 2 pesos de una vaca vendida a Juan de Arévalo; otros 2 pesos de otra vaca vendida a Luis de Grijalba; 1,502 pesos de oro común de la venta de una estancia de ganado vacuno del dicho menor, los cuales echó a censo; 320 pesos, un tomín y 8 granos de oro común de un censo por cobrar a Juan de Arana, de dos años corridos, echado el 2 de enero de 1561; 83 pesos de oro común que son por razón de 4 años de censos corridos; 89 pesos, 6 tomines y un grano de oro común de un censo de Martín de Monjaraz; 150 pesos de oro común de una carta de censo contra Diego de Mendoza, Pedro de Arévalo y Gonzalo López. |                                           |
|                                                                                                                                                                                                                                                                                                                                                                                                                                                                                                                                                                                                                                                                                                                                                                                                                                                                                                                                                                                                                                                                                                                                                                                                                                                                                                                                                                                                                                                               |                                           |
| Todo lo cual suma 4,952 pesos de oro común.                                                                                                                                                                                                                                                                                                                                                                                                                                                                                                                                                                                                                                                                                                                                                                                                                                                                                                                                                                                                                                                                                                                                                                                                                                                                                                                                                                                                                   |                                           |
|                                                                                                                                                                                                                                                                                                                                                                                                                                                                                                                                                                                                                                                                                                                                                                                                                                                                                                                                                                                                                                                                                                                                                                                                                                                                                                                                                                                                                                                               |                                           |
| Descargos                                                                                                                                                                                                                                                                                                                                                                                                                                                                                                                                                                                                                                                                                                                                                                                                                                                                                                                                                                                                                                                                                                                                                                                                                                                                                                                                                                                                                                                     |                                           |
|                                                                                                                                                                                                                                                                                                                                                                                                                                                                                                                                                                                                                                                                                                                                                                                                                                                                                                                                                                                                                                                                                                                                                                                                                                                                                                                                                                                                                                                               |                                           |
| Entre los descargos, diversos gastos hechos por razón de compras varias en las tiendas de la Villa de Colima y a particulares: al sastre Diego López,^([3]) por la hechura de unas calzas, 7 pesos; al cirujano se le dieron 30 pesos de oro por curarle a Gonzalo de Cáceres una herida que tenía en la cabeza; al sastre Diego Pinzón se le pagaron 4 pesos por la hechura de unos jubones; 40 pesos fueron por razón de unas calzas de tafetán negro; 15 pesos y 4 tomines se dieron al escribano Diego Veedor "de los negocios que hizo para el dicho menor"; un colchón que compró a Juan Ramírez de Alarcón, costó 7 pesos; al sastre Luis Martínez,^([4]) por la hechura de un capote, se le pagaron 6 pesos y medio; etcétera.                                                                                                                                                                                                                                                                                                                                                                                                                                                                                                                                                                                                                                                                                                                        |                                           |
|                                                                                                                                                                                                                                                                                                                                                                                                                                                                                                                                                                                                                                                                                                                                                                                                                                                                                                                                                                                                                                                                                                                                                                                                                                                                                                                                                                                                                                                               |                                           |
| Los descargos presentados por Andrés de Segura suman 4,555 pesos de oro común.                                                                                                                                                                                                                                                                                                                                                                                                                                                                                                                                                                                                                                                                                                                                                                                                                                                                                                                                                                                                                                                                                                                                                                                                                                                                                                                                                                                |                                           |
|                                                                                                                                                                                                                                                                                                                                                                                                                                                                                                                                                                                                                                                                                                                                                                                                                                                                                                                                                                                                                                                                                                                                                                                                                                                                                                                                                                                                                                                               |                                           |
| Queda debiendo, por consiguiente, 397 pesos. Juan de la Torre mandó que "dentro de treinta días siguientes exhiba ante el dicho señor alcalde los dichos trescientos noventa y siete pesos".                                                                                                                                                                                                                                                                                                                                                                                                                                                                                                                                                                                                                                                                                                                                                                                                                                                                                                                                                                                                                                                                                                                                                                                                                                                                  |                                           |
|                                                                                                                                                                                                                                                                                                                                                                                                                                                                                                                                                                                                                                                                                                                                                                                                                                                                                                                                                                                                                                                                                                                                                                                                                                                                                                                                                                                                                                                               |                                           |
| Caja A–3, exp. 16, ff. 1-6.                                                                                                                                                                                                                                                                                                                                                                                                                                                                                                                                                                                                                                                                                                                                                                                                                                                                                                                                                                                                                                                                                                                                                                                                                                                                                                                                                                                                                                   |                                           |
|                                                                                                                                                                                                                                                                                                                                                                                                                                                                                                                                                                                                                                                                                                                                                                                                                                                                                                                                                                                                                                                                                                                                                                                                                                                                                                                                                                                                                                                               |                                           |
|                                                                                                                                                                                                                                                                                                                                                                                                                                                                                                                                                                                                                                                                                                                                                                                                                                                                                                                                                                                                                                                                                                                                                                                                                                                                                                                                                                                                                                                               |                                           |
|                                                                                                                                                                                                                                                                                                                                                                                                                                                                                                                                                                                                                                                                                                                                                                                                                                                                                                                                                                                                                                                                                                                                                                                                                                                                                                                                                                                                                                                               |                                           |
| ---------------                                                                                                                                                                                                                                                                                                                                                                                                                                                                                                                                                                                                                                                                                                                                                                                                                                                                                                                                                                                                                                                                                                                                                                                                                                                                                                                                                                                                                                               |                                           |
|                                                                                                                                                                                                                                                                                                                                                                                                                                                                                                                                                                                                                                                                                                                                                                                                                                                                                                                                                                                                                                                                                                                                                                                                                                                                                                                                                                                                                                                               |                                           |
| (1) Al margen está escrito: "No se le tomó cuenta del negro: dijo haber dado cuenta de él ante Hernando de Gamboa, alcalde".                                                                                                                                                                                                                                                                                                                                                                                                                                                                                                                                                                                                                                                                                                                                                                                                                                                                                                                                                                                                                                                                                                                                                                                                                                                                                                                                  |                                           |
|                                                                                                                                                                                                                                                                                                                                                                                                                                                                                                                                                                                                                                                                                                                                                                                                                                                                                                                                                                                                                                                                                                                                                                                                                                                                                                                                                                                                                                                               |                                           |
| (2) No tenemos ientificado a Luis de Monjaraz.                                                                                                                                                                                                                                                                                                                                                                                                                                                                                                                                                                                                                                                                                                                                                                                                                                                                                                                                                                                                                                                                                                                                                                                                                                                                                                                                                                                                                |                                           |
|                                                                                                                                                                                                                                                                                                                                                                                                                                                                                                                                                                                                                                                                                                                                                                                                                                                                                                                                                                                                                                                                                                                                                                                                                                                                                                                                                                                                                                                               |                                           |
| (3) Ya presentamo antes la hipótesis que fuera la misma persona que en 1560 ocupaba el oficio de alguacil mayor en la Villa de Colima: supra, regº 69.                                                                                                                                                                                                                                                                                                                                                                                                                                                                                                                                                                                                                                                                                                                                                                                                                                                                                                                                                                                                                                                                                                                                                                                                                                                                                                        |                                           |
|                                                                                                                                                                                                                                                                                                                                                                                                                                                                                                                                                                                                                                                                                                                                                                                                                                                                                                                                                                                                                                                                                                                                                                                                                                                                                                                                                                                                                                                               |                                           |
| (4) Es posible que este Luis Martínez sea el que también es nombrado Andrés Martínez y que fue asesinado: infra, regº 124, expediente en que en repetidas ocasiones se le nombra Luis.                                                                                                                                                                                                                                                                                                                                                                                                                                                                                                                                                                                                                                                                                                                                                                                                                                                                                                                                                                                                                                                                                                                                                                                                                                                                        |                                           |
+---------------------------------------------------------------------------------------------------------------------------------------------------------------------------------------------------------------------------------------------------------------------------------------------------------------------------------------------------------------------------------------------------------------------------------------------------------------------------------------------------------------------------------------------------------------------------------------------------------------------------------------------------------------------------------------------------------------------------------------------------------------------------------------------------------------------------------------------------------------------------------------------------------------------------------------------------------------------------------------------------------------------------------------------------------------------------------------------------------------------------------------------------------------------------------------------------------------------------------------------------------------------------------------------------------------------------------------------------------------------------------------------------------------------------------------------------------------+-------------------------------------------+

Documento(s) original(es)

Archivo no encontrado (CAJAS/CAJA3/EXP16/001F.jpg)

Archivo no encontrado (CAJAS/CAJA3/EXP16/001V.jpg)

Archivo no encontrado (CAJAS/CAJA3/EXP16/002F.jpg)

Archivo no encontrado (CAJAS/CAJA3/EXP16/002V.jpg)

Archivo no encontrado (CAJAS/CAJA3/EXP16/003F.jpg)

Archivo no encontrado (CAJAS/CAJA3/EXP16/003V.jpg)

Archivo no encontrado (CAJAS/CAJA3/EXP16/004F.jpg)

Archivo no encontrado (CAJAS/CAJA3/EXP16/004V.jpg)

Archivo no encontrado (CAJAS/CAJA3/EXP16/005F.jpg)

Archivo no encontrado (CAJAS/CAJA3/EXP16/005V.jpg)

Archivo no encontrado (CAJAS/CAJA3/EXP16/006F.jpg)

Archivo no encontrado (CAJAS/CAJA3/EXP16/006V.jpg)

Proyecto interinstitucional del Archivo Histórico del Municipio de Colima y la Universidad de Colima,
realizado bajo los auspicios del fondo Ramón Álvarez-Buylla de Aldana.

------------------------------------------------------------------------

ISBN 978-968-7412-85-6
® Derechos Reservados 2008. Archivo Histórico del Municipio de Colima.

1,078 visitas
