+--------------------------------------------------------------------------------------------------------------------------------------------------------------------------------------------------------------------------------------------------------------------------------------+-----------------------+-----------------------+
| []                                                                                                                                                                                                                                                                                   |                       |                       |
|                                                                                                                                                                                                                                                                                      |                       |                       |
| +-----------------------------------+:-------------------------------------:+                                                                                                                                                                                                        |                       |                       |
| | []                                | LA VILLA DE COLIMA DE LA NUEVA ESPAÑA |                                                                                                                                                                                                        |                       |                       |
| |                                   | SIGLO XVI                             |                                                                                                                                                                                                        |                       |                       |
| |                                   |                                       |                                                                                                                                                                                                        |                       |                       |
| |                                   | VOLUMEN II      (CAJAS 12-20)         |                                                                                                                                                                                                        |                       |                       |
| +-----------------------------------+---------------------------------------+                                                                                                                                                                                                        |                       |                       |
+--------------------------------------------------------------------------------------------------------------------------------------------------------------------------------------------------------------------------------------------------------------------------------------+-----------------------+-----------------------+
| +------------------------------------------------------------------------+---------------------------+-----------------------+                                                                                                                                                       |                       |                       |
| | Inicio | Búsqueda | Siglas y bibliografía | Créditos | Más información | (consulta las cajas 1-11) |    [ES]               |                                                                                                                                                       |                       |                       |
| +------------------------------------------------------------------------+---------------------------+-----------------------+                                                                                                                                                       |                       |                       |
+--------------------------------------------------------------------------------------------------------------------------------------------------------------------------------------------------------------------------------------------------------------------------------------+-----------------------+-----------------------+
| Búsqueda rápida                                                                                                                                                                                                                                                                      |                       |                       |
|                                                                                                                                                                                                                                                                                      |                       |                       |
| +:-------------------:+-----------------+:----------------------------------------:+----------------:+                                                                                                                                                                               |                       |                       |
| | Documento de fecha: |                 | Ubicación física del documento original: | [] [] []        |                                                                                                                                                                               |                       |                       |
| |                     |                 |                                          |                 |                                                                                                                                                                               |                       |                       |
| | 1582. Enero, 18     |                 | Caja 17, exp. 11, 1 f.                   |                 |                                                                                                                                                                               |                       |                       |
| +---------------------+-----------------+------------------------------------------+-----------------+                                                                                                                                                                               |                       |                       |
|                                                                                                                                                                                                                                                                                      |                       |                       |
|   ------------- ----------------------------------------------------------------------------------------------                                                                                                                                                                       |                       |                       |
|   Resumen:      Diego Hernández Rubio da información de ser soltero a fin de poder casarse con Luisa de León                                                                                                                                                                         |                       |                       |
|   ------------- ----------------------------------------------------------------------------------------------                                                                                                                                                                       |                       |                       |
|                                                                                                                                                                                                                                                                                      |                       |                       |
|   ----------------------------------- ---------------------------------------------------------------------------------------------------------------------------------------------------------------------------------------------------------------------------------------------- |                       |                       |
|   Contenido:                          Ante el cura y vicario de la Villa de Colima bachiller Álvaro de Grijalba, Diego Hernández Rubio dijo que quería dar información de cómo es soltero, porque quiere casarse con Luisa León, viuda.                                              |                       |                       |
|                                       De la información presentada por Diego Hernández Rubio, se conserva únicamente la declaración del vecino Diego Mexía, quien dijo conocer a Diego Hernández desde que éste llegó a la Villa de Colima, en donde era tenido por soltero.         |                       |                       |
|                                       Vista la información, el vicario “dio licencia e facultad a los señores Curas desta dicha Villa, para que puedan casar e casen al dicho Diego Hernández con la dicha Luisa de León, viuda, previniendo ante todas cosas las amonestaciones”.   |                       |                       |
|                                       Lo cual fue notificado por el escribano Francisco López Avecilla al beneficiado Rodrigo de Vargas.                                                                                                                                             |                       |                       |
|                                                                                                                                                                                                                                                                                      |                       |                       |
|   ----------------------------------- ---------------------------------------------------------------------------------------------------------------------------------------------------------------------------------------------------------------------------------------------- |                       |                       |
|                                                                                                                                                                                                                                                                                      |                       |                       |
|   ---------------------------------------------------------------------------------------------------                                                                                                                                                                                |                       |                       |
|    Documento(s) original(es)                                                                                                                                                                                                                                                         |                       |                       |
|   --------------------------- ------- ------- ------- ------- ------- ------- ------- ------- -------                                                                                                                                                                                |                       |                       |
|               []                []                                                                                                                                                                                                                                                   |                       |                       |
|               1f                1v                                                                                                                                                                                                                                                   |                       |                       |
|                                                                                                                                                                                                                                                                                      |                       |                       |
|   ---------------------------------------------------------------------------------------------------                                                                                                                                                                                |                       |                       |
+--------------------------------------------------------------------------------------------------------------------------------------------------------------------------------------------------------------------------------------------------------------------------------------+-----------------------+-----------------------+
| +----------------------------------------------------------------------------+------------------------------------------------+                                                                                                                                                      |                       |                       |
| | ISBN 978-607-701-024-1                                                     |   ---- ---- ---- ---- ---- ---- ---- ---- ---- |                                                                                                                                                      |                       |                       |
| | © Derechos Reservados 2013. Archivo Histórico del Municipio de Colima. [*] |   []        []        []        []        []   |                                                                                                                                                      |                       |                       |
| |                                                                            |   ---- ---- ---- ---- ---- ---- ---- ---- ---- |                                                                                                                                                      |                       |                       |
| +----------------------------------------------------------------------------+------------------------------------------------+                                                                                                                                                      |                       |                       |
| |                                                                            |                                                |                                                                                                                                                      |                       |                       |
| +----------------------------------------------------------------------------+------------------------------------------------+                                                                                                                                                      |                       |                       |
+--------------------------------------------------------------------------------------------------------------------------------------------------------------------------------------------------------------------------------------------------------------------------------------+-----------------------+-----------------------+

615 visitas
