[]

LA VILLA DE COLIMA DE LA NUEVA ESPAÑA
SIGLO XVI

VOLUMEN I      (CAJAS 1-11)

[]

Inicio | Búsquedas | Siglas y bibliografía | Cartografía | Créditos | Más información

[]

Búsqueda rápida

+:---------------------------------------------------------------------------------------------------------------------------------------------------------------------------------------------------------------------------------------------------------------------------------------------------------------------------------------------------------------------------------------------------------------------------------------------------------------------------------------------------------------------------------------------------------:+------------------------------------------:+
| Fecha:                                                                                                                                                                                                                                                                                                                                                                                                                                                                                                                                                    | Ubicación física del documento original:  |
| 1573 Septiembre, 9                                                                                                                                                                                                                                                                                                                                                                                                                                                                                                                                        | CAJA A-6, EXP. 9, F. 49.                  |
|                                                                                                                                                                                                                                                                                                                                                                                                                                                                                                                                                           | Archivo Histórico del Municipio de Colima |
+-----------------------------------------------------------------------------------------------------------------------------------------------------------------------------------------------------------------------------------------------------------------------------------------------------------------------------------------------------------------------------------------------------------------------------------------------------------------------------------------------------------------------------------------------------------+-------------------------------------------+
| 215. 1573. Septiembre, 9.                                                                                                                                                                                                                                                                                                                                                                                                                                                                                                                                 |                                           |
|                                                                                                                                                                                                                                                                                                                                                                                                                                                                                                                                                           |                                           |
| Juan Preciado acusa a Pero López de Herrera, de haber abandonado la cárcel.                                                                                                                                                                                                                                                                                                                                                                                                                                                                               |                                           |
|                                                                                                                                                                                                                                                                                                                                                                                                                                                                                                                                                           |                                           |
| Juan Preciado, tutor y curador de sus hermanos, protesta ante el alcalde mayor Martín de Montúfar porque Pero López de Herrera, condenado a tener por prisión las casas de Hernando de Gamboa^([1]) ya que no ha querido hacer entrega de las escrituras y recaudos de los dichos menores que tiene en su poder, "está suelto y ha incurrido en pena y penas". Pide "sea condenado en ellas y mandándole de nuevo encarcelar en prisiones de en hora en hora acrecentándole pena y prisiones", hasta tanto dé y entregue las dichas escrituras y papeles. |                                           |
|                                                                                                                                                                                                                                                                                                                                                                                                                                                                                                                                                           |                                           |
| El alcalde mayor dio su mandamiento: "que luego dé y exhiba las escrituras e papeles" como se le ha ordenado "o se vuelve a la carcelería en que por mandado del dicho señor alcalde mayor le tenía puesta con la pena que le está puesta y que se traiga el proceso de la causa para ver la pena en que ha incurrido para proveer en ello justicia".                                                                                                                                                                                                     |                                           |
|                                                                                                                                                                                                                                                                                                                                                                                                                                                                                                                                                           |                                           |
| Respondió el alcalde ordinario López de Herrera que ya ha dio respuestas a estos mandamientos del alcalde mayor y los tiene apelados; que estaba por otra parte "presto de se volver a la carcelería que le está mandada tener e que hasta agora él ha tenido esta Villa por cárcel por avelle mandado tener por cárcel el dicho señor alcalde mayor, e que agora se volverá a la dicha carcelería".^([2])                                                                                                                                                |                                           |
|                                                                                                                                                                                                                                                                                                                                                                                                                                                                                                                                                           |                                           |
| Caja A–6, exp. 9, f. 49.                                                                                                                                                                                                                                                                                                                                                                                                                                                                                                                                  |                                           |
|                                                                                                                                                                                                                                                                                                                                                                                                                                                                                                                                                           |                                           |
|                                                                                                                                                                                                                                                                                                                                                                                                                                                                                                                                                           |                                           |
|                                                                                                                                                                                                                                                                                                                                                                                                                                                                                                                                                           |                                           |
| ---------------                                                                                                                                                                                                                                                                                                                                                                                                                                                                                                                                           |                                           |
|                                                                                                                                                                                                                                                                                                                                                                                                                                                                                                                                                           |                                           |
| (1) Véase supra regº 213.                                                                                                                                                                                                                                                                                                                                                                                                                                                                                                                                 |                                           |
|                                                                                                                                                                                                                                                                                                                                                                                                                                                                                                                                                           |                                           |
| (2) Según lo dispuesto por Montúfar, López de Herrera debía tener por cárcel la casa de Hernando de Gamboa, y no la Villa de Colima como aquí asegura.                                                                                                                                                                                                                                                                                                                                                                                                    |                                           |
+-----------------------------------------------------------------------------------------------------------------------------------------------------------------------------------------------------------------------------------------------------------------------------------------------------------------------------------------------------------------------------------------------------------------------------------------------------------------------------------------------------------------------------------------------------------+-------------------------------------------+

Documento(s) original(es)

Archivo no encontrado (CAJAS/CAJA6/EXP9/049F.jpg)

Archivo no encontrado (CAJAS/CAJA6/EXP9/049V.jpg)

Proyecto interinstitucional del Archivo Histórico del Municipio de Colima y la Universidad de Colima,
realizado bajo los auspicios del fondo Ramón Álvarez-Buylla de Aldana.

------------------------------------------------------------------------

ISBN 978-968-7412-85-6
® Derechos Reservados 2008. Archivo Histórico del Municipio de Colima.

1,078 visitas
