+--------------------------------------------------------------------------------------------------------------------------------------------------------------------------------------------------------------------------------------------------------------------------------------------------------------------------------------------------------------------------------------------------------------------------------------------------+-----------------------+-----------------------+
| []                                                                                                                                                                                                                                                                                                                                                                                                                                               |                       |                       |
|                                                                                                                                                                                                                                                                                                                                                                                                                                                  |                       |                       |
| +-----------------------------------+:-------------------------------------:+                                                                                                                                                                                                                                                                                                                                                                    |                       |                       |
| | []                                | LA VILLA DE COLIMA DE LA NUEVA ESPAÑA |                                                                                                                                                                                                                                                                                                                                                                    |                       |                       |
| |                                   | SIGLO XVI                             |                                                                                                                                                                                                                                                                                                                                                                    |                       |                       |
| |                                   |                                       |                                                                                                                                                                                                                                                                                                                                                                    |                       |                       |
| |                                   | VOLUMEN II      (CAJAS 12-20)         |                                                                                                                                                                                                                                                                                                                                                                    |                       |                       |
| +-----------------------------------+---------------------------------------+                                                                                                                                                                                                                                                                                                                                                                    |                       |                       |
+--------------------------------------------------------------------------------------------------------------------------------------------------------------------------------------------------------------------------------------------------------------------------------------------------------------------------------------------------------------------------------------------------------------------------------------------------+-----------------------+-----------------------+
| +------------------------------------------------------------------------+---------------------------+-----------------------+                                                                                                                                                                                                                                                                                                                   |                       |                       |
| | Inicio | Búsqueda | Siglas y bibliografía | Créditos | Más información | (consulta las cajas 1-11) |    [ES]               |                                                                                                                                                                                                                                                                                                                   |                       |                       |
| +------------------------------------------------------------------------+---------------------------+-----------------------+                                                                                                                                                                                                                                                                                                                   |                       |                       |
+--------------------------------------------------------------------------------------------------------------------------------------------------------------------------------------------------------------------------------------------------------------------------------------------------------------------------------------------------------------------------------------------------------------------------------------------------+-----------------------+-----------------------+
| Búsqueda rápida                                                                                                                                                                                                                                                                                                                                                                                                                                  |                       |                       |
|                                                                                                                                                                                                                                                                                                                                                                                                                                                  |                       |                       |
| +:-------------------:+-----------------+:----------------------------------------:+----------------:+                                                                                                                                                                                                                                                                                                                                           |                       |                       |
| | Documento de fecha: |                 | Ubicación física del documento original: | [] [] []        |                                                                                                                                                                                                                                                                                                                                           |                       |                       |
| |                     |                 |                                          |                 |                                                                                                                                                                                                                                                                                                                                           |                       |                       |
| | 1595. Agosto. 25    |                 | Caja 18, exp. 15, ff. 146-149.           |                 |                                                                                                                                                                                                                                                                                                                                           |                       |                       |
| +---------------------+-----------------+------------------------------------------+-----------------+                                                                                                                                                                                                                                                                                                                                           |                       |                       |
|                                                                                                                                                                                                                                                                                                                                                                                                                                                  |                       |                       |
|   ------------- ----------------------------------------------------------------------------------                                                                                                                                                                                                                                                                                                                                               |                       |                       |
|   Resumen:      De oficio, contra Francisco Núñez, por cuanto ha andado huyendo como delincuente                                                                                                                                                                                                                                                                                                                                                 |                       |                       |
|   ------------- ----------------------------------------------------------------------------------                                                                                                                                                                                                                                                                                                                                               |                       |                       |
|                                                                                                                                                                                                                                                                                                                                                                                                                                                  |                       |                       |
|   ----------------------------------- ---------------------------------------------------------------------------------------------------------------------------------------------------------------------------------------------------------------------------------------------------------------------------------------------------------------------------------------------------------------------------------------------------------- |                       |                       |
|   Contenido:                          El alcalde ordinario Diego Mejía de la Torre procede de oficio contra Francisco Núñez “por cuanto ha andado huyendo y andado como delincuente”, y por constar sus delitos, “le prendió anoche” poniéndole en la cárcel de la Villa.                                                                                                                                                                        |                       |                       |
|                                       Agrega el alcalde Mejía que, como ya está sentenciado por García Martinez,^([746]) alcalde ordinario que fue el año pasado de noventa y tres [1593], y habiendo visto la dicha sentencia, dio mandamiento para que fuera notificado el preso susodicho.                                                                                                                                                    |                       |                       |
|                                       El escribano real Cristóbal Hernández de Tene leyó y notificó la sentencia de García Martínez a Francisco Núñez, testificando de ello Juan Cuello, Álvaro Fernández y Pedro de Alcalá.                                                                                                                                                                                                                     |                       |                       |
|                                       El detenido, el mismo día, contestó por escrito alegando que había sido sentenciado “en rebeldía”, y que como “yo no he sido oído en esta causa y atento que soy menor de veinte y cinco años”, pedía que se le oyera.                                                                                                                                                                                     |                       |                       |
|                                       El alcalde contestó que, pagando la sentencia, se le oiría.                                                                                                                                                                                                                                                                                                                                                |                       |                       |
|                                       El 29 de agosto, el alcalde Mejía designó al bachiller Juan Rodríguez de Santiago para que hiciera la tasación de las costas de los procesos acumulados.                                                                                                                                                                                                                                                   |                       |                       |
|                                       El tasador así las cotizó: de costas del escribano, 11 pesos de oro común; de firmas de los jueces, 4 pesos y 1 tomín; 30 pesos más, según la sentencia dictada por García Martínez; “de la sangre, conforme a la dicha sentencia, 2 pesos y 2 tomines”, más 7 tomines. Todo lo cual sumaba 48 pesos y 2 tomines.                                                                                          |                       |                       |
|                                       Francisco Núñez comenzó a pagar.                                                                                                                                                                                                                                                                                                                                                                           |                       |                       |
|                                       Se anexan recibos: Juan Agustín de la Puerta recibió los 30 pesos de la condenación. “Dí carta de pago en el Libro del cargo de penas de cámara y gastos de justicia”. Diego de Mejía recibió los 4 pesos y 1 tomín, por las firmas, más 2 pesos y 2 tomines de la sangre. Cristóbal Hernández de Tene recibió los 11 pesos de los derechos notariales. Pedro Gómez Nájera, alguacil, recibió 7 tomines.   |                       |                       |
|                                       El alcalde Mejía de la Torre ordenó juntar a esta causa otros procesos pendientes: una causa de cuestión entre el dicho Francisco Núñez y Álvaro Fernández en que salió herido el primero; y otra más que tuvieron ambos. Además, el proceso por un incidente entre Francisco Núñez y algunos familiares de doña Francisca de Monroy, en el camino de Comala.^([747])                                      |                       |                       |
|                                                                                                                                                                                                                                                                                                                                                                                                                                                  |                       |                       |
|   ----------------------------------- ---------------------------------------------------------------------------------------------------------------------------------------------------------------------------------------------------------------------------------------------------------------------------------------------------------------------------------------------------------------------------------------------------------- |                       |                       |
|                                                                                                                                                                                                                                                                                                                                                                                                                                                  |                       |                       |
| (746) Véase la sentencia: supra, regº 695.                                                                                                                                                                                                                                                                                                                                                                                                       |                       |                       |
|                                                                                                                                                                                                                                                                                                                                                                                                                                                  |                       |                       |
| (747) Estas últimas causas parecen ser las que vienen registradas más adelante: infra, reg° 698-701.                                                                                                                                                                                                                                                                                                                                             |                       |                       |
|                                                                                                                                                                                                                                                                                                                                                                                                                                                  |                       |                       |
|   ---------------------------------------------------------------------------------------------------                                                                                                                                                                                                                                                                                                                                            |                       |                       |
|    Documento(s) original(es)                                                                                                                                                                                                                                                                                                                                                                                                                     |                       |                       |
|   --------------------------- ------- ------- ------- ------- ------- ------- ------- ------- -------                                                                                                                                                                                                                                                                                                                                            |                       |                       |
|               []                []      []      []      []      []                                                                                                                                                                                                                                                                                                                                                                               |                       |                       |
|              146f              147f    147v    148f    148v    149f                                                                                                                                                                                                                                                                                                                                                                              |                       |                       |
|                                                                                                                                                                                                                                                                                                                                                                                                                                                  |                       |                       |
|   ---------------------------------------------------------------------------------------------------                                                                                                                                                                                                                                                                                                                                            |                       |                       |
+--------------------------------------------------------------------------------------------------------------------------------------------------------------------------------------------------------------------------------------------------------------------------------------------------------------------------------------------------------------------------------------------------------------------------------------------------+-----------------------+-----------------------+
| +----------------------------------------------------------------------------+------------------------------------------------+                                                                                                                                                                                                                                                                                                                  |                       |                       |
| | ISBN 978-607-701-024-1                                                     |   ---- ---- ---- ---- ---- ---- ---- ---- ---- |                                                                                                                                                                                                                                                                                                                  |                       |                       |
| | © Derechos Reservados 2013. Archivo Histórico del Municipio de Colima. [*] |   []        []        []        []        []   |                                                                                                                                                                                                                                                                                                                  |                       |                       |
| |                                                                            |   ---- ---- ---- ---- ---- ---- ---- ---- ---- |                                                                                                                                                                                                                                                                                                                  |                       |                       |
| +----------------------------------------------------------------------------+------------------------------------------------+                                                                                                                                                                                                                                                                                                                  |                       |                       |
| |                                                                            |                                                |                                                                                                                                                                                                                                                                                                                  |                       |                       |
| +----------------------------------------------------------------------------+------------------------------------------------+                                                                                                                                                                                                                                                                                                                  |                       |                       |
+--------------------------------------------------------------------------------------------------------------------------------------------------------------------------------------------------------------------------------------------------------------------------------------------------------------------------------------------------------------------------------------------------------------------------------------------------+-----------------------+-----------------------+

615 visitas
