+--------------------------------------------------------------------------------------------------------------------------------------------------------------------------------------------------------------------------------+-----------------------+-----------------------+
| []                                                                                                                                                                                                                             |                       |                       |
|                                                                                                                                                                                                                                |                       |                       |
| +-----------------------------------+:-------------------------------------:+                                                                                                                                                  |                       |                       |
| | []                                | LA VILLA DE COLIMA DE LA NUEVA ESPAÑA |                                                                                                                                                  |                       |                       |
| |                                   | SIGLO XVI                             |                                                                                                                                                  |                       |                       |
| |                                   |                                       |                                                                                                                                                  |                       |                       |
| |                                   | VOLUMEN II      (CAJAS 12-20)         |                                                                                                                                                  |                       |                       |
| +-----------------------------------+---------------------------------------+                                                                                                                                                  |                       |                       |
+--------------------------------------------------------------------------------------------------------------------------------------------------------------------------------------------------------------------------------+-----------------------+-----------------------+
| +------------------------------------------------------------------------+---------------------------+-----------------------+                                                                                                 |                       |                       |
| | Inicio | Búsqueda | Siglas y bibliografía | Créditos | Más información | (consulta las cajas 1-11) |    [ES]               |                                                                                                 |                       |                       |
| +------------------------------------------------------------------------+---------------------------+-----------------------+                                                                                                 |                       |                       |
+--------------------------------------------------------------------------------------------------------------------------------------------------------------------------------------------------------------------------------+-----------------------+-----------------------+
| Búsqueda rápida                                                                                                                                                                                                                |                       |                       |
|                                                                                                                                                                                                                                |                       |                       |
| +:-------------------:+-----------------+:----------------------------------------:+----------------:+                                                                                                                         |                       |                       |
| | Documento de fecha: |                 | Ubicación física del documento original: | [] [] []        |                                                                                                                         |                       |                       |
| |                     |                 |                                          |                 |                                                                                                                         |                       |                       |
| | 1596. Marzo, 1º     |                 | Caja 12, exp. 8, ff. 88 fte-89 fte.      |                 |                                                                                                                         |                       |                       |
| |                     |                 |                                          |                 |                                                                                                                         |                       |                       |
| |                     |                 | Nota(s): Antes ff. 74 fte -75 fte.       |                 |                                                                                                                         |                       |                       |
| +---------------------+-----------------+------------------------------------------+-----------------+                                                                                                                         |                       |                       |
|                                                                                                                                                                                                                                |                       |                       |
|   ------------- ----------------------------------------------------                                                                                                                                                           |                       |                       |
|   Resumen:      Juan Ramírez de Alarcón, fiador de Diego de Monroy                                                                                                                                                             |                       |                       |
|   ------------- ----------------------------------------------------                                                                                                                                                           |                       |                       |
|                                                                                                                                                                                                                                |                       |                       |
|   ----------------------------------- ---------------------------------------------------------------------------------------------------------------------------------------------------------------------------------------- |                       |                       |
|   Contenido:                          Juan Ramírez Alarcón, vecino de Colima, se compromete como fiador de Diego de Monroy, en el censo impuesto sobre su Huerta de Aguacatitlan y casas de su morada en la Villa de Colima.   |                       |                       |
|                                       Testigos: Juan Muñoz y Diego Morán, regidores, y Juan Ruiz de Haro, vecinos de Colima.                                                                                                   |                       |                       |
|                                       Escribano: Cristóbal Hernández de Tene.                                                                                                                                                  |                       |                       |
|                                                                                                                                                                                                                                |                       |                       |
|   ----------------------------------- ---------------------------------------------------------------------------------------------------------------------------------------------------------------------------------------- |                       |                       |
|                                                                                                                                                                                                                                |                       |                       |
|   ---------------------------------------------------------------------------------------------------                                                                                                                          |                       |                       |
|    Documento(s) original(es)                                                                                                                                                                                                   |                       |                       |
|   --------------------------- ------- ------- ------- ------- ------- ------- ------- ------- -------                                                                                                                          |                       |                       |
|               []                []      []                                                                                                                                                                                     |                       |                       |
|               88f               88v     89f                                                                                                                                                                                    |                       |                       |
|                                                                                                                                                                                                                                |                       |                       |
|   ---------------------------------------------------------------------------------------------------                                                                                                                          |                       |                       |
+--------------------------------------------------------------------------------------------------------------------------------------------------------------------------------------------------------------------------------+-----------------------+-----------------------+
| +----------------------------------------------------------------------------+------------------------------------------------+                                                                                                |                       |                       |
| | ISBN 978-607-701-024-1                                                     |   ---- ---- ---- ---- ---- ---- ---- ---- ---- |                                                                                                |                       |                       |
| | © Derechos Reservados 2013. Archivo Histórico del Municipio de Colima. [*] |   []        []        []        []        []   |                                                                                                |                       |                       |
| |                                                                            |   ---- ---- ---- ---- ---- ---- ---- ---- ---- |                                                                                                |                       |                       |
| +----------------------------------------------------------------------------+------------------------------------------------+                                                                                                |                       |                       |
| |                                                                            |                                                |                                                                                                |                       |                       |
| +----------------------------------------------------------------------------+------------------------------------------------+                                                                                                |                       |                       |
+--------------------------------------------------------------------------------------------------------------------------------------------------------------------------------------------------------------------------------+-----------------------+-----------------------+

615 visitas
