+--------------------------------------------------------------------------------------------------------------------------------------------------------------------------------------------------------------------------------------------------------------------------------------------------------------------------------------------------------------------------------------------------+-----------------------+-----------------------+
| []                                                                                                                                                                                                                                                                                                                                                                                               |                       |                       |
|                                                                                                                                                                                                                                                                                                                                                                                                  |                       |                       |
| +-----------------------------------+:-------------------------------------:+                                                                                                                                                                                                                                                                                                                    |                       |                       |
| | []                                | LA VILLA DE COLIMA DE LA NUEVA ESPAÑA |                                                                                                                                                                                                                                                                                                                    |                       |                       |
| |                                   | SIGLO XVI                             |                                                                                                                                                                                                                                                                                                                    |                       |                       |
| |                                   |                                       |                                                                                                                                                                                                                                                                                                                    |                       |                       |
| |                                   | VOLUMEN II      (CAJAS 12-20)         |                                                                                                                                                                                                                                                                                                                    |                       |                       |
| +-----------------------------------+---------------------------------------+                                                                                                                                                                                                                                                                                                                    |                       |                       |
+--------------------------------------------------------------------------------------------------------------------------------------------------------------------------------------------------------------------------------------------------------------------------------------------------------------------------------------------------------------------------------------------------+-----------------------+-----------------------+
| +------------------------------------------------------------------------+-------------------------------+-----------------------+                                                                                                                                                                                                                                                               |                       |                       |
| | Inicio | Búsqueda | Siglas y bibliografía | Créditos | Más información | Vol. I (1-11) Vol. II (12-20) |    [ES]               |                                                                                                                                                                                                                                                               |                       |                       |
| +------------------------------------------------------------------------+-------------------------------+-----------------------+                                                                                                                                                                                                                                                               |                       |                       |
+--------------------------------------------------------------------------------------------------------------------------------------------------------------------------------------------------------------------------------------------------------------------------------------------------------------------------------------------------------------------------------------------------+-----------------------+-----------------------+
| Búsqueda rápida                                                                                                                                                                                                                                                                                                                                                                                  |                       |                       |
|                                                                                                                                                                                                                                                                                                                                                                                                  |                       |                       |
| +:-------------------:+-----------------+:----------------------------------------:+----------------:+                                                                                                                                                                                                                                                                                           |                       |                       |
| | Documento de fecha: |                 | Ubicación física del documento original: | [] [] []        |                                                                                                                                                                                                                                                                                           |                       |                       |
| |                     |                 |                                          |                 |                                                                                                                                                                                                                                                                                           |                       |                       |
| | 1596. Agosto, 21    |                 | Caja 25, exp. 22, 3 ff.                  |                 |                                                                                                                                                                                                                                                                                           |                       |                       |
| +---------------------+-----------------+------------------------------------------+-----------------+                                                                                                                                                                                                                                                                                           |                       |                       |
|                                                                                                                                                                                                                                                                                                                                                                                                  |                       |                       |
|   ------------- -------------------------------------------------------------------------------------------------------------------                                                                                                                                                                                                                                                              |                       |                       |
|   Resumen:      El mercader Juan Martínez de Olalde reclama cantidad de pesos que le quedó debiendo Francisca de Monroy, difunta.                                                                                                                                                                                                                                                                |                       |                       |
|   ------------- -------------------------------------------------------------------------------------------------------------------                                                                                                                                                                                                                                                              |                       |                       |
|                                                                                                                                                                                                                                                                                                                                                                                                  |                       |                       |
|   ----------------------------------- ---------------------------------------------------------------------------------------------------------------------------------------------------------------------------------------------------------------------------------------------------------------------------------------------------------------------------------------------------------- |                       |                       |
|   Contenido:                          Juan Martínez de Olalde,^([1]) mercader vecino de la Villa de Colima, dijo ante Antonio de Ocampo, alcalde ordinario, que doña Francisca de Monroy, difunta, le debía 13 pesos y 2 tomines y medio de mercaderías que sacó de su tienda, según consta por la memoria que presenta, y que la susodicha dejó reconocida por una cláusula de su testamento.   |                       |                       |
|                                       Ha sabido que Cristóbal Hernández de Tene tiene en su poder cantidad de pesos de oro común por bienes de la dicha difunta. Pide que se le pague.                                                                                                                                                                                                           |                       |                       |
|                                       Se anexa la Memoria de las mercaderías que corre desde el 21 de enero de 1592, fecha en la que hizo cuentas con doña Francisca de Monroy, “y quedóme debiendo once pesos y seis reales, por todo”.                                                                                                                                                         |                       |                       |
|                                                                                                                                                                                                                                                                                                                                                                                                  |                       |                       |
|   ----------------------------------- ---------------------------------------------------------------------------------------------------------------------------------------------------------------------------------------------------------------------------------------------------------------------------------------------------------------------------------------------------------- |                       |                       |
|                                                                                                                                                                                                                                                                                                                                                                                                  |                       |                       |
| (1) Juan Martínez de Olalde era vecino de Colima y mercader al menos desde 1592, según la Memoria de las mercaderías de la que se hace mención más adelante. Era primo del también mercader Juan López de Bengoa: Romero de Solís, Andariegos… (2001), 314-315.                                                                                                                                  |                       |                       |
|                                                                                                                                                                                                                                                                                                                                                                                                  |                       |                       |
|   ---------------------------------------------------------------------------------------------------                                                                                                                                                                                                                                                                                            |                       |                       |
|    Documento(s) original(es)                                                                                                                                                                                                                                                                                                                                                                     |                       |                       |
|   --------------------------- ------- ------- ------- ------- ------- ------- ------- ------- -------                                                                                                                                                                                                                                                                                            |                       |                       |
|               []                []      []      []      []                                                                                                                                                                                                                                                                                                                                       |                       |                       |
|               1f                2f      2v      3f      3v                                                                                                                                                                                                                                                                                                                                       |                       |                       |
|                                                                                                                                                                                                                                                                                                                                                                                                  |                       |                       |
|   ---------------------------------------------------------------------------------------------------                                                                                                                                                                                                                                                                                            |                       |                       |
+--------------------------------------------------------------------------------------------------------------------------------------------------------------------------------------------------------------------------------------------------------------------------------------------------------------------------------------------------------------------------------------------------+-----------------------+-----------------------+
| +----------------------------------------------------------------------------+-----------------------------------------------:+                                                                                                                                                                                                                                                                  |                       |                       |
| | ISBN 978-607-701-024-1                                                     |   ---- ---- ---- ---- ---- ---- ---- ---- ---- |                                                                                                                                                                                                                                                                  |                       |                       |
| | © Derechos Reservados 2013. Archivo Histórico del Municipio de Colima. [*] |   []        []        []        []        []   |                                                                                                                                                                                                                                                                  |                       |                       |
| |                                                                            |   ---- ---- ---- ---- ---- ---- ---- ---- ---- |                                                                                                                                                                                                                                                                  |                       |                       |
| +----------------------------------------------------------------------------+------------------------------------------------+                                                                                                                                                                                                                                                                  |                       |                       |
| |                                                                            |                                                |                                                                                                                                                                                                                                                                  |                       |                       |
| +----------------------------------------------------------------------------+------------------------------------------------+                                                                                                                                                                                                                                                                  |                       |                       |
+--------------------------------------------------------------------------------------------------------------------------------------------------------------------------------------------------------------------------------------------------------------------------------------------------------------------------------------------------------------------------------------------------+-----------------------+-----------------------+

636 visitas
