+---------------------------------------------------------------------------------------------------------------------------------------------------------------------------------------------------------------------------------------------------------------------------------------------------------------------------------------------------------------------------------------------------------------------------------------------------------------------------------------------------------------------------------------------------------------------------------------------------------------------------------------------------------------------------------------------------------------------------------------------------------------------------------------------------------------------------------------------------------------------------------------------------+-----------------------+-----------------------+
| []                                                                                                                                                                                                                                                                                                                                                                                                                                                                                                                                                                                                                                                                                                                                                                                                                                                                                                |                       |                       |
|                                                                                                                                                                                                                                                                                                                                                                                                                                                                                                                                                                                                                                                                                                                                                                                                                                                                                                   |                       |                       |
| +-----------------------------------+:-------------------------------------:+                                                                                                                                                                                                                                                                                                                                                                                                                                                                                                                                                                                                                                                                                                                                                                                                                     |                       |                       |
| | []                                | LA VILLA DE COLIMA DE LA NUEVA ESPAÑA |                                                                                                                                                                                                                                                                                                                                                                                                                                                                                                                                                                                                                                                                                                                                                                                                                     |                       |                       |
| |                                   | SIGLO XVI                             |                                                                                                                                                                                                                                                                                                                                                                                                                                                                                                                                                                                                                                                                                                                                                                                                                     |                       |                       |
| |                                   |                                       |                                                                                                                                                                                                                                                                                                                                                                                                                                                                                                                                                                                                                                                                                                                                                                                                                     |                       |                       |
| |                                   | VOLUMEN II      (CAJAS 12-20)         |                                                                                                                                                                                                                                                                                                                                                                                                                                                                                                                                                                                                                                                                                                                                                                                                                     |                       |                       |
| +-----------------------------------+---------------------------------------+                                                                                                                                                                                                                                                                                                                                                                                                                                                                                                                                                                                                                                                                                                                                                                                                                     |                       |                       |
+---------------------------------------------------------------------------------------------------------------------------------------------------------------------------------------------------------------------------------------------------------------------------------------------------------------------------------------------------------------------------------------------------------------------------------------------------------------------------------------------------------------------------------------------------------------------------------------------------------------------------------------------------------------------------------------------------------------------------------------------------------------------------------------------------------------------------------------------------------------------------------------------------+-----------------------+-----------------------+
| +------------------------------------------------------------------------+-------------------------------+-----------------------+                                                                                                                                                                                                                                                                                                                                                                                                                                                                                                                                                                                                                                                                                                                                                                |                       |                       |
| | Inicio | Búsqueda | Siglas y bibliografía | Créditos | Más información | Vol. I (1-11) Vol. II (12-20) |    [ES]               |                                                                                                                                                                                                                                                                                                                                                                                                                                                                                                                                                                                                                                                                                                                                                                |                       |                       |
| +------------------------------------------------------------------------+-------------------------------+-----------------------+                                                                                                                                                                                                                                                                                                                                                                                                                                                                                                                                                                                                                                                                                                                                                                |                       |                       |
+---------------------------------------------------------------------------------------------------------------------------------------------------------------------------------------------------------------------------------------------------------------------------------------------------------------------------------------------------------------------------------------------------------------------------------------------------------------------------------------------------------------------------------------------------------------------------------------------------------------------------------------------------------------------------------------------------------------------------------------------------------------------------------------------------------------------------------------------------------------------------------------------------+-----------------------+-----------------------+
| Búsqueda rápida                                                                                                                                                                                                                                                                                                                                                                                                                                                                                                                                                                                                                                                                                                                                                                                                                                                                                   |                       |                       |
|                                                                                                                                                                                                                                                                                                                                                                                                                                                                                                                                                                                                                                                                                                                                                                                                                                                                                                   |                       |                       |
| +:---------------------------:+-----------------+:----------------------------------------:+----------------:+                                                                                                                                                                                                                                                                                                                                                                                                                                                                                                                                                                                                                                                                                                                                                                                    |                       |                       |
| | Documento de fecha:         |                 | Ubicación física del documento original: | [] [] []        |                                                                                                                                                                                                                                                                                                                                                                                                                                                                                                                                                                                                                                                                                                                                                                                    |                       |                       |
| |                             |                 |                                          |                 |                                                                                                                                                                                                                                                                                                                                                                                                                                                                                                                                                                                                                                                                                                                                                                                    |                       |                       |
| | 1572, Septiembre 12.[10560] |                 | Caja 28, exp. 1, 7 ff.                   |                 |                                                                                                                                                                                                                                                                                                                                                                                                                                                                                                                                                                                                                                                                                                                                                                                    |                       |                       |
| +-----------------------------+-----------------+------------------------------------------+-----------------+                                                                                                                                                                                                                                                                                                                                                                                                                                                                                                                                                                                                                                                                                                                                                                                    |                       |                       |
|                                                                                                                                                                                                                                                                                                                                                                                                                                                                                                                                                                                                                                                                                                                                                                                                                                                                                                   |                       |                       |
|   ------------- -----------------------------------------------------------------------------------------------                                                                                                                                                                                                                                                                                                                                                                                                                                                                                                                                                                                                                                                                                                                                                                                   |                       |                       |
|   Resumen:      Censo que otorgan Álvaro de Grijalba y su mujer a favor de la iglesia del pueblo de Tecolapa.                                                                                                                                                                                                                                                                                                                                                                                                                                                                                                                                                                                                                                                                                                                                                                                     |                       |                       |
|   ------------- -----------------------------------------------------------------------------------------------                                                                                                                                                                                                                                                                                                                                                                                                                                                                                                                                                                                                                                                                                                                                                                                   |                       |                       |
|                                                                                                                                                                                                                                                                                                                                                                                                                                                                                                                                                                                                                                                                                                                                                                                                                                                                                                   |                       |                       |
|   ----------------------------------- ----------------------------------------------------------------------------------------------------------------------------------------------------------------------------------------------------------------------------------------------------------------------------------------------------------------------------------------------------------------------------------------------------------------------------------------------------------------------------------------------------------------------------------------------------------------------------------------------------------------------------------------------------------------------------------------------------------------------------------------------------------------------------------------------------------------------------------------------------------- |                       |                       |
|   Contenido:                          Álvaro de Grijalba y Catalina Ruiz, su legitima mujer, vecinos que son de la Villa de Colima, ella con licencia de su marido y en mancomún, otorgan y conceden en venta a la iglesia del pueblo de Tecolapa y al padre Francisco Ruiz hijo, presbítero como patrón de la capellanía que instituyó en la dicha iglesia Martín Gómez Vizcaíno, en su nombre e al patrón que fuere de aquí en adelante, “diez e siete pesos y seis tomines e seis granos de oro que corre de censo a quitar en cada un año los cuales le daremos e pagaremos en esta dicha villa, en fin de cada un año con las costas y daños intereses y menoscabos que se les siguieren e recrecieren los cuales dichos diez e siete pesos e seis tomines e seis granos del dicho censo le vendemos por precio e cuantía de doscientos e cincuenta pesos de dicho oro que del confesamos.   |                       |                       |
|                                       Haber recibido realmente e con efecto de quienes damos e otorgamos por bien contento pagado y entregados a toda nuestra voluntad”, “e nos los dichos otorgantes vendemos el dicho censo por nueva venta e imposición y lo situamos y señalamos sobre una huerta de cacao que tenemos en términos de la dicha villa, en el valle de Caxitlan que se llaman de San Juan, e sobre unas casas en eta dicha villa en la plaza della, y sobre todo o los de más breves e ansí mueble como raíces que la vemos y tenemos y tuviéremos de aquí adelante, lo cual es libre de censo y de otra hipoteca, con todas sus entradas y salidas usos e costumbres, e servidumbre con las condiciones siguientes, e a de correr desde veinte e dos de octubre del año próximo pasado de mil e quinientos y setenta años”.                                                    |                       |                       |
|                                       Fueron testigos: Guillermo Cola, Juan Iniesta e Alonso Miguel, vecinos de la dicha villa. El dicho Álvaro de Grijalba lo firmó en el registro de esta carta y por la dicha Catalina Ruiz e a su ruego lo firmó un testigo, a los cuales dichos otorgantes yo el presente escribano doy fe que conozco, Álvaro de Grijalba a su ruego del otorgante y por testigo Baltasar de Alcalá.                                                                                                                                                                                                                                                                                                                                                                                                                                                                        |                       |                       |
|                                       Pasó ante mí Blas López, escribano de Su Majestad. En dos notas por separado, Francisco Ruiz recibió los corridos de esta escritura del año de 1577 y de 1588 “porque hasta este día se abrió esta capellanía y consejo le firmó remate de cuenta y la comenzó de primero de enero de setenta y nueve el bachiller Grijalba”.                                                                                                                                                                                                                                                                                                                                                                                                                                                                                                                               |                       |                       |
|                                       El 2 de agosto de 1594, ante Gaspar Román en Colima, a pedimento de la parte de Francisco Muñoz, beneficiario de Tecolapa, se dio mandato ejecutiva por 71 pesos y 2 tomines de oro común de los réditos del censo por 4 años, que se cumplieron en 22 de octubre de 1592, ante el escribano Toribio de Casso.                                                                                                                                                                                                                                                                                                                                                                                                                                                                                                                                              |                       |                       |
|                                       Poder general que otorgó el señor Francisco Muñoz a Miguel Muñiz.                                                                                                                                                                                                                                                                                                                                                                                                                                                                                                                                                                                                                                                                                                                                                                                           |                       |                       |
|                                       Francisco Muñoz, clérigo presbítero beneficiado del partido de Tecolapa, otorga el 28 de mayo de 1591 poder cumplido a Miguel Muñoz de Valdivia para que en su nombre “pueda pedir e demandar, recibir, haber e cobrar cualesquiera maravedís pesos de oro que se me deban así por escrituras como de cédulas como en otra cualquier manera y de lo que en mi nombre cobrase pueda dar e otorgar su carta o cartas de pago de fin y quiso valgan como si yo las diese e lo otorgase e haya así lo presente fuese y generalmente para en todos mis pleitos, causas e negocios civiles y criminales”.                                                                                                                                                                                                                                                         |                       |                       |
|                                       Este poder lo da en el pueblo de Xicotlan el 28 de mayo de 1591, siendo testigos Baltasar de Alcalá, Toribio de Caso e Manuel de Trebedes, vecinos de Colima y estantes en esta provincia.                                                                                                                                                                                                                                                                                                                                                                                                                                                                                                                                                                                                                                                                  |                       |                       |
|                                       Pasó ante Cristóbal Fernández, escribano público y va enmendado por Cristóbal Fernández de Tene, escribano del Rey.                                                                                                                                                                                                                                                                                                                                                                                                                                                                                                                                                                                                                                                                                                                                         |                       |                       |
|                                       Miguel Muñoz pide que Alonso de Grijalba pague 74 pesos de oro que le debe al presbítero Francisco Muñoz.                                                                                                                                                                                                                                                                                                                                                                                                                                                                                                                                                                                                                                                                                                                                                   |                       |                       |
|                                       Miguel Muñoz pide en Colima al alcalde Gaspar Román, en nombre de Francisco Muñoz, presbítero del partido de Tecolapa, que Alonso de Grijalba, vecino de esta villa, le pegue 70 pesos 4 tomines “de que es a su cargo de lo cogido de la capellanía de Martín Gómez, difunto, cuyo capellán es el dicho mi parte, que se cumplieron y hubiere a deber los dichos setenta pesos y cuatro tomines a ocho de octubre del año pasado de noventa y tres”.                                                                                                                                                                                                                                                                                                                                                                                                       |                       |                       |
|                                                                                                                                                                                                                                                                                                                                                                                                                                                                                                                                                                                                                                                                                                                                                                                                                                                                                                   |                       |                       |
|   ----------------------------------- ----------------------------------------------------------------------------------------------------------------------------------------------------------------------------------------------------------------------------------------------------------------------------------------------------------------------------------------------------------------------------------------------------------------------------------------------------------------------------------------------------------------------------------------------------------------------------------------------------------------------------------------------------------------------------------------------------------------------------------------------------------------------------------------------------------------------------------------------------------- |                       |                       |
|                                                                                                                                                                                                                                                                                                                                                                                                                                                                                                                                                                                                                                                                                                                                                                                                                                                                                                   |                       |                       |
|   ---------------------------------------------------------------------------------------------------                                                                                                                                                                                                                                                                                                                                                                                                                                                                                                                                                                                                                                                                                                                                                                                             |                       |                       |
|    Documento(s) original(es)                                                                                                                                                                                                                                                                                                                                                                                                                                                                                                                                                                                                                                                                                                                                                                                                                                                                      |                       |                       |
|   --------------------------- ------- ------- ------- ------- ------- ------- ------- ------- -------                                                                                                                                                                                                                                                                                                                                                                                                                                                                                                                                                                                                                                                                                                                                                                                             |                       |                       |
|               []                []      []      []      []      []      []      []      []      []                                                                                                                                                                                                                                                                                                                                                                                                                                                                                                                                                                                                                                                                                                                                                                                                |                       |                       |
|               1f                1v      2f      2v      3f      3v      4v      5f      5v      6v                                                                                                                                                                                                                                                                                                                                                                                                                                                                                                                                                                                                                                                                                                                                                                                                |                       |                       |
|                                                                                                                                                                                                                                                                                                                                                                                                                                                                                                                                                                                                                                                                                                                                                                                                                                                                                                   |                       |                       |
|               []                []                                                                                                                                                                                                                                                                                                                                                                                                                                                                                                                                                                                                                                                                                                                                                                                                                                                                |                       |                       |
|               7f                7v                                                                                                                                                                                                                                                                                                                                                                                                                                                                                                                                                                                                                                                                                                                                                                                                                                                                |                       |                       |
|   ---------------------------------------------------------------------------------------------------                                                                                                                                                                                                                                                                                                                                                                                                                                                                                                                                                                                                                                                                                                                                                                                             |                       |                       |
+---------------------------------------------------------------------------------------------------------------------------------------------------------------------------------------------------------------------------------------------------------------------------------------------------------------------------------------------------------------------------------------------------------------------------------------------------------------------------------------------------------------------------------------------------------------------------------------------------------------------------------------------------------------------------------------------------------------------------------------------------------------------------------------------------------------------------------------------------------------------------------------------------+-----------------------+-----------------------+
| +----------------------------------------------------------------------------+-----------------------------------------------:+                                                                                                                                                                                                                                                                                                                                                                                                                                                                                                                                                                                                                                                                                                                                                                   |                       |                       |
| | ISBN 978-607-701-024-1                                                     |   ---- ---- ---- ---- ---- ---- ---- ---- ---- |                                                                                                                                                                                                                                                                                                                                                                                                                                                                                                                                                                                                                                                                                                                                                                   |                       |                       |
| | © Derechos Reservados 2013. Archivo Histórico del Municipio de Colima. [*] |   []        []        []        []        []   |                                                                                                                                                                                                                                                                                                                                                                                                                                                                                                                                                                                                                                                                                                                                                                   |                       |                       |
| |                                                                            |   ---- ---- ---- ---- ---- ---- ---- ---- ---- |                                                                                                                                                                                                                                                                                                                                                                                                                                                                                                                                                                                                                                                                                                                                                                   |                       |                       |
| +----------------------------------------------------------------------------+------------------------------------------------+                                                                                                                                                                                                                                                                                                                                                                                                                                                                                                                                                                                                                                                                                                                                                                   |                       |                       |
| |                                                                            |                                                |                                                                                                                                                                                                                                                                                                                                                                                                                                                                                                                                                                                                                                                                                                                                                                   |                       |                       |
| +----------------------------------------------------------------------------+------------------------------------------------+                                                                                                                                                                                                                                                                                                                                                                                                                                                                                                                                                                                                                                                                                                                                                                   |                       |                       |
+---------------------------------------------------------------------------------------------------------------------------------------------------------------------------------------------------------------------------------------------------------------------------------------------------------------------------------------------------------------------------------------------------------------------------------------------------------------------------------------------------------------------------------------------------------------------------------------------------------------------------------------------------------------------------------------------------------------------------------------------------------------------------------------------------------------------------------------------------------------------------------------------------+-----------------------+-----------------------+

636 visitas
