+-------------------------------------------------------------------------------------------------------------------------------------------------------------------------+-----------------------+-----------------------+
| []                                                                                                                                                                      |                       |                       |
|                                                                                                                                                                         |                       |                       |
| +-----------------------------------+:-------------------------------------:+                                                                                           |                       |                       |
| | []                                | LA VILLA DE COLIMA DE LA NUEVA ESPAÑA |                                                                                           |                       |                       |
| |                                   | SIGLO XVI                             |                                                                                           |                       |                       |
| |                                   |                                       |                                                                                           |                       |                       |
| |                                   | VOLUMEN II      (CAJAS 12-20)         |                                                                                           |                       |                       |
| +-----------------------------------+---------------------------------------+                                                                                           |                       |                       |
+-------------------------------------------------------------------------------------------------------------------------------------------------------------------------+-----------------------+-----------------------+
| +------------------------------------------------------------------------+-------------------------------+-----------------------+                                      |                       |                       |
| | Inicio | Búsqueda | Siglas y bibliografía | Créditos | Más información | Vol. I (1-11) Vol. II (12-20) |    [ES]               |                                      |                       |                       |
| +------------------------------------------------------------------------+-------------------------------+-----------------------+                                      |                       |                       |
+-------------------------------------------------------------------------------------------------------------------------------------------------------------------------+-----------------------+-----------------------+
| Búsqueda rápida                                                                                                                                                         |                       |                       |
|                                                                                                                                                                         |                       |                       |
| +:-------------------:+-----------------+:----------------------------------------:+----------------:+                                                                  |                       |                       |
| | Documento de fecha: |                 | Ubicación física del documento original: | [] [] []        |                                                                  |                       |                       |
| |                     |                 |                                          |                 |                                                                  |                       |                       |
| | 1570. Marzo, 25     |                 | Caja 21, exp. 11, 2 ff.^([4])            |                 |                                                                  |                       |                       |
| +---------------------+-----------------+------------------------------------------+-----------------+                                                                  |                       |                       |
|                                                                                                                                                                         |                       |                       |
|   ------------- ----------------------------------------------------------------                                                                                        |                       |                       |
|   Resumen:      Poder que otorga Francisca Hernández a su esposo Diego Moreno.                                                                                          |                       |                       |
|   ------------- ----------------------------------------------------------------                                                                                        |                       |                       |
|                                                                                                                                                                         |                       |                       |
|   ----------------------------------- --------------------------------------------------------------------------------------------------------------------------------- |                       |                       |
|   Contenido:                          En la Ciudad de México Francisca Hernández, mujer de Diego Moreno, vecino de México, otorga poder general a su esposo.            |                       |                       |
|                                       Testigos: Andrés Moreno, Francisco García y Diego Carrillo, vecinos de México.                                                    |                       |                       |
|                                       Pasó ante Baltasar Moreno, escribano de Su Majestad,                                                                              |                       |                       |
|                                       El 7 de julio de 1571 y ante el mismo escribano, Diego Moreno sustituía este poder en Antonio de Amaya, vecino de México.^([1])   |                       |                       |
|                                       Dos anotaciones al margen:                                                                                                        |                       |                       |
|                                       “A 25 del mes de abril, alquilóle la casa a Luis Moreno, vecino de Axozingo,^([2]) por seis meses. Año de 1570”.                  |                       |                       |
|                                       Y la otra: “Poder de Diego Moreno para cobrar en Colima de los réditos corridos, 350 pesos 2 tomines”.^([3])                      |                       |                       |
|                                                                                                                                                                         |                       |                       |
|   ----------------------------------- --------------------------------------------------------------------------------------------------------------------------------- |                       |                       |
|                                                                                                                                                                         |                       |                       |
| (1) Antonio de Amaya o Maya fue por años vecino de Colima: Romero de Solís, Andariegos… (2001), 319.                                                                    |                       |                       |
|                                                                                                                                                                         |                       |                       |
| (2) Ayotzingo, pueblo bajo la jurisdicción de la alcaldía mayor de Chalco: Peter Gerhard, Geografía histórica de la Nueva España… (1986), 104-108.                      |                       |                       |
|                                                                                                                                                                         |                       |                       |
| (3) No se dice de quién se debía cobrar tal cantidad de pesos.                                                                                                          |                       |                       |
|                                                                                                                                                                         |                       |                       |
| (4) Antes en Sección B, caja 21, exp. 13.                                                                                                                               |                       |                       |
|                                                                                                                                                                         |                       |                       |
|   ---------------------------------------------------------------------------------------------------                                                                   |                       |                       |
|    Documento(s) original(es)                                                                                                                                            |                       |                       |
|   --------------------------- ------- ------- ------- ------- ------- ------- ------- ------- -------                                                                   |                       |                       |
|               []                []      []      []                                                                                                                      |                       |                       |
|               1f                1v      2f      2v                                                                                                                      |                       |                       |
|                                                                                                                                                                         |                       |                       |
|   ---------------------------------------------------------------------------------------------------                                                                   |                       |                       |
+-------------------------------------------------------------------------------------------------------------------------------------------------------------------------+-----------------------+-----------------------+
| +----------------------------------------------------------------------------+-----------------------------------------------:+                                         |                       |                       |
| | ISBN 978-607-701-024-1                                                     |   ---- ---- ---- ---- ---- ---- ---- ---- ---- |                                         |                       |                       |
| | © Derechos Reservados 2013. Archivo Histórico del Municipio de Colima. [*] |   []        []        []        []        []   |                                         |                       |                       |
| |                                                                            |   ---- ---- ---- ---- ---- ---- ---- ---- ---- |                                         |                       |                       |
| +----------------------------------------------------------------------------+------------------------------------------------+                                         |                       |                       |
| |                                                                            |                                                |                                         |                       |                       |
| +----------------------------------------------------------------------------+------------------------------------------------+                                         |                       |                       |
+-------------------------------------------------------------------------------------------------------------------------------------------------------------------------+-----------------------+-----------------------+

636 visitas
