[]

LA VILLA DE COLIMA DE LA NUEVA ESPAÑA
SIGLO XVI

VOLUMEN I      (CAJAS 1-11)

[]

Inicio | Búsquedas | Siglas y bibliografía | Cartografía | Créditos | Más información

[]

Búsqueda rápida

+:------------------------------------------------------------------------------------------------------------------------------------------------------------------------------------------------------------------------------------------------------------------------------------------------------------------------------------------------------------------------------------------------------------------------------------------------------------------------------------------------------------------------------------------------------------------------------------------------------------------------------------------------------------------------------------------------------------------------------------------------------------------------------------------------------------------------------------------------------------------------------------------------------------------------------------------------------------------------------------------------------------------------------------------------------------------------------------------------------------------------------------------------------------------------------------------------------------------------------------------------------------------------------------------------------------------------------------------------------------------------------------------------------------------------------------------------------------------------------------------------------------------------------------------------------------------------------------------------------------------------------------------------------------------------------------------------------------------------------------------------------------------------------------------------------------------------------------------------------:+------------------------------------------:+
| Fecha:                                                                                                                                                                                                                                                                                                                                                                                                                                                                                                                                                                                                                                                                                                                                                                                                                                                                                                                                                                                                                                                                                                                                                                                                                                                                                                                                                                                                                                                                                                                                                                                                                                                                                                                                                                                                                                                 | Ubicación física del documento original:  |
| 1539 Septiembre, 25                                                                                                                                                                                                                                                                                                                                                                                                                                                                                                                                                                                                                                                                                                                                                                                                                                                                                                                                                                                                                                                                                                                                                                                                                                                                                                                                                                                                                                                                                                                                                                                                                                                                                                                                                                                                                                    | CAJA A-1, EXP. 5, 10 FF.                  |
|                                                                                                                                                                                                                                                                                                                                                                                                                                                                                                                                                                                                                                                                                                                                                                                                                                                                                                                                                                                                                                                                                                                                                                                                                                                                                                                                                                                                                                                                                                                                                                                                                                                                                                                                                                                                                                                        | Archivo Histórico del Municipio de Colima |
+--------------------------------------------------------------------------------------------------------------------------------------------------------------------------------------------------------------------------------------------------------------------------------------------------------------------------------------------------------------------------------------------------------------------------------------------------------------------------------------------------------------------------------------------------------------------------------------------------------------------------------------------------------------------------------------------------------------------------------------------------------------------------------------------------------------------------------------------------------------------------------------------------------------------------------------------------------------------------------------------------------------------------------------------------------------------------------------------------------------------------------------------------------------------------------------------------------------------------------------------------------------------------------------------------------------------------------------------------------------------------------------------------------------------------------------------------------------------------------------------------------------------------------------------------------------------------------------------------------------------------------------------------------------------------------------------------------------------------------------------------------------------------------------------------------------------------------------------------------+-------------------------------------------+
| 8. 1539. Septiembre, 25.                                                                                                                                                                                                                                                                                                                                                                                                                                                                                                                                                                                                                                                                                                                                                                                                                                                                                                                                                                                                                                                                                                                                                                                                                                                                                                                                                                                                                                                                                                                                                                                                                                                                                                                                                                                                                               |                                           |
|                                                                                                                                                                                                                                                                                                                                                                                                                                                                                                                                                                                                                                                                                                                                                                                                                                                                                                                                                                                                                                                                                                                                                                                                                                                                                                                                                                                                                                                                                                                                                                                                                                                                                                                                                                                                                                                        |                                           |
| Diego Alcalde contra los bienes de Diego Garrido, difunto, por pesos.                                                                                                                                                                                                                                                                                                                                                                                                                                                                                                                                                                                                                                                                                                                                                                                                                                                                                                                                                                                                                                                                                                                                                                                                                                                                                                                                                                                                                                                                                                                                                                                                                                                                                                                                                                                  |                                           |
|                                                                                                                                                                                                                                                                                                                                                                                                                                                                                                                                                                                                                                                                                                                                                                                                                                                                                                                                                                                                                                                                                                                                                                                                                                                                                                                                                                                                                                                                                                                                                                                                                                                                                                                                                                                                                                                        |                                           |
| Ante el alcalde ordinario Alonso López, siendo escribano Juan de la Torre,^([1]) el vecino de Colima Diego Alcalde^([2]) presenta demanda contra los bienes de Diego Garrido, difunto, por 80 pesos, 5 tomines y 6 granos de oro de minas de ley perfecta, de unas mercaderías que Garrido le compró para sus haciendas y granjerías y para sustentamiento de él y de su mujer,^([3]) y aparatos de su casa, como consta en su libro de cuentas y por una memoria firmada por el difunto. Diego Alcalde pide a la justicia que ordene a Alonso de Arévalo, albacea y testamentario de los bienes de Garrido, que reconozca su firma sobre los dichos conocimientos, que como asegura en otra petición, han sido "presentados conforme a la plemática [sic] de Segovia".^([4])                                                                                                                                                                                                                                                                                                                                                                                                                                                                                                                                                                                                                                                                                                                                                                                                                                                                                                                                                                                                                                                                          |                                           |
|                                                                                                                                                                                                                                                                                                                                                                                                                                                                                                                                                                                                                                                                                                                                                                                                                                                                                                                                                                                                                                                                                                                                                                                                                                                                                                                                                                                                                                                                                                                                                                                                                                                                                                                                                                                                                                                        |                                           |
| El demandante acompaña su demanda con una obligación firmada por el difunto Diego Garrido, siendo testigos de ella Juan Gómez, Juan Pinzón y Gómez de Segovia, por valor de 30 pesos de oro de minas, fechada el 2 de noviembre de 1538, "por razón de un esclavo y unas puertas que vos compré, el cual esclavo se llama Francisquito y es natural de Aguatlan".                                                                                                                                                                                                                                                                                                                                                                                                                                                                                                                                                                                                                                                                                                                                                                                                                                                                                                                                                                                                                                                                                                                                                                                                                                                                                                                                                                                                                                                                                      |                                           |
|                                                                                                                                                                                                                                                                                                                                                                                                                                                                                                                                                                                                                                                                                                                                                                                                                                                                                                                                                                                                                                                                                                                                                                                                                                                                                                                                                                                                                                                                                                                                                                                                                                                                                                                                                                                                                                                        |                                           |
| Obligación y memoria, afirma el demandante, las firmó Garrido "al tiempo que se quiso ir desta Villa para México, a se curar".                                                                                                                                                                                                                                                                                                                                                                                                                                                                                                                                                                                                                                                                                                                                                                                                                                                                                                                                                                                                                                                                                                                                                                                                                                                                                                                                                                                                                                                                                                                                                                                                                                                                                                                         |                                           |
|                                                                                                                                                                                                                                                                                                                                                                                                                                                                                                                                                                                                                                                                                                                                                                                                                                                                                                                                                                                                                                                                                                                                                                                                                                                                                                                                                                                                                                                                                                                                                                                                                                                                                                                                                                                                                                                        |                                           |
| En otro escrito, Diego Alcalde dice que Alonso de Arévalo había reconocido las firmas, y pide que se examine a los testigos para que conste más claramente.                                                                                                                                                                                                                                                                                                                                                                                                                                                                                                                                                                                                                                                                                                                                                                                                                                                                                                                                                                                                                                                                                                                                                                                                                                                                                                                                                                                                                                                                                                                                                                                                                                                                                            |                                           |
|                                                                                                                                                                                                                                                                                                                                                                                                                                                                                                                                                                                                                                                                                                                                                                                                                                                                                                                                                                                                                                                                                                                                                                                                                                                                                                                                                                                                                                                                                                                                                                                                                                                                                                                                                                                                                                                        |                                           |
| "Otrosí pido a V.m. mande tomar juramento a Antón Caballero,^([5]) porque él fue el que hizo la memoria que Diego Garrido hizo de lo que debía".                                                                                                                                                                                                                                                                                                                                                                                                                                                                                                                                                                                                                                                                                                                                                                                                                                                                                                                                                                                                                                                                                                                                                                                                                                                                                                                                                                                                                                                                                                                                                                                                                                                                                                       |                                           |
|                                                                                                                                                                                                                                                                                                                                                                                                                                                                                                                                                                                                                                                                                                                                                                                                                                                                                                                                                                                                                                                                                                                                                                                                                                                                                                                                                                                                                                                                                                                                                                                                                                                                                                                                                                                                                                                        |                                           |
| El alcalde tomó declaración a los vecinos de la Villa de Colima Ginés Pinzón, Juan Gómez, Gómez de Segovia y Bartolomé Garrido,^([6]) testigos presentados por el demandante.                                                                                                                                                                                                                                                                                                                                                                                                                                                                                                                                                                                                                                                                                                                                                                                                                                                                                                                                                                                                                                                                                                                                                                                                                                                                                                                                                                                                                                                                                                                                                                                                                                                                          |                                           |
|                                                                                                                                                                                                                                                                                                                                                                                                                                                                                                                                                                                                                                                                                                                                                                                                                                                                                                                                                                                                                                                                                                                                                                                                                                                                                                                                                                                                                                                                                                                                                                                                                                                                                                                                                                                                                                                        |                                           |
| También hizo lo mismo con Alonso de Arévalo y Diego Hurtado, escribano real, tutor de la hija de Elvira de Arévalo.^([7])                                                                                                                                                                                                                                                                                                                                                                                                                                                                                                                                                                                                                                                                                                                                                                                                                                                                                                                                                                                                                                                                                                                                                                                                                                                                                                                                                                                                                                                                                                                                                                                                                                                                                                                              |                                           |
|                                                                                                                                                                                                                                                                                                                                                                                                                                                                                                                                                                                                                                                                                                                                                                                                                                                                                                                                                                                                                                                                                                                                                                                                                                                                                                                                                                                                                                                                                                                                                                                                                                                                                                                                                                                                                                                        |                                           |
| El 29 de noviembre de 1539, en nueva petición presentada ante el alcalde mayor don Rodrigo Maldonado,^([8]) el demandante dice que "llegado el pleito a efectuada ejecución del mandamiento del dicho alcalde en los dichos bienes, y habiendo ya señalado por bienes del difunto ocho o diez esclavos que están en las minas cogiendo oro, y los tributos e rentas del pueblo que dejó el dicho difunto, y en cierto oro que Bartolomé Garrido ha traido, en el cual oro y en una esclava que se dice Beatriz está hecha ejecución y depósito en Alonso de Arévalo e Bartolomé Garrido por el dicho mandamiento, y a esta sazón, estando hecha la dicha ejecución, V.m. dio mandamiento para el dote^([9]) de Elvira de Arévalo, mujer que fue del dicho Diego Garrido, estorbando que no se acabe de hacer la dicha ejecución, y no ha lugar el tal mandamiento por cuanto ella está pagada de su docte que trujo a poder de su marido, que fueron ciertas yeguas y vestidos, e ciertas piezas de plata".                                                                                                                                                                                                                                                                                                                                                                                                                                                                                                                                                                                                                                                                                                                                                                                                                                            |                                           |
|                                                                                                                                                                                                                                                                                                                                                                                                                                                                                                                                                                                                                                                                                                                                                                                                                                                                                                                                                                                                                                                                                                                                                                                                                                                                                                                                                                                                                                                                                                                                                                                                                                                                                                                                                                                                                                                        |                                           |
| Terminaba diciendo Diego Alcalde que si no se declaraba nulo el mandamiento dado, "protesto de me quejar de V.m. ante quien e con derecho deba e cobrar de su persona e bienes los dichos ochenta pesos e tantos tomines que son debidos, con todas las costas e daños e menoscabos".                                                                                                                                                                                                                                                                                                                                                                                                                                                                                                                                                                                                                                                                                                                                                                                                                                                                                                                                                                                                                                                                                                                                                                                                                                                                                                                                                                                                                                                                                                                                                                  |                                           |
|                                                                                                                                                                                                                                                                                                                                                                                                                                                                                                                                                                                                                                                                                                                                                                                                                                                                                                                                                                                                                                                                                                                                                                                                                                                                                                                                                                                                                                                                                                                                                                                                                                                                                                                                                                                                                                                        |                                           |
| Caja A–1, exp. 5, 10 ff.                                                                                                                                                                                                                                                                                                                                                                                                                                                                                                                                                                                                                                                                                                                                                                                                                                                                                                                                                                                                                                                                                                                                                                                                                                                                                                                                                                                                                                                                                                                                                                                                                                                                                                                                                                                                                               |                                           |
|                                                                                                                                                                                                                                                                                                                                                                                                                                                                                                                                                                                                                                                                                                                                                                                                                                                                                                                                                                                                                                                                                                                                                                                                                                                                                                                                                                                                                                                                                                                                                                                                                                                                                                                                                                                                                                                        |                                           |
|                                                                                                                                                                                                                                                                                                                                                                                                                                                                                                                                                                                                                                                                                                                                                                                                                                                                                                                                                                                                                                                                                                                                                                                                                                                                                                                                                                                                                                                                                                                                                                                                                                                                                                                                                                                                                                                        |                                           |
|                                                                                                                                                                                                                                                                                                                                                                                                                                                                                                                                                                                                                                                                                                                                                                                                                                                                                                                                                                                                                                                                                                                                                                                                                                                                                                                                                                                                                                                                                                                                                                                                                                                                                                                                                                                                                                                        |                                           |
| ---------------                                                                                                                                                                                                                                                                                                                                                                                                                                                                                                                                                                                                                                                                                                                                                                                                                                                                                                                                                                                                                                                                                                                                                                                                                                                                                                                                                                                                                                                                                                                                                                                                                                                                                                                                                                                                                                        |                                           |
|                                                                                                                                                                                                                                                                                                                                                                                                                                                                                                                                                                                                                                                                                                                                                                                                                                                                                                                                                                                                                                                                                                                                                                                                                                                                                                                                                                                                                                                                                                                                                                                                                                                                                                                                                                                                                                                        |                                           |
| (1) Juan de la Torre aparece como vecino de Colima por primera vez en 1537: Romero de Solís, Protocolos... (1999), regº 26, 139, 141. Era cordobés y llegó a Nueva España hacia 1532, con dos hermanas: Icaza (1999), II, nº 720. Casó con Polonia de Gamboa. Hija suya legítima fue María de la Torre quien casó con el vecino de México Fernando Zarfate. En la Villa de Colima ejerció la escribanía hasta 1565: infra, regº 65. En 1557, 1563 y 1564 fue alcalde ordinario; regidor lo fue en 1565. Fue asimismo corregidor de Tecolapa, Caxitlan y Santiago, en 1567-1568. Más datos, en: Romero de Solís, Andariegos y pobladores... (2001), 543-544.                                                                                                                                                                                                                                                                                                                                                                                                                                                                                                                                                                                                                                                                                                                                                                                                                                                                                                                                                                                                                                                                                                                                                                                            |                                           |
|                                                                                                                                                                                                                                                                                                                                                                                                                                                                                                                                                                                                                                                                                                                                                                                                                                                                                                                                                                                                                                                                                                                                                                                                                                                                                                                                                                                                                                                                                                                                                                                                                                                                                                                                                                                                                                                        |                                           |
| (2) Diego Alcalde era vallisoletano, hijo de Diego Alcalde y Marina Rueda; después de haber estado cuatro años en Cuba, pasó a la Nueva España con Garay y participó en la pacificación de Pánuco, los valles de Suchimilco [Espuchimilco], Autlán, Milpa, Jalisco, Motín y Chapala, así como en alzamientos localizados de Michoacán, Colima y la Nueva Galicia. Tuvo "casa poblada con famylia, armas y cauallo": Icaza (1969), II, nº 1062. En el Padrón de 1532, consta su vecindad en Colima "de cuatro años a esta parte" [1528], y no había recibido encomienda alguna aunque participó "en una entrada que se halló en esta villa", sin duda, para reprimir indios alzados, por lo cual se le consideraba "hombre provechoso para la villa": VP 51. De su primer matrimonio con una india de la tierra tuvo por hijos a una muchacha y al pendenciero "mestizo" Juan Alcalde, tocador de vihuela y lector de La Celestina; luego casó en segundas nupcias con Francisca Álvarez, a quien su hijastro acusaría de ser "una bellaca puerca", por supuestos antecedentes judíos: infra, regº 23. Con los años, Juan Alcalde de Rueda —como luego se hizo llamar—, por su matrimonio con María López de Robles, viuda de Rodrigo de Evia, recibió las encomiendas de Ostula y Coxumatlan, en los Motines, según los informes dados por Lebrón (1979), 46. Juan Alcalde, de su afición a la lectura, sacó luces para redactar una parte de la importante Relación de la Provincia de Motines, en 1580, cuando moraba en su cacaguatal conocido como "de Señor San Joseph, que está en términos del pueblo de Cuxumatlan, que es en esta provincia de los Motines, del obispado de Mechuacan": Acuña (1987), 156. A Diego de Alcalde le volveremos a encontrar en el siguiente regº, protagonizando un acto de solemne independencia: infra, regº 9. |                                           |
|                                                                                                                                                                                                                                                                                                                                                                                                                                                                                                                                                                                                                                                                                                                                                                                                                                                                                                                                                                                                                                                                                                                                                                                                                                                                                                                                                                                                                                                                                                                                                                                                                                                                                                                                                                                                                                                        |                                           |
| (3) Elvira de Arévalo, hija natural del conquistador Alonso de Arévalo.                                                                                                                                                                                                                                                                                                                                                                                                                                                                                                                                                                                                                                                                                                                                                                                                                                                                                                                                                                                                                                                                                                                                                                                                                                                                                                                                                                                                                                                                                                                                                                                                                                                                                                                                                                                |                                           |
|                                                                                                                                                                                                                                                                                                                                                                                                                                                                                                                                                                                                                                                                                                                                                                                                                                                                                                                                                                                                                                                                                                                                                                                                                                                                                                                                                                                                                                                                                                                                                                                                                                                                                                                                                                                                                                                        |                                           |
| (4) Por "pragmática".                                                                                                                                                                                                                                                                                                                                                                                                                                                                                                                                                                                                                                                                                                                                                                                                                                                                                                                                                                                                                                                                                                                                                                                                                                                                                                                                                                                                                                                                                                                                                                                                                                                                                                                                                                                                                                  |                                           |
|                                                                                                                                                                                                                                                                                                                                                                                                                                                                                                                                                                                                                                                                                                                                                                                                                                                                                                                                                                                                                                                                                                                                                                                                                                                                                                                                                                                                                                                                                                                                                                                                                                                                                                                                                                                                                                                        |                                           |
| (5) Sin más noticias acerca de Antón Caballero. Tal vez se trate de un letrado de la Real Audiencia de México, del que da cuenta Icaza (1969), II, nº 545.                                                                                                                                                                                                                                                                                                                                                                                                                                                                                                                                                                                                                                                                                                                                                                                                                                                                                                                                                                                                                                                                                                                                                                                                                                                                                                                                                                                                                                                                                                                                                                                                                                                                                             |                                           |
|                                                                                                                                                                                                                                                                                                                                                                                                                                                                                                                                                                                                                                                                                                                                                                                                                                                                                                                                                                                                                                                                                                                                                                                                                                                                                                                                                                                                                                                                                                                                                                                                                                                                                                                                                                                                                                                        |                                           |
| (6) Hermano del difunto Diego Garrido. Llegó a México en 1521 y como su hermano, natural de Moguer. Con Cortés fue a Pánuco y luego a Cíbola: Icaza (1969), II, nº 1083. Casó con María Ruiz de Monjaraz. Fue regidor en la Villa de Colima en 1551 y 1556, y alcalde ordinario en 1555. Falleció en 1557: Romero de Solís, Andariegos y pobladores... (2001), 167.                                                                                                                                                                                                                                                                                                                                                                                                                                                                                                                                                                                                                                                                                                                                                                                                                                                                                                                                                                                                                                                                                                                                                                                                                                                                                                                                                                                                                                                                                    |                                           |
|                                                                                                                                                                                                                                                                                                                                                                                                                                                                                                                                                                                                                                                                                                                                                                                                                                                                                                                                                                                                                                                                                                                                                                                                                                                                                                                                                                                                                                                                                                                                                                                                                                                                                                                                                                                                                                                        |                                           |
| (7) Catalina Garrida o de Arévalo, única hija nacida de su matrimonio con Diego Garrido, quien también tuvo por tutor a su tío Bartolomé Garrido. Catalina casaría luego con Pedro de Vivanco y, tras enviudar, con Miguel de Torres: Romero de Solís, Andariegos y pobladores... (2001), 43.                                                                                                                                                                                                                                                                                                                                                                                                                                                                                                                                                                                                                                                                                                                                                                                                                                                                                                                                                                                                                                                                                                                                                                                                                                                                                                                                                                                                                                                                                                                                                          |                                           |
|                                                                                                                                                                                                                                                                                                                                                                                                                                                                                                                                                                                                                                                                                                                                                                                                                                                                                                                                                                                                                                                                                                                                                                                                                                                                                                                                                                                                                                                                                                                                                                                                                                                                                                                                                                                                                                                        |                                           |
| (8) Rodrigo Maldonado fue alcalde mayor de Colima a fines de la década de los treinta, por lo menos desde 1537 a 1539, por cuanto en la matrícula de la hueste capitaneada por Francisco Vázquez Coronado, al pasar revista en Compostela el 22 de febrero de 1540, aparece nuestro alcalde con el cargo de capitán llevando consigo cinco caballos. También sabemos que don Rodrigo, en ese mismo año, fungía de tesorero en la expedición organizada por Fernando de Alarcón: Romero de Solís, Colima marinera en el siglo XVI (1994), 30-31. De regreso, se avecindó en la ciudad de México donde casó con Luisa de Aux, viuda de Diego Dávila Salazar e hija de Miguel Díaz de Aux, quien también estuviera en la conquista de Colima: Icaza (1969), I, nº 127. Por cierto que doña Luisa topó con la Inquisición y, más tarde, juzgada y sentenciada a ser decapitada por la crueldad con que trataba a sirvientes y esclavos. Entre 1550 y 1553, fue alcalde mayor de Michoacán: Paredes Martínez (1994), n° 1 y 193. Más datos biográficos suyos, en: Porras Muñoz (1982), 344-347.                                                                                                                                                                                                                                                                                                                                                                                                                                                                                                                                                                                                                                                                                                                                                             |                                           |
|                                                                                                                                                                                                                                                                                                                                                                                                                                                                                                                                                                                                                                                                                                                                                                                                                                                                                                                                                                                                                                                                                                                                                                                                                                                                                                                                                                                                                                                                                                                                                                                                                                                                                                                                                                                                                                                        |                                           |
| (9) A la letra: el docte; por cierto, variante que no registra el Léxico hispanoamericano del siglo XVI de Boyd–Bowman (1971).                                                                                                                                                                                                                                                                                                                                                                                                                                                                                                                                                                                                                                                                                                                                                                                                                                                                                                                                                                                                                                                                                                                                                                                                                                                                                                                                                                                                                                                                                                                                                                                                                                                                                                                         |                                           |
+--------------------------------------------------------------------------------------------------------------------------------------------------------------------------------------------------------------------------------------------------------------------------------------------------------------------------------------------------------------------------------------------------------------------------------------------------------------------------------------------------------------------------------------------------------------------------------------------------------------------------------------------------------------------------------------------------------------------------------------------------------------------------------------------------------------------------------------------------------------------------------------------------------------------------------------------------------------------------------------------------------------------------------------------------------------------------------------------------------------------------------------------------------------------------------------------------------------------------------------------------------------------------------------------------------------------------------------------------------------------------------------------------------------------------------------------------------------------------------------------------------------------------------------------------------------------------------------------------------------------------------------------------------------------------------------------------------------------------------------------------------------------------------------------------------------------------------------------------------+-------------------------------------------+

Documento(s) original(es)

Archivo no encontrado (CAJAS/CAJA1/EXP5/002V.jpg)

Archivo no encontrado (CAJAS/CAJA1/EXP5/003V.jpg)

Archivo no encontrado (CAJAS/CAJA1/EXP5/009F.jpg)

[]
1F

[]
1V

[]
2F

[]
3F

[]
4F

[]
4V

[]
5F

[]
5V

[]
6F

[]
6V

[]
7F

[]
7V

[]
8F

[]
8V

[]
9V

[]
10F

[]
10V

Proyecto interinstitucional del Archivo Histórico del Municipio de Colima y la Universidad de Colima,
realizado bajo los auspicios del fondo Ramón Álvarez-Buylla de Aldana.

------------------------------------------------------------------------

ISBN 978-968-7412-85-6
® Derechos Reservados 2008. Archivo Histórico del Municipio de Colima.

1,078 visitas
