+--------------------------------------------------------------------------------------------------------------------------------------------------------------------------------------------------------------------------------------------------------------------------------------------------------------------------------------------------------------------------------------------------------------------------------------------------------------------------------------------------------------------------------------------------------------------------------------------------------------------------------------------------------------------------------------------------------------------------------------------------------------------------------------------------------------------------------------------------------------------------------------------------------------------------------------------------------------------------------------------------------------------------------------------------------------------------------------------------------------------------------------------------------------------------------------------------------------------------------------------------------------------------------------------------------+---------------------------------------+-----------------------+
| []                                                                                                                                                                                                                                                                                                                                                                                                                                                                                                                                                                                                                                                                                                                                                                                                                                                                                                                                                                                                                                                                                                                                                                                                                                                                                                     | LA VILLA DE COLIMA DE LA NUEVA ESPAÑA | []                    |
|                                                                                                                                                                                                                                                                                                                                                                                                                                                                                                                                                                                                                                                                                                                                                                                                                                                                                                                                                                                                                                                                                                                                                                                                                                                                                                        | SIGLO XVI                             |                       |
|                                                                                                                                                                                                                                                                                                                                                                                                                                                                                                                                                                                                                                                                                                                                                                                                                                                                                                                                                                                                                                                                                                                                                                                                                                                                                                        |                                       |                       |
|                                                                                                                                                                                                                                                                                                                                                                                                                                                                                                                                                                                                                                                                                                                                                                                                                                                                                                                                                                                                                                                                                                                                                                                                                                                                                                        | VOLUMEN I      (CAJAS 1-11)           |                       |
+--------------------------------------------------------------------------------------------------------------------------------------------------------------------------------------------------------------------------------------------------------------------------------------------------------------------------------------------------------------------------------------------------------------------------------------------------------------------------------------------------------------------------------------------------------------------------------------------------------------------------------------------------------------------------------------------------------------------------------------------------------------------------------------------------------------------------------------------------------------------------------------------------------------------------------------------------------------------------------------------------------------------------------------------------------------------------------------------------------------------------------------------------------------------------------------------------------------------------------------------------------------------------------------------------------+---------------------------------------+-----------------------+
| Inicio | Búsquedas | Siglas y bibliografía | Cartografía | Créditos | Más información                                                                                                                                                                                                                                                                                                                                                                                                                                                                                                                                                                                                                                                                                                                                                                                                                                                                                                                                                                                                                                                                                                                                                                                                                  |                                       | []                    |
+--------------------------------------------------------------------------------------------------------------------------------------------------------------------------------------------------------------------------------------------------------------------------------------------------------------------------------------------------------------------------------------------------------------------------------------------------------------------------------------------------------------------------------------------------------------------------------------------------------------------------------------------------------------------------------------------------------------------------------------------------------------------------------------------------------------------------------------------------------------------------------------------------------------------------------------------------------------------------------------------------------------------------------------------------------------------------------------------------------------------------------------------------------------------------------------------------------------------------------------------------------------------------------------------------------+---------------------------------------+-----------------------+
| Búsqueda rápida                                                                                                                                                                                                                                                                                                                                                                                                                                                                                                                                                                                                                                                                                                                                                                                                                                                                                                                                                                                                                                                                                                                                                                                                                                                                                        |                                       |                       |
|                                                                                                                                                                                                                                                                                                                                                                                                                                                                                                                                                                                                                                                                                                                                                                                                                                                                                                                                                                                                                                                                                                                                                                                                                                                                                                        |                                       |                       |
| +:------------------------------------------------------------------------------------------------------------------------------------------------------------------------------------------------------------------------------------------------------------------------------------------------------------------------------------------------------------------------------------------------------------------------------------------------------------------------------------------------------------------------------------------------------------------------------------------------------------------------------------------------------------------------------------------------------------------------------------------------------------------------------------------------------------------------------------------------------------------------------------------------------------------------------------------------------------------------------------------------------------------------------------------------------------------------------------------------------------------------------------------------------------------------------------------------------------------------------------------------------:+------------------------------------------:+ |                                       |                       |
| | Fecha:                                                                                                                                                                                                                                                                                                                                                                                                                                                                                                                                                                                                                                                                                                                                                                                                                                                                                                                                                                                                                                                                                                                                                                                                                                                 | Ubicación física del documento original:  | |                                       |                       |
| | 1579 Julio, 22                                                                                                                                                                                                                                                                                                                                                                                                                                                                                                                                                                                                                                                                                                                                                                                                                                                                                                                                                                                                                                                                                                                                                                                                                                         | CAJA A-7, EXP. 3, 4 FF.                   | |                                       |                       |
| |                                                                                                                                                                                                                                                                                                                                                                                                                                                                                                                                                                                                                                                                                                                                                                                                                                                                                                                                                                                                                                                                                                                                                                                                                                                        | Archivo Histórico del Municipio de Colima | |                                       |                       |
| +--------------------------------------------------------------------------------------------------------------------------------------------------------------------------------------------------------------------------------------------------------------------------------------------------------------------------------------------------------------------------------------------------------------------------------------------------------------------------------------------------------------------------------------------------------------------------------------------------------------------------------------------------------------------------------------------------------------------------------------------------------------------------------------------------------------------------------------------------------------------------------------------------------------------------------------------------------------------------------------------------------------------------------------------------------------------------------------------------------------------------------------------------------------------------------------------------------------------------------------------------------+-------------------------------------------+ |                                       |                       |
| | 238. 1579. Julio, 22.                                                                                                                                                                                                                                                                                                                                                                                                                                                                                                                                                                                                                                                                                                                                                                                                                                                                                                                                                                                                                                                                                                                                                                                                                                  |                                           | |                                       |                       |
| |                                                                                                                                                                                                                                                                                                                                                                                                                                                                                                                                                                                                                                                                                                                                                                                                                                                                                                                                                                                                                                                                                                                                                                                                                                                        |                                           | |                                       |                       |
| | Contra Juan de Arana, por estar amancebado con una india que se trajo de La Guava.                                                                                                                                                                                                                                                                                                                                                                                                                                                                                                                                                                                                                                                                                                                                                                                                                                                                                                                                                                                                                                                                                                                                                                     |                                           | |                                       |                       |
| |                                                                                                                                                                                                                                                                                                                                                                                                                                                                                                                                                                                                                                                                                                                                                                                                                                                                                                                                                                                                                                                                                                                                                                                                                                                        |                                           | |                                       |                       |
| | El alcalde mayor Juan Arce de Cueva,^([1]) por convenir "al servicio de Dios Nuestro Señor y de Su Majestad que las ofensas fechas a Dios Nuestro Señor sean castigadas y porque ha venido a su noticia que Juan de Arana, mozo soltero, hijo de Isabel de Monjaraz, viuda vecina desta Villa, puede haber dos años poco más o menos que el susodicho trujo de la provincia de Zacatula^([2]) una india casada, según dicen hurtada, con la cual ha estado públicamente amancebado; y lo tiene de costumbre traer indias hurtadas y tenerlas en casa de la dicha su madre, como las tiene, comiendo e durmiendo con ellas. Y porque semejantes ofensas y pecados públicos sean castigados, mandó de oficio hacer la información siguiente, y así lo proveyó e mandó e lo firmó".                                                                                                                                                                                                                                                                                                                                                                                                                                                                       |                                           | |                                       |                       |
| |                                                                                                                                                                                                                                                                                                                                                                                                                                                                                                                                                                                                                                                                                                                                                                                                                                                                                                                                                                                                                                                                                                                                                                                                                                                        |                                           | |                                       |                       |
| | El alcalde ordenó comparecer a Juana, india, que es la contenida en la cabeza de proceso, "la cual por se haber muerto su marido, dijo que se quería casar con Pedro Portugués, esclavo, por lo cual la susodicha pidió la pusiesen en su libertad, y de su pedimiento el Padre vicario Francisco Ruiz la mandó depositar en casa de Catalina López. Por muchas veces la dicha india dijo se quería casar con el dicho esclavo, y el dicho Juan de Arana, como estaba con ella amancebado y con saber que incurría en pena de descomunión, por se lo estorbar, anduvo por le hablar sobre ello y no teniendo lugar, le dijo a una esclava de Juan Gómez llamada Juana que le hablase, y la convenció tanto que tomó un billete que el dicho Juan de Arana le envió para lo llevar al dicho Vicario". "Aunque la dicha india no sabía lo que le llevaba, lo dio al dicho Vicario, por el cual se contradecía", estando como estaba "en su propósito de se casar". De esta manera, Juan de Arana venía impidiendo el matrimonio entre Juana y el esclavo.                                                                                                                                                                                                |                                           | |                                       |                       |
| |                                                                                                                                                                                                                                                                                                                                                                                                                                                                                                                                                                                                                                                                                                                                                                                                                                                                                                                                                                                                                                                                                                                                                                                                                                                        |                                           | |                                       |                       |
| | El alcalde mediante el intérprete de su juzgado Pedro Vázquez le tomó la confesión. Dijo llamarse Juana, natural de La Guava,^([3]) viuda desde hace mucho, y que tenía 24 años de edad. Declaró que Juan de Arana la trajo de su tierra, que hará dos años cuando el dicho Arana estuvo en La Guava y le habló y tuvo acceso carnal con ella, y luego le rogó que se viniese con él a esta tierra y la tendría en casa de su madre, dándole todo lo que hubiese menester, y la querría mucho. Viniendo pues con él, la trujo a casa de su madre, donde durante "todo este dicho tiempo ha estado con el susodicho amancebada y durmiendo con él y sirviéndole y lavándole su ropa y todo lo demás", hasta que se quiso casar y se salió de su compañía, por estar en servicio de Dios".                                                                                                                                                                                                                                                                                                                                                                                                                                                               |                                           | |                                       |                       |
| |                                                                                                                                                                                                                                                                                                                                                                                                                                                                                                                                                                                                                                                                                                                                                                                                                                                                                                                                                                                                                                                                                                                                                                                                                                                        |                                           | |                                       |                       |
| | Agregó que para no seguir amancebada, se quiso casar y sobre ello le habló al Padre vicario en repetidas ocasiones manifestando que se quería casar con Pedro, negro, y que por ello el Padre vicario la depositó en casa de Catalina López. "Y que estando depositada, ayer martes le habló Juana, negra esclava de Juan Gómez, e le dio una carta por mandado del dicho Juan de Arana para que la diese al Padre vicario, y no sabía lo que la dicha carta decía, y ansimismo le habló el dicho Juan de Arana para que no se casase con el dicho negro, e que él la sacaría de adonde estaba y la llevaría a donde ella quisiese, y que antes de agora la dicha negra Juana por mandado del dicho Juan de Arana le había hablado muchas veces para le estorbar el dicho matrimonio".                                                                                                                                                                                                                                                                                                                                                                                                                                                                 |                                           | |                                       |                       |
| |                                                                                                                                                                                                                                                                                                                                                                                                                                                                                                                                                                                                                                                                                                                                                                                                                                                                                                                                                                                                                                                                                                                                                                                                                                                        |                                           | |                                       |                       |
| | Preguntada si Arana le había pagado el tiempo que le había servido, respondió que "lo que le ha dado en este tiempo, ha sido dos güipiles,^([4]) con los cuales le ha servido e no le ha dado otra cosa". Se le preguntó también si sabía que Arana hubiese "traído hurtadas otras indias de otros pueblos, en especial una india llamada Luisa, natural del pueblo de Tuzpa". Contestó que Juan de Arana le mandó decir a esta confesante con una india, que se casase, "que ya había traído una india del pueblo de Tuzpa, que se llama Luisa, y no sabe qué otras indias haya traído".                                                                                                                                                                                                                                                                                                                                                                                                                                                                                                                                                                                                                                                              |                                           | |                                       |                       |
| |                                                                                                                                                                                                                                                                                                                                                                                                                                                                                                                                                                                                                                                                                                                                                                                                                                                                                                                                                                                                                                                                                                                                                                                                                                                        |                                           | |                                       |                       |
| | El 24 de julio, el alcalde mayor tomó declaración a Juan de Arana quien dijo ser natural de esta Villa de Colima y ser soltero y que tiene más de 20 años.                                                                                                                                                                                                                                                                                                                                                                                                                                                                                                                                                                                                                                                                                                                                                                                                                                                                                                                                                                                                                                                                                             |                                           | |                                       |                       |
| |                                                                                                                                                                                                                                                                                                                                                                                                                                                                                                                                                                                                                                                                                                                                                                                                                                                                                                                                                                                                                                                                                                                                                                                                                                                        |                                           | |                                       |                       |
| | Confesó que hará año y medio trujo de La Guava a la dicha Juana, india, para el servicio de su madre, y que durante este tiempo "ha tenido algunas veces acceso carnal con ella". Negó sin embargo que en el tiempo que llevaba depositada por el Padre vicario en casa de Catalina López, le haya hablado o le haya enviado recados con la negra Juana. Preguntado si sabía que Juana era mujer casada, respondió que "a otro camino que hizo a La Guava", supo por los parientes de ella que era casada, pero que "el marido andaba ausente della porque no quería hacer vida con ella". El alcalde entonces le dijo a Arana que por qué motivo al saber que era casada no la había tornado a llevar a su pueblo, a lo que respondió: "después de haber sabido este confesante que la dicha india era casada, en aquella sazón la susodicha se salió de casa de su madre y se fue a Los Motines, que es cerca de su tierra, y nunca más la procuró"; luego ella regresó a casa de su madre y de allí salió para ser depositada como dicho es. Finalmente se le preguntó si le habían pagado a Juana el tiempo que había servido en casa de su madre; respondió Arana que no sólo se le había pagado, sino que incluso "la dicha india debe dineros". |                                           | |                                       |                       |
| |                                                                                                                                                                                                                                                                                                                                                                                                                                                                                                                                                                                                                                                                                                                                                                                                                                                                                                                                                                                                                                                                                                                                                                                                                                                        |                                           | |                                       |                       |
| | Llamada a declarar como testigo, María, india natural del pueblo de Zapotitlan, mediante el intérprete Pedro Vázquez, dijo conocer a Juan de Arana y a Juana, natural de La Guava, y que en el tiempo que Juana había estado en casa de Arana, la había visto "que le servía de noche y de día en todo lo que le mandaba, e le lavaba la ropa y le guardaba todo su hato" y dineros, "y todo cuanto el susodicho tenía", y es todo lo que sabe al respecto. Interrogada acerca del pago del tiempo que Juana había servido, respondió que no sabía si le habían pagado, pero que sí le habían dado "dos pares de enaguas y dos güipiles, y le parece a esta testigo que todo ello podrá valer nueve pesos poco más o menos", y que también le habían dado "una manta delgada, que es una pierna de Campeche, y no sabe lo que valía, e una faja de paño, y no sabe otra cosa más de lo que dicho tiene". La testigo dijo tener más de 20 años.                                                                                                                                                                                                                                                                                                         |                                           | |                                       |                       |
| |                                                                                                                                                                                                                                                                                                                                                                                                                                                                                                                                                                                                                                                                                                                                                                                                                                                                                                                                                                                                                                                                                                                                                                                                                                                        |                                           | |                                       |                       |
| | El mismo día 24, Juan de Arana, "preso en esta cárcel pública" y que por cuanto "yo no he cometido delito por do deba estar preso y vejado, y tengo negocios de importancia" y que por estar en la cárcel, "se me pierde mi hacienda", pedía al alcalde mayor que "me mande soltar en fiado por honra de las fiestas, que yo estoy presto de dar fianzas".                                                                                                                                                                                                                                                                                                                                                                                                                                                                                                                                                                                                                                                                                                                                                                                                                                                                                             |                                           | |                                       |                       |
| |                                                                                                                                                                                                                                                                                                                                                                                                                                                                                                                                                                                                                                                                                                                                                                                                                                                                                                                                                                                                                                                                                                                                                                                                                                                        |                                           | |                                       |                       |
| | Cristóbal de Solórzano, vecino de la Villa, se presentó como fiador, y "por tanto que él tomaba e recibió preso y encarcelado a voz de carcelero" a Juan de Arana, prometiendo que cuando así se dispusiera, lo tornaría a dar y entregar a la justicia. Fueron testigos Juan Fernández, Gonzalo Moreno y Pedro Vázquez, vecinos de Colima.                                                                                                                                                                                                                                                                                                                                                                                                                                                                                                                                                                                                                                                                                                                                                                                                                                                                                                            |                                           | |                                       |                       |
| |                                                                                                                                                                                                                                                                                                                                                                                                                                                                                                                                                                                                                                                                                                                                                                                                                                                                                                                                                                                                                                                                                                                                                                                                                                                        |                                           | |                                       |                       |
| | Caja A–7, exp. 3, 4 ff.                                                                                                                                                                                                                                                                                                                                                                                                                                                                                                                                                                                                                                                                                                                                                                                                                                                                                                                                                                                                                                                                                                                                                                                                                                |                                           | |                                       |                       |
| |                                                                                                                                                                                                                                                                                                                                                                                                                                                                                                                                                                                                                                                                                                                                                                                                                                                                                                                                                                                                                                                                                                                                                                                                                                                        |                                           | |                                       |                       |
| |                                                                                                                                                                                                                                                                                                                                                                                                                                                                                                                                                                                                                                                                                                                                                                                                                                                                                                                                                                                                                                                                                                                                                                                                                                                        |                                           | |                                       |                       |
| |                                                                                                                                                                                                                                                                                                                                                                                                                                                                                                                                                                                                                                                                                                                                                                                                                                                                                                                                                                                                                                                                                                                                                                                                                                                        |                                           | |                                       |                       |
| | ---------------                                                                                                                                                                                                                                                                                                                                                                                                                                                                                                                                                                                                                                                                                                                                                                                                                                                                                                                                                                                                                                                                                                                                                                                                                                        |                                           | |                                       |                       |
| |                                                                                                                                                                                                                                                                                                                                                                                                                                                                                                                                                                                                                                                                                                                                                                                                                                                                                                                                                                                                                                                                                                                                                                                                                                                        |                                           | |                                       |                       |
| | (1) Juan Arce de Cueva o Cuevas, entre 1579 y 1580, fue alcalde mayor de Colima. Quizá pudiera tratarse del Juan de Arce, "vezino de Compostela, y natural del Valle de Buelva, que es en las Montañas de Santander, e hijo legítimo de Hernando de Arze y de doña Joana de Bustamente", quien tras pasar a la Nueva España, "se halló en la húltima paçificaçión de la Nueua Galizia, con sus armas y cauallo; y que tiene en encomyenda por Françisco Vázquez Coronado, vnos yndios serranos, yndómytos, que no le dan nynguna cosa, por lo qual padesçe neçesidad": Icaza (1969), II, nº 1191.                                                                                                                                                                                                                                                                                                                                                                                                                                                                                                                                                                                                                                                      |                                           | |                                       |                       |
| |                                                                                                                                                                                                                                                                                                                                                                                                                                                                                                                                                                                                                                                                                                                                                                                                                                                                                                                                                                                                                                                                                                                                                                                                                                                        |                                           | |                                       |                       |
| | (2) Para estas fechas, los vínculos entre Colima y Zacatula ya eran muy débiles.                                                                                                                                                                                                                                                                                                                                                                                                                                                                                                                                                                                                                                                                                                                                                                                                                                                                                                                                                                                                                                                                                                                                                                       |                                           | |                                       |                       |
| |                                                                                                                                                                                                                                                                                                                                                                                                                                                                                                                                                                                                                                                                                                                                                                                                                                                                                                                                                                                                                                                                                                                                                                                                                                                        |                                           | |                                       |                       |
| | (3) Cuando Gaspar Juárez visitó la provincia de Zacatula, registró entre sus pueblos La Guava, bajo el nombre de Lacoaba, a la sazón encomienda de Pedro Ruiz de Guadalcanal, y la describió así: "este pueblo y su subjeto tiene quinientos hombres de seruicio: está en la costa de la mar a veinte leguas de Çacatula. Los términos son sierras muy ásperas: terná de término por lo ancho dos leguas y por largo seis o siete. En lo que sirue es dar bastimentos en minas de oro, y quando esto no hazen, dan algún horo en poluo, y otras menudençias que pueden valer hasta doçientos pesos de oro de minas. Parte términos con Topetina y Texupa": SV 880. A Pedro Ruiz le sucedió en la encomienda, su yerno Diego de Castrejón, y a la muerte de éste, su viuda. Estos y otros datos, en: Gerhard (1986), 403-406.                                                                                                                                                                                                                                                                                                                                                                                                                           |                                           | |                                       |                       |
| |                                                                                                                                                                                                                                                                                                                                                                                                                                                                                                                                                                                                                                                                                                                                                                                                                                                                                                                                                                                                                                                                                                                                                                                                                                                        |                                           | |                                       |                       |
| | (4) La etimología y significado de huipil: supra regº 68.                                                                                                                                                                                                                                                                                                                                                                                                                                                                                                                                                                                                                                                                                                                                                                                                                                                                                                                                                                                                                                                                                                                                                                                              |                                           | |                                       |                       |
| +--------------------------------------------------------------------------------------------------------------------------------------------------------------------------------------------------------------------------------------------------------------------------------------------------------------------------------------------------------------------------------------------------------------------------------------------------------------------------------------------------------------------------------------------------------------------------------------------------------------------------------------------------------------------------------------------------------------------------------------------------------------------------------------------------------------------------------------------------------------------------------------------------------------------------------------------------------------------------------------------------------------------------------------------------------------------------------------------------------------------------------------------------------------------------------------------------------------------------------------------------------+-------------------------------------------+ |                                       |                       |
|                                                                                                                                                                                                                                                                                                                                                                                                                                                                                                                                                                                                                                                                                                                                                                                                                                                                                                                                                                                                                                                                                                                                                                                                                                                                                                        |                                       |                       |
|   ---------------------------------------------------------------------------------------------------                                                                                                                                                                                                                                                                                                                                                                                                                                                                                                                                                                                                                                                                                                                                                                                                                                                                                                                                                                                                                                                                                                                                                                                                  |                                       |                       |
|    Documento(s) original(es)                                                                                                                                                                                                                                                                                                                                                                                                                                                                                                                                                                                                                                                                                                                                                                                                                                                                                                                                                                                                                                                                                                                                                                                                                                                                           |                                       |                       |
|   --------------------------- ------- ------- ------- ------- ------- ------- ------- ------- -------                                                                                                                                                                                                                                                                                                                                                                                                                                                                                                                                                                                                                                                                                                                                                                                                                                                                                                                                                                                                                                                                                                                                                                                                  |                                       |                       |
|               []                []      []      []      []      []      []      []                                                                                                                                                                                                                                                                                                                                                                                                                                                                                                                                                                                                                                                                                                                                                                                                                                                                                                                                                                                                                                                                                                                                                                                                                     |                                       |                       |
|               1F                1V      2F      2V      3F      3V      4F      4V                                                                                                                                                                                                                                                                                                                                                                                                                                                                                                                                                                                                                                                                                                                                                                                                                                                                                                                                                                                                                                                                                                                                                                                                                     |                                       |                       |
|                                                                                                                                                                                                                                                                                                                                                                                                                                                                                                                                                                                                                                                                                                                                                                                                                                                                                                                                                                                                                                                                                                                                                                                                                                                                                                        |                                       |                       |
|   ---------------------------------------------------------------------------------------------------                                                                                                                                                                                                                                                                                                                                                                                                                                                                                                                                                                                                                                                                                                                                                                                                                                                                                                                                                                                                                                                                                                                                                                                                  |                                       |                       |
+--------------------------------------------------------------------------------------------------------------------------------------------------------------------------------------------------------------------------------------------------------------------------------------------------------------------------------------------------------------------------------------------------------------------------------------------------------------------------------------------------------------------------------------------------------------------------------------------------------------------------------------------------------------------------------------------------------------------------------------------------------------------------------------------------------------------------------------------------------------------------------------------------------------------------------------------------------------------------------------------------------------------------------------------------------------------------------------------------------------------------------------------------------------------------------------------------------------------------------------------------------------------------------------------------------+---------------------------------------+-----------------------+
| Proyecto interinstitucional del Archivo Histórico del Municipio de Colima y la Universidad de Colima,                                                                                                                                                                                                                                                                                                                                                                                                                                                                                                                                                                                                                                                                                                                                                                                                                                                                                                                                                                                                                                                                                                                                                                                                  |                                       |                       |
| realizado bajo los auspicios del fondo Ramón Álvarez-Buylla de Aldana.                                                                                                                                                                                                                                                                                                                                                                                                                                                                                                                                                                                                                                                                                                                                                                                                                                                                                                                                                                                                                                                                                                                                                                                                                                 |                                       |                       |
|                                                                                                                                                                                                                                                                                                                                                                                                                                                                                                                                                                                                                                                                                                                                                                                                                                                                                                                                                                                                                                                                                                                                                                                                                                                                                                        |                                       |                       |
| ------------------------------------------------------------------------                                                                                                                                                                                                                                                                                                                                                                                                                                                                                                                                                                                                                                                                                                                                                                                                                                                                                                                                                                                                                                                                                                                                                                                                                               |                                       |                       |
|                                                                                                                                                                                                                                                                                                                                                                                                                                                                                                                                                                                                                                                                                                                                                                                                                                                                                                                                                                                                                                                                                                                                                                                                                                                                                                        |                                       |                       |
| ISBN 978-968-7412-85-6                                                                                                                                                                                                                                                                                                                                                                                                                                                                                                                                                                                                                                                                                                                                                                                                                                                                                                                                                                                                                                                                                                                                                                                                                                                                                 |                                       |                       |
| ® Derechos Reservados 2008. Archivo Histórico del Municipio de Colima.                                                                                                                                                                                                                                                                                                                                                                                                                                                                                                                                                                                                                                                                                                                                                                                                                                                                                                                                                                                                                                                                                                                                                                                                                                 |                                       |                       |
+--------------------------------------------------------------------------------------------------------------------------------------------------------------------------------------------------------------------------------------------------------------------------------------------------------------------------------------------------------------------------------------------------------------------------------------------------------------------------------------------------------------------------------------------------------------------------------------------------------------------------------------------------------------------------------------------------------------------------------------------------------------------------------------------------------------------------------------------------------------------------------------------------------------------------------------------------------------------------------------------------------------------------------------------------------------------------------------------------------------------------------------------------------------------------------------------------------------------------------------------------------------------------------------------------------+---------------------------------------+-----------------------+

1,078 visitas
