+-----------------------------------------------------------------------------------------------------------------------------------------------------------------+-----------------------+-----------------------+
| []                                                                                                                                                              |                       |                       |
|                                                                                                                                                                 |                       |                       |
| +-----------------------------------+:-------------------------------------:+                                                                                   |                       |                       |
| | []                                | LA VILLA DE COLIMA DE LA NUEVA ESPAÑA |                                                                                   |                       |                       |
| |                                   | SIGLO XVI                             |                                                                                   |                       |                       |
| |                                   |                                       |                                                                                   |                       |                       |
| |                                   | VOLUMEN II      (CAJAS 12-20)         |                                                                                   |                       |                       |
| +-----------------------------------+---------------------------------------+                                                                                   |                       |                       |
+-----------------------------------------------------------------------------------------------------------------------------------------------------------------+-----------------------+-----------------------+
| +------------------------------------------------------------------------+---------------------------+-----------------------+                                  |                       |                       |
| | Inicio | Búsqueda | Siglas y bibliografía | Créditos | Más información | (consulta las cajas 1-11) |    [ES]               |                                  |                       |                       |
| +------------------------------------------------------------------------+---------------------------+-----------------------+                                  |                       |                       |
+-----------------------------------------------------------------------------------------------------------------------------------------------------------------+-----------------------+-----------------------+
| Búsqueda rápida                                                                                                                                                 |                       |                       |
|                                                                                                                                                                 |                       |                       |
| +:-------------------:+-----------------+:----------------------------------------:+----------------:+                                                          |                       |                       |
| | Documento de fecha: |                 | Ubicación física del documento original: | [] [] []        |                                                          |                       |                       |
| |                     |                 |                                          |                 |                                                          |                       |                       |
| | 1597. Julio, 23     |                 | Caja 19, exp. 1, ff. 282-288.^([900])    |                 |                                                          |                       |                       |
| +---------------------+-----------------+------------------------------------------+-----------------+                                                          |                       |                       |
|                                                                                                                                                                 |                       |                       |
|   ------------- ----------------------------------------------------------------                                                                                |                       |                       |
|   Resumen:      Almoneda de los bienes raíces de Francisca de Saldaña, difunta                                                                                  |                       |                       |
|   ------------- ----------------------------------------------------------------                                                                                |                       |                       |
|                                                                                                                                                                 |                       |                       |
|   ----------------------------------- ------------------------------------------------------------------------------------------------------------------------- |                       |                       |
|   Contenido:                          Almoneda de los bienes raíces de los herederos de Francisca de Saldaña, difunta.                                          |                       |                       |
|                                       Antón y Antonillo, negros de Gaspar Román, cantaron los pregones.                                                         |                       |                       |
|                                       El 14 de agosto, Cristóbal Hernández de Tene ponía precio al medio cuarto de huerta de cacao en Caxitlan, en 350 pesos.   |                       |                       |
|                                       El 17 de agosto, Alonso García Nomparte pujaba con 400 pesos.                                                             |                       |                       |
|                                       Pregones y remates.                                                                                                       |                       |                       |
|                                                                                                                                                                 |                       |                       |
|   ----------------------------------- ------------------------------------------------------------------------------------------------------------------------- |                       |                       |
|                                                                                                                                                                 |                       |                       |
| (900) Antes en caja 18, exp. 1.                                                                                                                                 |                       |                       |
|                                                                                                                                                                 |                       |                       |
|   ---------------------------------------------------------------------------------------------------                                                           |                       |                       |
|    Documento(s) original(es)                                                                                                                                    |                       |                       |
|   --------------------------- ------- ------- ------- ------- ------- ------- ------- ------- -------                                                           |                       |                       |
|               []                []      []      []      []      []      []      []      []      []                                                              |                       |                       |
|              282f              282v    283f    283v    284f    284v    285f    285v    286f    286v                                                             |                       |                       |
|                                                                                                                                                                 |                       |                       |
|               []                []      []      []                                                                                                              |                       |                       |
|              287f              287v    288f    288v                                                                                                             |                       |                       |
|   ---------------------------------------------------------------------------------------------------                                                           |                       |                       |
+-----------------------------------------------------------------------------------------------------------------------------------------------------------------+-----------------------+-----------------------+
| +----------------------------------------------------------------------------+------------------------------------------------+                                 |                       |                       |
| | ISBN 978-607-701-024-1                                                     |   ---- ---- ---- ---- ---- ---- ---- ---- ---- |                                 |                       |                       |
| | © Derechos Reservados 2013. Archivo Histórico del Municipio de Colima. [*] |   []        []        []        []        []   |                                 |                       |                       |
| |                                                                            |   ---- ---- ---- ---- ---- ---- ---- ---- ---- |                                 |                       |                       |
| +----------------------------------------------------------------------------+------------------------------------------------+                                 |                       |                       |
| |                                                                            |                                                |                                 |                       |                       |
| +----------------------------------------------------------------------------+------------------------------------------------+                                 |                       |                       |
+-----------------------------------------------------------------------------------------------------------------------------------------------------------------+-----------------------+-----------------------+

615 visitas
