+------------------------------------------------------------------------------------------------------------------------------------------------------------------------------------------------------------------------------------------------------------------------------------------------------------------------------------------------------------------------------------------------------------------------------------------------------------+-----------------------+-----------------------+
| []                                                                                                                                                                                                                                                                                                                                                                                                                                                         |                       |                       |
|                                                                                                                                                                                                                                                                                                                                                                                                                                                            |                       |                       |
| +-----------------------------------+:-------------------------------------:+                                                                                                                                                                                                                                                                                                                                                                              |                       |                       |
| | []                                | LA VILLA DE COLIMA DE LA NUEVA ESPAÑA |                                                                                                                                                                                                                                                                                                                                                                              |                       |                       |
| |                                   | SIGLO XVI                             |                                                                                                                                                                                                                                                                                                                                                                              |                       |                       |
| |                                   |                                       |                                                                                                                                                                                                                                                                                                                                                                              |                       |                       |
| |                                   | VOLUMEN II      (CAJAS 12-20)         |                                                                                                                                                                                                                                                                                                                                                                              |                       |                       |
| +-----------------------------------+---------------------------------------+                                                                                                                                                                                                                                                                                                                                                                              |                       |                       |
+------------------------------------------------------------------------------------------------------------------------------------------------------------------------------------------------------------------------------------------------------------------------------------------------------------------------------------------------------------------------------------------------------------------------------------------------------------+-----------------------+-----------------------+
| +------------------------------------------------------------------------+---------------------------+-----------------------+                                                                                                                                                                                                                                                                                                                             |                       |                       |
| | Inicio | Búsqueda | Siglas y bibliografía | Créditos | Más información | (consulta las cajas 1-11) |    [ES]               |                                                                                                                                                                                                                                                                                                                             |                       |                       |
| +------------------------------------------------------------------------+---------------------------+-----------------------+                                                                                                                                                                                                                                                                                                                             |                       |                       |
+------------------------------------------------------------------------------------------------------------------------------------------------------------------------------------------------------------------------------------------------------------------------------------------------------------------------------------------------------------------------------------------------------------------------------------------------------------+-----------------------+-----------------------+
| Búsqueda rápida                                                                                                                                                                                                                                                                                                                                                                                                                                            |                       |                       |
|                                                                                                                                                                                                                                                                                                                                                                                                                                                            |                       |                       |
| +:-------------------:+-----------------+:----------------------------------------:+----------------:+                                                                                                                                                                                                                                                                                                                                                     |                       |                       |
| | Documento de fecha: |                 | Ubicación física del documento original: | [] [] []        |                                                                                                                                                                                                                                                                                                                                                     |                       |                       |
| |                     |                 |                                          |                 |                                                                                                                                                                                                                                                                                                                                                     |                       |                       |
| | 1579. Enero, 20     |                 | Caja 16, exp. 4, ff. 23-83.^([620])      |                 |                                                                                                                                                                                                                                                                                                                                                     |                       |                       |
| +---------------------+-----------------+------------------------------------------+-----------------+                                                                                                                                                                                                                                                                                                                                                     |                       |                       |
|                                                                                                                                                                                                                                                                                                                                                                                                                                                            |                       |                       |
|   ------------- -----------------------------------------------------------------------------------------------------------------------------------------------------------------------------------                                                                                                                                                                                                                                                        |                       |                       |
|   Resumen:      Juan de Santa Cruz, en virtud del poder que tiene de Miguel de Torres y Catalina de Arévalo, su mujer, pide que se nombren jueces partidores de la herencia de Francisco Preciado                                                                                                                                                                                                                                                          |                       |                       |
|   ------------- -----------------------------------------------------------------------------------------------------------------------------------------------------------------------------------                                                                                                                                                                                                                                                        |                       |                       |
|                                                                                                                                                                                                                                                                                                                                                                                                                                                            |                       |                       |
|   ----------------------------------- -------------------------------------------------------------------------------------------------------------------------------------------------------------------------------------------------------------------------------------------------------------------------------------------------------------------------------------------------------------------------------------------------------------------- |                       |                       |
|   Contenido:                          “En el pueblo de Periban^([617]) desta Provincia de Mechuacan”, ante Francisco Díaz, contador escribano de Su Majestad y público y del Cabildo de la Villa de Zamora, Miguel de Torres, estante, sustituye el poder que en su favor había otorgado su esposa Catalina de Arévalo, ante Hernando Ortiz, escribano de Su Majestad, el 7 de junio de 1578.                                                              |                       |                       |
|                                       Nombra en sustitución suya a Juan de Santa Cruz, Juan Ramírez de Alarcón y a Martín de Santa Cruz, hijo de Juan de Santa Cruz.                                                                                                                                                                                                                                                                                       |                       |                       |
|                                       En virtud de esta poder, Juan de Santa Cruz, el 7 de julio de 1580, ante Cristóbal de Silva, justicia mayor de Colima, pedía que se nombrasen jueces partidores de la herencia de Francisco Preciado, en lugar de Juan Ramírez Alarcón que había sido designado para ello, por ser parte.                                                                                                                            |                       |                       |
|                                       Cristóbal de Silva nombró, entonces, como contadores partidores a Diego de Monroy y Baltasar de Alcalá, vecinos de la Villa, quienes juraron sus cargos.                                                                                                                                                                                                                                                             |                       |                       |
|                                       El 11 de junio de 1580 protestaba de esto Alonso Carrillo,^([618]) marido de Isabel de Arévalo, hija y heredera de Francisco Preciado, diciendo que, por haber habido tantos tutores de los bienes de Preciado, los menores y herederos han sido agraviados, por lo que se tuvo que recurrir a la Real Audiencia de México.                                                                                          |                       |                       |
|                                       Pide que el escribano traiga el proceso y la real provisión dada, y la mande cumplir; y que el proceso se lleve donde Su Majestad ordena.                                                                                                                                                                                                                                                                            |                       |                       |
|                                       El alcalde mayor Gaspar Huerta mandó notificar a las partes a fin de fenescer cuentas y particiones.                                                                                                                                                                                                                                                                                                                 |                       |                       |
|                                       López Avecilla, escribano, notificó a Juan de Santa Cruz procurador de Miguel de Torres y de Catalina de Arévalo; a Juan Ramírez de Alarcón, persona que tiene el poder de Catalina de Arévalo; a Alonso Carrillo, esposo de Isabel de Arévalo; a Cristóbal de Silva, procurador de Juan de Segovia, de Juan Núñez de Alvarado y de Pedro de Granada, yernos del dicho Francisco Preciado; y a Cristóbal Preciado.   |                       |                       |
|                                       El 17 de julio, Juan de Santa Cruz pedía carta de justicia citatoria para el efecto de convocar a la partición a María de Solórzano y Luisa Preciado, herederas de Francisco Preciado,^([619]) y que están fuera de la Provincia de Colima, lo que concedió el alcalde mayor Gaspar Huerta.                                                                                                                          |                       |                       |
|                                       El 2 de agosto, Santa Cruz decía que, mientras los demás hijos y herederos de Francisco Preciado habían recibido más de tres mil pesos, su parte ha sido agraviada; pide que al menos, de lo mejor parado, se le entreguen 2,000 pesos.                                                                                                                                                                              |                       |                       |
|                                       Vistos los autos, el alcalde mayor mandó que se le dieran en cuenta 1,000 pesos de oro, habiendo fiadores, quienes fueron Juan Ramírez de Alarcón y Cristóbal de Silva.                                                                                                                                                                                                                                              |                       |                       |
|                                       Siguen otras diligencias.                                                                                                                                                                                                                                                                                                                                                                                            |                       |                       |
|                                                                                                                                                                                                                                                                                                                                                                                                                                                            |                       |                       |
|   ----------------------------------- -------------------------------------------------------------------------------------------------------------------------------------------------------------------------------------------------------------------------------------------------------------------------------------------------------------------------------------------------------------------------------------------------------------------- |                       |                       |
|                                                                                                                                                                                                                                                                                                                                                                                                                                                            |                       |                       |
| (617) Periban: AQU                                                                                                                                                                                                                                                                                                                                                                                                                                         |                       |                       |
|                                                                                                                                                                                                                                                                                                                                                                                                                                                            |                       |                       |
| (618) No debe confundirse este Alonso Carrillo, mercader vecino de Colima, casado con Isabel de Arévalo —hija de Francisco Preciado y Elvira de Arévalo—, con Alonso Carrillo de Guzmán, esposo de Beatriz de Grijalba: supra, regº 621.                                                                                                                                                                                                                   |                       |                       |
|                                                                                                                                                                                                                                                                                                                                                                                                                                                            |                       |                       |
| (619) María de Solórzano, cuyo marido fue Juan Preciado, de quien enviudó en 1578: AHMC/Reyes 144 e infra, IV, regº 830, era nuera de Francisco Preciado. En su matrimonio procrearon a Juana y Luisa de Solórzano —aquí nombrada Luisa Preciado—, casadas con Martín Ruiz y Cristóbal de Pantoja, respectivamente; también, fueron sus hijos Francisco y Juan Preciado y, posiblemente, Juan de Solórzano: Romero de Solís, Andariegos... (2001), 530.    |                       |                       |
|                                                                                                                                                                                                                                                                                                                                                                                                                                                            |                       |                       |
| (620) Las ff. 42-65, están muy deterioradas.                                                                                                                                                                                                                                                                                                                                                                                                               |                       |                       |
|                                                                                                                                                                                                                                                                                                                                                                                                                                                            |                       |                       |
|   ---------------------------------------------------------------------------------------------------                                                                                                                                                                                                                                                                                                                                                      |                       |                       |
|    Documento(s) original(es)                                                                                                                                                                                                                                                                                                                                                                                                                               |                       |                       |
|   --------------------------- ------- ------- ------- ------- ------- ------- ------- ------- -------                                                                                                                                                                                                                                                                                                                                                      |                       |                       |
|               []                []      []      []      []      []      []      []      []      []                                                                                                                                                                                                                                                                                                                                                         |                       |                       |
|               23f               23v     24f     24v     25v     26f     26v     27f     27v     28f                                                                                                                                                                                                                                                                                                                                                        |                       |                       |
|                                                                                                                                                                                                                                                                                                                                                                                                                                                            |                       |                       |
|               []                []      []      []      []      []      []      []      []      []                                                                                                                                                                                                                                                                                                                                                         |                       |                       |
|               28v               29f     29v     30f     30v     31f     31v     32f     32v     33f                                                                                                                                                                                                                                                                                                                                                        |                       |                       |
|                                                                                                                                                                                                                                                                                                                                                                                                                                                            |                       |                       |
|               []                []      []      []      []      []      []      []      []      []                                                                                                                                                                                                                                                                                                                                                         |                       |                       |
|               33v               34f     34v     35f     35v     36f     36v     37f     37v     38f                                                                                                                                                                                                                                                                                                                                                        |                       |                       |
|                                                                                                                                                                                                                                                                                                                                                                                                                                                            |                       |                       |
|               []                []      []      []      []      []      []      []      []      []                                                                                                                                                                                                                                                                                                                                                         |                       |                       |
|               38v               39f     39v     40f     40v     41f     42f     43f     43v     44f                                                                                                                                                                                                                                                                                                                                                        |                       |                       |
|                                                                                                                                                                                                                                                                                                                                                                                                                                                            |                       |                       |
|               []                []      []      []      []      []      []      []      []      []                                                                                                                                                                                                                                                                                                                                                         |                       |                       |
|               44v               45f     45v     46f     46v     47f     47v     48f     48v     49f                                                                                                                                                                                                                                                                                                                                                        |                       |                       |
|                                                                                                                                                                                                                                                                                                                                                                                                                                                            |                       |                       |
|               []                []      []      []      []      []      []      []      []      []                                                                                                                                                                                                                                                                                                                                                         |                       |                       |
|               49v               50f     50v     51f     51v     52f     53f     53v     55f     56f                                                                                                                                                                                                                                                                                                                                                        |                       |                       |
|                                                                                                                                                                                                                                                                                                                                                                                                                                                            |                       |                       |
|               []                []      []      []      []      []      []      []      []      []                                                                                                                                                                                                                                                                                                                                                         |                       |                       |
|               56v               57f     57v     58f     59f     60f     60v     62f     62v     63f                                                                                                                                                                                                                                                                                                                                                        |                       |                       |
|                                                                                                                                                                                                                                                                                                                                                                                                                                                            |                       |                       |
|               []                []      []      []      []      []      []      []      []      []                                                                                                                                                                                                                                                                                                                                                         |                       |                       |
|               63v               65f     65v     66f     66v     67f     67v     68f     68v     69f                                                                                                                                                                                                                                                                                                                                                        |                       |                       |
|                                                                                                                                                                                                                                                                                                                                                                                                                                                            |                       |                       |
|               []                []      []      []      []      []      []      []      []      []                                                                                                                                                                                                                                                                                                                                                         |                       |                       |
|               69v               70f     70v     71f     71v     72f     73f     73v     74f     75f                                                                                                                                                                                                                                                                                                                                                        |                       |                       |
|                                                                                                                                                                                                                                                                                                                                                                                                                                                            |                       |                       |
|               []                []      []      []      []      []      []      []      []      []                                                                                                                                                                                                                                                                                                                                                         |                       |                       |
|               75v               76f     76v     77f     77v     78f     78v     79f     79v     80f                                                                                                                                                                                                                                                                                                                                                        |                       |                       |
|                                                                                                                                                                                                                                                                                                                                                                                                                                                            |                       |                       |
|               []                []      []      []      []      []      []                                                                                                                                                                                                                                                                                                                                                                                 |                       |                       |
|               80v               81f     81v     82f     82v     83f     83v                                                                                                                                                                                                                                                                                                                                                                                |                       |                       |
|   ---------------------------------------------------------------------------------------------------                                                                                                                                                                                                                                                                                                                                                      |                       |                       |
+------------------------------------------------------------------------------------------------------------------------------------------------------------------------------------------------------------------------------------------------------------------------------------------------------------------------------------------------------------------------------------------------------------------------------------------------------------+-----------------------+-----------------------+
| +----------------------------------------------------------------------------+------------------------------------------------+                                                                                                                                                                                                                                                                                                                            |                       |                       |
| | ISBN 978-607-701-024-1                                                     |   ---- ---- ---- ---- ---- ---- ---- ---- ---- |                                                                                                                                                                                                                                                                                                                            |                       |                       |
| | © Derechos Reservados 2013. Archivo Histórico del Municipio de Colima. [*] |   []        []        []        []        []   |                                                                                                                                                                                                                                                                                                                            |                       |                       |
| |                                                                            |   ---- ---- ---- ---- ---- ---- ---- ---- ---- |                                                                                                                                                                                                                                                                                                                            |                       |                       |
| +----------------------------------------------------------------------------+------------------------------------------------+                                                                                                                                                                                                                                                                                                                            |                       |                       |
| |                                                                            |                                                |                                                                                                                                                                                                                                                                                                                            |                       |                       |
| +----------------------------------------------------------------------------+------------------------------------------------+                                                                                                                                                                                                                                                                                                                            |                       |                       |
+------------------------------------------------------------------------------------------------------------------------------------------------------------------------------------------------------------------------------------------------------------------------------------------------------------------------------------------------------------------------------------------------------------------------------------------------------------+-----------------------+-----------------------+

615 visitas
