[]

LA VILLA DE COLIMA DE LA NUEVA ESPAÑA
SIGLO XVI

VOLUMEN I      (CAJAS 1-11)

[]

Inicio | Búsquedas | Siglas y bibliografía | Cartografía | Créditos | Más información

[]

Búsqueda rápida

+:---------------------------------------------------------------------------------------------------------------------------------------------------------------------------------------------------------------------------------------------------------------------------------------------------------------------------------------------------------------------------------------------------------------------------------------------------------------------------------------------------------------------------------------------------------------------------------------------------------------------------------------------------------------------------------------------------------------------------------------------------------------------------------------------------------------------------------------------------------------------------------------------------------------:+------------------------------------------:+
| Fecha:                                                                                                                                                                                                                                                                                                                                                                                                                                                                                                                                                                                                                                                                                                                                                                                                                                                                                                          | Ubicación física del documento original:  |
| 1586 Junio, 26                                                                                                                                                                                                                                                                                                                                                                                                                                                                                                                                                                                                                                                                                                                                                                                                                                                                                                  | CAJA A-11, EXP. 13, 19 FF.                |
|                                                                                                                                                                                                                                                                                                                                                                                                                                                                                                                                                                                                                                                                                                                                                                                                                                                                                                                 | Archivo Histórico del Municipio de Colima |
+-----------------------------------------------------------------------------------------------------------------------------------------------------------------------------------------------------------------------------------------------------------------------------------------------------------------------------------------------------------------------------------------------------------------------------------------------------------------------------------------------------------------------------------------------------------------------------------------------------------------------------------------------------------------------------------------------------------------------------------------------------------------------------------------------------------------------------------------------------------------------------------------------------------------+-------------------------------------------+
| 400. 1586. Junio, 26.                                                                                                                                                                                                                                                                                                                                                                                                                                                                                                                                                                                                                                                                                                                                                                                                                                                                                           |                                           |
|                                                                                                                                                                                                                                                                                                                                                                                                                                                                                                                                                                                                                                                                                                                                                                                                                                                                                                                 |                                           |
| Juan de Monroy reclama una mula y dos machos, a Juan Fernández de Ocampo.                                                                                                                                                                                                                                                                                                                                                                                                                                                                                                                                                                                                                                                                                                                                                                                                                                       |                                           |
|                                                                                                                                                                                                                                                                                                                                                                                                                                                                                                                                                                                                                                                                                                                                                                                                                                                                                                                 |                                           |
| "Digo yo Juan Fernández de Ocampo que es verdad que debo a vos, Juan de Aguilar, vecino de la Villa de Colima, un macho y una mula de edad de tres años para arriba, y el macho ha de ser escogido en las mulas y machos que tengo en mi estancia, y una mula de la dicha edad, que sea buena para la recua, de dar e recibir, y otro macho os debo de la nacencia (1) del año pasado de ochenta y cuatro [1584], que sea bueno, que por todos son: dos machos y una mula. Los cuales os debo y soy, por razón de un caballo que os compré, y recibí de vos. Los cuales mula y dos machos os daré puestos en mi estancia, de vuelta que estaréis de las Minas de Zacatecas que, agora al presente, váis. Y porque es verdad, lo firmo de mi nombre, que es fecha a tres de febrero de mil e quinientos y ochenta y cinco años [1585]. Juan Fernández de Ocampo.                                                 |                                           |
|                                                                                                                                                                                                                                                                                                                                                                                                                                                                                                                                                                                                                                                                                                                                                                                                                                                                                                                 |                                           |
| Ante el alcalde ordinario Antonio Carrillo de Guzmán, Juan de Monroy, en virtud del poder y traspaso que presentó de Gaspar Román, "pidió a Su Merced mande que Juan Fernández de Ocampo, que presente está, reconozca la firma de arriba, do dice "Juan Fernández de Ocampo", con juramento. E pidió justicia. Testigos: Juan Martín e Juan Fernández Cabral,(2) vecinos desta Villa".                                                                                                                                                                                                                                                                                                                                                                                                                                                                                                                         |                                           |
|                                                                                                                                                                                                                                                                                                                                                                                                                                                                                                                                                                                                                                                                                                                                                                                                                                                                                                                 |                                           |
| El alcalde Carrillo así lo dispuso, y Juan Fernández de Ocampo sin necesidad de hacer juramento, habiendo visto la dicha cédula, dijo que "la letra e firma, do dize «Juan Fernández de Ocampo», parece a las que suele hazer, y que no debe lo en la cédula contenido, porque lo tiene pagado".                                                                                                                                                                                                                                                                                                                                                                                                                                                                                                                                                                                                                |                                           |
|                                                                                                                                                                                                                                                                                                                                                                                                                                                                                                                                                                                                                                                                                                                                                                                                                                                                                                                 |                                           |
| Se anexan dos cartas poder.                                                                                                                                                                                                                                                                                                                                                                                                                                                                                                                                                                                                                                                                                                                                                                                                                                                                                     |                                           |
|                                                                                                                                                                                                                                                                                                                                                                                                                                                                                                                                                                                                                                                                                                                                                                                                                                                                                                                 |                                           |
| La primera, otorgada ante el escribano Juan de Cepeda, con fecha de 6 de junio de 1585, en el pueblo de Maquilí, por Juan de Aguilar a favor de Gaspar Román, vecinos ambos de la Villa de Colima, para que en su nombre "pueda cobrar y cobre lo en esta cédula, atrás contenida, de Juan Fernández de Ocampo, por cuanto me debía las dichas mulas en ellas contenidas, por cuanto yo confieso e declaro que vos, el dicho Gaspar Román, me habéis dado y pagado cuarenta y ocho pesos y medio, que valieron e montaron las dichas mulas, en que se apreciaron. E vos hago señor e poseedor de las dichas mulas, como en esta cédula atrás contenida, a mí el dicho Juan de Aguilar se me debían, e vos hago la dicha deuda cierta e verdadera, debida e por pagar". Testigos fueron Luis López Dávila(3) y Diego de Aguilar. Firman Juan Fernández Monroy,(4) Juan de Aguilar y el escribano Juan de Cepeda. |                                           |
|                                                                                                                                                                                                                                                                                                                                                                                                                                                                                                                                                                                                                                                                                                                                                                                                                                                                                                                 |                                           |
| Por el segundo poder, Gaspar Román traspasa la cédula contra Juan Fernández de Ocampo a Juan de Monroy, ante el escribano Cristóbal Hernández de Tene, el 23 de junio de 1586, por cuanto Monroy le dio a Gaspar Román otros tantos machos y mulas. Fueron testigos del traspaso Baltasar de Alcalá y Juan Agustín de la Puerta.                                                                                                                                                                                                                                                                                                                                                                                                                                                                                                                                                                                |                                           |
|                                                                                                                                                                                                                                                                                                                                                                                                                                                                                                                                                                                                                                                                                                                                                                                                                                                                                                                 |                                           |
| Presentados cédula y recaudos, Juan de Monroy pidió mandamiento contra Juan Fernández de Ocampo, para que luego le diera y entregase mula y machos. Así lo dispuso el alcalde Antonio Carrillo de Guzmán.                                                                                                                                                                                                                                                                                                                                                                                                                                                                                                                                                                                                                                                                                                       |                                           |
|                                                                                                                                                                                                                                                                                                                                                                                                                                                                                                                                                                                                                                                                                                                                                                                                                                                                                                                 |                                           |
| Notificado por el escribano Francisco López, Fernández de Ocampo respondió que estaba presto de dar las mencionadas bestias mulares, que tenía en su estancia, y que Monroy mandase por ellas. Testigos Juan Fernández Cabral y Andrés García, vecinos y estantes.                                                                                                                                                                                                                                                                                                                                                                                                                                                                                                                                                                                                                                              |                                           |
|                                                                                                                                                                                                                                                                                                                                                                                                                                                                                                                                                                                                                                                                                                                                                                                                                                                                                                                 |                                           |
| Sin embargo, Juan Fernández de Ocampo tenía ya presentada una querella contra Juan de Monroy por "cierta memoria de cosas" que éste le debía. El alcalde Carrillo había ordenado en consecuencia poner preso en la cárcel pública de la Villa a Monroy, hasta tanto la pagase.                                                                                                                                                                                                                                                                                                                                                                                                                                                                                                                                                                                                                                  |                                           |
|                                                                                                                                                                                                                                                                                                                                                                                                                                                                                                                                                                                                                                                                                                                                                                                                                                                                                                                 |                                           |
| El mismo 25 de junio, Monroy, "preso en esta cárcel pública", apelaba ante Cristóbal de Silva, justicia mayor de la Villa y Provincia. El alcalde Carrillo negó la apelación, siendo testigos de la correspondiente notificación Luis Lázaro(5) y Juan Martín, vecinos de Colima.                                                                                                                                                                                                                                                                                                                                                                                                                                                                                                                                                                                                                               |                                           |
|                                                                                                                                                                                                                                                                                                                                                                                                                                                                                                                                                                                                                                                                                                                                                                                                                                                                                                                 |                                           |
| El 3 de julio siguiente, Juan de Monroy, desde la cárcel, decía que Fernández de Ocampo, a pesar de habérsele mandado que en el término de tres días "me pagase las dichas mulas", y el plazo "es pasado y muchos días más, y no me ha pagado cosa alguna. Por tanto a V.m. pido y suplico, me mande dar su mandamiento para que un alguacil vaya a la dicha estancia a me entregar los dichos machos e mulas, a costa del dicho Juan Fernández".                                                                                                                                                                                                                                                                                                                                                                                                                                                               |                                           |
|                                                                                                                                                                                                                                                                                                                                                                                                                                                                                                                                                                                                                                                                                                                                                                                                                                                                                                                 |                                           |
| El alcalde Antonio Carrillo de Guzmán así lo dispuso dando órdenes al alguacil Diego Ximénez. Al ser notificado del auto del señor alcalde por el escribano Francisco López, Ocampo apeló del mismo, siendo testigos de ello Andrés García e Pedro Hernández, vecinos y estantes.                                                                                                                                                                                                                                                                                                                                                                                                                                                                                                                                                                                                                               |                                           |
|                                                                                                                                                                                                                                                                                                                                                                                                                                                                                                                                                                                                                                                                                                                                                                                                                                                                                                                 |                                           |
| El 4 de julio alegaba Ocampo: "En la causa de las tres bestias mulares que Juan de Monroy me pide, como cesionario que dice ser de Gaspar Román, digo que yo tengo declarado no deber las dichas mulas, y antes serme el dicho Juan de Monroy a cargo los pesos de oro contenidos en el memorial, que tengo presentado y pedido [que] reconozca", y no lo ha querido reconocer, sino que sólo pide que se le paguen las bestias mulares, "que no le debo". Agrega que Monroy, "estando preso, se ha ido de la cárcel", y pide que se le exija a Monroy que reconozca el memorial, tal y como se le ha mandado hacer, y que se junten "entrambas causas". Y una vez visto todo ello, se le dé mandamiento de ejecución contra él.                                                                                                                                                                                |                                           |
|                                                                                                                                                                                                                                                                                                                                                                                                                                                                                                                                                                                                                                                                                                                                                                                                                                                                                                                 |                                           |
| Así lo mandó el alcalde Carrillo. Este auto fue notificado a Monroy el 7 de julio, siendo testigos Juan Agustín de la Puerta y Antonio de Cárdenas Fullana, vecinos de Colima.                                                                                                                                                                                                                                                                                                                                                                                                                                                                                                                                                                                                                                                                                                                                  |                                           |
|                                                                                                                                                                                                                                                                                                                                                                                                                                                                                                                                                                                                                                                                                                                                                                                                                                                                                                                 |                                           |
| Ese mismo día 7 de julio, y ante el justicia mayor Cristóbal de Silva, "Juan de Monroy, vecino desta Villa, digo que ante V.m. me presento en grado de apelación y agravio, de un auto pronunciado por Antonio Carrillo, alcalde ordinario desta Villa", según el cual, además de mandársele aclarar en una demanda puesta contra él por Ocampo, en lugar de darle traslado de la misma, "la mandó acumular en una causa que yo tengo pedida requisitoria de unas mulas, que el dicho Juan Fernández me debe, del cual dicho auto del dicho Antonio Carrillo apelo para ante V.m. y me presento en el dicho agravio, y mande V.m. al escribano, traiga los autos, y haga relación. Y pido justicia".                                                                                                                                                                                                            |                                           |
|                                                                                                                                                                                                                                                                                                                                                                                                                                                                                                                                                                                                                                                                                                                                                                                                                                                                                                                 |                                           |
| Visto el pleito, Cristóbal de Silva dispuso que se ejecutara el mandamiento contra Fernández de Ocampo, que debía entregar las bestias mulares al alguacil de la Villa, "y en lo demás del memorial, que dicho alcalde mandó juntar en esta causa, no ha lugar, sino que particularmente cada una de las dichas partes en el caso pidan derechamente su justicia ante el dicho alcalde, como vieren que les convengan, dando traslado al dicho Juan de Monroy, conforme a derecho, por ser como es causa ordinaria".                                                                                                                                                                                                                                                                                                                                                                                            |                                           |
|                                                                                                                                                                                                                                                                                                                                                                                                                                                                                                                                                                                                                                                                                                                                                                                                                                                                                                                 |                                           |
| Se notificó el auto del teniente de alcalde mayor al alcalde Carrillo y a Juan Fernández de Ocampo, siendo testigos Andrés García y Francisco Ruiz, estantes; luego, ante los vecinos Cristóbal Hernández de Tene y Juan Agustín de la Puerta, fue notificado una vez más Monroy.                                                                                                                                                                                                                                                                                                                                                                                                                                                                                                                                                                                                                               |                                           |
|                                                                                                                                                                                                                                                                                                                                                                                                                                                                                                                                                                                                                                                                                                                                                                                                                                                                                                                 |                                           |
| Juan Fernández de Ocampo, el 10 de julio, apeló del auto del teniente Cristóbal de Silva ante la Real Audiencia de México, declarando: "Otrosí digo que yo tengo recusado a V.m. en todas mis causas y pedido [que] se acompañe, por la capital enemistad que me tiene".                                                                                                                                                                                                                                                                                                                                                                                                                                                                                                                                                                                                                                        |                                           |
|                                                                                                                                                                                                                                                                                                                                                                                                                                                                                                                                                                                                                                                                                                                                                                                                                                                                                                                 |                                           |
| Respondió el teniente: primero, que Ocampo cumpla lo que se le ha mandado, dando satisfacción a Monroy; segundo, que, una vez que esté "contenta y satisfecha la parte, en lo tocante a las dichas mulas, se le dé testimonio de todo"; tercero, "en cuanto a la dicha recusación, dijo que Su Merced tiene la dicha causa remitida al alcalde, ante quien pasa, por lo cual no ha lugar la dicha recusación. Y si ante Su Merced tornare a pasar e hubiere de conocer della, está presto de se acompañar, conforme a derecho. Y ansí lo proveyó e mandó". La decisión del teniente fue notificada a Ocampo siendo de ello testigos los vecinos Juan Ramírez de Alarcón y Gaspar Román.                                                                                                                                                                                                                         |                                           |
|                                                                                                                                                                                                                                                                                                                                                                                                                                                                                                                                                                                                                                                                                                                                                                                                                                                                                                                 |                                           |
| El 13 de julio, Ocampo sin abajarse de su apelación, nombraba por bienes suyos "las casas de su morada, en que se haga la dicha ejecución", y agregaba: "torno a apelar, hablando con el debido acatamiento, tantas cuantas veces se me negare".                                                                                                                                                                                                                                                                                                                                                                                                                                                                                                                                                                                                                                                                |                                           |
|                                                                                                                                                                                                                                                                                                                                                                                                                                                                                                                                                                                                                                                                                                                                                                                                                                                                                                                 |                                           |
| Por su parte, el 14 de julio, Monroy insistía ante el alcalde ordinario Carrillo reclamando el pago, puesto que "los seis días que V.m. mandó en que me entregase las mulas, son pasados, y el dicho Juan Fernández no ha querido entregarme las dichas mulas". El 21 del mismo mes, Monroy decía ante Carrillo: "Yo tengo recusado a V.m. en mis causas y negocios, y porque en el proveer a mis peticiones muchas veces se dilatan –porque el acompañado es hombre ocupado y padece mi justicia–, por tanto, yo me aparto de la recusación que a V.m. tengo hecha, y pido y suplico a V.m., se provea en la causa que yo tengo pedida contra Juan Fernández, sobre los dos mil pesos que le pido de mi servicio, pues por otras muchas mis peticiones, le tengo acusada la rebeldía y, hasta agora, no ha querido el susodicho responder, ni V.m. proveer en ello, y pido justicia".(6)                       |                                           |
|                                                                                                                                                                                                                                                                                                                                                                                                                                                                                                                                                                                                                                                                                                                                                                                                                                                                                                                 |                                           |
| El 29 de julio, el alcalde Antonio Carrillo de Guzmán se desistía como juez en esta causa, "y mandó que las partes pidan su justicia, adonde y como vieren que les convenga".                                                                                                                                                                                                                                                                                                                                                                                                                                                                                                                                                                                                                                                                                                                                   |                                           |
|                                                                                                                                                                                                                                                                                                                                                                                                                                                                                                                                                                                                                                                                                                                                                                                                                                                                                                                 |                                           |
| El 31 de julio y ante el teniente de alcalde mayor, Monroy decía que como "el alcalde ordinario, ante quien pendía esta causa, la tiene remitida a V.m., para que la vea y termine", pide que "el escribano de la causa venga a hacer relación y, hecha, se me dé el mandamiento de entrega de las dichas mulas". El teniente ratificó lo que tenía ya proveído al respecto, mandando al alguacil recoger las bestias mulares de la Estancia de Ocampo.(7)                                                                                                                                                                                                                                                                                                                                                                                                                                                      |                                           |
|                                                                                                                                                                                                                                                                                                                                                                                                                                                                                                                                                                                                                                                                                                                                                                                                                                                                                                                 |                                           |
| El 9 de agosto escribía Juan de Monroy: "Diego Ximénez, alguacil desta Villa, con mandamiento de V.m., me fue a entregar a la Estancia de Juan Fernández de Ocampo dos machos y una mula, que el susodicho me debía por una cédula". Agrega Monroy: "el cual dicho alguacil me entregó las dichas mulas y, a mi derecho conviene que el dicho Juan Fernández les eche el yerro de venta para que yo pueda libremente disponer dellas a mi voluntad, como cosa mía, sin riesgos de que el susodicho ni otra persona por él, [me] las pueda quitar por defecto de no tener el dicho yerro de venta, agora y en tiempo alguno. Por tanto, a V.m. pido y suplico que, con aclaración que el dicho alguacil haga ante el escribano ser las que entregó en la dicha estancia, mande al dicho Juan Fernández exhiba el yerro de venta para echarlo a las dichas mulas".                                                |                                           |
|                                                                                                                                                                                                                                                                                                                                                                                                                                                                                                                                                                                                                                                                                                                                                                                                                                                                                                                 |                                           |
| Así lo mandó Cristóbal de Silva, de cuyo auto apelaría Fernández de Ocampo, al ser de ello notificado, siendo testigos los vecinos Álvaro de Grijalba y Juan Agustín de la Puerta.                                                                                                                                                                                                                                                                                                                                                                                                                                                                                                                                                                                                                                                                                                                              |                                           |
|                                                                                                                                                                                                                                                                                                                                                                                                                                                                                                                                                                                                                                                                                                                                                                                                                                                                                                                 |                                           |
| Sabiéndose recusado por Juan Fernández de Ocampo, el teniente de alcalde mayor se acompañó de Juan de Grijalba, quien juró su oficio.                                                                                                                                                                                                                                                                                                                                                                                                                                                                                                                                                                                                                                                                                                                                                                           |                                           |
|                                                                                                                                                                                                                                                                                                                                                                                                                                                                                                                                                                                                                                                                                                                                                                                                                                                                                                                 |                                           |
| El 13 de agosto, Silva y Grijalba firmaron un auto mandando que "a Juan de Monroy, sobrino del dicho Juan Fernández,(8) se le notifique [que] nombre casa e procurador conocido en la Ciudad de México, con quien se hagan los autos desta causa en el dicho grado de apelación". Así fue hecho por el escribano López Avecilla, siendo testigos los vecinos Juan Agustín de la Puerta y Juan Cornejo.                                                                                                                                                                                                                                                                                                                                                                                                                                                                                                          |                                           |
|                                                                                                                                                                                                                                                                                                                                                                                                                                                                                                                                                                                                                                                                                                                                                                                                                                                                                                                 |                                           |
| El 26 de agosto, "ante mí el presente escribano y testigos, en cumplimiento de lo pedido por el dicho Juan de Monroy y lo proveído por el dicho señor teniente, el dicho Juan de Monroy echó un hierro y señal, tal como este Y, el cual echó en la dicha mula e dos machos contenidos en este pleito y causa, lo cual pasó en mi presencia y dello doy fe, siendo testigos Gaspar Román e Jerónimo Mexía, vecinos y estantes en esta dicha Villa. Ante mí, Francisco López, escribano público".                                                                                                                                                                                                                                                                                                                                                                                                                |                                           |
|                                                                                                                                                                                                                                                                                                                                                                                                                                                                                                                                                                                                                                                                                                                                                                                                                                                                                                                 |                                           |
| Caja A–11, exp. 13, 19 ff.                                                                                                                                                                                                                                                                                                                                                                                                                                                                                                                                                                                                                                                                                                                                                                                                                                                                                      |                                           |
|                                                                                                                                                                                                                                                                                                                                                                                                                                                                                                                                                                                                                                                                                                                                                                                                                                                                                                                 |                                           |
|                                                                                                                                                                                                                                                                                                                                                                                                                                                                                                                                                                                                                                                                                                                                                                                                                                                                                                                 |                                           |
|                                                                                                                                                                                                                                                                                                                                                                                                                                                                                                                                                                                                                                                                                                                                                                                                                                                                                                                 |                                           |
| ---------------                                                                                                                                                                                                                                                                                                                                                                                                                                                                                                                                                                                                                                                                                                                                                                                                                                                                                                 |                                           |
|                                                                                                                                                                                                                                                                                                                                                                                                                                                                                                                                                                                                                                                                                                                                                                                                                                                                                                                 |                                           |
| (1) Boyd–Bowman (1971), 613-614 registra "nacer" y "nascer", pero no "nacencia" como aquí ocurre.                                                                                                                                                                                                                                                                                                                                                                                                                                                                                                                                                                                                                                                                                                                                                                                                               |                                           |
|                                                                                                                                                                                                                                                                                                                                                                                                                                                                                                                                                                                                                                                                                                                                                                                                                                                                                                                 |                                           |
| (2) Fernández Cabral vivía en 1571 en las minas de Xocotlan y luego pasó a Colima, donde se avecindó: Hillerkuss (2001), 120, quien remite a Villaseñor Bordes (1959); además, Romero de Solís, Andariegos… (2001), 150.                                                                                                                                                                                                                                                                                                                                                                                                                                                                                                                                                                                                                                                                                        |                                           |
|                                                                                                                                                                                                                                                                                                                                                                                                                                                                                                                                                                                                                                                                                                                                                                                                                                                                                                                 |                                           |
| (3) Única referencia acerca de López Dávila o de Ávila quehallamos en el antiguo Archivo de la Villa de Colima.                                                                                                                                                                                                                                                                                                                                                                                                                                                                                                                                                                                                                                                                                                                                                                                                 |                                           |
|                                                                                                                                                                                                                                                                                                                                                                                                                                                                                                                                                                                                                                                                                                                                                                                                                                                                                                                 |                                           |
| (4) Juan de Monroy era corregidor de Maquilí.                                                                                                                                                                                                                                                                                                                                                                                                                                                                                                                                                                                                                                                                                                                                                                                                                                                                   |                                           |
|                                                                                                                                                                                                                                                                                                                                                                                                                                                                                                                                                                                                                                                                                                                                                                                                                                                                                                                 |                                           |
| (5) Luis Lázaro de Monroy, hijo del licenciado Antonio de Monroy y Juana de Piedra: Romero de Solís, Andariegos… (2001), 237-238.                                                                                                                                                                                                                                                                                                                                                                                                                                                                                                                                                                                                                                                                                                                                                                               |                                           |
|                                                                                                                                                                                                                                                                                                                                                                                                                                                                                                                                                                                                                                                                                                                                                                                                                                                                                                                 |                                           |
| (6) Resulta sorprendente este escrito. Sin duda, entre éste y el anterior que tenemos registrado (14 de julio), Monroy recusó al alcalde Carrillo pidiendo que su compañero de aquel año –era entonces también alcalde ordinario Cristóbal de Silva– entendiese en la causa. Pero además llama la atención que, al hablar de la demanda puesta contra Ocampo, no mencione las bestias mulares sino la suma de "dos mil pesos". Quizá se hayan mezclado aquí autos de otro proceso distinto.                                                                                                                                                                                                                                                                                                                                                                                                                     |                                           |
|                                                                                                                                                                                                                                                                                                                                                                                                                                                                                                                                                                                                                                                                                                                                                                                                                                                                                                                 |                                           |
| (7) El mandamiento que se recoge luego, especifica al alguacil que vaya "a la estancia de ganado mayor que es de Juan Fernández de Ocampo, vecino desta Villa, que es en el Valle de Alima". Así se ejecutó siendo testigos Álvaro de Grijalba, Baltasar de Alcalá, Gaspar Román y Juan de Cepeda, vecinos y estantes.                                                                                                                                                                                                                                                                                                                                                                                                                                                                                                                                                                                          |                                           |
|                                                                                                                                                                                                                                                                                                                                                                                                                                                                                                                                                                                                                                                                                                                                                                                                                                                                                                                 |                                           |
| (8) Por ser hijo de María de Ocampo, hermana de Juan Fernández de Ocampo.                                                                                                                                                                                                                                                                                                                                                                                                                                                                                                                                                                                                                                                                                                                                                                                                                                       |                                           |
+-----------------------------------------------------------------------------------------------------------------------------------------------------------------------------------------------------------------------------------------------------------------------------------------------------------------------------------------------------------------------------------------------------------------------------------------------------------------------------------------------------------------------------------------------------------------------------------------------------------------------------------------------------------------------------------------------------------------------------------------------------------------------------------------------------------------------------------------------------------------------------------------------------------------+-------------------------------------------+

Documento(s) original(es)

Archivo no encontrado (CAJAS/CAJA11/EXP13/007V.jpg)

Archivo no encontrado (CAJAS/CAJA11/EXP13/009V.jpg)

Archivo no encontrado (CAJAS/CAJA11/EXP13/010V.jpg)

Archivo no encontrado (CAJAS/CAJA11/EXP13/014V.jpg)

Archivo no encontrado (CAJAS/CAJA11/EXP13/017V.jpg)

Archivo no encontrado (CAJAS/CAJA11/EXP13/019V.jpg)

[]
1F

[]
1V

[]
2F

[]
2V

[]
3F

[]
3V

[]
4F

[]
4V

[]
5F

[]
5V

[]
6F

[]
6V

[]
7F

[]
8F

[]
8V

[]
9F

[]
10F

[]
11F

[]
11V

[]
12F

[]
12V

[]
13F

[]
13V

[]
14F

[]
15F

[]
15V

[]
16F

[]
16V

[]
17F

[]
18F

[]
18V

[]
19F

Proyecto interinstitucional del Archivo Histórico del Municipio de Colima y la Universidad de Colima,
realizado bajo los auspicios del fondo Ramón Álvarez-Buylla de Aldana.

------------------------------------------------------------------------

ISBN 978-968-7412-85-6
® Derechos Reservados 2008. Archivo Histórico del Municipio de Colima.

1,078 visitas
