+-------------------------------------------------------------------------------------------------------------------------------------------------------------------------------------------------------------------------------------------------------------------------------------------------------------------------------------+-----------------------+-----------------------+
| []                                                                                                                                                                                                                                                                                                                                  |                       |                       |
|                                                                                                                                                                                                                                                                                                                                     |                       |                       |
| +-----------------------------------+:-------------------------------------:+                                                                                                                                                                                                                                                       |                       |                       |
| | []                                | LA VILLA DE COLIMA DE LA NUEVA ESPAÑA |                                                                                                                                                                                                                                                       |                       |                       |
| |                                   | SIGLO XVI                             |                                                                                                                                                                                                                                                       |                       |                       |
| |                                   |                                       |                                                                                                                                                                                                                                                       |                       |                       |
| |                                   | VOLUMEN II      (CAJAS 12-20)         |                                                                                                                                                                                                                                                       |                       |                       |
| +-----------------------------------+---------------------------------------+                                                                                                                                                                                                                                                       |                       |                       |
+-------------------------------------------------------------------------------------------------------------------------------------------------------------------------------------------------------------------------------------------------------------------------------------------------------------------------------------+-----------------------+-----------------------+
| +------------------------------------------------------------------------+---------------------------+-----------------------+                                                                                                                                                                                                      |                       |                       |
| | Inicio | Búsqueda | Siglas y bibliografía | Créditos | Más información | (consulta las cajas 1-11) |    [ES]               |                                                                                                                                                                                                      |                       |                       |
| +------------------------------------------------------------------------+---------------------------+-----------------------+                                                                                                                                                                                                      |                       |                       |
+-------------------------------------------------------------------------------------------------------------------------------------------------------------------------------------------------------------------------------------------------------------------------------------------------------------------------------------+-----------------------+-----------------------+
| Búsqueda rápida                                                                                                                                                                                                                                                                                                                     |                       |                       |
|                                                                                                                                                                                                                                                                                                                                     |                       |                       |
| +:-------------------:+-----------------+:----------------------------------------:+----------------:+                                                                                                                                                                                                                              |                       |                       |
| | Documento de fecha: |                 | Ubicación física del documento original: | [] [] []        |                                                                                                                                                                                                                              |                       |                       |
| |                     |                 |                                          |                 |                                                                                                                                                                                                                              |                       |                       |
| | 1585. Julio, 26     |                 | Caja 19, exp. 5, ff. 5-6.                |                 |                                                                                                                                                                                                                              |                       |                       |
| +---------------------+-----------------+------------------------------------------+-----------------+                                                                                                                                                                                                                              |                       |                       |
|                                                                                                                                                                                                                                                                                                                                     |                       |                       |
|   ------------- ----------------------------------------------------------------------------                                                                                                                                                                                                                                        |                       |                       |
|   Resumen:      Inventario de los bienes que quedaron por el fallecimiento de Juan Hermoso                                                                                                                                                                                                                                          |                       |                       |
|   ------------- ----------------------------------------------------------------------------                                                                                                                                                                                                                                        |                       |                       |
|                                                                                                                                                                                                                                                                                                                                     |                       |                       |
|   ----------------------------------- --------------------------------------------------------------------------------------------------------------------------------------------------------------------------------------------------------------------------------------------------------------------------------------------- |                       |                       |
|   Contenido:                          El alcalde ordinario de la Villa Antonio Carrillo de Guzmán fue a las casas de la morada de Álvaro de Grijalba, albacea del difunto Juan Hermoso, donde éste había fallecido, para hacer inventario.^([914])                                                                                  |                       |                       |
|                                       Ciento cinco ovillos de hilo de algodón hilado que pesaron cuatro arrobas y media, más seis arrobas y media de algodón desmotado, una caja de madera blanca, sayas, chamarrillas, un candelero, telas, botas, una vara de medir, una espada vieja sin vaina, una silla estradiota, botones.   |                       |                       |
|                                       El 28 de julio se hizo almoneda.                                                                                                                                                                                                                                                              |                       |                       |
|                                       Los ovillos de hilo se remataron, a doce pesos de la arroba, en Francisco de Porras, quien igualmente se adjudicó a dos pesos y ducado la arroba de algodón desmotado.                                                                                                                        |                       |                       |
|                                       Las botas de venado las compró Andrés Ruiz en 6 tomines.                                                                                                                                                                                                                                      |                       |                       |
|                                       Cuatro pesos costó a Baltasar de Alcalá la silla estradiota con su freno, y él mismo se adjudicó, en un tostón, la vieja espada.                                                                                                                                                              |                       |                       |
|                                                                                                                                                                                                                                                                                                                                     |                       |                       |
|   ----------------------------------- --------------------------------------------------------------------------------------------------------------------------------------------------------------------------------------------------------------------------------------------------------------------------------------------- |                       |                       |
|                                                                                                                                                                                                                                                                                                                                     |                       |                       |
| (914) El testamento de Juan Hermoso, supra, regº 750. El hecho que habitase Juan Hermoso en la casa de Grijalba, nos indica que vivía solo y no era vecino, siendo su profesión la de mercader y tenía su familia en ultramar.                                                                                                      |                       |                       |
|                                                                                                                                                                                                                                                                                                                                     |                       |                       |
|   ---------------------------------------------------------------------------------------------------                                                                                                                                                                                                                               |                       |                       |
|    Documento(s) original(es)                                                                                                                                                                                                                                                                                                        |                       |                       |
|   --------------------------- ------- ------- ------- ------- ------- ------- ------- ------- -------                                                                                                                                                                                                                               |                       |                       |
|               []                []      []                                                                                                                                                                                                                                                                                          |                       |                       |
|               5f                5v      6f                                                                                                                                                                                                                                                                                          |                       |                       |
|                                                                                                                                                                                                                                                                                                                                     |                       |                       |
|   ---------------------------------------------------------------------------------------------------                                                                                                                                                                                                                               |                       |                       |
+-------------------------------------------------------------------------------------------------------------------------------------------------------------------------------------------------------------------------------------------------------------------------------------------------------------------------------------+-----------------------+-----------------------+
| +----------------------------------------------------------------------------+------------------------------------------------+                                                                                                                                                                                                     |                       |                       |
| | ISBN 978-607-701-024-1                                                     |   ---- ---- ---- ---- ---- ---- ---- ---- ---- |                                                                                                                                                                                                     |                       |                       |
| | © Derechos Reservados 2013. Archivo Histórico del Municipio de Colima. [*] |   []        []        []        []        []   |                                                                                                                                                                                                     |                       |                       |
| |                                                                            |   ---- ---- ---- ---- ---- ---- ---- ---- ---- |                                                                                                                                                                                                     |                       |                       |
| +----------------------------------------------------------------------------+------------------------------------------------+                                                                                                                                                                                                     |                       |                       |
| |                                                                            |                                                |                                                                                                                                                                                                     |                       |                       |
| +----------------------------------------------------------------------------+------------------------------------------------+                                                                                                                                                                                                     |                       |                       |
+-------------------------------------------------------------------------------------------------------------------------------------------------------------------------------------------------------------------------------------------------------------------------------------------------------------------------------------+-----------------------+-----------------------+

615 visitas
