+----------------------------------------------------------------------------------------------------------------------------------------------------------------------------------------------------------------------------------------+-----------------------+-----------------------+
| []                                                                                                                                                                                                                                     |                       |                       |
|                                                                                                                                                                                                                                        |                       |                       |
| +-----------------------------------+:-------------------------------------:+                                                                                                                                                          |                       |                       |
| | []                                | LA VILLA DE COLIMA DE LA NUEVA ESPAÑA |                                                                                                                                                          |                       |                       |
| |                                   | SIGLO XVI                             |                                                                                                                                                          |                       |                       |
| |                                   |                                       |                                                                                                                                                          |                       |                       |
| |                                   | VOLUMEN II      (CAJAS 12-20)         |                                                                                                                                                          |                       |                       |
| +-----------------------------------+---------------------------------------+                                                                                                                                                          |                       |                       |
+----------------------------------------------------------------------------------------------------------------------------------------------------------------------------------------------------------------------------------------+-----------------------+-----------------------+
| +------------------------------------------------------------------------+---------------------------+-----------------------+                                                                                                         |                       |                       |
| | Inicio | Búsqueda | Siglas y bibliografía | Créditos | Más información | (consulta las cajas 1-11) |    [ES]               |                                                                                                         |                       |                       |
| +------------------------------------------------------------------------+---------------------------+-----------------------+                                                                                                         |                       |                       |
+----------------------------------------------------------------------------------------------------------------------------------------------------------------------------------------------------------------------------------------+-----------------------+-----------------------+
| Búsqueda rápida                                                                                                                                                                                                                        |                       |                       |
|                                                                                                                                                                                                                                        |                       |                       |
| +:-------------------:+-----------------+:----------------------------------------:+----------------:+                                                                                                                                 |                       |                       |
| | Documento de fecha: |                 | Ubicación física del documento original: | [] [] []        |                                                                                                                                 |                       |                       |
| |                     |                 |                                          |                 |                                                                                                                                 |                       |                       |
| | S/f                 |                 | Caja 20, exp. 10, f. 1 vta.              |                 |                                                                                                                                 |                       |                       |
| +---------------------+-----------------+------------------------------------------+-----------------+                                                                                                                                 |                       |                       |
|                                                                                                                                                                                                                                        |                       |                       |
|   ------------- -----------------------------------                                                                                                                                                                                    |                       |                       |
|   Resumen:      Carta misiva de Rodrigo Maldonado                                                                                                                                                                                      |                       |                       |
|   ------------- -----------------------------------                                                                                                                                                                                    |                       |                       |
|                                                                                                                                                                                                                                        |                       |                       |
|   ------------ ----------------------------------------------------------------------------------------------------------------------------------------------------------------------------------------------------------------------- |                       |                       |
|   Contenido:   Fragmento de foja, donde se lee el final de una carta misiva: “...mano desta casa de V.m., hoy viernes por la mañana. Muy magnífico señor. Besa a V.m. las manos, su servidor: Rodrigo Maldonado” [rúbrica].^([1054])   |                       |                       |
|   ------------ ----------------------------------------------------------------------------------------------------------------------------------------------------------------------------------------------------------------------- |                       |                       |
|                                                                                                                                                                                                                                        |                       |                       |
| (1054) Rodrigo Maldonado fue alcalde mayor en Colima a fines de la década de los treinta, siendo él quien tomó preso y torturó a un marinero de la última expedición cortesiana, siguiendo las instrucciones del virrey Mendoza: AQU   |                       |                       |
|                                                                                                                                                                                                                                        |                       |                       |
|   ---------------------------------------------------------------------------------------------------                                                                                                                                  |                       |                       |
|    Documento(s) original(es)                                                                                                                                                                                                           |                       |                       |
|   --------------------------- ------- ------- ------- ------- ------- ------- ------- ------- -------                                                                                                                                  |                       |                       |
|               []                                                                                                                                                                                                                       |                       |                       |
|               1v                                                                                                                                                                                                                       |                       |                       |
|                                                                                                                                                                                                                                        |                       |                       |
|   ---------------------------------------------------------------------------------------------------                                                                                                                                  |                       |                       |
+----------------------------------------------------------------------------------------------------------------------------------------------------------------------------------------------------------------------------------------+-----------------------+-----------------------+
| +----------------------------------------------------------------------------+------------------------------------------------+                                                                                                        |                       |                       |
| | ISBN 978-607-701-024-1                                                     |   ---- ---- ---- ---- ---- ---- ---- ---- ---- |                                                                                                        |                       |                       |
| | © Derechos Reservados 2013. Archivo Histórico del Municipio de Colima. [*] |   []        []        []        []        []   |                                                                                                        |                       |                       |
| |                                                                            |   ---- ---- ---- ---- ---- ---- ---- ---- ---- |                                                                                                        |                       |                       |
| +----------------------------------------------------------------------------+------------------------------------------------+                                                                                                        |                       |                       |
| |                                                                            |                                                |                                                                                                        |                       |                       |
| +----------------------------------------------------------------------------+------------------------------------------------+                                                                                                        |                       |                       |
+----------------------------------------------------------------------------------------------------------------------------------------------------------------------------------------------------------------------------------------+-----------------------+-----------------------+

615 visitas
