[]

LA VILLA DE COLIMA DE LA NUEVA ESPAÑA
SIGLO XVI

VOLUMEN I      (CAJAS 1-11)

[]

Inicio | Búsquedas | Siglas y bibliografía | Cartografía | Créditos | Más información

[]

Búsqueda rápida

+:--------------------------------------------------------------------------------------------------------------------------------------------------------------------------------------------------------------------------------------------------------------------------------------------------------------------------------------------------------------------------------------------------------------------------------------------------------------------------------------------------------------------------------------------------------------------------------------------------------------------------------------:+------------------------------------------:+
| Fecha:                                                                                                                                                                                                                                                                                                                                                                                                                                                                                                                                                                                                                                 | Ubicación física del documento original:  |
| 1568 Noviembre, 17                                                                                                                                                                                                                                                                                                                                                                                                                                                                                                                                                                                                                     | CAJA A-5, EXP. 13, F. 20.                 |
|                                                                                                                                                                                                                                                                                                                                                                                                                                                                                                                                                                                                                                        | Archivo Histórico del Municipio de Colima |
+----------------------------------------------------------------------------------------------------------------------------------------------------------------------------------------------------------------------------------------------------------------------------------------------------------------------------------------------------------------------------------------------------------------------------------------------------------------------------------------------------------------------------------------------------------------------------------------------------------------------------------------+-------------------------------------------+
| 172. 1568. Noviembre, 17.                                                                                                                                                                                                                                                                                                                                                                                                                                                                                                                                                                                                              |                                           |
|                                                                                                                                                                                                                                                                                                                                                                                                                                                                                                                                                                                                                                        |                                           |
| Remate de los tributos de Chiametla y Tlacatipa.                                                                                                                                                                                                                                                                                                                                                                                                                                                                                                                                                                                       |                                           |
|                                                                                                                                                                                                                                                                                                                                                                                                                                                                                                                                                                                                                                        |                                           |
| [Al margen: Tlacatipa e Chiametla].                                                                                                                                                                                                                                                                                                                                                                                                                                                                                                                                                                                                    |                                           |
|                                                                                                                                                                                                                                                                                                                                                                                                                                                                                                                                                                                                                                        |                                           |
| En presencia del licenciado Juan de Hoyos, alcalde mayor de Colima y corregidor de Chiametla e Tlacatipa, presente Bernaldino Cola, persona nombrada por los jueces y oficiales de la Real Hacienda, por mandamiento del señor alcalde mayor y por voz de Juan, negro pregonero, se trujeron en pública almoneda 8 mantas y 2 piernas que son obligados los indios de los dichos pueblos a dar de tributo a Su Majestad, "de un tercio que se cumplió a siete días deste presente mes de noviembre, las cuatro mantas e una pierna de Tlacatipa, e las cuatro e una pierna de Chiametla, corregimiento del dicho señor alcalde mayor". |                                           |
|                                                                                                                                                                                                                                                                                                                                                                                                                                                                                                                                                                                                                                        |                                           |
| Pedro de Bobadilla, vecino de Colima, puso cada manta a 3 pesos, rematándose en él. Testigos fueron Pero Ruiz y Francisco de Frías.                                                                                                                                                                                                                                                                                                                                                                                                                                                                                                    |                                           |
|                                                                                                                                                                                                                                                                                                                                                                                                                                                                                                                                                                                                                                        |                                           |
| Pasó ante Juan Vázquez, escribano.                                                                                                                                                                                                                                                                                                                                                                                                                                                                                                                                                                                                     |                                           |
|                                                                                                                                                                                                                                                                                                                                                                                                                                                                                                                                                                                                                                        |                                           |
| Caja A–5, exp. 13, f. 20.                                                                                                                                                                                                                                                                                                                                                                                                                                                                                                                                                                                                              |                                           |
+----------------------------------------------------------------------------------------------------------------------------------------------------------------------------------------------------------------------------------------------------------------------------------------------------------------------------------------------------------------------------------------------------------------------------------------------------------------------------------------------------------------------------------------------------------------------------------------------------------------------------------------+-------------------------------------------+

Documento(s) original(es)

Archivo no encontrado (CAJAS/CAJA5/EXP13/020V.jpg)

[]
20F

Proyecto interinstitucional del Archivo Histórico del Municipio de Colima y la Universidad de Colima,
realizado bajo los auspicios del fondo Ramón Álvarez-Buylla de Aldana.

------------------------------------------------------------------------

ISBN 978-968-7412-85-6
® Derechos Reservados 2008. Archivo Histórico del Municipio de Colima.

1,078 visitas
