+--------------------------------------------------------------------------------------------------------------------------------------------------------------------------------------------------------------------------------------------------------------------------------------------------------------------------------------------+---------------------------------------+-----------------------+
| []                                                                                                                                                                                                                                                                                                                                         | LA VILLA DE COLIMA DE LA NUEVA ESPAÑA | []                    |
|                                                                                                                                                                                                                                                                                                                                            | SIGLO XVI                             |                       |
|                                                                                                                                                                                                                                                                                                                                            |                                       |                       |
|                                                                                                                                                                                                                                                                                                                                            | VOLUMEN I      (CAJAS 1-11)           |                       |
+--------------------------------------------------------------------------------------------------------------------------------------------------------------------------------------------------------------------------------------------------------------------------------------------------------------------------------------------+---------------------------------------+-----------------------+
| Inicio | Búsquedas | Siglas y bibliografía | Cartografía | Créditos | Más información                                                                                                                                                                                                                                                      |                                       | []                    |
+--------------------------------------------------------------------------------------------------------------------------------------------------------------------------------------------------------------------------------------------------------------------------------------------------------------------------------------------+---------------------------------------+-----------------------+
| Búsqueda rápida                                                                                                                                                                                                                                                                                                                            |                                       |                       |
|                                                                                                                                                                                                                                                                                                                                            |                                       |                       |
| +:------------------------------------------------------------------------------------------------------------------------------------------------------------------------------------------------------------------------------------------------------------------------------------------:+------------------------------------------:+ |                                       |                       |
| | Fecha:                                                                                                                                                                                                                                                                                     | Ubicación física del documento original:  | |                                       |                       |
| | 1577 Julio, 28                                                                                                                                                                                                                                                                             | CAJA A-9, EXP. 13, F. 1.                  | |                                       |                       |
| |                                                                                                                                                                                                                                                                                            | Archivo Histórico del Municipio de Colima | |                                       |                       |
| +--------------------------------------------------------------------------------------------------------------------------------------------------------------------------------------------------------------------------------------------------------------------------------------------+-------------------------------------------+ |                                       |                       |
| | 304. 1577. Julio, 28.                                                                                                                                                                                                                                                                      |                                           | |                                       |                       |
| |                                                                                                                                                                                                                                                                                            |                                           | |                                       |                       |
| | Cristóbal de Silva sustituye en Pedro de Ribafrecha un poder que le había otorgado Alonso de la Puerta.                                                                                                                                                                                    |                                           | |                                       |                       |
| |                                                                                                                                                                                                                                                                                            |                                           | |                                       |                       |
| | Cristóbal de Silva sustituye en Pedro de Ribafrecha un poder otorgado en México por Alonso de la Puerta, ante el escribano Diego de Zamora, el pasado 6 de marzo de 1576, en México, del que habían sido testigos Gonzalo de Prado, Antón Martín y Fernando Rodríguez, vecinos y estantes. |                                           | |                                       |                       |
| |                                                                                                                                                                                                                                                                                            |                                           | |                                       |                       |
| | Pasó ante Baltasar de Alcalá, escribano de Su Majestad, siendo testigos Pero Ruiz de Vilches, Juan de Quirós(1) y Cristóbal Hernández de Tene.                                                                                                                                             |                                           | |                                       |                       |
| |                                                                                                                                                                                                                                                                                            |                                           | |                                       |                       |
| | Caja A–9, exp. 13, f. 1.                                                                                                                                                                                                                                                                   |                                           | |                                       |                       |
| |                                                                                                                                                                                                                                                                                            |                                           | |                                       |                       |
| |                                                                                                                                                                                                                                                                                            |                                           | |                                       |                       |
| |                                                                                                                                                                                                                                                                                            |                                           | |                                       |                       |
| | ---------------                                                                                                                                                                                                                                                                            |                                           | |                                       |                       |
| |                                                                                                                                                                                                                                                                                            |                                           | |                                       |                       |
| | (1) Es posible que se trate de un vecino de México homónimo: infra, regº 354, aunque también pudiera ser Juan Bautista de Quirós, vecino de Colima.                                                                                                                                        |                                           | |                                       |                       |
| +--------------------------------------------------------------------------------------------------------------------------------------------------------------------------------------------------------------------------------------------------------------------------------------------+-------------------------------------------+ |                                       |                       |
|                                                                                                                                                                                                                                                                                                                                            |                                       |                       |
|   ---------------------------------------------------------------------------------------------------                                                                                                                                                                                                                                      |                                       |                       |
|    Documento(s) original(es)                                                                                                                                                                                                                                                                                                               |                                       |                       |
|   --------------------------- ------- ------- ------- ------- ------- ------- ------- ------- -------                                                                                                                                                                                                                                      |                                       |                       |
|               []                []                                                                                                                                                                                                                                                                                                         |                                       |                       |
|               1F                1V                                                                                                                                                                                                                                                                                                         |                                       |                       |
|                                                                                                                                                                                                                                                                                                                                            |                                       |                       |
|   ---------------------------------------------------------------------------------------------------                                                                                                                                                                                                                                      |                                       |                       |
+--------------------------------------------------------------------------------------------------------------------------------------------------------------------------------------------------------------------------------------------------------------------------------------------------------------------------------------------+---------------------------------------+-----------------------+
| Proyecto interinstitucional del Archivo Histórico del Municipio de Colima y la Universidad de Colima,                                                                                                                                                                                                                                      |                                       |                       |
| realizado bajo los auspicios del fondo Ramón Álvarez-Buylla de Aldana.                                                                                                                                                                                                                                                                     |                                       |                       |
|                                                                                                                                                                                                                                                                                                                                            |                                       |                       |
| ------------------------------------------------------------------------                                                                                                                                                                                                                                                                   |                                       |                       |
|                                                                                                                                                                                                                                                                                                                                            |                                       |                       |
| ISBN 978-968-7412-85-6                                                                                                                                                                                                                                                                                                                     |                                       |                       |
| ® Derechos Reservados 2008. Archivo Histórico del Municipio de Colima.                                                                                                                                                                                                                                                                     |                                       |                       |
+--------------------------------------------------------------------------------------------------------------------------------------------------------------------------------------------------------------------------------------------------------------------------------------------------------------------------------------------+---------------------------------------+-----------------------+

1,078 visitas
