+------------------------------------------------------------------------------------------------------------------------------------------------------------------------------------------------------------------------------------------------------------------+-----------------------+-----------------------+
| []                                                                                                                                                                                                                                                               |                       |                       |
|                                                                                                                                                                                                                                                                  |                       |                       |
| +-----------------------------------+:-------------------------------------:+                                                                                                                                                                                    |                       |                       |
| | []                                | LA VILLA DE COLIMA DE LA NUEVA ESPAÑA |                                                                                                                                                                                    |                       |                       |
| |                                   | SIGLO XVI                             |                                                                                                                                                                                    |                       |                       |
| |                                   |                                       |                                                                                                                                                                                    |                       |                       |
| |                                   | VOLUMEN II      (CAJAS 12-20)         |                                                                                                                                                                                    |                       |                       |
| +-----------------------------------+---------------------------------------+                                                                                                                                                                                    |                       |                       |
+------------------------------------------------------------------------------------------------------------------------------------------------------------------------------------------------------------------------------------------------------------------+-----------------------+-----------------------+
| +------------------------------------------------------------------------+---------------------------+-----------------------+                                                                                                                                   |                       |                       |
| | Inicio | Búsqueda | Siglas y bibliografía | Créditos | Más información | (consulta las cajas 1-11) |    [ES]               |                                                                                                                                   |                       |                       |
| +------------------------------------------------------------------------+---------------------------+-----------------------+                                                                                                                                   |                       |                       |
+------------------------------------------------------------------------------------------------------------------------------------------------------------------------------------------------------------------------------------------------------------------+-----------------------+-----------------------+
| Búsqueda rápida                                                                                                                                                                                                                                                  |                       |                       |
|                                                                                                                                                                                                                                                                  |                       |                       |
| +:-------------------:+-----------------+:----------------------------------------:+----------------:+                                                                                                                                                           |                       |                       |
| | Documento de fecha: |                 | Ubicación física del documento original: | [] [] []        |                                                                                                                                                           |                       |                       |
| |                     |                 |                                          |                 |                                                                                                                                                           |                       |                       |
| | 1598. Marzo, 28     |                 | Caja 19, exp. 1, ff. 352-358.^([905])    |                 |                                                                                                                                                           |                       |                       |
| +---------------------+-----------------+------------------------------------------+-----------------+                                                                                                                                                           |                       |                       |
|                                                                                                                                                                                                                                                                  |                       |                       |
|   ------------- ----------------------------------------------------------------------------------------------------------------------                                                                                                                           |                       |                       |
|   Resumen:      Juan Agustín de la Puerta, curador que fue de Francisca de Grijalba, pide que su sucesor se asiente a cuentas con él                                                                                                                             |                       |                       |
|   ------------- ----------------------------------------------------------------------------------------------------------------------                                                                                                                           |                       |                       |
|                                                                                                                                                                                                                                                                  |                       |                       |
|   ----------------------------------- -------------------------------------------------------------------------------------------------------------------------------------------------------------------------------------------------------------------------- |                       |                       |
|   Contenido:                          Ante el alcalde mayor de la Villa de Colima don Felipe de Valdés, Juan Agustín de la Puerta, curador que fue de Francisca de Grijalba, pide que el nuevo curador Álvaro García de Grijalba, se asiente a cuentas con él.   |                       |                       |
|                                       Cargos y descargos.                                                                                                                                                                                                        |                       |                       |
|                                                                                                                                                                                                                                                                  |                       |                       |
|   ----------------------------------- -------------------------------------------------------------------------------------------------------------------------------------------------------------------------------------------------------------------------- |                       |                       |
|                                                                                                                                                                                                                                                                  |                       |                       |
| (905) Antes en caja 18, exp. 1.                                                                                                                                                                                                                                  |                       |                       |
|                                                                                                                                                                                                                                                                  |                       |                       |
|   ---------------------------------------------------------------------------------------------------                                                                                                                                                            |                       |                       |
|    Documento(s) original(es)                                                                                                                                                                                                                                     |                       |                       |
|   --------------------------- ------- ------- ------- ------- ------- ------- ------- ------- -------                                                                                                                                                            |                       |                       |
|               []                []      []      []      []      []      []      []      []      []                                                                                                                                                               |                       |                       |
|              352f              353f    354f    354v    355f    355v    356f    356v    357f    357v                                                                                                                                                              |                       |                       |
|                                                                                                                                                                                                                                                                  |                       |                       |
|               []                []                                                                                                                                                                                                                               |                       |                       |
|              358f              358v                                                                                                                                                                                                                              |                       |                       |
|   ---------------------------------------------------------------------------------------------------                                                                                                                                                            |                       |                       |
+------------------------------------------------------------------------------------------------------------------------------------------------------------------------------------------------------------------------------------------------------------------+-----------------------+-----------------------+
| +----------------------------------------------------------------------------+------------------------------------------------+                                                                                                                                  |                       |                       |
| | ISBN 978-607-701-024-1                                                     |   ---- ---- ---- ---- ---- ---- ---- ---- ---- |                                                                                                                                  |                       |                       |
| | © Derechos Reservados 2013. Archivo Histórico del Municipio de Colima. [*] |   []        []        []        []        []   |                                                                                                                                  |                       |                       |
| |                                                                            |   ---- ---- ---- ---- ---- ---- ---- ---- ---- |                                                                                                                                  |                       |                       |
| +----------------------------------------------------------------------------+------------------------------------------------+                                                                                                                                  |                       |                       |
| |                                                                            |                                                |                                                                                                                                  |                       |                       |
| +----------------------------------------------------------------------------+------------------------------------------------+                                                                                                                                  |                       |                       |
+------------------------------------------------------------------------------------------------------------------------------------------------------------------------------------------------------------------------------------------------------------------+-----------------------+-----------------------+

615 visitas
