[]

LA VILLA DE COLIMA DE LA NUEVA ESPAÑA
SIGLO XVI

VOLUMEN I      (CAJAS 1-11)

[]

Inicio | Búsquedas | Siglas y bibliografía | Cartografía | Créditos | Más información

[]

Búsqueda rápida

+:------------------------------------------------------------------------------------------------------------------------------------------------------------------------------------------------------------------------------------------------------------------------------------------------------------------------------------------------------------------------------------------------------------------------------------------------------------------------------------------------------------------------------------:+------------------------------------------:+
| Fecha:                                                                                                                                                                                                                                                                                                                                                                                                                                                                                                                               | Ubicación física del documento original:  |
| 1570 Febrero, 22                                                                                                                                                                                                                                                                                                                                                                                                                                                                                                                     | CAJA A-6, EXP. 8, FF. 1-2.                |
|                                                                                                                                                                                                                                                                                                                                                                                                                                                                                                                                      | Archivo Histórico del Municipio de Colima |
+--------------------------------------------------------------------------------------------------------------------------------------------------------------------------------------------------------------------------------------------------------------------------------------------------------------------------------------------------------------------------------------------------------------------------------------------------------------------------------------------------------------------------------------+-------------------------------------------+
| 186. 1570. Febrero, 22.                                                                                                                                                                                                                                                                                                                                                                                                                                                                                                              |                                           |
|                                                                                                                                                                                                                                                                                                                                                                                                                                                                                                                                      |                                           |
| Pedro Maldonado, vecino de Zapotlan, en nombre del mercader Juan de Arrúe, contra Juan Griego por pesos.                                                                                                                                                                                                                                                                                                                                                                                                                             |                                           |
|                                                                                                                                                                                                                                                                                                                                                                                                                                                                                                                                      |                                           |
| "En el pueblo de Tuspa de la Nueva España" y "ante el muy magnífico señor Joan Fernández, alcalde mayor desde dicho pueblo y su partido por Su Majestad, e por ante mí Diego del Castillo, escribano" y testigos, compareció Pedro Maldonado en nombre de Joanes de Arrúe y presentó este poder y una obligación contra Juan Griego, pidiendo mandamiento ejecutorio por cuantía de 30 pesos y 2 tomines de tipuzque.                                                                                                                |                                           |
|                                                                                                                                                                                                                                                                                                                                                                                                                                                                                                                                      |                                           |
| "Sepan cuantos esta carta vieren, cómo yo Juan de Arrúe, residente que soy en esta gran Ciudad de México desta Nueva España, otorgo e conozco por esta su carta que doy e otorgo todo mi poder cumplido, libre e lleno" a Cristóbal de Silva, vecino de Colima. El poder está dado en México el 15 de junio de 1569 ante el escribano Luis de Armenta.                                                                                                                                                                               |                                           |
|                                                                                                                                                                                                                                                                                                                                                                                                                                                                                                                                      |                                           |
| El 16 de octubre del mismo año, ante el alcalde ordinario de la Villa de Colima Bernaldino Cola y el escribano Baltasar de Alcalá, Cristóbal de Silva, "residente en esta dicha Villa, dijo que en su lugar y en nombre de Juanes de Arrúe, vecino de México, sustituía e sustituyó de a esta otra parte contenido en Pedro Maldonado, vecino del pueblo de Zapotlan".                                                                                                                                                               |                                           |
|                                                                                                                                                                                                                                                                                                                                                                                                                                                                                                                                      |                                           |
| El 25 de enero de 1576, "ante mí Francisco López Avecilla, escribano público desta dicha Villa [de Colima] e su Provincia por Su Majestad" y de Agustín de la Puerta, Andrés de Segura y Mateo de Berlanga, vecinos de Colima, por testigos, "paresció presente Cristóbal de Silva, vecino desta dicha Villa, e dijo que en su lugar y en nombre de Juanes de Arrúe, vecino de México, sustituía e sustituyó el poder desta otra parte contenido según y como en él se contiene a Martín Ruiz, vecino desta Villa, questá presente". |                                           |
|                                                                                                                                                                                                                                                                                                                                                                                                                                                                                                                                      |                                           |
| Caja A–6, exp. 8, ff. 1-2.                                                                                                                                                                                                                                                                                                                                                                                                                                                                                                           |                                           |
+--------------------------------------------------------------------------------------------------------------------------------------------------------------------------------------------------------------------------------------------------------------------------------------------------------------------------------------------------------------------------------------------------------------------------------------------------------------------------------------------------------------------------------------+-------------------------------------------+

Documento(s) original(es)

Archivo no encontrado (CAJAS/CAJA6/EXP8/001F.jpg)

Archivo no encontrado (CAJAS/CAJA6/EXP8/001V.jpg)

Archivo no encontrado (CAJAS/CAJA6/EXP8/002F.jpg)

Archivo no encontrado (CAJAS/CAJA6/EXP8/002V.jpg)

Proyecto interinstitucional del Archivo Histórico del Municipio de Colima y la Universidad de Colima,
realizado bajo los auspicios del fondo Ramón Álvarez-Buylla de Aldana.

------------------------------------------------------------------------

ISBN 978-968-7412-85-6
® Derechos Reservados 2008. Archivo Histórico del Municipio de Colima.

1,078 visitas
