[]

LA VILLA DE COLIMA DE LA NUEVA ESPAÑA
SIGLO XVI

VOLUMEN I      (CAJAS 1-11)

[]

Inicio | Búsquedas | Siglas y bibliografía | Cartografía | Créditos | Más información

[]

Búsqueda rápida

+:--------------------------------------------------------------------------------------------------------------------------------------------------------------------------------------------------------------------------------------------------------------------------------------------------------------------------------------------------------------------------------------------------------------------------------------------------------------------------------------------------------------------------------------------------------------------------------------------------------------------------------------------------------------------------------------------------------------------------------------------------------------------------------------------------------------------------------------------------------------------------------------------------------------------------------------------------------------------------------------------:+------------------------------------------:+
| Fecha:                                                                                                                                                                                                                                                                                                                                                                                                                                                                                                                                                                                                                                                                                                                                                                                                                                                                                                                                                                                       | Ubicación física del documento original:  |
| 1574 Octubre, 2                                                                                                                                                                                                                                                                                                                                                                                                                                                                                                                                                                                                                                                                                                                                                                                                                                                                                                                                                                              | CAJA A-7, EXP. 17, 17 FF.                 |
|                                                                                                                                                                                                                                                                                                                                                                                                                                                                                                                                                                                                                                                                                                                                                                                                                                                                                                                                                                                              | Archivo Histórico del Municipio de Colima |
+----------------------------------------------------------------------------------------------------------------------------------------------------------------------------------------------------------------------------------------------------------------------------------------------------------------------------------------------------------------------------------------------------------------------------------------------------------------------------------------------------------------------------------------------------------------------------------------------------------------------------------------------------------------------------------------------------------------------------------------------------------------------------------------------------------------------------------------------------------------------------------------------------------------------------------------------------------------------------------------------+-------------------------------------------+
| 254. 1574. Octubre, 2.                                                                                                                                                                                                                                                                                                                                                                                                                                                                                                                                                                                                                                                                                                                                                                                                                                                                                                                                                                       |                                           |
|                                                                                                                                                                                                                                                                                                                                                                                                                                                                                                                                                                                                                                                                                                                                                                                                                                                                                                                                                                                              |                                           |
| Licencia para vender un pedazo de tierra y huerta de cacao, llamada de Achiutlan, que solicitan Diego Mexicano y su esposa Mencía Sánchez, indios de Tapixtlan.                                                                                                                                                                                                                                                                                                                                                                                                                                                                                                                                                                                                                                                                                                                                                                                                                              |                                           |
|                                                                                                                                                                                                                                                                                                                                                                                                                                                                                                                                                                                                                                                                                                                                                                                                                                                                                                                                                                                              |                                           |
| Tapixtlan, jurisdicción de la alcaldía mayor de la Villa de Colima. Ante Pedro de Almodóvar, juez de comisión por el contador Martín de Montúfar, alcalde mayor, y en presencia de Luis de Arriaga, escribano nombrado para este efecto, presentaron unos naturales, indios vecinos del pueblo de Tapixtlan, una petición, cuyo tenor es el siguiente:                                                                                                                                                                                                                                                                                                                                                                                                                                                                                                                                                                                                                                       |                                           |
|                                                                                                                                                                                                                                                                                                                                                                                                                                                                                                                                                                                                                                                                                                                                                                                                                                                                                                                                                                                              |                                           |
| "Diego Mexicano y Mencía Sánchez, su mujer, hija legítima de don Sancho, gobernador que fue de el pueblo de Tlapistlan, difunto, que Dios haya, "indios somos, decimos, que por fin y muerte del dicho don Sancho, yo la dicha Mencía Sánchez hube y heredé como su hija legítima, la cuarta parte de las tierras y güertas de cacao que se dice de Achiutlan, que están en términos del pueblo de Tlapistlan, por linderos de la una parte Huerta de don Alonso, gobernador del dicho pueblo, y de la otra parte las vertientes de los cerros que dicen de Los Ángeles".^([1])                                                                                                                                                                                                                                                                                                                                                                                                              |                                           |
|                                                                                                                                                                                                                                                                                                                                                                                                                                                                                                                                                                                                                                                                                                                                                                                                                                                                                                                                                                                              |                                           |
| Agregan que ambos están ya "convenidos y concertados de vender la dicha cuarta parte a la persona que más por ella nos diere, atento a que se nos va perdiendo e cada día es menos a causa de estar como estamos de muchos años a esta parte tullidos y enfermos, y desde que nosotros tenemos la dicha cuarta parte de heredad de cacao, nunca nos hemos aprovechado de los frutos y esquilmos della, de cuya causa se nos ha perdido y pierde y se nos acabaría de perder si no la vendiésemos, porque con lo que por ella nos darán, podremos suplir y remediar nuestra pobreza y la mucha necesidad que padecemos".                                                                                                                                                                                                                                                                                                                                                                      |                                           |
|                                                                                                                                                                                                                                                                                                                                                                                                                                                                                                                                                                                                                                                                                                                                                                                                                                                                                                                                                                                              |                                           |
| Piden que se les dé licencia y facultad para vender, "con las diligencias que Su Majestad por su Real Cédula manda".                                                                                                                                                                                                                                                                                                                                                                                                                                                                                                                                                                                                                                                                                                                                                                                                                                                                         |                                           |
|                                                                                                                                                                                                                                                                                                                                                                                                                                                                                                                                                                                                                                                                                                                                                                                                                                                                                                                                                                                              |                                           |
| Pedro de Almodóvar, vecino y regidor de la Villa de Colima, en virtud de la comisión dada por el alcalde mayor Martín de Montúfar, fechada el 1° de octubre de 1574, donde le dice que los susodichos naturales le hicieron relación de que tienen y poseen un cuarto de huerta en términos de Tapixtlan, heredada de don Sancho, gobernador, y que "las otras e terceras partes tiene al presente e posée Francisco Ruiz, clérigo presbítero, cuya y vicario del partido de Tecolapa en esta jurisdicción", y como desde hace muchos años Diego y Mencía no se aprovechan de los frutos de la huerta, "ansí por estar como estaban enfermos e tullidos, como por ser poca cosa", y que por tanto solicitaban licencia para poder vender.                                                                                                                                                                                                                                                    |                                           |
|                                                                                                                                                                                                                                                                                                                                                                                                                                                                                                                                                                                                                                                                                                                                                                                                                                                                                                                                                                                              |                                           |
| Como el pueblo de Tapixtlan "está diez leguas desta Villa e yo estoy ocupado en negocios tocantes al servicio de Su Majestad y ejecución de su Real Justicia, de cuya causa no puedo ir en persona", por consiguiente, "vos nombro por juez para el dicho efecto".                                                                                                                                                                                                                                                                                                                                                                                                                                                                                                                                                                                                                                                                                                                           |                                           |
|                                                                                                                                                                                                                                                                                                                                                                                                                                                                                                                                                                                                                                                                                                                                                                                                                                                                                                                                                                                              |                                           |
| El juez de comisión, trasladado al pueblo de Tapixtlan, nombró por escribano a Luis de Arriaga, español; luego designó por intérprete de la lengua mexicana "que es la lengua que los dichos indios hablan", a Jerónimo López, "indio ladino en la lengua castellana y mexicana que habla"; y por cuanto Diego Mexicano y Mencía Sánchez "son indios e ignorantes", y "para que mejor hagan e vendan la dicha huerta y pidan su justicia", nombró de acuerdo con los interesados por su defensor a Martín Chavarín.                                                                                                                                                                                                                                                                                                                                                                                                                                                                          |                                           |
|                                                                                                                                                                                                                                                                                                                                                                                                                                                                                                                                                                                                                                                                                                                                                                                                                                                                                                                                                                                              |                                           |
| Pedro de Almodóvar les mandó dar "información de cómo es útil e provechoso vender la dicha cuarta parte de güerta de cacao", y para ello presentaron por testigos a Ruy López Tenorio, a Gonzalo de Cáceres, a don Pedro, gobernador del pueblo de Alima, a don Alonso, gobernador del pueblo de Tapixtlan, a don Gabriel, gobernador del pueblo de Tezahuacan, y a Pedro, natural del pueblo de Tapixtlan, a quienes se les tomó juramento conforme a derecho.                                                                                                                                                                                                                                                                                                                                                                                                                                                                                                                              |                                           |
|                                                                                                                                                                                                                                                                                                                                                                                                                                                                                                                                                                                                                                                                                                                                                                                                                                                                                                                                                                                              |                                           |
| Ruy López Tenorio, "estante en esta tierra e pueblo de Tezaguacan", dijo conocer a Diego Mexicano y Mencía Sánchez "de más de quince años a esta parte", y que desde hace mucho tiempo tienen la cuarta parte de la huerta de cacao; opina que es útil y provechoso venderla, "porque nunca ellos se han aprovechado de cosa alguna de frutos que les hayan cabido, y si algunos les han cabido, no los han cobrado porque un tarasco que poseía la dicha güerta, que se dice Pedro Cuxo, se lo llevaba todo y no les acudía ni acudió con cosa alguna, y que esto sabe porque el dicho Diego Mexicano se le quejó muchas veces dello, de más de que este testigo vido coger los frutos al dicho Pedro Cuxo e su hermano Miguel, e que ellos mismos decían que era suyo, demás de que el dicho Diego no ha tenido ni tiene salud para cultivar e beneficiar las tierras e güerta". Añade que Mencía "siempre ha estado tullida e al presente lo está". Declaró tener más de 40 años de edad. |                                           |
|                                                                                                                                                                                                                                                                                                                                                                                                                                                                                                                                                                                                                                                                                                                                                                                                                                                                                                                                                                                              |                                           |
| Gonzalo de Cáceres dijo conocer a los susodichos y a don Sancho, gobernador que fue del pueblo de Tapixtlan, y que sabe que por fin y muerte de éste, Mencía Sánchez heredó la cuarta parte de la huerta de cacao, "que se dice de Achiutlan e que como tales los han habido e poseído, aunque después que se casó Pedro Cuxo con una hija de Francisco Mexicano, el dicho Pedro Cuxo siempre se ha llevado los frutos contra la voluntad de los dichos". Opina que es más útil y provechoso que la vendan, porque se les pierde todo, no se aprovechan de sus frutos y además, "de ocho o nueve años a esta parte que murió el dicho don Sancho, demás de que el dicho Diego Mexicano tiene otra heredad en que se ocupa e por ser solo, no puede con todo". Cáceres dijo tener más de 30 años de edad.                                                                                                                                                                                     |                                           |
|                                                                                                                                                                                                                                                                                                                                                                                                                                                                                                                                                                                                                                                                                                                                                                                                                                                                                                                                                                                              |                                           |
| El gobernador don Alonso, por lengua de Jerónimo López, indio ladino, dijo que conocía a Diego y Mencía y que también conoció a don Sancho, padre de la susodicha, y que por lo mismo sabe que heredó de él la parte de la Huerta de Achiutlan; que desde que falleció don Sancho, hará ocho o nueve años, no se han aprovechado del cacao, porque después de que casó Pedro Cuxo con María, hija de Francisco Mexicano, "siempre se llevó todo el cacao". La venta de la huerta es lo más conveniente, opina, porque "Diego Mexicano tiene otras tierras e güerta, donde tiene que hacer y esto que agora vende, se le pierde". Dijo tener más de 40 años de edad.                                                                                                                                                                                                                                                                                                                          |                                           |
|                                                                                                                                                                                                                                                                                                                                                                                                                                                                                                                                                                                                                                                                                                                                                                                                                                                                                                                                                                                              |                                           |
| En los mismos términos dio su testimonio Pedro, indio natural de Tapistlan, quien dijo tener más de 30 años de edad.                                                                                                                                                                                                                                                                                                                                                                                                                                                                                                                                                                                                                                                                                                                                                                                                                                                                         |                                           |
|                                                                                                                                                                                                                                                                                                                                                                                                                                                                                                                                                                                                                                                                                                                                                                                                                                                                                                                                                                                              |                                           |
| Don Pedro, gobernador de Alima, declaró que conocía de más de 15 años a Diego Mexicano y a Mencía, y que también conoció a su padre, el gobernador don Sancho, de quien ella heredó esa parte de huerta de cacao; pero que desde la muerte de don Sancho, nunca "se han aprovechado en cosa alguna de cacao ni otra cosa, sino que siempre ha visto llevar los esquilmos de la Huerta de Achiutla a Pedro Cuxo, tarasco, e que nunca le quiso dar ninguna cosa y que nunca el dicho Diego Mexicano labró ni cultivó tierras ningunas della". Juzga "más útil e provechoso vendella, porque se le va perdiendo y que teniendo como tiene otra heredad en que se puede ocupar, no recibe daño en vendella, sino que le es más provechoso".                                                                                                                                                                                                                                                     |                                           |
|                                                                                                                                                                                                                                                                                                                                                                                                                                                                                                                                                                                                                                                                                                                                                                                                                                                                                                                                                                                              |                                           |
| Don Gabriel, gobernador de Tezaguacan, dijo conocer a Diego y Mencía así como también al difunto don Sancho, quien "le dejó parte de sus bienes entre los cuales le dejó la cuarta parte de la Huerta de Achiutla, de la cual sabe este testigo que nunca ha tenido aprovechamiento alguno, porque siempre vido este testigo que un tarasquillo que se casó con una sobrina de la dicha Mencía Sánchez, se ha llevado los frutos e esquilmos della e que ansí la dejaba perder por no poderla beneficiar y tener otra heredad, e que sabe que le será más útil e provechoso venderla que no tenerla". Dijo tener más de 30 años de edad.                                                                                                                                                                                                                                                                                                                                                     |                                           |
|                                                                                                                                                                                                                                                                                                                                                                                                                                                                                                                                                                                                                                                                                                                                                                                                                                                                                                                                                                                              |                                           |
| Recibida la información, en cumplimiento de las Reales Cédulas acerca de vender los indios naturales sus tierras, Pedro de Almodóvar mandó que anduviera en almoneda la dicha cuarta parte de huerta según y como Su Majestad lo tiene proveído y mandado. Testigos: Diego de Aguilar, Gonzalo de Cáceres, Ruy López Tenorio, españoles, y Martín Chavarín y los dichos indios.                                                                                                                                                                                                                                                                                                                                                                                                                                                                                                                                                                                                              |                                           |
|                                                                                                                                                                                                                                                                                                                                                                                                                                                                                                                                                                                                                                                                                                                                                                                                                                                                                                                                                                                              |                                           |
| Por voz del mulato Gabriel, pregonero nombrado, se cantaron los pregones. El Padre Francisco Ruiz y "puso la dicha cuarta parte de huerta e tierras e aguas a ella pertenecientes e lo demás a ella aneja", en 40 pesos de oro común; por no aparecer quien más diera por la huerta, el Padre Francisco Ruiz "firmó la dicha postura". Testigos: Diego de Aguilar y Ruy López Tenorio, españoles; don Alonso, gobernador de este pueblo de Tapixtlan, Alonso Miguel, alcalde, Pedro, mayordomo y otros muchos indios del dicho pueblo.                                                                                                                                                                                                                                                                                                                                                                                                                                                       |                                           |
|                                                                                                                                                                                                                                                                                                                                                                                                                                                                                                                                                                                                                                                                                                                                                                                                                                                                                                                                                                                              |                                           |
| En día sucesivos corrieron los 30 pregones conforme a la ley, sin aparecer persona alguna que pujara más de los 40 pesos que ofreciera Francisco Ruiz. El 2 de noviembre, cuando el mulato Gabriel cantó el último pregón, Ruy López Tenorio puso la heredad de cacao que "está un cuarto de legua desde dicho pueblo", en 45 pesos; entonces el Padre Ruiz ofreció por ella 60 pesos, a quien se le adjudicó por esa cantidad.                                                                                                                                                                                                                                                                                                                                                                                                                                                                                                                                                              |                                           |
|                                                                                                                                                                                                                                                                                                                                                                                                                                                                                                                                                                                                                                                                                                                                                                                                                                                                                                                                                                                              |                                           |
| El 8 de noviembre, ante el juez de comisión Pedro de Almodóvar y de Baltasar de Alcalá, escribano, Diego Mexicano y Mencía Sánchez dieron y otorgaron carta de venta al Padre Francisco Ruiz.                                                                                                                                                                                                                                                                                                                                                                                                                                                                                                                                                                                                                                                                                                                                                                                                |                                           |
|                                                                                                                                                                                                                                                                                                                                                                                                                                                                                                                                                                                                                                                                                                                                                                                                                                                                                                                                                                                              |                                           |
| Caja A–7, exp. 17, 17 ff.                                                                                                                                                                                                                                                                                                                                                                                                                                                                                                                                                                                                                                                                                                                                                                                                                                                                                                                                                                    |                                           |
|                                                                                                                                                                                                                                                                                                                                                                                                                                                                                                                                                                                                                                                                                                                                                                                                                                                                                                                                                                                              |                                           |
|                                                                                                                                                                                                                                                                                                                                                                                                                                                                                                                                                                                                                                                                                                                                                                                                                                                                                                                                                                                              |                                           |
|                                                                                                                                                                                                                                                                                                                                                                                                                                                                                                                                                                                                                                                                                                                                                                                                                                                                                                                                                                                              |                                           |
| ---------------                                                                                                                                                                                                                                                                                                                                                                                                                                                                                                                                                                                                                                                                                                                                                                                                                                                                                                                                                                              |                                           |
|                                                                                                                                                                                                                                                                                                                                                                                                                                                                                                                                                                                                                                                                                                                                                                                                                                                                                                                                                                                              |                                           |
| (1) Acerca de Tapixtlan y estos cerros, nuestras notas: supra, regº 226.                                                                                                                                                                                                                                                                                                                                                                                                                                                                                                                                                                                                                                                                                                                                                                                                                                                                                                                     |                                           |
+----------------------------------------------------------------------------------------------------------------------------------------------------------------------------------------------------------------------------------------------------------------------------------------------------------------------------------------------------------------------------------------------------------------------------------------------------------------------------------------------------------------------------------------------------------------------------------------------------------------------------------------------------------------------------------------------------------------------------------------------------------------------------------------------------------------------------------------------------------------------------------------------------------------------------------------------------------------------------------------------+-------------------------------------------+

Documento(s) original(es)

Archivo no encontrado (CAJAS/CAJA7/EXP17/001V.jpg)

Archivo no encontrado (CAJAS/CAJA7/EXP17/002F.jpg)

Archivo no encontrado (CAJAS/CAJA7/EXP17/002V.jpg)

Archivo no encontrado (CAJAS/CAJA7/EXP17/003F.jpg)

Archivo no encontrado (CAJAS/CAJA7/EXP17/003V.jpg)

Archivo no encontrado (CAJAS/CAJA7/EXP17/004F.jpg)

Archivo no encontrado (CAJAS/CAJA7/EXP17/004V.jpg)

Archivo no encontrado (CAJAS/CAJA7/EXP17/005F.jpg)

Archivo no encontrado (CAJAS/CAJA7/EXP17/005V.jpg)

Archivo no encontrado (CAJAS/CAJA7/EXP17/006F.jpg)

Archivo no encontrado (CAJAS/CAJA7/EXP17/006V.jpg)

Archivo no encontrado (CAJAS/CAJA7/EXP17/007F.jpg)

Archivo no encontrado (CAJAS/CAJA7/EXP17/007V.jpg)

Archivo no encontrado (CAJAS/CAJA7/EXP17/008F.jpg)

Archivo no encontrado (CAJAS/CAJA7/EXP17/008V.jpg)

Archivo no encontrado (CAJAS/CAJA7/EXP17/009F.jpg)

Archivo no encontrado (CAJAS/CAJA7/EXP17/009V.jpg)

Archivo no encontrado (CAJAS/CAJA7/EXP17/010F.jpg)

Archivo no encontrado (CAJAS/CAJA7/EXP17/010V.jpg)

Archivo no encontrado (CAJAS/CAJA7/EXP17/011F.jpg)

Archivo no encontrado (CAJAS/CAJA7/EXP17/011V.jpg)

Archivo no encontrado (CAJAS/CAJA7/EXP17/012F.jpg)

Archivo no encontrado (CAJAS/CAJA7/EXP17/012V.jpg)

Archivo no encontrado (CAJAS/CAJA7/EXP17/017F.jpg)

Archivo no encontrado (CAJAS/CAJA7/EXP17/017V.jpg)

[]
1F

[]
13F

[]
13V

[]
14F

[]
14V

[]
15F

[]
15V

[]
16F

[]
16V

Proyecto interinstitucional del Archivo Histórico del Municipio de Colima y la Universidad de Colima,
realizado bajo los auspicios del fondo Ramón Álvarez-Buylla de Aldana.

------------------------------------------------------------------------

ISBN 978-968-7412-85-6
® Derechos Reservados 2008. Archivo Histórico del Municipio de Colima.

1,078 visitas
