+----------------------------------------------------------------------------------------------------------------------------------------------------------------------------------------------------------------------------------------------------------------------------------------------------------+---------------------------------------+-----------------------+
| []                                                                                                                                                                                                                                                                                                       | LA VILLA DE COLIMA DE LA NUEVA ESPAÑA | []                    |
|                                                                                                                                                                                                                                                                                                          | SIGLO XVI                             |                       |
|                                                                                                                                                                                                                                                                                                          |                                       |                       |
|                                                                                                                                                                                                                                                                                                          | VOLUMEN I      (CAJAS 1-11)           |                       |
+----------------------------------------------------------------------------------------------------------------------------------------------------------------------------------------------------------------------------------------------------------------------------------------------------------+---------------------------------------+-----------------------+
| Inicio | Búsquedas | Siglas y bibliografía | Cartografía | Créditos | Más información                                                                                                                                                                                                                    |                                       | []                    |
+----------------------------------------------------------------------------------------------------------------------------------------------------------------------------------------------------------------------------------------------------------------------------------------------------------+---------------------------------------+-----------------------+
| Búsqueda rápida                                                                                                                                                                                                                                                                                          |                                       |                       |
|                                                                                                                                                                                                                                                                                                          |                                       |                       |
| +:--------------------------------------------------------------------------------------------------------------------------------------------------------------------------------------------------------------------------------------------------------:+------------------------------------------:+ |                                       |                       |
| | Fecha:                                                                                                                                                                                                                                                   | Ubicación física del documento original:  | |                                       |                       |
| | 1562 Septiembre, 14                                                                                                                                                                                                                                      | CAJA A-3, EXP. 2, FF. 36-40.              | |                                       |                       |
| |                                                                                                                                                                                                                                                          | Archivo Histórico del Municipio de Colima | |                                       |                       |
| +----------------------------------------------------------------------------------------------------------------------------------------------------------------------------------------------------------------------------------------------------------+-------------------------------------------+ |                                       |                       |
| | 63. 1562. Septiembre, 14.                                                                                                                                                                                                                                |                                           | |                                       |                       |
| |                                                                                                                                                                                                                                                          |                                           | |                                       |                       |
| | Diego de Ávila, en nombre de su esposa Estebanía de Cervera, sigue pidiendo que Diego Morán le pague.                                                                                                                                                    |                                           | |                                       |                       |
| |                                                                                                                                                                                                                                                          |                                           | |                                       |                       |
| | Ante el alcalde ordinario Hernando de Gamboa, Diego de Ávila seguía pidiendo a nombre de su esposa Estebanía de Cervera que se mandara a Diego Morán, "me dé e pague los dichos pesos de oro que ansí le fueron alcanzados, pues son bienes de menores". |                                           | |                                       |                       |
| |                                                                                                                                                                                                                                                          |                                           | |                                       |                       |
| | Cargos por 1,737 pesos, 5 tomines y 6 granos de oro. Descargos por 1,087 pesos y un tomín de oro de minas.                                                                                                                                               |                                           | |                                       |                       |
| |                                                                                                                                                                                                                                                          |                                           | |                                       |                       |
| | El 23 de septiembre, Diego de Ávila presentaba nuevos cargos y Morán sus descargos.                                                                                                                                                                      |                                           | |                                       |                       |
| |                                                                                                                                                                                                                                                          |                                           | |                                       |                       |
| | Caja A–3, exp. 2, ff. 36-40.                                                                                                                                                                                                                             |                                           | |                                       |                       |
| +----------------------------------------------------------------------------------------------------------------------------------------------------------------------------------------------------------------------------------------------------------+-------------------------------------------+ |                                       |                       |
|                                                                                                                                                                                                                                                                                                          |                                       |                       |
|   ---------------------------------------------------------------------------------------------------                                                                                                                                                                                                    |                                       |                       |
|    Documento(s) original(es)                                                                                                                                                                                                                                                                             |                                       |                       |
|   --------------------------- ------- ------- ------- ------- ------- ------- ------- ------- -------                                                                                                                                                                                                    |                                       |                       |
|               []                []      []      []      []      []      []      []      []      []                                                                                                                                                                                                       |                                       |                       |
|               36F               36V     37F     37V     38F     38V     39F     39V     40F     40V                                                                                                                                                                                                      |                                       |                       |
|                                                                                                                                                                                                                                                                                                          |                                       |                       |
|   ---------------------------------------------------------------------------------------------------                                                                                                                                                                                                    |                                       |                       |
+----------------------------------------------------------------------------------------------------------------------------------------------------------------------------------------------------------------------------------------------------------------------------------------------------------+---------------------------------------+-----------------------+
| Proyecto interinstitucional del Archivo Histórico del Municipio de Colima y la Universidad de Colima,                                                                                                                                                                                                    |                                       |                       |
| realizado bajo los auspicios del fondo Ramón Álvarez-Buylla de Aldana.                                                                                                                                                                                                                                   |                                       |                       |
|                                                                                                                                                                                                                                                                                                          |                                       |                       |
| ------------------------------------------------------------------------                                                                                                                                                                                                                                 |                                       |                       |
|                                                                                                                                                                                                                                                                                                          |                                       |                       |
| ISBN 978-968-7412-85-6                                                                                                                                                                                                                                                                                   |                                       |                       |
| ® Derechos Reservados 2008. Archivo Histórico del Municipio de Colima.                                                                                                                                                                                                                                   |                                       |                       |
+----------------------------------------------------------------------------------------------------------------------------------------------------------------------------------------------------------------------------------------------------------------------------------------------------------+---------------------------------------+-----------------------+

1,078 visitas
