+---------------------------------------------------------------------------------------------------------------------------------------------------------------------------------------------------------------------------------------------------------------------------------------------------------------------------------------------------------------------------------------------------------------------------+-----------------------+-----------------------+
| []                                                                                                                                                                                                                                                                                                                                                                                                                        |                       |                       |
|                                                                                                                                                                                                                                                                                                                                                                                                                           |                       |                       |
| +-----------------------------------+:-------------------------------------:+                                                                                                                                                                                                                                                                                                                                             |                       |                       |
| | []                                | LA VILLA DE COLIMA DE LA NUEVA ESPAÑA |                                                                                                                                                                                                                                                                                                                                             |                       |                       |
| |                                   | SIGLO XVI                             |                                                                                                                                                                                                                                                                                                                                             |                       |                       |
| |                                   |                                       |                                                                                                                                                                                                                                                                                                                                             |                       |                       |
| |                                   | VOLUMEN II      (CAJAS 12-20)         |                                                                                                                                                                                                                                                                                                                                             |                       |                       |
| +-----------------------------------+---------------------------------------+                                                                                                                                                                                                                                                                                                                                             |                       |                       |
+---------------------------------------------------------------------------------------------------------------------------------------------------------------------------------------------------------------------------------------------------------------------------------------------------------------------------------------------------------------------------------------------------------------------------+-----------------------+-----------------------+
| +------------------------------------------------------------------------+-------------------------------+-----------------------+                                                                                                                                                                                                                                                                                        |                       |                       |
| | Inicio | Búsqueda | Siglas y bibliografía | Créditos | Más información | Vol. I (1-11) Vol. II (12-20) |    [ES]               |                                                                                                                                                                                                                                                                                        |                       |                       |
| +------------------------------------------------------------------------+-------------------------------+-----------------------+                                                                                                                                                                                                                                                                                        |                       |                       |
+---------------------------------------------------------------------------------------------------------------------------------------------------------------------------------------------------------------------------------------------------------------------------------------------------------------------------------------------------------------------------------------------------------------------------+-----------------------+-----------------------+
| Búsqueda rápida                                                                                                                                                                                                                                                                                                                                                                                                           |                       |                       |
|                                                                                                                                                                                                                                                                                                                                                                                                                           |                       |                       |
| +:-------------------:+-----------------+:----------------------------------------:+----------------:+                                                                                                                                                                                                                                                                                                                    |                       |                       |
| | Documento de fecha: |                 | Ubicación física del documento original: | [] [] []        |                                                                                                                                                                                                                                                                                                                    |                       |                       |
| |                     |                 |                                          |                 |                                                                                                                                                                                                                                                                                                                    |                       |                       |
| | 1581. Octubre, 1º   |                 | Caja 22, exp. 18, 9 ff.^([8])            |                 |                                                                                                                                                                                                                                                                                                                    |                       |                       |
| +---------------------+-----------------+------------------------------------------+-----------------+                                                                                                                                                                                                                                                                                                                    |                       |                       |
|                                                                                                                                                                                                                                                                                                                                                                                                                           |                       |                       |
|   ------------- -----------------------------------------------------------------------------------------                                                                                                                                                                                                                                                                                                                 |                       |                       |
|   Resumen:      Francisco Pantoja, clérigo presbítero, reclama de Juan Fernández de Ocampo, diez pesos.                                                                                                                                                                                                                                                                                                                   |                       |                       |
|   ------------- -----------------------------------------------------------------------------------------                                                                                                                                                                                                                                                                                                                 |                       |                       |
|                                                                                                                                                                                                                                                                                                                                                                                                                           |                       |                       |
|   ----------------------------------- ----------------------------------------------------------------------------------------------------------------------------------------------------------------------------------------------------------------------------------------------------------------------------------------------------------------------------------------------------------------------------------- |                       |                       |
|   Contenido:                          Ante el alcalde mayor de la Villa y Provincia de Colima, el Padre Francisco Pantoja^([1]) presentó una petición, donde decía que Juan Fernández de Ocampo le debía diez pesos, de resto de una deuda de mayor cuantía. El clérigo solicitaba que Juan Fernández reconociera la deuda y pagase.                                                                                      |                       |                       |
|                                       Éste, bajo juramento, declaró que los debía por el hallazgo de una negra.^([2])Se anexa carta misiva al Padre Pantoja firmada por Juan Fernández de Ocampo, donde escribía entre otras cosas:                                                                                                                                                                                       |                       |                       |
|                                       “Recibí la [carta] de V.m. que cierto me espantó por ser yo tan servidor de V.m. [...]veinte pesos que V.m. me había de dar en reales por el hallazgo [...] de esa negraque sirve a V.m. los tomase yo por le ser huir en tan principal [...] como en el tarasco, y que demás de hacer esto quisiera V.m. que la resta que él debe la pague yo, como si yo fuera el deudor della.   |                       |                       |
|                                       “Yo digo que pague V.m., y que por lo que a mí toca, yo le daré larga, y si V.m. lo quisiera como dice soltar algo, como V.m. fuere servido” [...].                                                                                                                                                                                                                                 |                       |                       |
|                                       Agrega: “En lo que toca al un año y nueve meses que V.m. dice serví yo en los Motines, y que le tengo de dar a V.m. a razón de a diez pesos por año, el poblezuelo de Xiroma^([3]) -ya sabe V.m.- renta el pueblo veinte pesos y aún no llega [...]. En lo que toca a la mula que V.m. dice no son por mí” [...].                                                                   |                       |                       |
|                                       “En lo tocante a las misas que dice V.m. dijo por Juliana,^([4]) pues el caso [es] que fue a voluntad de V.m. el decirlas por su salud [...]. En Maquili^([5]) dije a V.m. que se las quería pagar, y V.m. se corrió mucho dello y aún la misma Juliana [...]las quiso pagar” [...].                                                                                                |                       |                       |
|                                       “En lo tocante a lo que V.m. dice del señor Pedro de Ceballos^([6]) me parece, me dijo V.m. que es ansí que restaban tres pesos y tantos reales, los cuales yo dije que los tomaría a cuenta de la Real Alcabala, de lo que allá había vendido, y si es más de esto, véalo V.m., que lo uno y lo otro yo lo pagaré y yo cobraré el alcabala de él o lo pagaré de mi bolsa”.^([7])   |                       |                       |
|                                       El 2 de octubre, en nuevo escrito, el Padre Francisco de Pantoja decía que Juan Fernández no había declarado con verdad, por lo cual, dice: “Truje una carta de letra y firma del dicho Juan Fernández y la presenté ante V.m. para que la reconociese”.                                                                                                                            |                       |                       |
|                                       Así lo mandó el alcalde.                                                                                                                                                                                                                                                                                                                                                            |                       |                       |
|                                       Al parecer, Juan Fernández Ocampo reconoció la carta y pagó.                                                                                                                                                                                                                                                                                                                        |                       |                       |
|                                                                                                                                                                                                                                                                                                                                                                                                                           |                       |                       |
|   ----------------------------------- ----------------------------------------------------------------------------------------------------------------------------------------------------------------------------------------------------------------------------------------------------------------------------------------------------------------------------------------------------------------------------------- |                       |                       |
|                                                                                                                                                                                                                                                                                                                                                                                                                           |                       |                       |
| (1) El Padre Francisco de Pantoja, cura de Quacoman en Motines (1579-1581), es posible que fuera hermano de Cristóbal y María de Pantoja, vecinos de Colima: Romero de Solís, Andariegos… (2001), 387.                                                                                                                                                                                                                    |                       |                       |
|                                                                                                                                                                                                                                                                                                                                                                                                                           |                       |                       |
| (2) Hemos registrado a esta negra de la que desconocemos su nombre, en: Romero de Solís, Padrón de negros… (2007), 15, n° 166.                                                                                                                                                                                                                                                                                            |                       |                       |
|                                                                                                                                                                                                                                                                                                                                                                                                                           |                       |                       |
| (3) Giroma o Xiroma, en Motines: Romero de Solís, Los pueblos de Colima… (2015).                                                                                                                                                                                                                                                                                                                                          |                       |                       |
|                                                                                                                                                                                                                                                                                                                                                                                                                           |                       |                       |
| (4) Juliana era una mulata de Juan Fernández de Ocampo -infra, reg° 842-, a quien hemos registrado, en: Romero de Solís, Padrón de mulatos… (2007), 8, n° 21.                                                                                                                                                                                                                                                             |                       |                       |
|                                                                                                                                                                                                                                                                                                                                                                                                                           |                       |                       |
| (5) Maquili, en Motines: Romero de Solís, Los pueblos de Colima… (2015).                                                                                                                                                                                                                                                                                                                                                  |                       |                       |
|                                                                                                                                                                                                                                                                                                                                                                                                                           |                       |                       |
| (6) Pedro de Ceballos, vecino de Colima al menos desde 1560, casó con Magdalena de Solórzano; fue alcalde ordinario y regidor, y en 1597 era alcalde mayor de Autlan: Romero de Solís, Andariegos… (2001), 103-104.                                                                                                                                                                                                       |                       |                       |
|                                                                                                                                                                                                                                                                                                                                                                                                                           |                       |                       |
| (7) La carta es por momentos ilegible.                                                                                                                                                                                                                                                                                                                                                                                    |                       |                       |
|                                                                                                                                                                                                                                                                                                                                                                                                                           |                       |                       |
| (8) El expediente está deteriorado.                                                                                                                                                                                                                                                                                                                                                                                       |                       |                       |
|                                                                                                                                                                                                                                                                                                                                                                                                                           |                       |                       |
|   ---------------------------------------------------------------------------------------------------                                                                                                                                                                                                                                                                                                                     |                       |                       |
|    Documento(s) original(es)                                                                                                                                                                                                                                                                                                                                                                                              |                       |                       |
|   --------------------------- ------- ------- ------- ------- ------- ------- ------- ------- -------                                                                                                                                                                                                                                                                                                                     |                       |                       |
|               []                []      []      []      []      []      []      []      []      []                                                                                                                                                                                                                                                                                                                        |                       |                       |
|               1f                1v      2f      2v      3f      3v      4f      5f      6f      7f                                                                                                                                                                                                                                                                                                                        |                       |                       |
|                                                                                                                                                                                                                                                                                                                                                                                                                           |                       |                       |
|               []                []      []      []      []                                                                                                                                                                                                                                                                                                                                                                |                       |                       |
|               7v                8f      8v      9f      9v                                                                                                                                                                                                                                                                                                                                                                |                       |                       |
|   ---------------------------------------------------------------------------------------------------                                                                                                                                                                                                                                                                                                                     |                       |                       |
+---------------------------------------------------------------------------------------------------------------------------------------------------------------------------------------------------------------------------------------------------------------------------------------------------------------------------------------------------------------------------------------------------------------------------+-----------------------+-----------------------+
| +----------------------------------------------------------------------------+-----------------------------------------------:+                                                                                                                                                                                                                                                                                           |                       |                       |
| | ISBN 978-607-701-024-1                                                     |   ---- ---- ---- ---- ---- ---- ---- ---- ---- |                                                                                                                                                                                                                                                                                           |                       |                       |
| | © Derechos Reservados 2013. Archivo Histórico del Municipio de Colima. [*] |   []        []        []        []        []   |                                                                                                                                                                                                                                                                                           |                       |                       |
| |                                                                            |   ---- ---- ---- ---- ---- ---- ---- ---- ---- |                                                                                                                                                                                                                                                                                           |                       |                       |
| +----------------------------------------------------------------------------+------------------------------------------------+                                                                                                                                                                                                                                                                                           |                       |                       |
| |                                                                            |                                                |                                                                                                                                                                                                                                                                                           |                       |                       |
| +----------------------------------------------------------------------------+------------------------------------------------+                                                                                                                                                                                                                                                                                           |                       |                       |
+---------------------------------------------------------------------------------------------------------------------------------------------------------------------------------------------------------------------------------------------------------------------------------------------------------------------------------------------------------------------------------------------------------------------------+-----------------------+-----------------------+

636 visitas
