[]

LA VILLA DE COLIMA DE LA NUEVA ESPAÑA
SIGLO XVI

VOLUMEN I      (CAJAS 1-11)

[]

Inicio | Búsquedas | Siglas y bibliografía | Cartografía | Créditos | Más información

[]

Búsqueda rápida

+:-------------------------------------------------------------------------------------------------------------------------------------------------------------------------------------------------------------------------------------------------------------------------------------------------------------------------------------------------------------------------------------------------------------------------------------------------------------------------------------------------------------------------------------------------------------------------------------------------------------------------------------------------------------------------------------------------------------------------------------------------------------------------------------------------------------------------------------------------------------------------------------------------------------------------------------------------------------------------------------------------------------------------------------------------------------------------------------------------------------------------------------------------------------------------------------------------------------------------------------------------------------------------------:+------------------------------------------:+
| Fecha:                                                                                                                                                                                                                                                                                                                                                                                                                                                                                                                                                                                                                                                                                                                                                                                                                                                                                                                                                                                                                                                                                                                                                                                                                                                                          | Ubicación física del documento original:  |
| 1553 Abril, 12                                                                                                                                                                                                                                                                                                                                                                                                                                                                                                                                                                                                                                                                                                                                                                                                                                                                                                                                                                                                                                                                                                                                                                                                                                                                  | CAJA A-2, EXP. 6, 4 FF. (3)               |
|                                                                                                                                                                                                                                                                                                                                                                                                                                                                                                                                                                                                                                                                                                                                                                                                                                                                                                                                                                                                                                                                                                                                                                                                                                                                                 | Archivo Histórico del Municipio de Colima |
+---------------------------------------------------------------------------------------------------------------------------------------------------------------------------------------------------------------------------------------------------------------------------------------------------------------------------------------------------------------------------------------------------------------------------------------------------------------------------------------------------------------------------------------------------------------------------------------------------------------------------------------------------------------------------------------------------------------------------------------------------------------------------------------------------------------------------------------------------------------------------------------------------------------------------------------------------------------------------------------------------------------------------------------------------------------------------------------------------------------------------------------------------------------------------------------------------------------------------------------------------------------------------------+-------------------------------------------+
| 38. 1553. Abril, 12.                                                                                                                                                                                                                                                                                                                                                                                                                                                                                                                                                                                                                                                                                                                                                                                                                                                                                                                                                                                                                                                                                                                                                                                                                                                            |                                           |
|                                                                                                                                                                                                                                                                                                                                                                                                                                                                                                                                                                                                                                                                                                                                                                                                                                                                                                                                                                                                                                                                                                                                                                                                                                                                                 |                                           |
| Juan de Aguilar pide trance y remate de los bienes de Francisco Preciado, para pagarse.                                                                                                                                                                                                                                                                                                                                                                                                                                                                                                                                                                                                                                                                                                                                                                                                                                                                                                                                                                                                                                                                                                                                                                                         |                                           |
|                                                                                                                                                                                                                                                                                                                                                                                                                                                                                                                                                                                                                                                                                                                                                                                                                                                                                                                                                                                                                                                                                                                                                                                                                                                                                 |                                           |
| Juan de Aguilar había puesto pleito a Francisco Preciado, habiendo entendido en la causa el alcalde ordinario de la Villa Hernán Ruiz de la Peña.^([1]) Pero como éste se había ausentado de la Provincia, pide ante el alcalde Martín de Monjaraz que asuma la causa, y por cuanto el término de ley ha concluido, dá su mandamiento ejecutorio de trance y remate de los bienes y rentas del susodicho.                                                                                                                                                                                                                                                                                                                                                                                                                                                                                                                                                                                                                                                                                                                                                                                                                                                                       |                                           |
|                                                                                                                                                                                                                                                                                                                                                                                                                                                                                                                                                                                                                                                                                                                                                                                                                                                                                                                                                                                                                                                                                                                                                                                                                                                                                 |                                           |
| El alcalde Martín de Monjaraz tomó la causa y el escribano Diego Veedor notificó el auto respectivo a Preciado, siendo testigos de ellos Juan Vázquez de Mella^([2]) y Juan Ruiz.                                                                                                                                                                                                                                                                                                                                                                                                                                                                                                                                                                                                                                                                                                                                                                                                                                                                                                                                                                                                                                                                                               |                                           |
|                                                                                                                                                                                                                                                                                                                                                                                                                                                                                                                                                                                                                                                                                                                                                                                                                                                                                                                                                                                                                                                                                                                                                                                                                                                                                 |                                           |
| Al día siguiente, el alcalde ordinario Martín de Monjaraz dictó sentencia, mandando rematar los bienes de Preciado, hasta hacer entero y cumplido pago de Juan de Aguilar.                                                                                                                                                                                                                                                                                                                                                                                                                                                                                                                                                                                                                                                                                                                                                                                                                                                                                                                                                                                                                                                                                                      |                                           |
|                                                                                                                                                                                                                                                                                                                                                                                                                                                                                                                                                                                                                                                                                                                                                                                                                                                                                                                                                                                                                                                                                                                                                                                                                                                                                 |                                           |
| Caja A–2, exp. 6, 4 ff.^([3])                                                                                                                                                                                                                                                                                                                                                                                                                                                                                                                                                                                                                                                                                                                                                                                                                                                                                                                                                                                                                                                                                                                                                                                                                                                   |                                           |
|                                                                                                                                                                                                                                                                                                                                                                                                                                                                                                                                                                                                                                                                                                                                                                                                                                                                                                                                                                                                                                                                                                                                                                                                                                                                                 |                                           |
|                                                                                                                                                                                                                                                                                                                                                                                                                                                                                                                                                                                                                                                                                                                                                                                                                                                                                                                                                                                                                                                                                                                                                                                                                                                                                 |                                           |
|                                                                                                                                                                                                                                                                                                                                                                                                                                                                                                                                                                                                                                                                                                                                                                                                                                                                                                                                                                                                                                                                                                                                                                                                                                                                                 |                                           |
| ---------------                                                                                                                                                                                                                                                                                                                                                                                                                                                                                                                                                                                                                                                                                                                                                                                                                                                                                                                                                                                                                                                                                                                                                                                                                                                                 |                                           |
|                                                                                                                                                                                                                                                                                                                                                                                                                                                                                                                                                                                                                                                                                                                                                                                                                                                                                                                                                                                                                                                                                                                                                                                                                                                                                 |                                           |
| (1) Hernán Ruiz de la Peña o Fernando (Hernando) de la Peña, "persona muy honrada" al decir del Padrón de 1532, llegó a la Nueva España después de la toma de la Ciudad de México, y participó en las conquistas de Michoacán y Colima, sirviendo a pie y a caballo y contándose entre los vecinos fundadores de la Villa, en donde tuvo cargos de justicia: en 1532 era regidor y, en nuestro regº, alcalde ordinario. Tenía por encomienda, dada por Marcos de Aguilar el 8 de octubre de 1526, la mitad de cuatro pueblos, entre ellos, Autlan: VP 35; SV 43 y 367; Lebrón (1979), 56 y 62. En junio de 1550, el alcalde mayor de Colima Alonso de Torres salió en comisión hacia el Valle de Autlán por órdenes del virrey para abrir información y hacer justicia acerca de las quejas de los naturales contra su encomendero: supra, regº 18. Ruiz de la Peña poco aparecía por Colima, pasando largas temporadas en Autlan o en Villa de la Purificación, donde por fin se avecindó. El visitador Lebrón denunciaba que llevaba "quince años" sin residir en la Villa de Colima, no obstante que en sus términos poseía "tres estancias de ganados mayores y menores, en las cuales tendrá dos mil ovejas y trescientas yeguas y algunas vacas": Lebrón (1979), 62 y 66. |                                           |
|                                                                                                                                                                                                                                                                                                                                                                                                                                                                                                                                                                                                                                                                                                                                                                                                                                                                                                                                                                                                                                                                                                                                                                                                                                                                                 |                                           |
| (2) Única referencia hallada.                                                                                                                                                                                                                                                                                                                                                                                                                                                                                                                                                                                                                                                                                                                                                                                                                                                                                                                                                                                                                                                                                                                                                                                                                                                   |                                           |
|                                                                                                                                                                                                                                                                                                                                                                                                                                                                                                                                                                                                                                                                                                                                                                                                                                                                                                                                                                                                                                                                                                                                                                                                                                                                                 |                                           |
| (3) En la portadilla, fechada en Colima en 1912, que guarda en la actualidad este expediente, se lee: "Año de 1553. Seguido contra Juan de Aguilar, Juan Pinzón, Francisco Preciado y Juan Fernández El Viejo, por deuda de resto de salario al padre Juan Oliveros como cura y vicario de los pueblos de la jurisdicción de Colima. Con 13 fojas". Sobre este asunto, véase lo que se comentó: supra, regº 18.                                                                                                                                                                                                                                                                                                                                                                                                                                                                                                                                                                                                                                                                                                                                                                                                                                                                 |                                           |
+---------------------------------------------------------------------------------------------------------------------------------------------------------------------------------------------------------------------------------------------------------------------------------------------------------------------------------------------------------------------------------------------------------------------------------------------------------------------------------------------------------------------------------------------------------------------------------------------------------------------------------------------------------------------------------------------------------------------------------------------------------------------------------------------------------------------------------------------------------------------------------------------------------------------------------------------------------------------------------------------------------------------------------------------------------------------------------------------------------------------------------------------------------------------------------------------------------------------------------------------------------------------------------+-------------------------------------------+

Documento(s) original(es)

Archivo no encontrado (CAJAS/CAJA2/EXP6/001V.jpg)

[]
1F

[]
2F

[]
2V

[]
3F

[]
3V

[]
4F

[]
4V

Proyecto interinstitucional del Archivo Histórico del Municipio de Colima y la Universidad de Colima,
realizado bajo los auspicios del fondo Ramón Álvarez-Buylla de Aldana.

------------------------------------------------------------------------

ISBN 978-968-7412-85-6
® Derechos Reservados 2008. Archivo Histórico del Municipio de Colima.

1,078 visitas
