[]

LA VILLA DE COLIMA DE LA NUEVA ESPAÑA
SIGLO XVI

VOLUMEN I      (CAJAS 1-11)

[]

Inicio | Búsquedas | Siglas y bibliografía | Cartografía | Créditos | Más información

[]

Búsqueda rápida

+:---------------------------------------------------------------------------------------------------------------------------------------------------------------------------------------------------------------------------------------------------------------------------------------------------------------------------------------------------------------------------------------------------------------------------------------------------------------------------------------------------------------------------------------------------------------------------------------------------------------------------------------------------------------------------------------------------------------------------------------------------------------------------------------------------------------------------------------------------------------------------------------------------------------------------------------------------------------------------------------------------------------------------------------------------------------------------------------------------------------------------------------------------------------------------------------------------------------------------------------------------------------------------------------------------------------------------------------------------------------------------------------------------------------------------------------------------------------------------------------------------------:+------------------------------------------:+
| Fecha:                                                                                                                                                                                                                                                                                                                                                                                                                                                                                                                                                                                                                                                                                                                                                                                                                                                                                                                                                                                                                                                                                                                                                                                                                                                                                                                                                                                                                                                                                                    | Ubicación física del documento original:  |
| 1577 Abril, 10                                                                                                                                                                                                                                                                                                                                                                                                                                                                                                                                                                                                                                                                                                                                                                                                                                                                                                                                                                                                                                                                                                                                                                                                                                                                                                                                                                                                                                                                                            | CAJA A-10, EXP. 1, FF. 2-8.               |
|                                                                                                                                                                                                                                                                                                                                                                                                                                                                                                                                                                                                                                                                                                                                                                                                                                                                                                                                                                                                                                                                                                                                                                                                                                                                                                                                                                                                                                                                                                           | Archivo Histórico del Municipio de Colima |
+-----------------------------------------------------------------------------------------------------------------------------------------------------------------------------------------------------------------------------------------------------------------------------------------------------------------------------------------------------------------------------------------------------------------------------------------------------------------------------------------------------------------------------------------------------------------------------------------------------------------------------------------------------------------------------------------------------------------------------------------------------------------------------------------------------------------------------------------------------------------------------------------------------------------------------------------------------------------------------------------------------------------------------------------------------------------------------------------------------------------------------------------------------------------------------------------------------------------------------------------------------------------------------------------------------------------------------------------------------------------------------------------------------------------------------------------------------------------------------------------------------------+-------------------------------------------+
| 349. 1577. Abril, 10.                                                                                                                                                                                                                                                                                                                                                                                                                                                                                                                                                                                                                                                                                                                                                                                                                                                                                                                                                                                                                                                                                                                                                                                                                                                                                                                                                                                                                                                                                     |                                           |
|                                                                                                                                                                                                                                                                                                                                                                                                                                                                                                                                                                                                                                                                                                                                                                                                                                                                                                                                                                                                                                                                                                                                                                                                                                                                                                                                                                                                                                                                                                           |                                           |
| Demanda de Diego de Contreras contra los bienes de Diego Hernández de Saldaña, difunto, por media carga de cacao.                                                                                                                                                                                                                                                                                                                                                                                                                                                                                                                                                                                                                                                                                                                                                                                                                                                                                                                                                                                                                                                                                                                                                                                                                                                                                                                                                                                         |                                           |
|                                                                                                                                                                                                                                                                                                                                                                                                                                                                                                                                                                                                                                                                                                                                                                                                                                                                                                                                                                                                                                                                                                                                                                                                                                                                                                                                                                                                                                                                                                           |                                           |
| El 10 de abril de 1577, Diego de Contreras decía que "podrá haber siete meses poco más o menos que, estando en la Ciudad de México vendiendo cierta partida de cacao, fue a mí Diego Hernández de Saldaña, vecino desta Villa, el cual entonces estaba en la Ciudad de México, el cual dicho Diego Hernández fue a mí diciendo que Francisco López Avecilla le había escrito una carta que me rogase de su parte que diese a su yerno Alonso de Mesa una carga de cacao para ciertos negocios que el dicho Avecilla tenía en México. Yo le dije que el dicho Francisco López no me había escrito sobre ello cosa ninguna, que cómo quería que yo le diese, y él dijo que si no fuese ansí, que él sería hombre para pagármela, que allí estaba una carta en que a él se lo escribía. Yo, entendiendo que era ansí, no le quise dar más de media carga por mandado del dicho Diego Hernández. Venido que yo fuí a esta Villa lo dije al dicho Francisco López, y dijo que no había escrito ni mandado al dicho Diego Hernández, de todo lo cual estoy presto de dar información. Por tanto, a V.m. pido y suplico que habida la dicha información, V.m. mande que de los bienes del dicho Diego Hernández se me paguen catorce pesos, que la media carga de cacao valía, porque ansí lo vendí al susodicho, y pido justicia. Otrosí a V.m. pido y suplico que mande al dicho Francisco López declare con juramento si escribió al dicho Diego Hernández que por su parte diera el cacao, y pido justicia". |                                           |
|                                                                                                                                                                                                                                                                                                                                                                                                                                                                                                                                                                                                                                                                                                                                                                                                                                                                                                                                                                                                                                                                                                                                                                                                                                                                                                                                                                                                                                                                                                           |                                           |
| Así lo dispuso el alcalde, y el escribano López de Avecilla notificó lo proveído a Juan Fernández de Ocampo, como albacea y testamentario de Diego Fernández, difunto, siendo testigos de ello Alonso Lorenzo y Hernando de Solórzano, vecinos de Colima.                                                                                                                                                                                                                                                                                                                                                                                                                                                                                                                                                                                                                                                                                                                                                                                                                                                                                                                                                                                                                                                                                                                                                                                                                                                 |                                           |
|                                                                                                                                                                                                                                                                                                                                                                                                                                                                                                                                                                                                                                                                                                                                                                                                                                                                                                                                                                                                                                                                                                                                                                                                                                                                                                                                                                                                                                                                                                           |                                           |
| El 11 de abril respondió Juan Fernández de Ocampo protestando de la forma que se había tramitado el caso, "pues siendo como es demanda, tengo de ser primero oído, alegando mis ejecuciones y defensiones dentro del término de la ley, y ser yo ansí mismo recibido a la prueba de lo que yo de la dicha mi parte alegue de mi justicia, donde no con el acatamiento que debo, digo que apelo de V.m. para ante el Justicia señor Álvaro de Grijalba, teniente de alcalde mayor desta dicha Villa, ante quien me presento en el dicho grado".                                                                                                                                                                                                                                                                                                                                                                                                                                                                                                                                                                                                                                                                                                                                                                                                                                                                                                                                                            |                                           |
|                                                                                                                                                                                                                                                                                                                                                                                                                                                                                                                                                                                                                                                                                                                                                                                                                                                                                                                                                                                                                                                                                                                                                                                                                                                                                                                                                                                                                                                                                                           |                                           |
| El 12 de abril, el alcalde ordinario Juan Preciado le otorgó la apelación. Vistos los autos por el teniente de alcalde mayor, éste "dijo que el dicho señor alcalde tiene proveído esta causa justa y derechamente, atento a lo cual dijo que el alcalde haga justicia en el caso".                                                                                                                                                                                                                                                                                                                                                                                                                                                                                                                                                                                                                                                                                                                                                                                                                                                                                                                                                                                                                                                                                                                                                                                                                       |                                           |
|                                                                                                                                                                                                                                                                                                                                                                                                                                                                                                                                                                                                                                                                                                                                                                                                                                                                                                                                                                                                                                                                                                                                                                                                                                                                                                                                                                                                                                                                                                           |                                           |
| El 13 de abril, Miguel de Rivera(1) presentó por testigo para en prueba al vecino Martín de Segura, quien prestó juramento. Declaró que "estando este testigo en la Ciudad de México, puede haber siete meses poco más o menos", en compañía de Diego de Contreras, vio cómo Diego Fernández de Saldaña que a la sazón también estaba en México, "allegó [sic] a pedir al dicho Diego de Contreras le diese una carga de cacao a Alonso de Mesa, yerno del dicho Francisco López de Avecilla, para ciertos negocios que le hacía en México, porque el dicho Avecilla se lo había escrito al dicho Diego Fernández, y el dicho Diego de Contreras le respondió que él no sabía nada ni el dicho Avecilla se lo dijo cuando salió de Colima, y el dicho Diego Fernández respondió que él tenía una carta del dicho Avecilla que le escribía se lo pidiese el dicho cacao, e que si así no fuese, que él era hombre para se la pagar, y que más que una carga de cacao era hombre él para se la fiar, y entonces el dicho Diego de Contreras le dijo que no le podía dar una carga de cacao mas que él le daría media carga, debajo de que él se la pagaría pareciendo otra cosa, y debajo dello el dicho Diego de Contreras le dio al dicho Diego Fernández media carga de cacao en presencia deste testigo e de Andrés de Segura, y que esto es la verdad". El testigo dijo tener más de 20 años de edad.                                                                                                  |                                           |
|                                                                                                                                                                                                                                                                                                                                                                                                                                                                                                                                                                                                                                                                                                                                                                                                                                                                                                                                                                                                                                                                                                                                                                                                                                                                                                                                                                                                                                                                                                           |                                           |
| El 18 de abril, Miguel de Rivera dice que "para acabar de hacer mi información, conviene a mi derecho que jure y declare en el caso Andrés de Segura, persona que se halló presente al dicho negocio y entrego de cacao, al cual presento por testigo", quien sin embargo "está fuera desta Villa. Por tanto pido y suplico a V.m. mande que el escribano de la causa le desamine [sic](2) y le mande dar V.m. comisión para el dicho examen, y pido justicia".                                                                                                                                                                                                                                                                                                                                                                                                                                                                                                                                                                                                                                                                                                                                                                                                                                                                                                                                                                                                                                           |                                           |
|                                                                                                                                                                                                                                                                                                                                                                                                                                                                                                                                                                                                                                                                                                                                                                                                                                                                                                                                                                                                                                                                                                                                                                                                                                                                                                                                                                                                                                                                                                           |                                           |
| Así lo dispuso el alcalde Preciado cometiendo y facultando para ese efecto al escribano López de Avecilla.(3)                                                                                                                                                                                                                                                                                                                                                                                                                                                                                                                                                                                                                                                                                                                                                                                                                                                                                                                                                                                                                                                                                                                                                                                                                                                                                                                                                                                             |                                           |
|                                                                                                                                                                                                                                                                                                                                                                                                                                                                                                                                                                                                                                                                                                                                                                                                                                                                                                                                                                                                                                                                                                                                                                                                                                                                                                                                                                                                                                                                                                           |                                           |
| Ante los alcaldes Juan Preciado y Antonio Carrillo de Guzmán, su acompañado,(4) el 6 de mayo, Miguel de Rivera presentó por testigo en esta causa a Andrés de Segura, vecino y estante. Declara el testigo que, estando en México hará siete meses, vio cómo Diego Fernández de Saldaña "allegó [sic] a la posada do posaba Diego de Contreras", diciéndole que Avecilla le había escrito que le diese una carga de cacao. Contreras le respondió que el escribano nada le había dicho de ello, "e que si se lo dijera, se la diera". Saldaña contestó "cómo allí tenía la carta dello, mas este testigo no vido que la dicha carta fuese de la letra del dicho Francisco López, y en esto el dicho Contreras le dijo que si a su cuenta quería media carga, que él se la daría, y entonces el dicho Diego Fernández le dijo que se la diese, que cuando el dicho Avecilla dijese que él no lo había mandado, que él se la pagaría, y así, debajo desto, el dicho Diego de Contreras le dio la dicha media carga de cacao, e sabe este testigo cómo entonces se vendió la carga dello a veinte y cinco y a veinte y seis pesos, y esto es la verdad de lo que pasa". Segura dijo que tenía de edad más de 20 años.                                                                                                                                                                                                                                                                                        |                                           |
|                                                                                                                                                                                                                                                                                                                                                                                                                                                                                                                                                                                                                                                                                                                                                                                                                                                                                                                                                                                                                                                                                                                                                                                                                                                                                                                                                                                                                                                                                                           |                                           |
| A petición de Contreras, ese mismo día, le fue tomado testimonio al escribano Francisco López de Avecilla, que lo prestó ante los alcaldes Juan Preciado y Antonio Carrillo de Guzmán, su acompañado. El escribano dijo: "Lo que sé deste caso es que los días pasados, viniendo de la Ciudad de México Diego de Contreras, vecino desta Villa, me dijo cómo en mi nombre había dado a Diego Fernández de Saldaña, que a la sazón estaba en la Ciudad de México, media carga de cacao, el cual se la dio porque dijo que cuando yo no pasase por ello, él se la pagaría, e yo le respondí que yo no mandé tal, e que se la pidiese al dicho Diego Fernández, porque yo no le mandé tal; y para el juramento que fecho tengo, no le dije tal ni escribí tal, y esto es la verdad de lo que pasa deste caso para el juramento que fecho tengo, en lo cual me ratifico e afirmo, e lo firmo de mi nombre, e soy de edad de más de cincuenta años".                                                                                                                                                                                                                                                                                                                                                                                                                                                                                                                                                           |                                           |
|                                                                                                                                                                                                                                                                                                                                                                                                                                                                                                                                                                                                                                                                                                                                                                                                                                                                                                                                                                                                                                                                                                                                                                                                                                                                                                                                                                                                                                                                                                           |                                           |
| El mismo 6 de mayo, los alcaldes Preciado y Carrillo de Guzmán dictaron sentencia condenando a Fernández de Ocampo como albacea y testamentario de su hermano Diego Fernández de Saldaña, "en que luego dé y pague a Diego de Contreras doce pesos de oro común por la media carga de cacao que parece le dio al dicho Diego Fernández de Saldaña, para lo cual mandaron dar su mandamiento para descargo del dicho Juan Fernández".                                                                                                                                                                                                                                                                                                                                                                                                                                                                                                                                                                                                                                                                                                                                                                                                                                                                                                                                                                                                                                                                      |                                           |
|                                                                                                                                                                                                                                                                                                                                                                                                                                                                                                                                                                                                                                                                                                                                                                                                                                                                                                                                                                                                                                                                                                                                                                                                                                                                                                                                                                                                                                                                                                           |                                           |
| El 22 de junio de 1579, ante Cristóbal de Silva, alcalde ordinario de la Villa de Colima, Juan Fernández El Viejo decía que "a mi noticia ha venido que Diego de Contreras puso cierta demanda a los bienes de Diego Fernández, mi hijo difunto, de que soy heredero, sobre media carga de cacao que el dicho Diego de Contreras dio a Alonso de Mesa, yerno de Francisco López de Avecilla, escribano público desta Villa, para sus negocios y ciertas provisiones que le envió". Juan Fernández El Viejo alega que "por ser ya difunto [su hijo] y por evadirse de no pagallo", el escribano López de Avecilla había mentido en las informaciones, además de no "haber yo sido citado ni dado traslado de la dicha información". Pide por tanto a Su Merced que "sobresea la dicha causa y vea los autos por donde se dio el dicho mandamiento, y me mande dar traslado dellos, que yo estoy presto y aparejado de dar bastante información cómo la dicha media carga de cacao la debe el dicho Francisco López, escribano, y su yerno Alonso de Mesa".                                                                                                                                                                                                                                                                                                                                                                                                                                                 |                                           |
|                                                                                                                                                                                                                                                                                                                                                                                                                                                                                                                                                                                                                                                                                                                                                                                                                                                                                                                                                                                                                                                                                                                                                                                                                                                                                                                                                                                                                                                                                                           |                                           |
| Cinco días después, el 27 de junio, vistos los autos del proceso y la petición de Juan Fernández El Viejo, el alcalde Cristóbal de Silva respondió que "mandaba e mandó que se guarde e cumpla el auto proveído y mandado en esta causa e pronunciado por el dicho alcalde y su acompañado, según y como en él se contiene".                                                                                                                                                                                                                                                                                                                                                                                                                                                                                                                                                                                                                                                                                                                                                                                                                                                                                                                                                                                                                                                                                                                                                                              |                                           |
|                                                                                                                                                                                                                                                                                                                                                                                                                                                                                                                                                                                                                                                                                                                                                                                                                                                                                                                                                                                                                                                                                                                                                                                                                                                                                                                                                                                                                                                                                                           |                                           |
| Caja A–10, exp. 1, ff. 2-8.                                                                                                                                                                                                                                                                                                                                                                                                                                                                                                                                                                                                                                                                                                                                                                                                                                                                                                                                                                                                                                                                                                                                                                                                                                                                                                                                                                                                                                                                               |                                           |
|                                                                                                                                                                                                                                                                                                                                                                                                                                                                                                                                                                                                                                                                                                                                                                                                                                                                                                                                                                                                                                                                                                                                                                                                                                                                                                                                                                                                                                                                                                           |                                           |
|                                                                                                                                                                                                                                                                                                                                                                                                                                                                                                                                                                                                                                                                                                                                                                                                                                                                                                                                                                                                                                                                                                                                                                                                                                                                                                                                                                                                                                                                                                           |                                           |
|                                                                                                                                                                                                                                                                                                                                                                                                                                                                                                                                                                                                                                                                                                                                                                                                                                                                                                                                                                                                                                                                                                                                                                                                                                                                                                                                                                                                                                                                                                           |                                           |
| ---------------                                                                                                                                                                                                                                                                                                                                                                                                                                                                                                                                                                                                                                                                                                                                                                                                                                                                                                                                                                                                                                                                                                                                                                                                                                                                                                                                                                                                                                                                                           |                                           |
|                                                                                                                                                                                                                                                                                                                                                                                                                                                                                                                                                                                                                                                                                                                                                                                                                                                                                                                                                                                                                                                                                                                                                                                                                                                                                                                                                                                                                                                                                                           |                                           |
| (1) Miguel de Rivera actúa en nombre de Contreras en virtud del poder que de éste tenía: supra, regº 348.                                                                                                                                                                                                                                                                                                                                                                                                                                                                                                                                                                                                                                                                                                                                                                                                                                                                                                                                                                                                                                                                                                                                                                                                                                                                                                                                                                                                 |                                           |
|                                                                                                                                                                                                                                                                                                                                                                                                                                                                                                                                                                                                                                                                                                                                                                                                                                                                                                                                                                                                                                                                                                                                                                                                                                                                                                                                                                                                                                                                                                           |                                           |
| (2) Por "examine"; son formas documentadas por Boyd–Bowman (1971), 293, 365, 388-389.                                                                                                                                                                                                                                                                                                                                                                                                                                                                                                                                                                                                                                                                                                                                                                                                                                                                                                                                                                                                                                                                                                                                                                                                                                                                                                                                                                                                                     |                                           |
|                                                                                                                                                                                                                                                                                                                                                                                                                                                                                                                                                                                                                                                                                                                                                                                                                                                                                                                                                                                                                                                                                                                                                                                                                                                                                                                                                                                                                                                                                                           |                                           |
| (3) Petición y auto del alcalde dando poder al escribano para el examen del testigo, figuran al fin de la información.                                                                                                                                                                                                                                                                                                                                                                                                                                                                                                                                                                                                                                                                                                                                                                                                                                                                                                                                                                                                                                                                                                                                                                                                                                                                                                                                                                                    |                                           |
|                                                                                                                                                                                                                                                                                                                                                                                                                                                                                                                                                                                                                                                                                                                                                                                                                                                                                                                                                                                                                                                                                                                                                                                                                                                                                                                                                                                                                                                                                                           |                                           |
| (4) Entre la declaración de este testigo y los autos anteriores, tuvo que haber una petición de Fernández de Ocampo para que el alcalde Juan Preciado se acompañase, por cuanto aquí aparece con su compañero Antonio Carrillo que era por igual alcalde ordinario ese año.                                                                                                                                                                                                                                                                                                                                                                                                                                                                                                                                                                                                                                                                                                                                                                                                                                                                                                                                                                                                                                                                                                                                                                                                                               |                                           |
+-----------------------------------------------------------------------------------------------------------------------------------------------------------------------------------------------------------------------------------------------------------------------------------------------------------------------------------------------------------------------------------------------------------------------------------------------------------------------------------------------------------------------------------------------------------------------------------------------------------------------------------------------------------------------------------------------------------------------------------------------------------------------------------------------------------------------------------------------------------------------------------------------------------------------------------------------------------------------------------------------------------------------------------------------------------------------------------------------------------------------------------------------------------------------------------------------------------------------------------------------------------------------------------------------------------------------------------------------------------------------------------------------------------------------------------------------------------------------------------------------------------+-------------------------------------------+

Documento(s) original(es)

Archivo no encontrado (CAJAS/CAJA10/EXP1/008F.jpg)

Archivo no encontrado (CAJAS/CAJA10/EXP1/008V.jpg)

[]
2F

[]
2V

[]
3F

[]
3V

[]
4F

[]
4V

[]
5F

[]
5V

[]
6F

[]
6V

[]
7F

[]
7V

Proyecto interinstitucional del Archivo Histórico del Municipio de Colima y la Universidad de Colima,
realizado bajo los auspicios del fondo Ramón Álvarez-Buylla de Aldana.

------------------------------------------------------------------------

ISBN 978-968-7412-85-6
® Derechos Reservados 2008. Archivo Histórico del Municipio de Colima.

1,078 visitas
