[]

LA VILLA DE COLIMA DE LA NUEVA ESPAÑA
SIGLO XVI

VOLUMEN I      (CAJAS 1-11)

[]

Inicio | Búsquedas | Siglas y bibliografía | Cartografía | Créditos | Más información

[]

Búsqueda rápida

+:-------------------------------------------------------------------------------------------------------------------------------------------------------------------------------------------------------------------------------------------------------------------------------------------------------------------------------------------------------------------------------------------------------------------------------------------------------------------------------------------------------------------------------------------------------------------------------------------------------------------------------------------------------------------------------------------------------------------------------------------------------------------------------------------------------------------------------------------------------------------------------------------------------------------------------------------------------------------------------------------------------------------------------------------------------------------------------------------------------------------------------------------------------:+------------------------------------------:+
| Fecha:                                                                                                                                                                                                                                                                                                                                                                                                                                                                                                                                                                                                                                                                                                                                                                                                                                                                                                                                                                                                                                                                                                                                                  | Ubicación física del documento original:  |
| 1579 Septiembre, 5                                                                                                                                                                                                                                                                                                                                                                                                                                                                                                                                                                                                                                                                                                                                                                                                                                                                                                                                                                                                                                                                                                                                      | CAJA A-9, EXP. 21, 8 FF.                  |
|                                                                                                                                                                                                                                                                                                                                                                                                                                                                                                                                                                                                                                                                                                                                                                                                                                                                                                                                                                                                                                                                                                                                                         | Archivo Histórico del Municipio de Colima |
+---------------------------------------------------------------------------------------------------------------------------------------------------------------------------------------------------------------------------------------------------------------------------------------------------------------------------------------------------------------------------------------------------------------------------------------------------------------------------------------------------------------------------------------------------------------------------------------------------------------------------------------------------------------------------------------------------------------------------------------------------------------------------------------------------------------------------------------------------------------------------------------------------------------------------------------------------------------------------------------------------------------------------------------------------------------------------------------------------------------------------------------------------------+-------------------------------------------+
| 345. 1579. Septiembre, 5.                                                                                                                                                                                                                                                                                                                                                                                                                                                                                                                                                                                                                                                                                                                                                                                                                                                                                                                                                                                                                                                                                                                               |                                           |
|                                                                                                                                                                                                                                                                                                                                                                                                                                                                                                                                                                                                                                                                                                                                                                                                                                                                                                                                                                                                                                                                                                                                                         |                                           |
| El mercader Juan de Salinas contra Blas de la Serna, herrero, por una obligación de plazo pasado.                                                                                                                                                                                                                                                                                                                                                                                                                                                                                                                                                                                                                                                                                                                                                                                                                                                                                                                                                                                                                                                       |                                           |
|                                                                                                                                                                                                                                                                                                                                                                                                                                                                                                                                                                                                                                                                                                                                                                                                                                                                                                                                                                                                                                                                                                                                                         |                                           |
| "Sepan cuantos esta carta de obligación vieren, cómo yo Blas de la Serna, herrero, vecino de la Villa de Colima de la Nueva España, otorgo e conozco que debo y me obligo de dar e pagar, y que daré y pagaré a vos, Juan de Salinas, mercader, vecino desta dicha Villa, e a quien vuestro poder hubiere, conviene a saber, treinta pesos de oro común de a ocho reales de plata de buena moneda e marca real, los cuales dichos treinta pesos del dicho oro, que ansí vos debo, son por razón de fenecimiento de todas nuestras cuentas, dares y tomares, que hasta hoy dicho día de la fecha desta carta habemos habido e tenido entre ambos a dos, los cuales dichos treinta pesos del dicho oro me obligo de vos los dar e pagar en esta dicha Villa o en otra cualquiera parte e lugar que me los pidiéredes y demandáredes, llana e realmente, sin pleito ni contienda alguna, so pena de las costas de la cobranza desta dicha escritura, en fin del mes de octubre deste presente año de setenta y nueve años [1579], en cacao bueno, escogido, de dar e tomar, a razón de a veinte pesos la carga o a como valiere al tiempo de la cobranza". |                                           |
|                                                                                                                                                                                                                                                                                                                                                                                                                                                                                                                                                                                                                                                                                                                                                                                                                                                                                                                                                                                                                                                                                                                                                         |                                           |
| Pasó ante el escribano Francisco López y fueron testigos los vecinos Miguel de Rivera, Gonzalo de Cáceres y Juan de Ledesma. "E porque el dicho otorgante dijo que no sabía firmar, a su ruego, firmó un testigo, Miguel de Rivera".                                                                                                                                                                                                                                                                                                                                                                                                                                                                                                                                                                                                                                                                                                                                                                                                                                                                                                                    |                                           |
|                                                                                                                                                                                                                                                                                                                                                                                                                                                                                                                                                                                                                                                                                                                                                                                                                                                                                                                                                                                                                                                                                                                                                         |                                           |
| El 19 de noviembre de ese año, ante el alcalde ordinario Cristóbal de Silva, Juan de Salinas presentó esta escritura de plazo pasado contra Blas de la Serna, pidiendo su ejecución. Así lo mandó el alcalde, dando de inmediato su mandamiento al alguacil mayor de la Villa .                                                                                                                                                                                                                                                                                                                                                                                                                                                                                                                                                                                                                                                                                                                                                                                                                                                                         |                                           |
|                                                                                                                                                                                                                                                                                                                                                                                                                                                                                                                                                                                                                                                                                                                                                                                                                                                                                                                                                                                                                                                                                                                                                         |                                           |
| El 9 de diciembre, el alguacil mayor Juan Muñoz requirió con este mandamiento al herrero Blas de la Serna, vecino de Colima, a que nombrase bienes en donde hacer la ejecución. El herrero contestó que "no tiene bienes ningunos y en defecto de no los tener, el dicho alguacil hizo entrega y ejecución en su persona, por la dicha cuantía e costas, e le prendió el cuerpo, y le puso preso en la cárcel pública desta Villa". Testigo fue el vecino Alonso Carrillo.                                                                                                                                                                                                                                                                                                                                                                                                                                                                                                                                                                                                                                                                              |                                           |
|                                                                                                                                                                                                                                                                                                                                                                                                                                                                                                                                                                                                                                                                                                                                                                                                                                                                                                                                                                                                                                                                                                                                                         |                                           |
| El 11 de diciembre Blas de la Serna nombró por bienes suyos, donde hacer la ejecución, las casas de su morada, y puso por fiador suyo al vecino Cristóbal de Solórzano. El alguacil entonces hizo entrega y ejecución en las dichas casas. Entre otros testigos, el vecino Luis Gómez.                                                                                                                                                                                                                                                                                                                                                                                                                                                                                                                                                                                                                                                                                                                                                                                                                                                                  |                                           |
|                                                                                                                                                                                                                                                                                                                                                                                                                                                                                                                                                                                                                                                                                                                                                                                                                                                                                                                                                                                                                                                                                                                                                         |                                           |
| El fiador Cristóbal de Solórzano se obligó ante el escribano Francisco López y de los testigos Juan Fernández y Juan Gómez, vecinos.                                                                                                                                                                                                                                                                                                                                                                                                                                                                                                                                                                                                                                                                                                                                                                                                                                                                                                                                                                                                                    |                                           |
|                                                                                                                                                                                                                                                                                                                                                                                                                                                                                                                                                                                                                                                                                                                                                                                                                                                                                                                                                                                                                                                                                                                                                         |                                           |
| El 12 de diciembre y ante el alcalde ordinario Álvaro de Grijalba, Juan de Salinas pedía que se procediera a los pregones de la almoneda, cosa que dispuso el alcalde. Luego, por voz de Juan, indio ladino en castilla, en la plaza pública, fue gritado el primer pregón: "¿Hay quién quiera comprar e poner en precio las casas de la morada de Blas de la Serna, herrero, vecino desta Villa, que se venden por bienes en ellas ejecutados, a pedimiento de Juan de Salinas, mercader, por contía de treinta pesos de oro común e costas?". Fueron testigos los vecinos Gaspar Román, Juan Muñoz y Juan de Velasco.                                                                                                                                                                                                                                                                                                                                                                                                                                                                                                                                 |                                           |
|                                                                                                                                                                                                                                                                                                                                                                                                                                                                                                                                                                                                                                                                                                                                                                                                                                                                                                                                                                                                                                                                                                                                                         |                                           |
| El 21 y 30 de diciembre el mismo pregonero dio los dos restantes pregones.                                                                                                                                                                                                                                                                                                                                                                                                                                                                                                                                                                                                                                                                                                                                                                                                                                                                                                                                                                                                                                                                              |                                           |
|                                                                                                                                                                                                                                                                                                                                                                                                                                                                                                                                                                                                                                                                                                                                                                                                                                                                                                                                                                                                                                                                                                                                                         |                                           |
| El 10 de enero de 1580, Juan de Salinas recordaba ante Juan Ramírez de Alarcón, alcalde ordinario de la Villa, que "el término de los pregones es pasado y muchos días más. A V.m. pido y suplico, mande avivar la voz del almoneda". El alcalde ordenó notificar a Blas de la Serna de esta petición, dándole de término tres días para pagar, o diese razón legítima por donde no se debiera hacer el remate. Así se le notificó ante los testigos Gonzalo Hernández de Tene(1) y Alonso de Aguilar, vecinos de Colima.                                                                                                                                                                                                                                                                                                                                                                                                                                                                                                                                                                                                                               |                                           |
|                                                                                                                                                                                                                                                                                                                                                                                                                                                                                                                                                                                                                                                                                                                                                                                                                                                                                                                                                                                                                                                                                                                                                         |                                           |
| Juan de Salinas, por cuanto había pasado el término sin que el herrero alegara cosa alguna, el 18 de enero insistía en el remate para "de su precio y valor, hacerme cumplido pago de principal y costas".                                                                                                                                                                                                                                                                                                                                                                                                                                                                                                                                                                                                                                                                                                                                                                                                                                                                                                                                              |                                           |
|                                                                                                                                                                                                                                                                                                                                                                                                                                                                                                                                                                                                                                                                                                                                                                                                                                                                                                                                                                                                                                                                                                                                                         |                                           |
| El alcalde, vistos los autos, dictó sentencia: "Fallo que debo de mandar y mando avivar la voz del almoneda en los bienes en esta causa ejecutados". Ante Andrés Toscano y Alonso Ramírez,(2) vecinos y testigos, el escribano notificó esta sentencia a Blas de la Serna.                                                                                                                                                                                                                                                                                                                                                                                                                                                                                                                                                                                                                                                                                                                                                                                                                                                                              |                                           |
|                                                                                                                                                                                                                                                                                                                                                                                                                                                                                                                                                                                                                                                                                                                                                                                                                                                                                                                                                                                                                                                                                                                                                         |                                           |
| El 28 de enero, Juan de Salinas decía: "Por V.m. fue hecho el trance y remate en la dicha ejecución, y no hubo ponedor de los dichos bienes ejecutados. A V.m. pido y suplico, me mande dar su mandamiento de apremio para el dicho principal y fiador, por la dicha cantidad, e costas Y pido justicia y, en lo necesario, el ilustre oficio de V.m. imploro".                                                                                                                                                                                                                                                                                                                                                                                                                                                                                                                                                                                                                                                                                                                                                                                         |                                           |
|                                                                                                                                                                                                                                                                                                                                                                                                                                                                                                                                                                                                                                                                                                                                                                                                                                                                                                                                                                                                                                                                                                                                                         |                                           |
| El alcalde dio, entonces, su mandamiento de apremio e hizo tasación de las costas: "Derechos del juez, seis tomines. Derechos del alguacil, peso y medio. Derechos de escribano, dos pesos y dos tomines. Derechos de pregonero, cuatro tomines. De principal, treinta pesos. Por todo lo cual el dicho señor alcalde mandó dar e se dio mandamiento de apremio contra el principal e fiador, e se dio en forma. Ante mí, Francisco López, escribano público".                                                                                                                                                                                                                                                                                                                                                                                                                                                                                                                                                                                                                                                                                          |                                           |
|                                                                                                                                                                                                                                                                                                                                                                                                                                                                                                                                                                                                                                                                                                                                                                                                                                                                                                                                                                                                                                                                                                                                                         |                                           |
| Caja A–9, exp. 21, 8 ff.                                                                                                                                                                                                                                                                                                                                                                                                                                                                                                                                                                                                                                                                                                                                                                                                                                                                                                                                                                                                                                                                                                                                |                                           |
|                                                                                                                                                                                                                                                                                                                                                                                                                                                                                                                                                                                                                                                                                                                                                                                                                                                                                                                                                                                                                                                                                                                                                         |                                           |
|                                                                                                                                                                                                                                                                                                                                                                                                                                                                                                                                                                                                                                                                                                                                                                                                                                                                                                                                                                                                                                                                                                                                                         |                                           |
|                                                                                                                                                                                                                                                                                                                                                                                                                                                                                                                                                                                                                                                                                                                                                                                                                                                                                                                                                                                                                                                                                                                                                         |                                           |
| ---------------                                                                                                                                                                                                                                                                                                                                                                                                                                                                                                                                                                                                                                                                                                                                                                                                                                                                                                                                                                                                                                                                                                                                         |                                           |
|                                                                                                                                                                                                                                                                                                                                                                                                                                                                                                                                                                                                                                                                                                                                                                                                                                                                                                                                                                                                                                                                                                                                                         |                                           |
| (1) Si bien aquí es registrado vecino de Colima, todavía en ese año se declaraba avecindado en Zamora: infra, regº 595. Quizá, hermano del escribano real Cristóbal Hernández de Tene: Romero de Solís, Andariegos… (2001), 201-202. No debe confundirse con otros homónimos –a saber, un Gonzalo Hernández que fue alguacil mayor de la Villa, y otro que era mulato– que ya fueron registrados: supra, I, regº 216, 222, 225, 235. Es posible, empero, que algunos de los registros puedan corresponder a unos u otros, por cuanto no se dan ulteriores indicaciones.                                                                                                                                                                                                                                                                                                                                                                                                                                                                                                                                                                                 |                                           |
|                                                                                                                                                                                                                                                                                                                                                                                                                                                                                                                                                                                                                                                                                                                                                                                                                                                                                                                                                                                                                                                                                                                                                         |                                           |
| (2) Única referencia acerca de este vecino.                                                                                                                                                                                                                                                                                                                                                                                                                                                                                                                                                                                                                                                                                                                                                                                                                                                                                                                                                                                                                                                                                                             |                                           |
+---------------------------------------------------------------------------------------------------------------------------------------------------------------------------------------------------------------------------------------------------------------------------------------------------------------------------------------------------------------------------------------------------------------------------------------------------------------------------------------------------------------------------------------------------------------------------------------------------------------------------------------------------------------------------------------------------------------------------------------------------------------------------------------------------------------------------------------------------------------------------------------------------------------------------------------------------------------------------------------------------------------------------------------------------------------------------------------------------------------------------------------------------------+-------------------------------------------+

Documento(s) original(es)

Archivo no encontrado (CAJAS/CAJA9/EXP21/002F.jpg)

Archivo no encontrado (CAJAS/CAJA9/EXP21/005V.jpg)

Archivo no encontrado (CAJAS/CAJA9/EXP21/006V.jpg)

[]
1F

[]
1V

[]
2V

[]
3F

[]
3V

[]
4F

[]
4V

[]
5F

[]
6F

[]
7F

[]
7V

[]
8F

[]
8V

Proyecto interinstitucional del Archivo Histórico del Municipio de Colima y la Universidad de Colima,
realizado bajo los auspicios del fondo Ramón Álvarez-Buylla de Aldana.

------------------------------------------------------------------------

ISBN 978-968-7412-85-6
® Derechos Reservados 2008. Archivo Histórico del Municipio de Colima.

1,078 visitas
