[0] Config.pm:302> INFO - This is Biber 2.11
[0] Config.pm:305> INFO - Logfile is '01-arendt_agamben.blg'
[18] biber:313> INFO - === sáb oct 13, 2018, 10:01:59
[33] Biber.pm:371> INFO - Reading '01-arendt_agamben.bcf'
[81] Biber.pm:857> INFO - Found 6 citekeys in bib section 0
[90] Biber.pm:3976> INFO - Processing section 0
[98] Biber.pm:4136> INFO - Looking for bibtex format file '../bibliografia.bib' for section 0
[98] bibtex.pm:1500> INFO - LaTeX decoding ...
[103] bibtex.pm:1316> INFO - Found BibTeX data source '../bibliografia.bib'
[129] UCollate.pm:68> INFO - Overriding locale 'es-ES' defaults 'variable = shifted' with 'variable = non-ignorable'
[129] UCollate.pm:68> INFO - Overriding locale 'es-ES' defaults 'normalization = NFD' with 'normalization = prenormalized'
[130] Biber.pm:3804> INFO - Sorting list 'apa/global//global/global' of type 'entry' with template 'apa' and locale 'es-ES'
[136] bbl.pm:617> INFO - Writing '01-arendt_agamben.bbl' with encoding 'UTF-8'
[139] bbl.pm:720> INFO - Output to 01-arendt_agamben.bbl
