% $ biblatex auxiliary file $
% $ biblatex bbl format version 2.9 $
% Do not modify the above lines!
%
% This is an auxiliary file used by the 'biblatex' package.
% This file may safely be deleted. It will be recreated by
% biber as required.
%
\begingroup
\makeatletter
\@ifundefined{ver@biblatex.sty}
  {\@latex@error
     {Missing 'biblatex' package}
     {The bibliography requires the 'biblatex' package.}
      \aftergroup\endinput}
  {}
\endgroup


\refsection{0}
  \datalist[entry]{apa/global//global/global}
    \entry{agamben2006a}{book}{}
      \name{author}{1}{}{%
        {{uniquename=0,uniquepart=base,hash=8c74b403c34f5bada1d8b1bd87b56556}{%
           family={Agamben},
           familyi={A\bibinitperiod},
           given={Giorgio},
           giveni={G\bibinitperiod},
           givenun=0}}%
      }
      \list{publisher}{1}{%
        {Adriana Hidalgo editora}%
      }
      \strng{namehash}{8c74b403c34f5bada1d8b1bd87b56556}
      \strng{fullhash}{8c74b403c34f5bada1d8b1bd87b56556}
      \strng{bibnamehash}{8c74b403c34f5bada1d8b1bd87b56556}
      \strng{authorbibnamehash}{8c74b403c34f5bada1d8b1bd87b56556}
      \strng{authornamehash}{8c74b403c34f5bada1d8b1bd87b56556}
      \strng{authorfullhash}{8c74b403c34f5bada1d8b1bd87b56556}
      \field{sortinit}{A}
      \field{sortinithash}{d77c7cdd82ff690d4c3ef13216f92f0b}
      \field{extradatescope}{labelyear}
      \field{labeldatesource}{year}
      \true{uniqueprimaryauthor}
      \field{labelnamesource}{author}
      \field{labeltitlesource}{title}
      \field{title}{Lo abierto. El hombre y el animal}
      \field{year}{2016}
    \endentry
    \entry{artilleria2016a}{article}{}
      \name{author}{1}{}{%
        {{uniquename=0,uniquepart=base,hash=46f57c9c93742ec8be2a452a8c5eb37a}{%
           family={anón.},
           familyi={a\bibinitperiod}}}%
      }
      \strng{namehash}{46f57c9c93742ec8be2a452a8c5eb37a}
      \strng{fullhash}{46f57c9c93742ec8be2a452a8c5eb37a}
      \strng{bibnamehash}{46f57c9c93742ec8be2a452a8c5eb37a}
      \strng{authorbibnamehash}{46f57c9c93742ec8be2a452a8c5eb37a}
      \strng{authornamehash}{46f57c9c93742ec8be2a452a8c5eb37a}
      \strng{authorfullhash}{46f57c9c93742ec8be2a452a8c5eb37a}
      \field{sortinit}{a}
      \field{sortinithash}{d77c7cdd82ff690d4c3ef13216f92f0b}
      \field{extradatescope}{labelyear}
      \field{labeldatesource}{year}
      \true{uniqueprimaryauthor}
      \field{labelnamesource}{author}
      \field{labeltitlesource}{title}
      \field{journaltitle}{Artillería Inmanente}
      \field{title}{Correspondencia entre Giorgio Agamben y Hannah Arendt}
      \field{year}{2016}
      \verb{urlraw}
      \verb https://artilleriainmanente.noblogs.org/post/2016/09/29/correspondencia-entre-giorgio-agamben-y-hannah-arendt-1970/
      \endverb
      \verb{url}
      \verb https://artilleriainmanente.noblogs.org/post/2016/09/29/correspondencia-entre-giorgio-agamben-y-hannah-arendt-1970/
      \endverb
    \endentry
    \entry{arendt2006a}{book}{}
      \name{author}{1}{}{%
        {{uniquename=0,uniquepart=base,hash=f50f57f3bb1808b3fd67c3e65baf025f}{%
           family={Arendt},
           familyi={A\bibinitperiod},
           given={Hannah},
           giveni={H\bibinitperiod},
           givenun=0}}%
      }
      \list{publisher}{1}{%
        {Paidós}%
      }
      \strng{namehash}{f50f57f3bb1808b3fd67c3e65baf025f}
      \strng{fullhash}{f50f57f3bb1808b3fd67c3e65baf025f}
      \strng{bibnamehash}{f50f57f3bb1808b3fd67c3e65baf025f}
      \strng{authorbibnamehash}{f50f57f3bb1808b3fd67c3e65baf025f}
      \strng{authornamehash}{f50f57f3bb1808b3fd67c3e65baf025f}
      \strng{authorfullhash}{f50f57f3bb1808b3fd67c3e65baf025f}
      \field{sortinit}{A}
      \field{sortinithash}{d77c7cdd82ff690d4c3ef13216f92f0b}
      \field{extradatescope}{labelyear}
      \field{labeldatesource}{year}
      \true{uniqueprimaryauthor}
      \field{labelnamesource}{author}
      \field{labeltitlesource}{title}
      \field{title}{La condición humana}
      \field{year}{2016}
    \endentry
    \entry{fromm1962a}{book}{}
      \name{author}{1}{}{%
        {{uniquename=0,uniquepart=base,hash=81cc238ec7ae519983978f06e75536c3}{%
           family={Fromm},
           familyi={F\bibinitperiod},
           given={Erich},
           giveni={E\bibinitperiod},
           givenun=0}}%
      }
      \list{publisher}{1}{%
        {Fondo de Cultura Económica}%
      }
      \strng{namehash}{81cc238ec7ae519983978f06e75536c3}
      \strng{fullhash}{81cc238ec7ae519983978f06e75536c3}
      \strng{bibnamehash}{81cc238ec7ae519983978f06e75536c3}
      \strng{authorbibnamehash}{81cc238ec7ae519983978f06e75536c3}
      \strng{authornamehash}{81cc238ec7ae519983978f06e75536c3}
      \strng{authorfullhash}{81cc238ec7ae519983978f06e75536c3}
      \field{sortinit}{F}
      \field{sortinithash}{669c706c6f1fbf3b5a83d26f1d9e9e72}
      \field{extradatescope}{labelyear}
      \field{labeldatesource}{year}
      \true{uniqueprimaryauthor}
      \field{labelnamesource}{author}
      \field{labeltitlesource}{title}
      \field{title}{Marx y su concepto de hombre}
      \field{year}{1962}
    \endentry
    \entry{linares2008a}{book}{}
      \name{author}{1}{}{%
        {{uniquename=0,uniquepart=base,hash=481809d896842fa3b8c03138450f0133}{%
           family={Linares},
           familyi={L\bibinitperiod},
           given={Jorge\bibnamedelima Enrique},
           giveni={J\bibinitperiod\bibinitdelim E\bibinitperiod},
           givenun=0}}%
      }
      \list{publisher}{1}{%
        {Fondo de Cultura Económica — Universidad Nacional Autónoma de México}%
      }
      \strng{namehash}{481809d896842fa3b8c03138450f0133}
      \strng{fullhash}{481809d896842fa3b8c03138450f0133}
      \strng{bibnamehash}{481809d896842fa3b8c03138450f0133}
      \strng{authorbibnamehash}{481809d896842fa3b8c03138450f0133}
      \strng{authornamehash}{481809d896842fa3b8c03138450f0133}
      \strng{authorfullhash}{481809d896842fa3b8c03138450f0133}
      \field{sortinit}{L}
      \field{sortinithash}{2c7981aaabc885868aba60f0c09ee20f}
      \field{extradatescope}{labelyear}
      \field{labeldatesource}{year}
      \true{uniqueprimaryauthor}
      \field{labelnamesource}{author}
      \field{labeltitlesource}{title}
      \field{title}{Ética y mundo tecnológico}
      \field{year}{2008}
    \endentry
    \entry{tercera2018a}{article}{}
      \name{author}{1}{}{%
        {{uniquename=0,uniquepart=base,hash=3f94d84522b1035c077b23b052cd2f66}{%
           family={Marín},
           familyi={M\bibinitperiod},
           given={Pablo},
           giveni={P\bibinitperiod},
           givenun=0}}%
      }
      \strng{namehash}{3f94d84522b1035c077b23b052cd2f66}
      \strng{fullhash}{3f94d84522b1035c077b23b052cd2f66}
      \strng{bibnamehash}{3f94d84522b1035c077b23b052cd2f66}
      \strng{authorbibnamehash}{3f94d84522b1035c077b23b052cd2f66}
      \strng{authornamehash}{3f94d84522b1035c077b23b052cd2f66}
      \strng{authorfullhash}{3f94d84522b1035c077b23b052cd2f66}
      \field{sortinit}{M}
      \field{sortinithash}{cfd219b90152c06204fab207bc6c7cab}
      \field{extradatescope}{labelyear}
      \field{labeldatesource}{year}
      \true{uniqueprimaryauthor}
      \field{labelnamesource}{author}
      \field{labeltitlesource}{title}
      \field{journaltitle}{La Tercera}
      \field{month}{4}
      \field{title}{Los archivos de Hannah Arendt se abren al público}
      \field{year}{2018}
      \verb{urlraw}
      \verb https://www.latercera.com/cultura/noticia/los-archivos-hannah-arendt-se-abren-al-publico/127175/
      \endverb
      \verb{url}
      \verb https://www.latercera.com/cultura/noticia/los-archivos-hannah-arendt-se-abren-al-publico/127175/
      \endverb
    \endentry
  \enddatalist
\endrefsection
\endinput

