\relax 
\providecommand\hyper@newdestlabel[2]{}
\providecommand*{\memsetcounter}[2]{}
\catcode `"\active 
\catcode `<\active 
\catcode `>\active 
\@nameuse{es@quoting}
\providecommand\HyperFirstAtBeginDocument{\AtBeginDocument}
\HyperFirstAtBeginDocument{\ifx\hyper@anchor\@undefined
\global\let\oldcontentsline\contentsline
\gdef\contentsline#1#2#3#4{\oldcontentsline{#1}{#2}{#3}}
\global\let\oldnewlabel\newlabel
\gdef\newlabel#1#2{\newlabelxx{#1}#2}
\gdef\newlabelxx#1#2#3#4#5#6{\oldnewlabel{#1}{{#2}{#3}}}
\AtEndDocument{\ifx\hyper@anchor\@undefined
\let\contentsline\oldcontentsline
\let\newlabel\oldnewlabel
\fi}
\fi}
\global\let\hyper@last\relax 
\gdef\HyperFirstAtBeginDocument#1{#1}
\providecommand\HyField@AuxAddToFields[1]{}
\providecommand\HyField@AuxAddToCoFields[2]{}
\abx@aux@refcontext{apa/global//global/global}
\@writefile{toc}{\boolfalse {citerequest}\boolfalse {citetracker}\boolfalse {pagetracker}\boolfalse {backtracker}\relax }
\@writefile{lof}{\boolfalse {citerequest}\boolfalse {citetracker}\boolfalse {pagetracker}\boolfalse {backtracker}\relax }
\@writefile{lot}{\boolfalse {citerequest}\boolfalse {citetracker}\boolfalse {pagetracker}\boolfalse {backtracker}\relax }
\babel@aux{spanish}{}
\abx@aux@cite{dove2014a}
\abx@aux@segm{0}{0}{dove2014a}
\abx@aux@backref{1}{dove2014a}{0}{2}{2}
\abx@aux@page{1}{2}
\abx@aux@cite{keith2009a}
\abx@aux@segm{0}{0}{keith2009a}
\abx@aux@segm{0}{0}{keith2009a}
\abx@aux@segm{0}{0}{keith2009a}
\abx@aux@cite{freud2002a}
\abx@aux@segm{0}{0}{freud2002a}
\abx@aux@segm{0}{0}{keith2009a}
\abx@aux@backref{2}{keith2009a}{0}{6}{6}
\abx@aux@page{2}{6}
\abx@aux@backref{3}{keith2009a}{0}{6}{6}
\abx@aux@page{3}{6}
\abx@aux@backref{4}{keith2009a}{0}{6}{6}
\abx@aux@page{4}{6}
\abx@aux@backref{5}{freud2002a}{0}{6}{6}
\abx@aux@page{5}{6}
\abx@aux@backref{6}{keith2009a}{0}{6}{6}
\abx@aux@page{6}{6}
\abx@aux@segm{0}{0}{keith2009a}
\abx@aux@backref{7}{keith2009a}{0}{7}{7}
\abx@aux@page{7}{7}
\abx@aux@segm{0}{0}{keith2009a}
\abx@aux@backref{8}{keith2009a}{0}{8}{8}
\abx@aux@page{8}{8}
\abx@aux@segm{0}{0}{freud2002a}
\abx@aux@backref{9}{freud2002a}{0}{9}{9}
\abx@aux@page{9}{9}
\abx@aux@refcontextdefaultsdone
\abx@aux@defaultrefcontext{0}{dove2014a}{apa/global//global/global}
\abx@aux@defaultrefcontext{0}{freud2002a}{apa/global//global/global}
\abx@aux@defaultrefcontext{0}{keith2009a}{apa/global//global/global}
\@writefile{toc}{\defcounter {refsection}{0}\relax }\@writefile{toc}{\contentsline {chapter}{Bibliograf\'{\i }a}{10}{section*.3}}
\abx@aux@page{10}{10}
\abx@aux@page{11}{10}
\abx@aux@page{12}{10}
\memsetcounter{lastsheet}{10}
\memsetcounter{lastpage}{10}
