[]

LA VILLA DE COLIMA DE LA NUEVA ESPAÑA
SIGLO XVI

VOLUMEN I      (CAJAS 1-11)

[]

Inicio | Búsquedas | Siglas y bibliografía | Cartografía | Créditos | Más información

[]

Búsqueda rápida

+:---------------------------------------------------------------------------------------------------------------------------------------------------------------------------------------------------------------------------------------------------------------------------------------------------------------------------------------------------------------------------------------------------------------------------------------------------------------------------------------------------------------------------------------------------------------------------------------------------------------------------------------------------------------------------------------------------------------------------------------------------------------------------------------------------------------------------------------------------------------------------------------------:+------------------------------------------:+
| Fecha:                                                                                                                                                                                                                                                                                                                                                                                                                                                                                                                                                                                                                                                                                                                                                                                                                                                                                        | Ubicación física del documento original:  |
| 1579 Febrero, 8                                                                                                                                                                                                                                                                                                                                                                                                                                                                                                                                                                                                                                                                                                                                                                                                                                                                               | CAJA A-10, EXP. 16, 6 FF.                 |
|                                                                                                                                                                                                                                                                                                                                                                                                                                                                                                                                                                                                                                                                                                                                                                                                                                                                                               | Archivo Histórico del Municipio de Colima |
+-----------------------------------------------------------------------------------------------------------------------------------------------------------------------------------------------------------------------------------------------------------------------------------------------------------------------------------------------------------------------------------------------------------------------------------------------------------------------------------------------------------------------------------------------------------------------------------------------------------------------------------------------------------------------------------------------------------------------------------------------------------------------------------------------------------------------------------------------------------------------------------------------+-------------------------------------------+
| 382. 1579. Febrero, 8.                                                                                                                                                                                                                                                                                                                                                                                                                                                                                                                                                                                                                                                                                                                                                                                                                                                                        |                                           |
|                                                                                                                                                                                                                                                                                                                                                                                                                                                                                                                                                                                                                                                                                                                                                                                                                                                                                               |                                           |
| Ejecución de Juan Fernández de Ocampo a Jerónimo Ortiz.                                                                                                                                                                                                                                                                                                                                                                                                                                                                                                                                                                                                                                                                                                                                                                                                                                       |                                           |
|                                                                                                                                                                                                                                                                                                                                                                                                                                                                                                                                                                                                                                                                                                                                                                                                                                                                                               |                                           |
| "Digo yo Jerónimo Ortiz que debo y me obligo de dar y pagar al señor Juan Fernández de Ocampo setenta pesos de oro común, los cuales son por razón de un caballo castaño oscuro, labrado, y el cual recibí y está en mi poder, en plata o reales, de hoy día de la fecha desta en dos meses, los cuales os dará sin pleito ni contienda, y porque es verdad, lo firmé de mi nombre. Testigos que fueron presentes a lo que dicho es, Alonso Miguel y Gonzalo López, vecinos desta Villa, que es fecho a 8 de febrero de mil e quinientos y setenta y nueve [1579] años. [Rúbrica] Jerónimo Ortiz. Soy testigo, [rúbrica] Gonzalo López de Ayala".                                                                                                                                                                                                                                             |                                           |
|                                                                                                                                                                                                                                                                                                                                                                                                                                                                                                                                                                                                                                                                                                                                                                                                                                                                                               |                                           |
| El 6 de julio de ese año y ante el alcalde ordinario Cristóbal de Silva, Fernández de Ocampo pidió a Su Merced que mandara parecer ante sí a Jerónimo Ortiz, para que reconociera bajo juramento la dicha cédula. Así lo ordenó el alcalde. Ortiz, sin necesidad de jurar, dijo que "la letra e firma a do dice Jerónimo Ortiz es suya e la hizo con sus manos, e lo firmó". Pasó ante Francisco López, escribano público.                                                                                                                                                                                                                                                                                                                                                                                                                                                                    |                                           |
|                                                                                                                                                                                                                                                                                                                                                                                                                                                                                                                                                                                                                                                                                                                                                                                                                                                                                               |                                           |
| El 19 de septiembre de 1580, ante el alcalde ordinario Juan de Aguilar, Fernández de Ocampo presentó nuevamente esta cédula contra Ortiz, y pidió mandamiento ejecutorio por su cuantía. El alcalde Aguilar, viendo que era de plazo pasado, así lo dispuso y el alguacil mayor de la Villa Juan Muñoz ejecutó el 3 de octubre a Jerónimo Ortiz, vecino de Colima, que nombró por sus bienes las casas de su morada y dio por su fiador al vecino Cristóbal de Solórzano, siendo testigos de ello Pero de Almodóvar y Álvaro García,(1) vecinos asimismo de esta Villa.                                                                                                                                                                                                                                                                                                                       |                                           |
|                                                                                                                                                                                                                                                                                                                                                                                                                                                                                                                                                                                                                                                                                                                                                                                                                                                                                               |                                           |
| Fernández de Ocampo, con fecha de 2 de octubre, decía que al ser Ortiz notificado de la ejecución, "el susodicho dio los pregones por dados con protestación de gozar del término, el cual es pasado y días más. A V.m. pido y suplico mande hacer y haga el trance y remate en los bienes ejecutados y de su valor hacerme entero y cumplido pago".                                                                                                                                                                                                                                                                                                                                                                                                                                                                                                                                          |                                           |
|                                                                                                                                                                                                                                                                                                                                                                                                                                                                                                                                                                                                                                                                                                                                                                                                                                                                                               |                                           |
| El alcalde Juan de Aguilar mandó dar traslado a la parte demandada "para que, dentro de tercero día, muestre paga o razón legítima que impida el remate, con apercibimiento que el término pasado, Su Merced proveerá justicia". Fue notificado Ortiz por el escribano López, siendo testigo el vecino Álvaro García "y en presencia del señor alcalde mayor, de lo cual doy fe".                                                                                                                                                                                                                                                                                                                                                                                                                                                                                                             |                                           |
|                                                                                                                                                                                                                                                                                                                                                                                                                                                                                                                                                                                                                                                                                                                                                                                                                                                                                               |                                           |
| El 5 de noviembre, Jerónimo Ortiz se oponía a la ejecución, diciendo que el mandamiento y demás autos ordenados por el alcalde se habían de revocar, "porque la cédula que yo otorgué" por la era ejecutado, "fue por el precio de una jaca castaña" que, "en la dicha cédula, digo haber comprado, la cual yo no he recibido del susodicho en la dicha compra ni él por tal título me la entregó, porque la dicha jaca, al tiempo que hice la dicha cédula que es en el tiempo que la parte contraria quiere decir se celebró la dicha venta, antes ni después valía en el precio riguroso que él le podía poner, más de ocho pesos de oro común, y ansí el nombre de precio que parece habérsele puesto en la dicha cédula, fue ficción y sin intento ni propósito que hubiese efecto como no lo hubo, y ansí yo no soy obligado a pagar al dicho Juan Fernández los dichos setenta pesos". |                                           |
|                                                                                                                                                                                                                                                                                                                                                                                                                                                                                                                                                                                                                                                                                                                                                                                                                                                                                               |                                           |
| El alcalde tuvo por presentada esta petición mandando dar de la misma traslado a Ocampo, lo cual hizo el escribano López notificando a ambas partes "los diez días de la ley de Toledo". El 17 de noviembre, Ocampo decía que había pedido trance y remate contra Ortiz, a quien se le notificó; éste "se opuso y no ha probado nada" habiendo pasado los términos de la ejecución. Por tanto, pedía a Su Merced "mande hacer y haga el trance y remate".                                                                                                                                                                                                                                                                                                                                                                                                                                     |                                           |
|                                                                                                                                                                                                                                                                                                                                                                                                                                                                                                                                                                                                                                                                                                                                                                                                                                                                                               |                                           |
| El 9 de diciembre, el alcalde ordinario Julian de Frías dictó sentencia, fallando a favor de Juan de Fernández Ocampo y mandando "avivar la voz del almoneda" contra Ortiz.                                                                                                                                                                                                                                                                                                                                                                                                                                                                                                                                                                                                                                                                                                                   |                                           |
|                                                                                                                                                                                                                                                                                                                                                                                                                                                                                                                                                                                                                                                                                                                                                                                                                                                                                               |                                           |
| El último remate se realizó el 16 de diciembre, "por voz de Francisco, negro", sin que apareciera ponedor alguno sobre las casas de Jerónimo Ortiz. Testigos fueron, entre otros muchos, los vecinos Juan de Salinas, Juan de Velasco y Juan Muñoz.(2)                                                                                                                                                                                                                                                                                                                                                                                                                                                                                                                                                                                                                                        |                                           |
|                                                                                                                                                                                                                                                                                                                                                                                                                                                                                                                                                                                                                                                                                                                                                                                                                                                                                               |                                           |
| En escrito fechado el 22 de diciembre, Juan de Santa Cruz, en nombre de Fernández de Ocampo, decía que "todos los términos de la dicha ejecución son pasados y el trance y remate se hizo y no hubo ponedor a los dichos bienes. A V.m. pido y suplico, mande hacer tasación de costas y mande dar su mandamiento contra el principal y fiador, para que me den y paguen los pesos de oro del principal con más las costas, sobre que pido justicia".                                                                                                                                                                                                                                                                                                                                                                                                                                         |                                           |
|                                                                                                                                                                                                                                                                                                                                                                                                                                                                                                                                                                                                                                                                                                                                                                                                                                                                                               |                                           |
| El alcalde Juan de Aguilar dio entonces mandamiento de apremio e hizo la tasación de las costas: de juez y escribano, peso y medio; derechos de pregonero, 2 tomines. "Que monta lo susodicho peso y ducado".                                                                                                                                                                                                                                                                                                                                                                                                                                                                                                                                                                                                                                                                                 |                                           |
|                                                                                                                                                                                                                                                                                                                                                                                                                                                                                                                                                                                                                                                                                                                                                                                                                                                                                               |                                           |
| Caja A–10, exp. 16, 6 ff.                                                                                                                                                                                                                                                                                                                                                                                                                                                                                                                                                                                                                                                                                                                                                                                                                                                                     |                                           |
|                                                                                                                                                                                                                                                                                                                                                                                                                                                                                                                                                                                                                                                                                                                                                                                                                                                                                               |                                           |
|                                                                                                                                                                                                                                                                                                                                                                                                                                                                                                                                                                                                                                                                                                                                                                                                                                                                                               |                                           |
|                                                                                                                                                                                                                                                                                                                                                                                                                                                                                                                                                                                                                                                                                                                                                                                                                                                                                               |                                           |
| ---------------                                                                                                                                                                                                                                                                                                                                                                                                                                                                                                                                                                                                                                                                                                                                                                                                                                                                               |                                           |
|                                                                                                                                                                                                                                                                                                                                                                                                                                                                                                                                                                                                                                                                                                                                                                                                                                                                                               |                                           |
| (1) Tal vez se avecindó en Colima en 1580: infra, III, regº 669, pero no debe ser confundido con el también vecino Álvaro García de Grijalba, hijo legítimo de Álvaro de Grijalba y Catalina Ruiz: Romero de Solís, Andariegos… (2001), 161-162, 165-166.                                                                                                                                                                                                                                                                                                                                                                                                                                                                                                                                                                                                                                     |                                           |
|                                                                                                                                                                                                                                                                                                                                                                                                                                                                                                                                                                                                                                                                                                                                                                                                                                                                                               |                                           |
| (2) La foja donde aparecen la petición de Ocampo, la sentencia de Julián de Frías y el auto del último remate, trae al reverso escrito lo siguiente: "JHS. Al ilustre señor Juan de Sancta Cruz, mi señor, en Cristo", lo cual se repite también en la siguiente foja. Por la inscripción JHS [Jesús] diríase que la suscribe un jesuita o alguien influenciado por la Compañía de Jesús. Sobre Santa Cruz, entonces mayordomo del Hospital de la Catedral michoacana: Romero de Solís, Andariegos… (2001), 509.                                                                                                                                                                                                                                                                                                                                                                              |                                           |
+-----------------------------------------------------------------------------------------------------------------------------------------------------------------------------------------------------------------------------------------------------------------------------------------------------------------------------------------------------------------------------------------------------------------------------------------------------------------------------------------------------------------------------------------------------------------------------------------------------------------------------------------------------------------------------------------------------------------------------------------------------------------------------------------------------------------------------------------------------------------------------------------------+-------------------------------------------+

Documento(s) original(es)

Archivo no encontrado (CAJAS/CAJA10/EXP16/003V.jpg)

[]
1F

[]
1V

[]
2F

[]
2V

[]
3F

[]
4F

[]
4V

[]
5F

[]
5V

[]
6F

[]
6V

Proyecto interinstitucional del Archivo Histórico del Municipio de Colima y la Universidad de Colima,
realizado bajo los auspicios del fondo Ramón Álvarez-Buylla de Aldana.

------------------------------------------------------------------------

ISBN 978-968-7412-85-6
® Derechos Reservados 2008. Archivo Histórico del Municipio de Colima.

1,078 visitas
