+----------------------------------------------------------------------------------------------------------------------------------------------------------------------------------------------------------------------------------------------------------------------------------------------------------------------------------------------------+-----------------------+-----------------------+
| []                                                                                                                                                                                                                                                                                                                                                 |                       |                       |
|                                                                                                                                                                                                                                                                                                                                                    |                       |                       |
| +-----------------------------------+:-------------------------------------:+                                                                                                                                                                                                                                                                      |                       |                       |
| | []                                | LA VILLA DE COLIMA DE LA NUEVA ESPAÑA |                                                                                                                                                                                                                                                                      |                       |                       |
| |                                   | SIGLO XVI                             |                                                                                                                                                                                                                                                                      |                       |                       |
| |                                   |                                       |                                                                                                                                                                                                                                                                      |                       |                       |
| |                                   | VOLUMEN II      (CAJAS 12-20)         |                                                                                                                                                                                                                                                                      |                       |                       |
| +-----------------------------------+---------------------------------------+                                                                                                                                                                                                                                                                      |                       |                       |
+----------------------------------------------------------------------------------------------------------------------------------------------------------------------------------------------------------------------------------------------------------------------------------------------------------------------------------------------------+-----------------------+-----------------------+
| +------------------------------------------------------------------------+-------------------------------+-----------------------+                                                                                                                                                                                                                 |                       |                       |
| | Inicio | Búsqueda | Siglas y bibliografía | Créditos | Más información | Vol. I (1-11) Vol. II (12-20) |    [ES]               |                                                                                                                                                                                                                 |                       |                       |
| +------------------------------------------------------------------------+-------------------------------+-----------------------+                                                                                                                                                                                                                 |                       |                       |
+----------------------------------------------------------------------------------------------------------------------------------------------------------------------------------------------------------------------------------------------------------------------------------------------------------------------------------------------------+-----------------------+-----------------------+
| Búsqueda rápida                                                                                                                                                                                                                                                                                                                                    |                       |                       |
|                                                                                                                                                                                                                                                                                                                                                    |                       |                       |
| +:-------------------:+-----------------+:----------------------------------------:+----------------:+                                                                                                                                                                                                                                             |                       |                       |
| | Documento de fecha: |                 | Ubicación física del documento original: | [] [] []        |                                                                                                                                                                                                                                             |                       |                       |
| |                     |                 |                                          |                 |                                                                                                                                                                                                                                             |                       |                       |
| | 1598. Septiembre, 7 |                 | Caja 26, exp. 90, 1 f.                   |                 |                                                                                                                                                                                                                                             |                       |                       |
| +---------------------+-----------------+------------------------------------------+-----------------+                                                                                                                                                                                                                                             |                       |                       |
|                                                                                                                                                                                                                                                                                                                                                    |                       |                       |
|   ------------- -----------------------------------------------------------------------------------------------------------------------------------------------------------------                                                                                                                                                                  |                       |                       |
|   Resumen:      El mercader Domingo Sánchez pide que se le pague cierta cantidad de pesos que le quedó debiendo Alonso Lorenzo, difunto, de mercaderías que llevó de su tienda.                                                                                                                                                                    |                       |                       |
|   ------------- -----------------------------------------------------------------------------------------------------------------------------------------------------------------                                                                                                                                                                  |                       |                       |
|                                                                                                                                                                                                                                                                                                                                                    |                       |                       |
|   ----------------------------------- ------------------------------------------------------------------------------------------------------------------------------------------------------------------------------------------------------------------------------------------------------------------------------------------------------------ |                       |                       |
|   Contenido:                          Ante Felipe de Valdés, alcalde mayor de la Villa y Provincia de Colima, se presentó la petición siguiente:                                                                                                                                                                                                   |                       |                       |
|                                       “Domingo Sánchez, mercader, digo que Alonso Lorenzo,^([1]) difunto, dejó en su testamento mandado que me pagasen lo que yo declarase con juramento de mercadurías de mi tienda.                                                                                                                              |                       |                       |
|                                       “Y el dicho difunto me debe, conforme a mi Libro, noventa pesos en reales que le di para becerros, y dieciocho pesos que le di en reales por una carga de cacao, y más doce [pesos de] vino, de tres cuartillas de vino, que llevó en veces de mi tienda; que todo monta ciento y veinte pesos todo ello”.   |                       |                       |
|                                       Concluía Domingo Sánchez: “A V.m. pido y suplico mande que me lo paguen de los bienes que dejó conforme a la cláusula de su testamento, que juro a Dios y a esta Santa + [Cruz] me son debidos y por pagar. Y pido justicia”.                                                                                |                       |                       |
|                                       “El alcalde mayor mandó que, citados los albaceas del dicho difunto, se saque la cláusula del dicho testamento y, sacada, proveerá en justicia. Y ansí lo proveyó y mandó”.                                                                                                                                  |                       |                       |
|                                       Ese mismo día, el escribano Toribio de Casso citó a Diego Morán, albacea de Alonso Lorenzo. En su presencia y en la de Juan Martínez de Olalde, se sacó la mencionada cláusula del dicho testamento.                                                                                                         |                       |                       |
|                                                                                                                                                                                                                                                                                                                                                    |                       |                       |
|   ----------------------------------- ------------------------------------------------------------------------------------------------------------------------------------------------------------------------------------------------------------------------------------------------------------------------------------------------------------ |                       |                       |
|                                                                                                                                                                                                                                                                                                                                                    |                       |                       |
| (1) El vecino de Colima Alonso Lorenzo El Guay falleció meses atrás, en marzo de 1598.                                                                                                                                                                                                                                                             |                       |                       |
|                                                                                                                                                                                                                                                                                                                                                    |                       |                       |
|   ---------------------------------------------------------------------------------------------------                                                                                                                                                                                                                                              |                       |                       |
|    Documento(s) original(es)                                                                                                                                                                                                                                                                                                                       |                       |                       |
|   --------------------------- ------- ------- ------- ------- ------- ------- ------- ------- -------                                                                                                                                                                                                                                              |                       |                       |
|               []                                                                                                                                                                                                                                                                                                                                   |                       |                       |
|               1f                                                                                                                                                                                                                                                                                                                                   |                       |                       |
|                                                                                                                                                                                                                                                                                                                                                    |                       |                       |
|   ---------------------------------------------------------------------------------------------------                                                                                                                                                                                                                                              |                       |                       |
+----------------------------------------------------------------------------------------------------------------------------------------------------------------------------------------------------------------------------------------------------------------------------------------------------------------------------------------------------+-----------------------+-----------------------+
| +----------------------------------------------------------------------------+-----------------------------------------------:+                                                                                                                                                                                                                    |                       |                       |
| | ISBN 978-607-701-024-1                                                     |   ---- ---- ---- ---- ---- ---- ---- ---- ---- |                                                                                                                                                                                                                    |                       |                       |
| | © Derechos Reservados 2013. Archivo Histórico del Municipio de Colima. [*] |   []        []        []        []        []   |                                                                                                                                                                                                                    |                       |                       |
| |                                                                            |   ---- ---- ---- ---- ---- ---- ---- ---- ---- |                                                                                                                                                                                                                    |                       |                       |
| +----------------------------------------------------------------------------+------------------------------------------------+                                                                                                                                                                                                                    |                       |                       |
| |                                                                            |                                                |                                                                                                                                                                                                                    |                       |                       |
| +----------------------------------------------------------------------------+------------------------------------------------+                                                                                                                                                                                                                    |                       |                       |
+----------------------------------------------------------------------------------------------------------------------------------------------------------------------------------------------------------------------------------------------------------------------------------------------------------------------------------------------------+-----------------------+-----------------------+

636 visitas
