[]

LA VILLA DE COLIMA DE LA NUEVA ESPAÑA
SIGLO XVI

VOLUMEN I      (CAJAS 1-11)

[]

Inicio | Búsquedas | Siglas y bibliografía | Cartografía | Créditos | Más información

[]

Búsqueda rápida

+:-------------------------------------------------------------------------------------------------------------------------------------------------------------------------------------------------------------------------------------------------------------------------------------------------------------------------------------------------------------------------------------------------------------------------------------------------------------------------------------------------------------------------------------------------------------------------------------------------------------------------------------------------------------------------------------------------------------------------------------------------------------------------------------------------------------------------------------------------------------------------------------------------------------------------------------------------------------------------------------------------------------------------------------------------------------------------------:+------------------------------------------:+
| Fecha:                                                                                                                                                                                                                                                                                                                                                                                                                                                                                                                                                                                                                                                                                                                                                                                                                                                                                                                                                                                                                                                                          | Ubicación física del documento original:  |
| 1570 Agosto, 14                                                                                                                                                                                                                                                                                                                                                                                                                                                                                                                                                                                                                                                                                                                                                                                                                                                                                                                                                                                                                                                                 | CAJA A-10, EXP. 4, FF. 64-65. (3)         |
|                                                                                                                                                                                                                                                                                                                                                                                                                                                                                                                                                                                                                                                                                                                                                                                                                                                                                                                                                                                                                                                                                 | Archivo Histórico del Municipio de Colima |
+---------------------------------------------------------------------------------------------------------------------------------------------------------------------------------------------------------------------------------------------------------------------------------------------------------------------------------------------------------------------------------------------------------------------------------------------------------------------------------------------------------------------------------------------------------------------------------------------------------------------------------------------------------------------------------------------------------------------------------------------------------------------------------------------------------------------------------------------------------------------------------------------------------------------------------------------------------------------------------------------------------------------------------------------------------------------------------+-------------------------------------------+
| 363. 1570. Agosto, 14.                                                                                                                                                                                                                                                                                                                                                                                                                                                                                                                                                                                                                                                                                                                                                                                                                                                                                                                                                                                                                                                          |                                           |
|                                                                                                                                                                                                                                                                                                                                                                                                                                                                                                                                                                                                                                                                                                                                                                                                                                                                                                                                                                                                                                                                                 |                                           |
| Poder que otorga Juan Ramírez de Alarcón en favor de Pero Ruiz de Vilches.                                                                                                                                                                                                                                                                                                                                                                                                                                                                                                                                                                                                                                                                                                                                                                                                                                                                                                                                                                                                      |                                           |
|                                                                                                                                                                                                                                                                                                                                                                                                                                                                                                                                                                                                                                                                                                                                                                                                                                                                                                                                                                                                                                                                                 |                                           |
| "Este es un traslado bien y fielmente sacado de un poder que Juan Ramírez Alarcón, vecino desta Villa, dio y otorgó a Pero Ruiz de Vilches, vecino que fue desta dicha Villa, ante Jerónimo Flores, alcalde mayor que fue desta dicha Villa, y ante Baltasar de Alcalá, escribano nombrado de su juzgado, el tenor del cual es este que se sigue:                                                                                                                                                                                                                                                                                                                                                                                                                                                                                                                                                                                                                                                                                                                               |                                           |
|                                                                                                                                                                                                                                                                                                                                                                                                                                                                                                                                                                                                                                                                                                                                                                                                                                                                                                                                                                                                                                                                                 |                                           |
| "Sepan cuantos esta carta vieren, cómo yo Juan Ramírez Alarcón, estante al presente en esta Villa de Colima desta Nueva España, otorgo e conozco por esta presente carta, que doy e otorgo todo mi poder cumplido, libre e llenero, bastante, según que lo yo he y tengo y de derecho más puede y debe valer, a vos Pedro(1) Ruiz de Vilches, vecino desta dicha Villa, e a la persona que por vos fuere sustituido, para que por mí y en mi nombre e como yo mismo, podáis pedir, e demandar, recibir, y haber, y cobrar en juicio e fuera de él, de todas e cualesquier personas [...]; e para que ansí mismo podáis cobrar de los indios de los pueblos de Quizalapa, Coquimatlan e Izcatlan, que yo tengo en corregimiento, todas las mantas, maíz, e gallinas e otros tributos, que son obligados a dar e tributar en cada un año a Su Majestad e a mí, en su nombre, e de todo lo que recibiéredes y cobráredes podáis dar e otorgar las cartas de pago que convengan e menester sean". Fueron testigos Diego Fernández de Saldaña y Diego de Aguilar, vecinos de Colima. |                                           |
|                                                                                                                                                                                                                                                                                                                                                                                                                                                                                                                                                                                                                                                                                                                                                                                                                                                                                                                                                                                                                                                                                 |                                           |
| El alcalde mayor Jerónimo Flores interpuso su autoridad y decreto judicial. Pasó ante el escribano Baltasar de Alcalá.                                                                                                                                                                                                                                                                                                                                                                                                                                                                                                                                                                                                                                                                                                                                                                                                                                                                                                                                                          |                                           |
|                                                                                                                                                                                                                                                                                                                                                                                                                                                                                                                                                                                                                                                                                                                                                                                                                                                                                                                                                                                                                                                                                 |                                           |
| "Fecho e sacado, corregido e concertado fue este dicho traslado ante mí el presente escribano, en una ejecución y proceso della que hizo Pedro de Ribafrecha a los bienes del dicho Juan Ramírez Alarcón, por cierta cantidad de pesos de oro, e para le notificar el trance y remate de la dicha ejecución al dicho Juan Ramírez, por estar ausente, el juez de la causa mandó al dicho Pero Ruiz exhibir el dicho poder para le notificar el dicho trance y remate, y ansí lo exhibió, como parece y consta del dicho proceso y poder, que está en poder de mí el presente escribano, a que me refiero, el cual va cierto y verdadero.                                                                                                                                                                                                                                                                                                                                                                                                                                        |                                           |
|                                                                                                                                                                                                                                                                                                                                                                                                                                                                                                                                                                                                                                                                                                                                                                                                                                                                                                                                                                                                                                                                                 |                                           |
| "E lo saqué yo el presente escribano público desta dicha Villa de Colima y su provincia e del Cabildo della por Su Majestad, de pedimiento de la parte y de mandamiento del dicho señor alcalde, siendo testigos a lo ver sacar, corregir e concertar, Blas de la Serna e Juan Hernández, vecinos desta dicha Villa.(2)                                                                                                                                                                                                                                                                                                                                                                                                                                                                                                                                                                                                                                                                                                                                                         |                                           |
|                                                                                                                                                                                                                                                                                                                                                                                                                                                                                                                                                                                                                                                                                                                                                                                                                                                                                                                                                                                                                                                                                 |                                           |
| "Fue sacado en siete días del mes de agosto de mil e quinientos e setenta y nueve [1579] años, e por ende, fiz aquí mío signo que es a tal. En testimonio de verdad: Francisco López, escribano público".                                                                                                                                                                                                                                                                                                                                                                                                                                                                                                                                                                                                                                                                                                                                                                                                                                                                       |                                           |
|                                                                                                                                                                                                                                                                                                                                                                                                                                                                                                                                                                                                                                                                                                                                                                                                                                                                                                                                                                                                                                                                                 |                                           |
| Caja A–10, exp. 4, ff. 64-65.(3)                                                                                                                                                                                                                                                                                                                                                                                                                                                                                                                                                                                                                                                                                                                                                                                                                                                                                                                                                                                                                                                |                                           |
|                                                                                                                                                                                                                                                                                                                                                                                                                                                                                                                                                                                                                                                                                                                                                                                                                                                                                                                                                                                                                                                                                 |                                           |
|                                                                                                                                                                                                                                                                                                                                                                                                                                                                                                                                                                                                                                                                                                                                                                                                                                                                                                                                                                                                                                                                                 |                                           |
|                                                                                                                                                                                                                                                                                                                                                                                                                                                                                                                                                                                                                                                                                                                                                                                                                                                                                                                                                                                                                                                                                 |                                           |
| ---------------                                                                                                                                                                                                                                                                                                                                                                                                                                                                                                                                                                                                                                                                                                                                                                                                                                                                                                                                                                                                                                                                 |                                           |
|                                                                                                                                                                                                                                                                                                                                                                                                                                                                                                                                                                                                                                                                                                                                                                                                                                                                                                                                                                                                                                                                                 |                                           |
| (1) De modo explícito se le nombra en este caso "Pedro", cuando siempre que se alude a él, es designado "Pero".                                                                                                                                                                                                                                                                                                                                                                                                                                                                                                                                                                                                                                                                                                                                                                                                                                                                                                                                                                 |                                           |
|                                                                                                                                                                                                                                                                                                                                                                                                                                                                                                                                                                                                                                                                                                                                                                                                                                                                                                                                                                                                                                                                                 |                                           |
| (2) De tiempo atrás, juntos, Blas de la Serna y Fernández Ladrillero –¿acaso el Juan Hernández aquí registrado?– habían hecho negocios; por ejemplo, cuando éste entregó al primero 24 arrobas de pescado, la mitad de seco y la otra mitad de fresco, por valor de 27 pesos: supra, regº 292. Blas, además, era herrero: infra, regº 345, 619.                                                                                                                                                                                                                                                                                                                                                                                                                                                                                                                                                                                                                                                                                                                                 |                                           |
|                                                                                                                                                                                                                                                                                                                                                                                                                                                                                                                                                                                                                                                                                                                                                                                                                                                                                                                                                                                                                                                                                 |                                           |
| (3) Corresponden a las ff. 69-70, según la numeración original del expediente.                                                                                                                                                                                                                                                                                                                                                                                                                                                                                                                                                                                                                                                                                                                                                                                                                                                                                                                                                                                                  |                                           |
+---------------------------------------------------------------------------------------------------------------------------------------------------------------------------------------------------------------------------------------------------------------------------------------------------------------------------------------------------------------------------------------------------------------------------------------------------------------------------------------------------------------------------------------------------------------------------------------------------------------------------------------------------------------------------------------------------------------------------------------------------------------------------------------------------------------------------------------------------------------------------------------------------------------------------------------------------------------------------------------------------------------------------------------------------------------------------------+-------------------------------------------+

Documento(s) original(es)

Archivo no encontrado (CAJAS/CAJA10/EXP4/065V.jpg)

[]
64F

[]
64V

[]
65F

Proyecto interinstitucional del Archivo Histórico del Municipio de Colima y la Universidad de Colima,
realizado bajo los auspicios del fondo Ramón Álvarez-Buylla de Aldana.

------------------------------------------------------------------------

ISBN 978-968-7412-85-6
® Derechos Reservados 2008. Archivo Histórico del Municipio de Colima.

1,078 visitas
