+--------------------------------------------------------------------------------------------------------------------------------------------------------------------------------------------------------------------------------------------------------------------------------------------------------------------------------------------------------------------------------------+-----------------------+-----------------------+
| []                                                                                                                                                                                                                                                                                                                                                                                   |                       |                       |
|                                                                                                                                                                                                                                                                                                                                                                                      |                       |                       |
| +-----------------------------------+:-------------------------------------:+                                                                                                                                                                                                                                                                                                        |                       |                       |
| | []                                | LA VILLA DE COLIMA DE LA NUEVA ESPAÑA |                                                                                                                                                                                                                                                                                                        |                       |                       |
| |                                   | SIGLO XVI                             |                                                                                                                                                                                                                                                                                                        |                       |                       |
| |                                   |                                       |                                                                                                                                                                                                                                                                                                        |                       |                       |
| |                                   | VOLUMEN II      (CAJAS 12-20)         |                                                                                                                                                                                                                                                                                                        |                       |                       |
| +-----------------------------------+---------------------------------------+                                                                                                                                                                                                                                                                                                        |                       |                       |
+--------------------------------------------------------------------------------------------------------------------------------------------------------------------------------------------------------------------------------------------------------------------------------------------------------------------------------------------------------------------------------------+-----------------------+-----------------------+
| +------------------------------------------------------------------------+-------------------------------+-----------------------+                                                                                                                                                                                                                                                   |                       |                       |
| | Inicio | Búsqueda | Siglas y bibliografía | Créditos | Más información | Vol. I (1-11) Vol. II (12-20) |    [ES]               |                                                                                                                                                                                                                                                   |                       |                       |
| +------------------------------------------------------------------------+-------------------------------+-----------------------+                                                                                                                                                                                                                                                   |                       |                       |
+--------------------------------------------------------------------------------------------------------------------------------------------------------------------------------------------------------------------------------------------------------------------------------------------------------------------------------------------------------------------------------------+-----------------------+-----------------------+
| Búsqueda rápida                                                                                                                                                                                                                                                                                                                                                                      |                       |                       |
|                                                                                                                                                                                                                                                                                                                                                                                      |                       |                       |
| +:-------------------:+-----------------+:----------------------------------------:+----------------:+                                                                                                                                                                                                                                                                               |                       |                       |
| | Documento de fecha: |                 | Ubicación física del documento original: | [] [] []        |                                                                                                                                                                                                                                                                               |                       |                       |
| |                     |                 |                                          |                 |                                                                                                                                                                                                                                                                               |                       |                       |
| | 1598. Mayo, 23      |                 | Caja 26, exp. 37, ff. 55-57fte.          |                 |                                                                                                                                                                                                                                                                               |                       |                       |
| +---------------------+-----------------+------------------------------------------+-----------------+                                                                                                                                                                                                                                                                               |                       |                       |
|                                                                                                                                                                                                                                                                                                                                                                                      |                       |                       |
|   ------------- ----------------------------------------------------------------------------------------------------                                                                                                                                                                                                                                                                 |                       |                       |
|   Resumen:      Testamento de Ana de Arévalo, viuda de Pedro de Granada, vecinos que fueron de la Villa de Colima.                                                                                                                                                                                                                                                                   |                       |                       |
|   ------------- ----------------------------------------------------------------------------------------------------                                                                                                                                                                                                                                                                 |                       |                       |
|                                                                                                                                                                                                                                                                                                                                                                                      |                       |                       |
|   ----------------------------------- ---------------------------------------------------------------------------------------------------------------------------------------------------------------------------------------------------------------------------------------------------------------------------------------------------------------------------------------------- |                       |                       |
|   Contenido:                          “En el nombre de Dios. Amén.                                                                                                                                                                                                                                                                                                                   |                       |                       |
|                                       “Sepan cuántos esta carta de testamento y última voluntad vieren como yo Ana de Arévalo, viuda mujer que fui de Pedro de Granada, difunto, y vecina que soy desta Villa de Colima de la Nueva España, estando en la cama acostada y enferma del cuerpo y en mi buen seso y juicio natural”.                                                    |                       |                       |
|                                       Dispone que su “cuerpo sea sepultado en la iglesia parroquial desta Villa, donde están enterrados Francisco Preciado y Elvira de Arévalo, difuntos”.                                                                                                                                                                                           |                       |                       |
|                                       Declara que sus albaceas habrán de cobrar ciertas deudas: a Juan de Solórzano, su sobrino, que le debe 11 pesos de oro común; 20 pesos de Juan de Segura;^([1]) el Padre Francisco Muñoz,^([2]) 9 pesos, a quien por otra parte se le dará un anillo de oro; Juan de Berlanga, 7 pesos; de su sobrino Hernando de Alvarado, 6 pesos.           |                       |                       |
|                                       “Iten declaro que yo tengo en mi poder un paño de manos de Antonio Carrillo, labrado [...] y se concertó la hechura en cinco pesos y hasta agora no me ha dado [...]. Iten declaro que yo tengo en mi poder un pecho de Juana de Tapia, hija de Ana de la Zarza, y está comenzado a labrar y [...] ha de dar dos pesos de la hechura”.^([3])   |                       |                       |
|                                       “Iten declaro que yo tengo en mi poder a Isabel de las Casas,^([4]) muchacha, a la cual tengo en mi compañía, y por el buen servicio que me ha hecho y el amor que le tengo, mando [...] se le den todas las ropas de mi cama y vestidos [...], excepto una saya de paño azul, la cual mando se dé a Magdalena, mujer de Juan de Berlanga”.    |                       |                       |
|                                       Testigos: Salvador de Cuenca, presbítero, vicario de esta Villa de Colima, quien a su ruego firmó por ella, Juan Cornejo y Juan Sánchez Escobar, vecinos.                                                                                                                                                                                      |                       |                       |
|                                       Pasó ante el escribano público Toribio de Casso.                                                                                                                                                                                                                                                                                               |                       |                       |
|                                                                                                                                                                                                                                                                                                                                                                                      |                       |                       |
|   ----------------------------------- ---------------------------------------------------------------------------------------------------------------------------------------------------------------------------------------------------------------------------------------------------------------------------------------------------------------------------------------------- |                       |                       |
|                                                                                                                                                                                                                                                                                                                                                                                      |                       |                       |
| (1) Juan de Segura, al parecer, fue mozo del escribano Baltasar de Alcalá y familia: Romero de Solís, Andariegos… (2001), 518.                                                                                                                                                                                                                                                       |                       |                       |
|                                                                                                                                                                                                                                                                                                                                                                                      |                       |                       |
| (2) El Padre Francisco Muñoz, entre 1583 y 1597, ocupó el beneficio de Tecolapa: Romero de Solís, Andariegos… (2001), 355.                                                                                                                                                                                                                                                           |                       |                       |
|                                                                                                                                                                                                                                                                                                                                                                                      |                       |                       |
| (3) De ello se deduce que Ana de Arévalo se dedicaba a labrar ropa fina y a cobrar por ello.                                                                                                                                                                                                                                                                                         |                       |                       |
|                                                                                                                                                                                                                                                                                                                                                                                      |                       |                       |
| (4) Mestiza, hija de Pedro de las Casas y Justina, india natural de Zapotitlan: Romero de Solís, Andariegos… (2001), 95-96.                                                                                                                                                                                                                                                          |                       |                       |
|                                                                                                                                                                                                                                                                                                                                                                                      |                       |                       |
|   ---------------------------------------------------------------------------------------------------                                                                                                                                                                                                                                                                                |                       |                       |
|    Documento(s) original(es)                                                                                                                                                                                                                                                                                                                                                         |                       |                       |
|   --------------------------- ------- ------- ------- ------- ------- ------- ------- ------- -------                                                                                                                                                                                                                                                                                |                       |                       |
|               []                []      []      []      []                                                                                                                                                                                                                                                                                                                           |                       |                       |
|               55f               55v     56f     56v     57f                                                                                                                                                                                                                                                                                                                          |                       |                       |
|                                                                                                                                                                                                                                                                                                                                                                                      |                       |                       |
|   ---------------------------------------------------------------------------------------------------                                                                                                                                                                                                                                                                                |                       |                       |
+--------------------------------------------------------------------------------------------------------------------------------------------------------------------------------------------------------------------------------------------------------------------------------------------------------------------------------------------------------------------------------------+-----------------------+-----------------------+
| +----------------------------------------------------------------------------+-----------------------------------------------:+                                                                                                                                                                                                                                                      |                       |                       |
| | ISBN 978-607-701-024-1                                                     |   ---- ---- ---- ---- ---- ---- ---- ---- ---- |                                                                                                                                                                                                                                                      |                       |                       |
| | © Derechos Reservados 2013. Archivo Histórico del Municipio de Colima. [*] |   []        []        []        []        []   |                                                                                                                                                                                                                                                      |                       |                       |
| |                                                                            |   ---- ---- ---- ---- ---- ---- ---- ---- ---- |                                                                                                                                                                                                                                                      |                       |                       |
| +----------------------------------------------------------------------------+------------------------------------------------+                                                                                                                                                                                                                                                      |                       |                       |
| |                                                                            |                                                |                                                                                                                                                                                                                                                      |                       |                       |
| +----------------------------------------------------------------------------+------------------------------------------------+                                                                                                                                                                                                                                                      |                       |                       |
+--------------------------------------------------------------------------------------------------------------------------------------------------------------------------------------------------------------------------------------------------------------------------------------------------------------------------------------------------------------------------------------+-----------------------+-----------------------+

636 visitas
