+---------------------------------------------------------------------------------------------------------------------------------------------------------------------------------------------------------------------------------------------------------------------------------------------------------------------------------------------------------------------------------------------------------------------------------------------------------------------------------------------------------+-----------------------+-----------------------+
| []                                                                                                                                                                                                                                                                                                                                                                                                                                                                                                      |                       |                       |
|                                                                                                                                                                                                                                                                                                                                                                                                                                                                                                         |                       |                       |
| +-----------------------------------+:-------------------------------------:+                                                                                                                                                                                                                                                                                                                                                                                                                           |                       |                       |
| | []                                | LA VILLA DE COLIMA DE LA NUEVA ESPAÑA |                                                                                                                                                                                                                                                                                                                                                                                                                           |                       |                       |
| |                                   | SIGLO XVI                             |                                                                                                                                                                                                                                                                                                                                                                                                                           |                       |                       |
| |                                   |                                       |                                                                                                                                                                                                                                                                                                                                                                                                                           |                       |                       |
| |                                   | VOLUMEN II      (CAJAS 12-20)         |                                                                                                                                                                                                                                                                                                                                                                                                                           |                       |                       |
| +-----------------------------------+---------------------------------------+                                                                                                                                                                                                                                                                                                                                                                                                                           |                       |                       |
+---------------------------------------------------------------------------------------------------------------------------------------------------------------------------------------------------------------------------------------------------------------------------------------------------------------------------------------------------------------------------------------------------------------------------------------------------------------------------------------------------------+-----------------------+-----------------------+
| +------------------------------------------------------------------------+---------------------------+-----------------------+                                                                                                                                                                                                                                                                                                                                                                          |                       |                       |
| | Inicio | Búsqueda | Siglas y bibliografía | Créditos | Más información | (consulta las cajas 1-11) |    [ES]               |                                                                                                                                                                                                                                                                                                                                                                          |                       |                       |
| +------------------------------------------------------------------------+---------------------------+-----------------------+                                                                                                                                                                                                                                                                                                                                                                          |                       |                       |
+---------------------------------------------------------------------------------------------------------------------------------------------------------------------------------------------------------------------------------------------------------------------------------------------------------------------------------------------------------------------------------------------------------------------------------------------------------------------------------------------------------+-----------------------+-----------------------+
| Búsqueda rápida                                                                                                                                                                                                                                                                                                                                                                                                                                                                                         |                       |                       |
|                                                                                                                                                                                                                                                                                                                                                                                                                                                                                                         |                       |                       |
| +:-------------------:+-----------------+:----------------------------------------:+----------------:+                                                                                                                                                                                                                                                                                                                                                                                                  |                       |                       |
| | Documento de fecha: |                 | Ubicación física del documento original: | [] [] []        |                                                                                                                                                                                                                                                                                                                                                                                                  |                       |                       |
| |                     |                 |                                          |                 |                                                                                                                                                                                                                                                                                                                                                                                                  |                       |                       |
| | 1595                |                 | Caja 12, exp. 8, ff. 85 fte-85 vta.      |                 |                                                                                                                                                                                                                                                                                                                                                                                                  |                       |                       |
| |                     |                 |                                          |                 |                                                                                                                                                                                                                                                                                                                                                                                                  |                       |                       |
| |                     |                 | Nota(s): Antes ff. 71 fte y vta.         |                 |                                                                                                                                                                                                                                                                                                                                                                                                  |                       |                       |
| +---------------------+-----------------+------------------------------------------+-----------------+                                                                                                                                                                                                                                                                                                                                                                                                  |                       |                       |
|                                                                                                                                                                                                                                                                                                                                                                                                                                                                                                         |                       |                       |
|   ------------- ----------------------------------------------------------------------------------------------------------------------------------------------------------                                                                                                                                                                                                                                                                                                                              |                       |                       |
|   Resumen:      La Justicia e Regimiento de Colima piden al Deán y Cabildo de Valladolid no enviar al bachiller Sebastián de Valderrama, como cura e vicario de la Villa                                                                                                                                                                                                                                                                                                                                |                       |                       |
|   ------------- ----------------------------------------------------------------------------------------------------------------------------------------------------------                                                                                                                                                                                                                                                                                                                              |                       |                       |
|                                                                                                                                                                                                                                                                                                                                                                                                                                                                                                         |                       |                       |
|   ----------------------------------- ----------------------------------------------------------------------------------------------------------------------------------------------------------------------------------------------------------------------------------------------------------------------------------------------------------------------------------------------------------------------------------------------------------------------------------------------------------------- |                       |                       |
|   Contenido:                          Juan Fernández de Tene y Diego Morán, regidores de la Villa de Colima, así como don Fernando Sotelo Montezuma, alcalde mayor de Colima y su Provincia, “dijeron que la Justicia e Regimiento desta Villa despacha a Toribio de Casso, escribano público, con carta para los señores Deán e Cabildo de la Catedral de Valladolid”.                                                                                                                                 |                       |                       |
|                                       El motivo por el que se envía al escribano Toribio de Casso, es a propósito del nombramiento que se extendió al bachiller Sebastián de Valderrama, como cura y vicario de la Villa de Colima.                                                                                                                                                                                                                                                                     |                       |                       |
|                                       Piden alcalde y regidores que, “por la quietud desta Villa e Concejo”, la autoridad eclesiástica retire esta provisión, porque, de seguir en pie la misma, están dispuestos a “apelar ante la Audiencia Metropolitana e seguir la dicha causa por todas instancias”. Según el alcalde mayor y los regidores, la Villa de Colima recuerda todavía lo que el bachiller Valderrama “hizo contra los vecinos desta Villa”, cuando fue vicario de Colima e diezmero.   |                       |                       |
|                                       Testigos: Alonso Rodríguez, el Padre Fray Pablo de Munguía, guardián del Convento de Colima, Juan Ruiz Quintero y Gonzalo López, vecinos de Colima.                                                                                                                                                                                                                                                                                                               |                       |                       |
|                                       Firman: el alcalde mayor don Fernando Sotelo Montezuma, el alférez real García Martínez, y los regidores Juan Fernández de Tene y Diego Morán.                                                                                                                                                                                                                                                                                                                    |                       |                       |
|                                       Escribano ante quien pasó, Cristóbal Hernández de Tene.                                                                                                                                                                                                                                                                                                                                                                                                           |                       |                       |
|                                                                                                                                                                                                                                                                                                                                                                                                                                                                                                         |                       |                       |
|   ----------------------------------- ----------------------------------------------------------------------------------------------------------------------------------------------------------------------------------------------------------------------------------------------------------------------------------------------------------------------------------------------------------------------------------------------------------------------------------------------------------------- |                       |                       |
|                                                                                                                                                                                                                                                                                                                                                                                                                                                                                                         |                       |                       |
|   ---------------------------------------------------------------------------------------------------                                                                                                                                                                                                                                                                                                                                                                                                   |                       |                       |
|    Documento(s) original(es)                                                                                                                                                                                                                                                                                                                                                                                                                                                                            |                       |                       |
|   --------------------------- ------- ------- ------- ------- ------- ------- ------- ------- -------                                                                                                                                                                                                                                                                                                                                                                                                   |                       |                       |
|               []                []                                                                                                                                                                                                                                                                                                                                                                                                                                                                      |                       |                       |
|               85f               85v                                                                                                                                                                                                                                                                                                                                                                                                                                                                     |                       |                       |
|                                                                                                                                                                                                                                                                                                                                                                                                                                                                                                         |                       |                       |
|   ---------------------------------------------------------------------------------------------------                                                                                                                                                                                                                                                                                                                                                                                                   |                       |                       |
+---------------------------------------------------------------------------------------------------------------------------------------------------------------------------------------------------------------------------------------------------------------------------------------------------------------------------------------------------------------------------------------------------------------------------------------------------------------------------------------------------------+-----------------------+-----------------------+
| +----------------------------------------------------------------------------+------------------------------------------------+                                                                                                                                                                                                                                                                                                                                                                         |                       |                       |
| | ISBN 978-607-701-024-1                                                     |   ---- ---- ---- ---- ---- ---- ---- ---- ---- |                                                                                                                                                                                                                                                                                                                                                                         |                       |                       |
| | © Derechos Reservados 2013. Archivo Histórico del Municipio de Colima. [*] |   []        []        []        []        []   |                                                                                                                                                                                                                                                                                                                                                                         |                       |                       |
| |                                                                            |   ---- ---- ---- ---- ---- ---- ---- ---- ---- |                                                                                                                                                                                                                                                                                                                                                                         |                       |                       |
| +----------------------------------------------------------------------------+------------------------------------------------+                                                                                                                                                                                                                                                                                                                                                                         |                       |                       |
| |                                                                            |                                                |                                                                                                                                                                                                                                                                                                                                                                         |                       |                       |
| +----------------------------------------------------------------------------+------------------------------------------------+                                                                                                                                                                                                                                                                                                                                                                         |                       |                       |
+---------------------------------------------------------------------------------------------------------------------------------------------------------------------------------------------------------------------------------------------------------------------------------------------------------------------------------------------------------------------------------------------------------------------------------------------------------------------------------------------------------+-----------------------+-----------------------+

615 visitas
