+-----------------------------------------------------------------------------------------------------------------------------------------------------------------------------------------------------------------------------------------------------------------------------------------------------------------------------------------------------------------------------------------------------------------------------------------------------------------------------------------+-----------------------+-----------------------+
| []                                                                                                                                                                                                                                                                                                                                                                                                                                                                                      |                       |                       |
|                                                                                                                                                                                                                                                                                                                                                                                                                                                                                         |                       |                       |
| +-----------------------------------+:-------------------------------------:+                                                                                                                                                                                                                                                                                                                                                                                                           |                       |                       |
| | []                                | LA VILLA DE COLIMA DE LA NUEVA ESPAÑA |                                                                                                                                                                                                                                                                                                                                                                                                           |                       |                       |
| |                                   | SIGLO XVI                             |                                                                                                                                                                                                                                                                                                                                                                                                           |                       |                       |
| |                                   |                                       |                                                                                                                                                                                                                                                                                                                                                                                                           |                       |                       |
| |                                   | VOLUMEN II      (CAJAS 12-20)         |                                                                                                                                                                                                                                                                                                                                                                                                           |                       |                       |
| +-----------------------------------+---------------------------------------+                                                                                                                                                                                                                                                                                                                                                                                                           |                       |                       |
+-----------------------------------------------------------------------------------------------------------------------------------------------------------------------------------------------------------------------------------------------------------------------------------------------------------------------------------------------------------------------------------------------------------------------------------------------------------------------------------------+-----------------------+-----------------------+
| +------------------------------------------------------------------------+-------------------------------+-----------------------+                                                                                                                                                                                                                                                                                                                                                      |                       |                       |
| | Inicio | Búsqueda | Siglas y bibliografía | Créditos | Más información | Vol. I (1-11) Vol. II (12-20) |    [ES]               |                                                                                                                                                                                                                                                                                                                                                      |                       |                       |
| +------------------------------------------------------------------------+-------------------------------+-----------------------+                                                                                                                                                                                                                                                                                                                                                      |                       |                       |
+-----------------------------------------------------------------------------------------------------------------------------------------------------------------------------------------------------------------------------------------------------------------------------------------------------------------------------------------------------------------------------------------------------------------------------------------------------------------------------------------+-----------------------+-----------------------+
| Búsqueda rápida                                                                                                                                                                                                                                                                                                                                                                                                                                                                         |                       |                       |
|                                                                                                                                                                                                                                                                                                                                                                                                                                                                                         |                       |                       |
| +:-------------------:+-----------------+:----------------------------------------:+----------------:+                                                                                                                                                                                                                                                                                                                                                                                  |                       |                       |
| | Documento de fecha: |                 | Ubicación física del documento original: | [] [] []        |                                                                                                                                                                                                                                                                                                                                                                                  |                       |                       |
| |                     |                 |                                          |                 |                                                                                                                                                                                                                                                                                                                                                                                  |                       |                       |
| | 1595. Junio, 5      |                 | Caja 25, exp. 12, ff. 1-8.^([2])         |                 |                                                                                                                                                                                                                                                                                                                                                                                  |                       |                       |
| +---------------------+-----------------+------------------------------------------+-----------------+                                                                                                                                                                                                                                                                                                                                                                                  |                       |                       |
|                                                                                                                                                                                                                                                                                                                                                                                                                                                                                         |                       |                       |
|   ------------- ------------------------------------------------------------------------------------------------------------------------------------------------                                                                                                                                                                                                                                                                                                                        |                       |                       |
|   Resumen:      Joaquín Jiménez hace presentación de una cédula por la cual Antonio de Velasco le vendía una labor o suerte de tierra en el Valle de Caxitlan.                                                                                                                                                                                                                                                                                                                          |                       |                       |
|   ------------- ------------------------------------------------------------------------------------------------------------------------------------------------                                                                                                                                                                                                                                                                                                                        |                       |                       |
|                                                                                                                                                                                                                                                                                                                                                                                                                                                                                         |                       |                       |
|   ----------------------------------- ------------------------------------------------------------------------------------------------------------------------------------------------------------------------------------------------------------------------------------------------------------------------------------------------------------------------------------------------------------------------------------------------------------------------------------------------- |                       |                       |
|   Contenido:                          Joaquín Jiménez, ante el alcalde ordinario Diego Mejía de la Torre, dijo que el vecino Antonio de Velasco le vendió “una labor o suerte de tierra que es en el Valle de Caxitlan,^([1]) entre Huerta de Alonso Carrillo de Guzmán y Huerta de Alonso García Nomparte, como consta de esta cédula de contrato de que hago presentación, por la cual estaba obligado a hacerme escritura en forma, y sanearme la dicha labor y suerte de tierra”.   |                       |                       |
|                                       Al acudir a la labor, encontró a García Nomparte cultivándolas; pidiéndole que no las sembrase. Éste respondió que tales tierras eran suyas, que había pagado por ellas a Antonio de Velasco 210 pesos en reales “en una libranza en Juan Agustín de la Puerta, que me los debía”.                                                                                                                                                                |                       |                       |
|                                       Joaquín Jiménez, por tanto, pide que Alonso García Nomparte declare si pagó todo o parte a Antonio de Velasco, y a éste, que se halla ausente de la Villa, se le embarguen sus bienes.                                                                                                                                                                                                                                                            |                       |                       |
|                                       La cédula dada por Velasco el 20 de febrero de 1595, y de la cual se hizo presentación, decía:                                                                                                                                                                                                                                                                                                                                                    |                       |                       |
|                                       Cédula de venta                                                                                                                                                                                                                                                                                                                                                                                                                                   |                       |                       |
|                                       “Es verdad que vendí a Joaquín Jiménez [...] unas tierras que son desde adonde llegan las tierras de Alonso Carrillo de Guzmán y Antonio Carrillo, su hermano, hasta la mojonera de las tierras que llaman de Juan Fernández de Ocampo, que al presente son de Alonso García Nomparte.                                                                                                                                                            |                       |                       |
|                                       “Por manera que son en medio de las dichas tierras aquí señaladas en este Valle de Caxitlan.                                                                                                                                                                                                                                                                                                                                                      |                       |                       |
|                                       “Las cuales dichas tierras le vendo según y cómo yo las hube e compré de Martín Ruiz y de Julián de Frías, primeros dueños que fueron de las dichas tierras.                                                                                                                                                                                                                                                                                      |                       |                       |
|                                       “Y me obligo de que cada y cuando que se me pidiere, haga escritura pública”.                                                                                                                                                                                                                                                                                                                                                                     |                       |                       |
|                                       Precio de venta: 210 pesos de oro en reales.                                                                                                                                                                                                                                                                                                                                                                                                      |                       |                       |
|                                       Testigos: Álvaro de Grijalba, Antonio Carrillo de Guzmán y Jerónimo de Ovantes, estantes al presente en este dicho Valle de Caxitlan, quienes firmaron de su mano.                                                                                                                                                                                                                                                                                |                       |                       |
|                                                                                                                                                                                                                                                                                                                                                                                                                                                                                         |                       |                       |
|   ----------------------------------- ------------------------------------------------------------------------------------------------------------------------------------------------------------------------------------------------------------------------------------------------------------------------------------------------------------------------------------------------------------------------------------------------------------------------------------------------- |                       |                       |
|                                                                                                                                                                                                                                                                                                                                                                                                                                                                                         |                       |                       |
| (1) Véase supra, reg° 942. Estas tierras se nombraban Istapa: infra, reg° 950.                                                                                                                                                                                                                                                                                                                                                                                                          |                       |                       |
|                                                                                                                                                                                                                                                                                                                                                                                                                                                                                         |                       |                       |
| (2) Las ff. 3-7, muy deterioradas.                                                                                                                                                                                                                                                                                                                                                                                                                                                      |                       |                       |
|                                                                                                                                                                                                                                                                                                                                                                                                                                                                                         |                       |                       |
|   ---------------------------------------------------------------------------------------------------                                                                                                                                                                                                                                                                                                                                                                                   |                       |                       |
|    Documento(s) original(es)                                                                                                                                                                                                                                                                                                                                                                                                                                                            |                       |                       |
|   --------------------------- ------- ------- ------- ------- ------- ------- ------- ------- -------                                                                                                                                                                                                                                                                                                                                                                                   |                       |                       |
|               []                []      []      []      []      []      []      []      []      []                                                                                                                                                                                                                                                                                                                                                                                      |                       |                       |
|               1f                1v      2f      3f      4f      5f      5v      6f      7f      7v                                                                                                                                                                                                                                                                                                                                                                                      |                       |                       |
|                                                                                                                                                                                                                                                                                                                                                                                                                                                                                         |                       |                       |
|               []                                                                                                                                                                                                                                                                                                                                                                                                                                                                        |                       |                       |
|               8f                                                                                                                                                                                                                                                                                                                                                                                                                                                                        |                       |                       |
|   ---------------------------------------------------------------------------------------------------                                                                                                                                                                                                                                                                                                                                                                                   |                       |                       |
+-----------------------------------------------------------------------------------------------------------------------------------------------------------------------------------------------------------------------------------------------------------------------------------------------------------------------------------------------------------------------------------------------------------------------------------------------------------------------------------------+-----------------------+-----------------------+
| +----------------------------------------------------------------------------+-----------------------------------------------:+                                                                                                                                                                                                                                                                                                                                                         |                       |                       |
| | ISBN 978-607-701-024-1                                                     |   ---- ---- ---- ---- ---- ---- ---- ---- ---- |                                                                                                                                                                                                                                                                                                                                                         |                       |                       |
| | © Derechos Reservados 2013. Archivo Histórico del Municipio de Colima. [*] |   []        []        []        []        []   |                                                                                                                                                                                                                                                                                                                                                         |                       |                       |
| |                                                                            |   ---- ---- ---- ---- ---- ---- ---- ---- ---- |                                                                                                                                                                                                                                                                                                                                                         |                       |                       |
| +----------------------------------------------------------------------------+------------------------------------------------+                                                                                                                                                                                                                                                                                                                                                         |                       |                       |
| |                                                                            |                                                |                                                                                                                                                                                                                                                                                                                                                         |                       |                       |
| +----------------------------------------------------------------------------+------------------------------------------------+                                                                                                                                                                                                                                                                                                                                                         |                       |                       |
+-----------------------------------------------------------------------------------------------------------------------------------------------------------------------------------------------------------------------------------------------------------------------------------------------------------------------------------------------------------------------------------------------------------------------------------------------------------------------------------------+-----------------------+-----------------------+

636 visitas
