+---------------------------------------------------------------------------------------------------------------------------------------------------------------------------------------------------------------------------------------------------------------------------------------------------------------------------------------------------------------------------------------------------------------+-----------------------+-----------------------+
| []                                                                                                                                                                                                                                                                                                                                                                                                            |                       |                       |
|                                                                                                                                                                                                                                                                                                                                                                                                               |                       |                       |
| +-----------------------------------+:-------------------------------------:+                                                                                                                                                                                                                                                                                                                                 |                       |                       |
| | []                                | LA VILLA DE COLIMA DE LA NUEVA ESPAÑA |                                                                                                                                                                                                                                                                                                                                 |                       |                       |
| |                                   | SIGLO XVI                             |                                                                                                                                                                                                                                                                                                                                 |                       |                       |
| |                                   |                                       |                                                                                                                                                                                                                                                                                                                                 |                       |                       |
| |                                   | VOLUMEN II      (CAJAS 12-20)         |                                                                                                                                                                                                                                                                                                                                 |                       |                       |
| +-----------------------------------+---------------------------------------+                                                                                                                                                                                                                                                                                                                                 |                       |                       |
+---------------------------------------------------------------------------------------------------------------------------------------------------------------------------------------------------------------------------------------------------------------------------------------------------------------------------------------------------------------------------------------------------------------+-----------------------+-----------------------+
| +------------------------------------------------------------------------+-------------------------------+-----------------------+                                                                                                                                                                                                                                                                            |                       |                       |
| | Inicio | Búsqueda | Siglas y bibliografía | Créditos | Más información | Vol. I (1-11) Vol. II (12-20) |    [ES]               |                                                                                                                                                                                                                                                                            |                       |                       |
| +------------------------------------------------------------------------+-------------------------------+-----------------------+                                                                                                                                                                                                                                                                            |                       |                       |
+---------------------------------------------------------------------------------------------------------------------------------------------------------------------------------------------------------------------------------------------------------------------------------------------------------------------------------------------------------------------------------------------------------------+-----------------------+-----------------------+
| Búsqueda rápida                                                                                                                                                                                                                                                                                                                                                                                               |                       |                       |
|                                                                                                                                                                                                                                                                                                                                                                                                               |                       |                       |
| +:-------------------:+-----------------+:----------------------------------------:+----------------:+                                                                                                                                                                                                                                                                                                        |                       |                       |
| | Documento de fecha: |                 | Ubicación física del documento original: | [] [] []        |                                                                                                                                                                                                                                                                                                        |                       |                       |
| |                     |                 |                                          |                 |                                                                                                                                                                                                                                                                                                        |                       |                       |
| | 1584. Enero, 26     |                 | Caja 23, exp. 26, 1 f.                   |                 |                                                                                                                                                                                                                                                                                                        |                       |                       |
| +---------------------+-----------------+------------------------------------------+-----------------+                                                                                                                                                                                                                                                                                                        |                       |                       |
|                                                                                                                                                                                                                                                                                                                                                                                                               |                       |                       |
|   ------------- ----------------------------------------------------------------------------------------------------------------------------------------------------------                                                                                                                                                                                                                                    |                       |                       |
|   Resumen:      Diego de Monroy que había comprado las huertas de cacao y las casas que fueron de Juana de Medina, contra Juan de Velasco que reclama cantidad de pesos.                                                                                                                                                                                                                                      |                       |                       |
|   ------------- ----------------------------------------------------------------------------------------------------------------------------------------------------------                                                                                                                                                                                                                                    |                       |                       |
|                                                                                                                                                                                                                                                                                                                                                                                                               |                       |                       |
|   ----------------------------------- ----------------------------------------------------------------------------------------------------------------------------------------------------------------------------------------------------------------------------------------------------------------------------------------------------------------------------------------------------------------------- |                       |                       |
|   Contenido:                          Diego de Monroy dijo ante el alcalde ordinario de la Villa de Colima Cristóbal de Solórzano, haber comprado las huertas de cacao^([1]) y casas de la morada que quedaron por fin y muerte de Juana de Medina, vecina que fue de Colima.                                                                                                                                 |                       |                       |
|                                       Ahora -dice-, Juan de Velasco pretende cobrar de los dichos bienes 1,000 pesos de oro común que, por testamento, Diego de Velasco, marido que fue de la susodicha, le quedó debiendo. Sin embargo, ésta por su mandado ya pagó a Juan de Velasco 620 pesos en un negro^([2]) y ciertas mulas, de que los susodichos otorgaron carta de venta ante Baltasar de Alcalá.   |                       |                       |
|                                       Pide que el escribano le dé traslado de dicha escritura y cartas de pago.                                                                                                                                                                                                                                                                                               |                       |                       |
|                                                                                                                                                                                                                                                                                                                                                                                                               |                       |                       |
|   ----------------------------------- ----------------------------------------------------------------------------------------------------------------------------------------------------------------------------------------------------------------------------------------------------------------------------------------------------------------------------------------------------------------------- |                       |                       |
|                                                                                                                                                                                                                                                                                                                                                                                                               |                       |                       |
| (1) Es probable que se refiera a las huertas situadas en Aguacatitlan, en la provincia de Tepetitango: Romero de Solís, Los pueblos de Colima… (2015).                                                                                                                                                                                                                                                        |                       |                       |
|                                                                                                                                                                                                                                                                                                                                                                                                               |                       |                       |
| (2) No se dice su nombre y como “negro” lo tenemos registrado, en: Romero de Solís, Padrón de negros… (2007), 16, n° 179.                                                                                                                                                                                                                                                                                     |                       |                       |
|                                                                                                                                                                                                                                                                                                                                                                                                               |                       |                       |
|   ---------------------------------------------------------------------------------------------------                                                                                                                                                                                                                                                                                                         |                       |                       |
|    Documento(s) original(es)                                                                                                                                                                                                                                                                                                                                                                                  |                       |                       |
|   --------------------------- ------- ------- ------- ------- ------- ------- ------- ------- -------                                                                                                                                                                                                                                                                                                         |                       |                       |
|               []                []                                                                                                                                                                                                                                                                                                                                                                            |                       |                       |
|               1f                1v                                                                                                                                                                                                                                                                                                                                                                            |                       |                       |
|                                                                                                                                                                                                                                                                                                                                                                                                               |                       |                       |
|   ---------------------------------------------------------------------------------------------------                                                                                                                                                                                                                                                                                                         |                       |                       |
+---------------------------------------------------------------------------------------------------------------------------------------------------------------------------------------------------------------------------------------------------------------------------------------------------------------------------------------------------------------------------------------------------------------+-----------------------+-----------------------+
| +----------------------------------------------------------------------------+-----------------------------------------------:+                                                                                                                                                                                                                                                                               |                       |                       |
| | ISBN 978-607-701-024-1                                                     |   ---- ---- ---- ---- ---- ---- ---- ---- ---- |                                                                                                                                                                                                                                                                               |                       |                       |
| | © Derechos Reservados 2013. Archivo Histórico del Municipio de Colima. [*] |   []        []        []        []        []   |                                                                                                                                                                                                                                                                               |                       |                       |
| |                                                                            |   ---- ---- ---- ---- ---- ---- ---- ---- ---- |                                                                                                                                                                                                                                                                               |                       |                       |
| +----------------------------------------------------------------------------+------------------------------------------------+                                                                                                                                                                                                                                                                               |                       |                       |
| |                                                                            |                                                |                                                                                                                                                                                                                                                                               |                       |                       |
| +----------------------------------------------------------------------------+------------------------------------------------+                                                                                                                                                                                                                                                                               |                       |                       |
+---------------------------------------------------------------------------------------------------------------------------------------------------------------------------------------------------------------------------------------------------------------------------------------------------------------------------------------------------------------------------------------------------------------+-----------------------+-----------------------+

636 visitas
