+----------------------------------------------------------------------------------------------------------------------------------------------------------------------------------------------------------------------------------------------------------------------------------------------------------------------------------------+---------------------------------------+-----------------------+
| []                                                                                                                                                                                                                                                                                                                                     | LA VILLA DE COLIMA DE LA NUEVA ESPAÑA | []                    |
|                                                                                                                                                                                                                                                                                                                                        | SIGLO XVI                             |                       |
|                                                                                                                                                                                                                                                                                                                                        |                                       |                       |
|                                                                                                                                                                                                                                                                                                                                        | VOLUMEN I      (CAJAS 1-11)           |                       |
+----------------------------------------------------------------------------------------------------------------------------------------------------------------------------------------------------------------------------------------------------------------------------------------------------------------------------------------+---------------------------------------+-----------------------+
| Inicio | Búsquedas | Siglas y bibliografía | Cartografía | Créditos | Más información                                                                                                                                                                                                                                                  |                                       | []                    |
+----------------------------------------------------------------------------------------------------------------------------------------------------------------------------------------------------------------------------------------------------------------------------------------------------------------------------------------+---------------------------------------+-----------------------+
| Búsqueda rápida                                                                                                                                                                                                                                                                                                                        |                                       |                       |
|                                                                                                                                                                                                                                                                                                                                        |                                       |                       |
| +:--------------------------------------------------------------------------------------------------------------------------------------------------------------------------------------------------------------------------------------------------------------------------------------:+------------------------------------------:+ |                                       |                       |
| | Fecha:                                                                                                                                                                                                                                                                                 | Ubicación física del documento original:  | |                                       |                       |
| | 1568 Mayo, 14                                                                                                                                                                                                                                                                          | CAJA A-5, EXP. 13, F. 23 FTE.             | |                                       |                       |
| |                                                                                                                                                                                                                                                                                        | Archivo Histórico del Municipio de Colima | |                                       |                       |
| +----------------------------------------------------------------------------------------------------------------------------------------------------------------------------------------------------------------------------------------------------------------------------------------+-------------------------------------------+ |                                       |                       |
| | 159. 1568. Mayo, 14.                                                                                                                                                                                                                                                                   |                                           | |                                       |                       |
| |                                                                                                                                                                                                                                                                                        |                                           | |                                       |                       |
| | Remate de los tributos del pueblo de Tepetitango.                                                                                                                                                                                                                                      |                                           | |                                       |                       |
| |                                                                                                                                                                                                                                                                                        |                                           | |                                       |                       |
| | El corregidor del pueblo de Tepetitango, Juan Fernández Ladrillero, pide ante el alcalde mayor licenciado Juan de Hoyos y de Bernaldino Cola que salieran en almoneda pública 10 mantas y 27 hanegas de maíz, que son obligados a dar a Su Majestad los indios del dicho pueblo.^([1]) |                                           | |                                       |                       |
| |                                                                                                                                                                                                                                                                                        |                                           | |                                       |                       |
| | Después de los pregones, Cristóbal de Silva puso a 3 pesos y medio cada manta y a 4 reales la hanega de maíz. El remate le fue adjudicado, siendo testigos Juan Fernández de Ocampo, Melchor Pérez y Álvaro de Grijalba.                                                               |                                           | |                                       |                       |
| |                                                                                                                                                                                                                                                                                        |                                           | |                                       |                       |
| | Pasó ante Juan Vázquez.                                                                                                                                                                                                                                                                |                                           | |                                       |                       |
| |                                                                                                                                                                                                                                                                                        |                                           | |                                       |                       |
| | Caja A–5, exp. 13, f. 23 fte.                                                                                                                                                                                                                                                          |                                           | |                                       |                       |
| |                                                                                                                                                                                                                                                                                        |                                           | |                                       |                       |
| |                                                                                                                                                                                                                                                                                        |                                           | |                                       |                       |
| |                                                                                                                                                                                                                                                                                        |                                           | |                                       |                       |
| | ---------------                                                                                                                                                                                                                                                                        |                                           | |                                       |                       |
| |                                                                                                                                                                                                                                                                                        |                                           | |                                       |                       |
| | (1) Al margen aparece una nota que dice: "Son [estos tributos] del año pasado de 67 años [1567], que cumplió a 18 de abril deste" [1568]. Ya hemos dado noticias de este pueblo: supra, regº 144.                                                                                      |                                           | |                                       |                       |
| +----------------------------------------------------------------------------------------------------------------------------------------------------------------------------------------------------------------------------------------------------------------------------------------+-------------------------------------------+ |                                       |                       |
|                                                                                                                                                                                                                                                                                                                                        |                                       |                       |
|   ---------------------------------------------------------------------------------------------------                                                                                                                                                                                                                                  |                                       |                       |
|    Documento(s) original(es)                                                                                                                                                                                                                                                                                                           |                                       |                       |
|   --------------------------- ------- ------- ------- ------- ------- ------- ------- ------- -------                                                                                                                                                                                                                                  |                                       |                       |
|               []                                                                                                                                                                                                                                                                                                                       |                                       |                       |
|               23F                                                                                                                                                                                                                                                                                                                      |                                       |                       |
|                                                                                                                                                                                                                                                                                                                                        |                                       |                       |
|   ---------------------------------------------------------------------------------------------------                                                                                                                                                                                                                                  |                                       |                       |
+----------------------------------------------------------------------------------------------------------------------------------------------------------------------------------------------------------------------------------------------------------------------------------------------------------------------------------------+---------------------------------------+-----------------------+
| Proyecto interinstitucional del Archivo Histórico del Municipio de Colima y la Universidad de Colima,                                                                                                                                                                                                                                  |                                       |                       |
| realizado bajo los auspicios del fondo Ramón Álvarez-Buylla de Aldana.                                                                                                                                                                                                                                                                 |                                       |                       |
|                                                                                                                                                                                                                                                                                                                                        |                                       |                       |
| ------------------------------------------------------------------------                                                                                                                                                                                                                                                               |                                       |                       |
|                                                                                                                                                                                                                                                                                                                                        |                                       |                       |
| ISBN 978-968-7412-85-6                                                                                                                                                                                                                                                                                                                 |                                       |                       |
| ® Derechos Reservados 2008. Archivo Histórico del Municipio de Colima.                                                                                                                                                                                                                                                                 |                                       |                       |
+----------------------------------------------------------------------------------------------------------------------------------------------------------------------------------------------------------------------------------------------------------------------------------------------------------------------------------------+---------------------------------------+-----------------------+

1,078 visitas
