[]

LA VILLA DE COLIMA DE LA NUEVA ESPAÑA
SIGLO XVI

VOLUMEN I      (CAJAS 1-11)

[]

Inicio | Búsquedas | Siglas y bibliografía | Cartografía | Créditos | Más información

[]

Búsqueda rápida

+:---------------------------------------------------------------------------------------------------------------------------------------------------------------------------------------------------------------------------------------------------------------------------------------------------------------------------------------------------------------------------------------------------------------------------------------------------------------------------------------------------------------------------------------------------------------------------------------------------------------------------------------------------------------------------------------------------------------------------------------------------------------------------------------------------------------------------------------------------------------------------------------------------------------------------------------------------------------------------------------------------------------------------------------------------------------------------------------------------------------------------------------------------------------------------------------------------------------------------------------------------------------------------------------------------------------------------------------------------------------------------------------------------------------------------------------------------------:+------------------------------------------:+
| Fecha:                                                                                                                                                                                                                                                                                                                                                                                                                                                                                                                                                                                                                                                                                                                                                                                                                                                                                                                                                                                                                                                                                                                                                                                                                                                                                                                                                                                                                                                    | Ubicación física del documento original:  |
| 1566 Febrero, 12                                                                                                                                                                                                                                                                                                                                                                                                                                                                                                                                                                                                                                                                                                                                                                                                                                                                                                                                                                                                                                                                                                                                                                                                                                                                                                                                                                                                                                          | CAJA A-5, EXP. 7, 11 FF. [TRUNCO].        |
|                                                                                                                                                                                                                                                                                                                                                                                                                                                                                                                                                                                                                                                                                                                                                                                                                                                                                                                                                                                                                                                                                                                                                                                                                                                                                                                                                                                                                                                           | Archivo Histórico del Municipio de Colima |
+-----------------------------------------------------------------------------------------------------------------------------------------------------------------------------------------------------------------------------------------------------------------------------------------------------------------------------------------------------------------------------------------------------------------------------------------------------------------------------------------------------------------------------------------------------------------------------------------------------------------------------------------------------------------------------------------------------------------------------------------------------------------------------------------------------------------------------------------------------------------------------------------------------------------------------------------------------------------------------------------------------------------------------------------------------------------------------------------------------------------------------------------------------------------------------------------------------------------------------------------------------------------------------------------------------------------------------------------------------------------------------------------------------------------------------------------------------------+-------------------------------------------+
| 121. 1566. Febrero, 12.                                                                                                                                                                                                                                                                                                                                                                                                                                                                                                                                                                                                                                                                                                                                                                                                                                                                                                                                                                                                                                                                                                                                                                                                                                                                                                                                                                                                                                   |                                           |
|                                                                                                                                                                                                                                                                                                                                                                                                                                                                                                                                                                                                                                                                                                                                                                                                                                                                                                                                                                                                                                                                                                                                                                                                                                                                                                                                                                                                                                                           |                                           |
| Juan de Iniesta, con poder de Alonso Miguel, reclama de Diego de Velasco, fiador de Pedro Dávila Quiñones, no haber dado un burro por una jaca según concierto firmado entre ellos.                                                                                                                                                                                                                                                                                                                                                                                                                                                                                                                                                                                                                                                                                                                                                                                                                                                                                                                                                                                                                                                                                                                                                                                                                                                                       |                                           |
|                                                                                                                                                                                                                                                                                                                                                                                                                                                                                                                                                                                                                                                                                                                                                                                                                                                                                                                                                                                                                                                                                                                                                                                                                                                                                                                                                                                                                                                           |                                           |
| Ante Alonso Sánchez de Figueroa, juez de residencia, el vecino Juan de Iniesta en nombre de Alonso Miguel, dice que "siendo alcalde mayor Pedro Dávila Quiñones hizo cierto contrato con el dicho mi parte, en que quedó de dar un burro de año y medio por una jaca hovera que el dicho mi parte le dio y era obligado a dársele en esta Villa dentro de cierto término, como consta por una cédula firmada de su nombre, de que hago presentación".                                                                                                                                                                                                                                                                                                                                                                                                                                                                                                                                                                                                                                                                                                                                                                                                                                                                                                                                                                                                     |                                           |
|                                                                                                                                                                                                                                                                                                                                                                                                                                                                                                                                                                                                                                                                                                                                                                                                                                                                                                                                                                                                                                                                                                                                                                                                                                                                                                                                                                                                                                                           |                                           |
| Llegado el término del plazo, Alonso Miguel pidió a Dávila Quiñones que cumpliese con el contrato o devolviese la jaca, pero éste no se la quiso dar, antes la envió a su pueblo, que está fuera de esta Provincia, "por lo que parece se quiso alzar con la hacienda del dicho mi parte, y después hizo con Diego de Velasco, su fiador, se obligase por la dicha jaca y darme el dicho burro dentro de cierto término juntamente con él un Alonso de las Casas. Todo lo cual constará por esta cédula de que asimismo hago presentación".                                                                                                                                                                                                                                                                                                                                                                                                                                                                                                                                                                                                                                                                                                                                                                                                                                                                                                               |                                           |
|                                                                                                                                                                                                                                                                                                                                                                                                                                                                                                                                                                                                                                                                                                                                                                                                                                                                                                                                                                                                                                                                                                                                                                                                                                                                                                                                                                                                                                                           |                                           |
| Tampoco en esta ocasión, agrega Iniesta, dieron "el dicho burro como eran obligados dentro del dicho término". Por tanto, se pide al juez de residencia "mande al dicho Diego de Velasco que luego dé y entregue el dicho burro o quinientos pesos", porque éste fue el precio por el que se dio la jaca.                                                                                                                                                                                                                                                                                                                                                                                                                                                                                                                                                                                                                                                                                                                                                                                                                                                                                                                                                                                                                                                                                                                                                 |                                           |
|                                                                                                                                                                                                                                                                                                                                                                                                                                                                                                                                                                                                                                                                                                                                                                                                                                                                                                                                                                                                                                                                                                                                                                                                                                                                                                                                                                                                                                                           |                                           |
| Juan de Iniesta hizo presentación del poder otorgado por Alonso Miguel ante el escribano Miguel Rodríguez y fechado en la Villa de Colima el 7 de enero de 1566, del cual fueron testigos Francisco Toscano, Juan Griego y Álvaro de Grijalba, vecinos de Colima.                                                                                                                                                                                                                                                                                                                                                                                                                                                                                                                                                                                                                                                                                                                                                                                                                                                                                                                                                                                                                                                                                                                                                                                         |                                           |
|                                                                                                                                                                                                                                                                                                                                                                                                                                                                                                                                                                                                                                                                                                                                                                                                                                                                                                                                                                                                                                                                                                                                                                                                                                                                                                                                                                                                                                                           |                                           |
| Diego de Velasco fue notificado por el escribano Baltasar de Alcalá, siendo testigos Pedro de Bobadilla, Diego Pinzón y Suero Vázquez, estantes en esta Villa.                                                                                                                                                                                                                                                                                                                                                                                                                                                                                                                                                                                                                                                                                                                                                                                                                                                                                                                                                                                                                                                                                                                                                                                                                                                                                            |                                           |
|                                                                                                                                                                                                                                                                                                                                                                                                                                                                                                                                                                                                                                                                                                                                                                                                                                                                                                                                                                                                                                                                                                                                                                                                                                                                                                                                                                                                                                                           |                                           |
| El 17 de febrero, por nuevo escrito, Juan de Iniesta decía que habiendo sido notificado Diego de Velasco de su demanda, no ha respondido en el término obligado, por lo que él le acusa la rebeldía y pide que el juez determine la causa. El día 20 respondió Diego de Velasco: "niego la demanda en todo y por todo como en ella se contiene", y anunciaba su alegato en el término de la ley. El 27 de febrero, "Diego de Velasco en la causa que contra mí trata Alonso de Miguel sobre el burro que me pide, digo que yo tengo negada la demanda", por cuanto "esta causa no es caso de residencia y es demanda real y como tal se ha de seguir". Dice que "por V.m. me fue mandado que para la primera audiencia respondiese y concluyese y de derecho tengo veinte días después de la negativa de la demanda para alegar mis defensiones y ofensiones conforme a la ley y conforme a esto, no soy obligado a responder".                                                                                                                                                                                                                                                                                                                                                                                                                                                                                                                           |                                           |
|                                                                                                                                                                                                                                                                                                                                                                                                                                                                                                                                                                                                                                                                                                                                                                                                                                                                                                                                                                                                                                                                                                                                                                                                                                                                                                                                                                                                                                                           |                                           |
| El alcalde mayor Alonso Sánchez de Figueroa, el 11 de marzo, dio y pronunció sentencia de prueba, siendo testigos de la misma Pedro de Bobadilla, Juan Fernández Ladrillero y Diego Pinzón, vecinos de Colima.                                                                                                                                                                                                                                                                                                                                                                                                                                                                                                                                                                                                                                                                                                                                                                                                                                                                                                                                                                                                                                                                                                                                                                                                                                            |                                           |
|                                                                                                                                                                                                                                                                                                                                                                                                                                                                                                                                                                                                                                                                                                                                                                                                                                                                                                                                                                                                                                                                                                                                                                                                                                                                                                                                                                                                                                                           |                                           |
| El 24 de marzo, Juan de Iniesta hizo presentación del interrogatorio según el cual quería que fueran examinados los testigos.                                                                                                                                                                                                                                                                                                                                                                                                                                                                                                                                                                                                                                                                                                                                                                                                                                                                                                                                                                                                                                                                                                                                                                                                                                                                                                                             |                                           |
|                                                                                                                                                                                                                                                                                                                                                                                                                                                                                                                                                                                                                                                                                                                                                                                                                                                                                                                                                                                                                                                                                                                                                                                                                                                                                                                                                                                                                                                           |                                           |
| Interrogatorio                                                                                                                                                                                                                                                                                                                                                                                                                                                                                                                                                                                                                                                                                                                                                                                                                                                                                                                                                                                                                                                                                                                                                                                                                                                                                                                                                                                                                                            |                                           |
|                                                                                                                                                                                                                                                                                                                                                                                                                                                                                                                                                                                                                                                                                                                                                                                                                                                                                                                                                                                                                                                                                                                                                                                                                                                                                                                                                                                                                                                           |                                           |
| Se pregunta "si saben que el dicho mi parte tenía e poseía por suya una jaca hovera, y en el tiempo que la poseyó se la llegaron a comprar muchas personas, y al dicho mi parte le daban por ella más de trecientos pesos y no la quería dar, diciendo que si no le daban un negro o su valor no la daría. Digan lo que saben.                                                                                                                                                                                                                                                                                                                                                                                                                                                                                                                                                                                                                                                                                                                                                                                                                                                                                                                                                                                                                                                                                                                            |                                           |
|                                                                                                                                                                                                                                                                                                                                                                                                                                                                                                                                                                                                                                                                                                                                                                                                                                                                                                                                                                                                                                                                                                                                                                                                                                                                                                                                                                                                                                                           |                                           |
| "Iten si saben que el valor de la dicha jaca era mucho más de lo que así le daban, hasta cantidad de quinientos pesos, por ser buena. Digan lo que saben.                                                                                                                                                                                                                                                                                                                                                                                                                                                                                                                                                                                                                                                                                                                                                                                                                                                                                                                                                                                                                                                                                                                                                                                                                                                                                                 |                                           |
|                                                                                                                                                                                                                                                                                                                                                                                                                                                                                                                                                                                                                                                                                                                                                                                                                                                                                                                                                                                                                                                                                                                                                                                                                                                                                                                                                                                                                                                           |                                           |
| "Iten si saben que el dicho mi parte vendió la dicha jaca al dicho Pedro Dávila prometiéndole de le dar un muy buen burro y para ello se obligó Diego de Velasco".                                                                                                                                                                                                                                                                                                                                                                                                                                                                                                                                                                                                                                                                                                                                                                                                                                                                                                                                                                                                                                                                                                                                                                                                                                                                                        |                                           |
|                                                                                                                                                                                                                                                                                                                                                                                                                                                                                                                                                                                                                                                                                                                                                                                                                                                                                                                                                                                                                                                                                                                                                                                                                                                                                                                                                                                                                                                           |                                           |
| Se pregunta también si saben que de haber sido dado el burro dentro del plazo fijado en el concierto, hubiera podido fundar una estancia por cuanto tenía "cincuenta yeguas recogidas" para echárselas al burro, lo que no se pudo, y de haberse cumplido "valiera el dicho ganado con la dicha estancia más de mil pesos; digan lo que saben".                                                                                                                                                                                                                                                                                                                                                                                                                                                                                                                                                                                                                                                                                                                                                                                                                                                                                                                                                                                                                                                                                                           |                                           |
|                                                                                                                                                                                                                                                                                                                                                                                                                                                                                                                                                                                                                                                                                                                                                                                                                                                                                                                                                                                                                                                                                                                                                                                                                                                                                                                                                                                                                                                           |                                           |
| Los testigos presentados para la probanza de Alonso Miguel fueron Juan Preciado, el alguacil Antonio de Carvajal y Álvaro de Grijalba.                                                                                                                                                                                                                                                                                                                                                                                                                                                                                                                                                                                                                                                                                                                                                                                                                                                                                                                                                                                                                                                                                                                                                                                                                                                                                                                    |                                           |
|                                                                                                                                                                                                                                                                                                                                                                                                                                                                                                                                                                                                                                                                                                                                                                                                                                                                                                                                                                                                                                                                                                                                                                                                                                                                                                                                                                                                                                                           |                                           |
| Juan Preciado, de 30 años de edad, dijo conocer las partes de ocho años atrás. Agregó que vio la mencionada jaca en poder de Alonso Miguel, quien la poseía y se servía de ella como de cosa propia y que sabe que algunas personas se la quisieron comprar pero que Alonso Miguel "no la quería vender, antes decía que no la había de vender sino fuese por un negro, y a este testigo selo dijo muchas veces que si no le daban un negro o su valor no la había de dar porque la dicha jaca era muy buena, y corría y paraba muy bien". Dice también que "todos a una mano decían que era muy buena y que valía todo dinero, y este testigo lo oía decir públicamente a los vecinos". Agrega que "a este testigo le parece que para un señor o para un caballero" pudiera valer mucho porque "era una bestia" pequeña y bien hecha.^([1]) Dice además que Alonso Miguel se la entregó a Pedro Dávila, "porque este testigo fue el tercero y lo concertó". Opina que si Dávila Quiñones hubiera entregado el burro a tiempo, Alonso Miguel pudiera "tener crías de él que valieran dineros, y que el dicho Alonso Miguel tenía yeguas recogidas esperando el dicho asno para echárselas y hacer cría dellas, y fundar una estancia que le hubiera valido muchos dineros, y que este testigo, por no le haber enviado el dicho burro, ha oído decir que se le han huido todas las yeguas que tenía juntas, en lo que ha recibido gran daño y perjuicio". |                                           |
|                                                                                                                                                                                                                                                                                                                                                                                                                                                                                                                                                                                                                                                                                                                                                                                                                                                                                                                                                                                                                                                                                                                                                                                                                                                                                                                                                                                                                                                           |                                           |
| El alguacil Carvajal en su declaración dice tener más de 30 años y de haber sido una de las personas que quiso comprar la jaca a Alonso Miguel, y "especialmente fue por testigo del Bachiller Martínez que le daba por ella trecientos pesos de tipuzque" que pagaría al contado y en reales, pero que Alonso Miguel contestó que no la vendería si no le daban por ella un negro. Sobre la estampa de la jaca comenta que era "hovera y muy linda y valía mucho dinero". Opina que si Dávila Quiñones le hubiera entregado el burro a su tiempo, Alonso Miguel "hubiera hecho buena hacienda porque este testigo vido que tenía muchas yeguas mansas recogidas para echallas el dicho burro", y que ahora "se le han huido todas", perdiendo muchos dineros "porque hubiera poblado una estancia que para ello tenía".                                                                                                                                                                                                                                                                                                                                                                                                                                                                                                                                                                                                                                  |                                           |
|                                                                                                                                                                                                                                                                                                                                                                                                                                                                                                                                                                                                                                                                                                                                                                                                                                                                                                                                                                                                                                                                                                                                                                                                                                                                                                                                                                                                                                                           |                                           |
| Álvaro de Grijalba dijo tener más de 25 años y no ser pariente ni enemigo de ninguna de las partes. Dice que Alonso Miguel tenía por suya aquella jaca, y que "publicaba el dicho Alonso Miguel que si no le daban un negro o su valor por ella, que no la había de vender a ninguna persona", porque "la dicha jaca era muy buena y valía mucho dinero, pero que este testigo no sabe qué cantidad podía valer".^([2])                                                                                                                                                                                                                                                                                                                                                                                                                                                                                                                                                                                                                                                                                                                                                                                                                                                                                                                                                                                                                                   |                                           |
|                                                                                                                                                                                                                                                                                                                                                                                                                                                                                                                                                                                                                                                                                                                                                                                                                                                                                                                                                                                                                                                                                                                                                                                                                                                                                                                                                                                                                                                           |                                           |
| Caja A–5, exp. 7, 11 ff. [Trunco].                                                                                                                                                                                                                                                                                                                                                                                                                                                                                                                                                                                                                                                                                                                                                                                                                                                                                                                                                                                                                                                                                                                                                                                                                                                                                                                                                                                                                        |                                           |
|                                                                                                                                                                                                                                                                                                                                                                                                                                                                                                                                                                                                                                                                                                                                                                                                                                                                                                                                                                                                                                                                                                                                                                                                                                                                                                                                                                                                                                                           |                                           |
|                                                                                                                                                                                                                                                                                                                                                                                                                                                                                                                                                                                                                                                                                                                                                                                                                                                                                                                                                                                                                                                                                                                                                                                                                                                                                                                                                                                                                                                           |                                           |
|                                                                                                                                                                                                                                                                                                                                                                                                                                                                                                                                                                                                                                                                                                                                                                                                                                                                                                                                                                                                                                                                                                                                                                                                                                                                                                                                                                                                                                                           |                                           |
| ---------------                                                                                                                                                                                                                                                                                                                                                                                                                                                                                                                                                                                                                                                                                                                                                                                                                                                                                                                                                                                                                                                                                                                                                                                                                                                                                                                                                                                                                                           |                                           |
|                                                                                                                                                                                                                                                                                                                                                                                                                                                                                                                                                                                                                                                                                                                                                                                                                                                                                                                                                                                                                                                                                                                                                                                                                                                                                                                                                                                                                                                           |                                           |
| (1) Aquí las fojas están deterioradas, dificultando la lectura completa de la declaración del testigo.                                                                                                                                                                                                                                                                                                                                                                                                                                                                                                                                                                                                                                                                                                                                                                                                                                                                                                                                                                                                                                                                                                                                                                                                                                                                                                                                                    |                                           |
|                                                                                                                                                                                                                                                                                                                                                                                                                                                                                                                                                                                                                                                                                                                                                                                                                                                                                                                                                                                                                                                                                                                                                                                                                                                                                                                                                                                                                                                           |                                           |
| (2) El expediente que está trunco, aquí concluye.                                                                                                                                                                                                                                                                                                                                                                                                                                                                                                                                                                                                                                                                                                                                                                                                                                                                                                                                                                                                                                                                                                                                                                                                                                                                                                                                                                                                         |                                           |
+-----------------------------------------------------------------------------------------------------------------------------------------------------------------------------------------------------------------------------------------------------------------------------------------------------------------------------------------------------------------------------------------------------------------------------------------------------------------------------------------------------------------------------------------------------------------------------------------------------------------------------------------------------------------------------------------------------------------------------------------------------------------------------------------------------------------------------------------------------------------------------------------------------------------------------------------------------------------------------------------------------------------------------------------------------------------------------------------------------------------------------------------------------------------------------------------------------------------------------------------------------------------------------------------------------------------------------------------------------------------------------------------------------------------------------------------------------------+-------------------------------------------+

Documento(s) original(es)

Archivo no encontrado (CAJAS/CAJA5/EXP7/002F.jpg)

Archivo no encontrado (CAJAS/CAJA5/EXP7/002V.jpg)

Archivo no encontrado (CAJAS/CAJA5/EXP7/005V.jpg)

Archivo no encontrado (CAJAS/CAJA5/EXP7/006V.jpg)

Archivo no encontrado (CAJAS/CAJA5/EXP7/008V.jpg)

[]
1F

[]
1V

[]
3F

[]
3V

[]
4F

[]
4V

[]
5F

[]
6F

[]
7F

[]
7V

[]
8F

[]
9F

[]
9V

[]
10F

[]
10V

[]
11F

[]
11V

Proyecto interinstitucional del Archivo Histórico del Municipio de Colima y la Universidad de Colima,
realizado bajo los auspicios del fondo Ramón Álvarez-Buylla de Aldana.

------------------------------------------------------------------------

ISBN 978-968-7412-85-6
® Derechos Reservados 2008. Archivo Histórico del Municipio de Colima.

1,078 visitas
