+--------------------------------------------------------------------------------------------------------------------------------------------------------------------------------------------------------------------------------------------------------------------------------------------------------------------------------+-----------------------+-----------------------+
| []                                                                                                                                                                                                                                                                                                                             |                       |                       |
|                                                                                                                                                                                                                                                                                                                                |                       |                       |
| +-----------------------------------+:-------------------------------------:+                                                                                                                                                                                                                                                  |                       |                       |
| | []                                | LA VILLA DE COLIMA DE LA NUEVA ESPAÑA |                                                                                                                                                                                                                                                  |                       |                       |
| |                                   | SIGLO XVI                             |                                                                                                                                                                                                                                                  |                       |                       |
| |                                   |                                       |                                                                                                                                                                                                                                                  |                       |                       |
| |                                   | VOLUMEN II      (CAJAS 12-20)         |                                                                                                                                                                                                                                                  |                       |                       |
| +-----------------------------------+---------------------------------------+                                                                                                                                                                                                                                                  |                       |                       |
+--------------------------------------------------------------------------------------------------------------------------------------------------------------------------------------------------------------------------------------------------------------------------------------------------------------------------------+-----------------------+-----------------------+
| +------------------------------------------------------------------------+---------------------------+-----------------------+                                                                                                                                                                                                 |                       |                       |
| | Inicio | Búsqueda | Siglas y bibliografía | Créditos | Más información | (consulta las cajas 1-11) |    [ES]               |                                                                                                                                                                                                 |                       |                       |
| +------------------------------------------------------------------------+---------------------------+-----------------------+                                                                                                                                                                                                 |                       |                       |
+--------------------------------------------------------------------------------------------------------------------------------------------------------------------------------------------------------------------------------------------------------------------------------------------------------------------------------+-----------------------+-----------------------+
| Búsqueda rápida                                                                                                                                                                                                                                                                                                                |                       |                       |
|                                                                                                                                                                                                                                                                                                                                |                       |                       |
| +:-------------------:+-----------------+:----------------------------------------:+----------------:+                                                                                                                                                                                                                         |                       |                       |
| | Documento de fecha: |                 | Ubicación física del documento original: | [] [] []        |                                                                                                                                                                                                                         |                       |                       |
| |                     |                 |                                          |                 |                                                                                                                                                                                                                         |                       |                       |
| | 1580. Abril, 6      |                 | Caja 18, exp. 4, 3 ff.                   |                 |                                                                                                                                                                                                                         |                       |                       |
| +---------------------+-----------------+------------------------------------------+-----------------+                                                                                                                                                                                                                         |                       |                       |
|                                                                                                                                                                                                                                                                                                                                |                       |                       |
|   ------------- -----------------------------------------------------------------------------------------------------------------------------                                                                                                                                                                                  |                       |                       |
|   Resumen:      Juan Bautista de Quirós pide que se le reconozca la propiedad de la Huerta de San Juan del Monte, en la Provincia de Colima                                                                                                                                                                                    |                       |                       |
|   ------------- -----------------------------------------------------------------------------------------------------------------------------                                                                                                                                                                                  |                       |                       |
|                                                                                                                                                                                                                                                                                                                                |                       |                       |
|   ----------------------------------- ---------------------------------------------------------------------------------------------------------------------------------------------------------------------------------------------------------------------------------------------------------------------------------------- |                       |                       |
|   Contenido:                          Ante el alcalde mayor Juan de Arce de Cueva, el vecino de Colima Juan Baptista de Quirós, casado con Juana de Angulo, viuda que fue de Juan de Arévalo, pide que se le reconozca el derecho de propiedad de la Huerta de San Juan del Monte que es en esta Provincia.^([680])            |                       |                       |
|                                       Explica el demandante que su esposa Juana de Angulo hubo del matrimonio con Juan de Arévalo, dos hijas: Leonor, de doce o trece años, y María, de seis o siete.^([681])                                                                                                                  |                       |                       |
|                                       Cuando él casó con Juana de Angulo, ella trajo en dote la Huerta de cacao llamada San Juan del Monte, en los términos de esta Provincia de Colima, que ya poseía en vida de su anterior marido, por lo que no pertenecen en propiedad, contra lo que pudiere parecer, a sus dos hijas.   |                       |                       |
|                                       Quirós pide que le reciban información y que se les nombre tutor y curador a sus entenadas.                                                                                                                                                                                              |                       |                       |
|                                       Quirós presentó por testigos a Catalina Maldonado, viuda y vecina de Colima,^([682]) a doña María de Cáceres, esposa de Diego de Aguilar, y al escribano Francisco López Avecilla.                                                                                                       |                       |                       |
|                                                                                                                                                                                                                                                                                                                                |                       |                       |
|   ----------------------------------- ---------------------------------------------------------------------------------------------------------------------------------------------------------------------------------------------------------------------------------------------------------------------------------------- |                       |                       |
|                                                                                                                                                                                                                                                                                                                                |                       |                       |
| (680) Esta huerta pasó luego a propiedad de Leonor de Arévalo, aquí mencionada, hija de Juan de Arévalo y Juana de Angulo que todavía la poseía cuando otorgó testamento en 1595: supra, regº 445 y 462.                                                                                                                       |                       |                       |
|                                                                                                                                                                                                                                                                                                                                |                       |                       |
| (681) Ambas llevaban el apellido Arévalo.                                                                                                                                                                                                                                                                                      |                       |                       |
|                                                                                                                                                                                                                                                                                                                                |                       |                       |
| (682) Viuda de Andrés de Madrid, con quien procreó cuatro hijos: Andrés de Madrid, Lorenzo Álvarez de Madrid, María Álvarez de Madrid y Juan dee Peñalba: supra, I, regº 231 y 251.                                                                                                                                            |                       |                       |
|                                                                                                                                                                                                                                                                                                                                |                       |                       |
|   ---------------------------------------------------------------------------------------------------                                                                                                                                                                                                                          |                       |                       |
|    Documento(s) original(es)                                                                                                                                                                                                                                                                                                   |                       |                       |
|   --------------------------- ------- ------- ------- ------- ------- ------- ------- ------- -------                                                                                                                                                                                                                          |                       |                       |
|               []                []      []      []      []      []                                                                                                                                                                                                                                                             |                       |                       |
|               1f                1v      2f      2v      3f      3v                                                                                                                                                                                                                                                             |                       |                       |
|                                                                                                                                                                                                                                                                                                                                |                       |                       |
|   ---------------------------------------------------------------------------------------------------                                                                                                                                                                                                                          |                       |                       |
+--------------------------------------------------------------------------------------------------------------------------------------------------------------------------------------------------------------------------------------------------------------------------------------------------------------------------------+-----------------------+-----------------------+
| +----------------------------------------------------------------------------+------------------------------------------------+                                                                                                                                                                                                |                       |                       |
| | ISBN 978-607-701-024-1                                                     |   ---- ---- ---- ---- ---- ---- ---- ---- ---- |                                                                                                                                                                                                |                       |                       |
| | © Derechos Reservados 2013. Archivo Histórico del Municipio de Colima. [*] |   []        []        []        []        []   |                                                                                                                                                                                                |                       |                       |
| |                                                                            |   ---- ---- ---- ---- ---- ---- ---- ---- ---- |                                                                                                                                                                                                |                       |                       |
| +----------------------------------------------------------------------------+------------------------------------------------+                                                                                                                                                                                                |                       |                       |
| |                                                                            |                                                |                                                                                                                                                                                                |                       |                       |
| +----------------------------------------------------------------------------+------------------------------------------------+                                                                                                                                                                                                |                       |                       |
+--------------------------------------------------------------------------------------------------------------------------------------------------------------------------------------------------------------------------------------------------------------------------------------------------------------------------------+-----------------------+-----------------------+

615 visitas
