+--------------------------------------------------------------------------------------------------------------------------------------------------------------------------------------------------------------------------------------------------------------------------------------------------------------------------------------------------------------------------------------------------------------------------------------------------------------------------------------------------------------------------------------------------------------------------------------------------------------------------------------------------------------------------------------------------------------------------------------------+-----------------------+-----------------------+
| []                                                                                                                                                                                                                                                                                                                                                                                                                                                                                                                                                                                                                                                                                                                                         |                       |                       |
|                                                                                                                                                                                                                                                                                                                                                                                                                                                                                                                                                                                                                                                                                                                                            |                       |                       |
| +-----------------------------------+:-------------------------------------:+                                                                                                                                                                                                                                                                                                                                                                                                                                                                                                                                                                                                                                                              |                       |                       |
| | []                                | LA VILLA DE COLIMA DE LA NUEVA ESPAÑA |                                                                                                                                                                                                                                                                                                                                                                                                                                                                                                                                                                                                                                                              |                       |                       |
| |                                   | SIGLO XVI                             |                                                                                                                                                                                                                                                                                                                                                                                                                                                                                                                                                                                                                                                              |                       |                       |
| |                                   |                                       |                                                                                                                                                                                                                                                                                                                                                                                                                                                                                                                                                                                                                                                              |                       |                       |
| |                                   | VOLUMEN II      (CAJAS 12-20)         |                                                                                                                                                                                                                                                                                                                                                                                                                                                                                                                                                                                                                                                              |                       |                       |
| +-----------------------------------+---------------------------------------+                                                                                                                                                                                                                                                                                                                                                                                                                                                                                                                                                                                                                                                              |                       |                       |
+--------------------------------------------------------------------------------------------------------------------------------------------------------------------------------------------------------------------------------------------------------------------------------------------------------------------------------------------------------------------------------------------------------------------------------------------------------------------------------------------------------------------------------------------------------------------------------------------------------------------------------------------------------------------------------------------------------------------------------------------+-----------------------+-----------------------+
| +------------------------------------------------------------------------+-------------------------------+-----------------------+                                                                                                                                                                                                                                                                                                                                                                                                                                                                                                                                                                                                         |                       |                       |
| | Inicio | Búsqueda | Siglas y bibliografía | Créditos | Más información | Vol. I (1-11) Vol. II (12-20) |    [ES]               |                                                                                                                                                                                                                                                                                                                                                                                                                                                                                                                                                                                                         |                       |                       |
| +------------------------------------------------------------------------+-------------------------------+-----------------------+                                                                                                                                                                                                                                                                                                                                                                                                                                                                                                                                                                                                         |                       |                       |
+--------------------------------------------------------------------------------------------------------------------------------------------------------------------------------------------------------------------------------------------------------------------------------------------------------------------------------------------------------------------------------------------------------------------------------------------------------------------------------------------------------------------------------------------------------------------------------------------------------------------------------------------------------------------------------------------------------------------------------------------+-----------------------+-----------------------+
| Búsqueda rápida                                                                                                                                                                                                                                                                                                                                                                                                                                                                                                                                                                                                                                                                                                                            |                       |                       |
|                                                                                                                                                                                                                                                                                                                                                                                                                                                                                                                                                                                                                                                                                                                                            |                       |                       |
| +:-------------------:+-----------------+:----------------------------------------:+----------------:+                                                                                                                                                                                                                                                                                                                                                                                                                                                                                                                                                                                                                                     |                       |                       |
| | Documento de fecha: |                 | Ubicación física del documento original: | [] [] []        |                                                                                                                                                                                                                                                                                                                                                                                                                                                                                                                                                                                                                                     |                       |                       |
| |                     |                 |                                          |                 |                                                                                                                                                                                                                                                                                                                                                                                                                                                                                                                                                                                                                                     |                       |                       |
| | 1577. Agosto, 9     |                 | Caja 22, exp. 11, 3 ff.                  |                 |                                                                                                                                                                                                                                                                                                                                                                                                                                                                                                                                                                                                                                     |                       |                       |
| +---------------------+-----------------+------------------------------------------+-----------------+                                                                                                                                                                                                                                                                                                                                                                                                                                                                                                                                                                                                                                     |                       |                       |
|                                                                                                                                                                                                                                                                                                                                                                                                                                                                                                                                                                                                                                                                                                                                            |                       |                       |
|   ------------- ----------------------------------------------------------------------------------                                                                                                                                                                                                                                                                                                                                                                                                                                                                                                                                                                                                                                         |                       |                       |
|   Resumen:      La Justicia Mayor de Colima, de oficio, contra dos indios que viven amancebados.                                                                                                                                                                                                                                                                                                                                                                                                                                                                                                                                                                                                                                           |                       |                       |
|   ------------- ----------------------------------------------------------------------------------                                                                                                                                                                                                                                                                                                                                                                                                                                                                                                                                                                                                                                         |                       |                       |
|                                                                                                                                                                                                                                                                                                                                                                                                                                                                                                                                                                                                                                                                                                                                            |                       |                       |
|   ----------------------------------- ---------------------------------------------------------------------------------------------------------------------------------------------------------------------------------------------------------------------------------------------------------------------------------------------------------------------------------------------------------------------------------------------------------------------------------------------------------------------------------------------------------------------------------------------------------------------------------------------------------------------------------------------------------------------------------------------------- |                       |                       |
|   Contenido:                          Álvaro de Grijalba, justicia mayor en la Villa y Provincia de Colima, dijo que a su noticia había venido que “en el Valle de Caxitlan, en la Güerta de cacao de Juan Fernández El Viejo, está una india amancebada llamada Isabel con un indio llamado Pedro. E por castigar semejante pecado conforme a derecho, mandó de oficio hacer la información siguiente contra los susodichos. Ante mí, Francisco López, escribano público”.                                                                                                                                                                                                                                                                |                       |                       |
|                                       Información                                                                                                                                                                                                                                                                                                                                                                                                                                                                                                                                                                                                                                                                                          |                       |                       |
|                                       Para este efecto, fue llamado a declarar “Juan Cortés, indio natural que dijo ser del pueblo de Ocotlan^([1]) e residente en la dicha güerta”.^([2])                                                                                                                                                                                                                                                                                                                                                                                                                                                                                                                                                 |                       |                       |
|                                       Mediante el intérprete del juzgado Melchor de los Reyes,^([3]) dijo que conocía a Isabel y a Pedro, indios que “andan y están amancebados, e duermen juntos. E lo sabe porque la dicha Isabel se empreñó del dicho Pedro, indio, y ella misma confesó que estaba preñada del dicho Pedro, indio, e que los días pasados movió y echó la criatura muerta. E oyó decir que lo había hecho de miedo^([4]) de la mujer del dicho Pedro, indio. E asímismo ha visto este testigo a la dicha mujer del dicho Pedro, indio, enojada e reñir muchas veces porque sabe que andan juntos los dichos Isabel e Pedro, indios. E que es público en la dicha güerta. Lo cual es la verdad”.                        |                       |                       |
|                                       El testigo dijo tener más de 20 años y no firmó porque no sabía hacerlo.                                                                                                                                                                                                                                                                                                                                                                                                                                                                                                                                                                                                                             |                       |                       |
|                                       El 12 de agosto, el teniente Álvaro de Grijalba mandó llamar a Juan Pérez, indio natural del pueblo de Ocotlan, quien a través de Melchor de los Reyes, intérprete, dijo que conocía a Isabel y a Pedro, indios que están en la Huerta de Juan Fernández, donde este testigo reside. Sabe que Isabel es soltera y Pedro es casado. Y, sin embargo, han andado y andan amancebados desde hace mucho tiempo, “y comían e dormían juntos. Y sabe cómo la dicha Isabel se empreñó del dicho Pedro, indio, e los días pasados movió e lo echó.^([5]) E sabe cómo el dicho Pedro, indio, ha dado e da mala vida a su mujer la dicha Isabel.^([6]) Todo lo cual es público e notorio. Lo cual es verdad”.   |                       |                       |
|                                       El testigo declaró tener más de 30 años y no firmó porque dijo que no sabía.                                                                                                                                                                                                                                                                                                                                                                                                                                                                                                                                                                                                                         |                       |                       |
|                                       Álvaro de Grijalba, “en visita de cárcel”, hizo llamar a Pedro, indio, preso en la cárcel. Éste confesó que era natural de Guachinango,^([7]) casado y criado de Juan Fernández El Viejo. Declaró que conocía a Isabel, y “que ha más de un año que está amancebado con ella, e la conoce carnalmente, lo cual es la verdad”.                                                                                                                                                                                                                                                                                                                                                                        |                       |                       |
|                                       Así lo confesó mediante Mateo de Berlanga, intérprete.                                                                                                                                                                                                                                                                                                                                                                                                                                                                                                                                                                                                                                               |                       |                       |
|                                       Dijo tener más de 20 años y no firmó porque dijo que no sabía.                                                                                                                                                                                                                                                                                                                                                                                                                                                                                                                                                                                                                                       |                       |                       |
|                                       A continuación, el justicia mayor llamó a Isabel para tomarle su confesión. Dijo que era viuda y natural de Ocotlan, que conocía a Pedro, y “es verdad que ha estado con ella amancebado de un año a esta parte. E sabe que es casado e que estuvo preñada del dicho Pedro indio, e que por estar mal hecho...^([8])                                                                                                                                                                                                                                                                                                                                                                                 |                       |                       |
|                                       Vistas ambas confesiones, Álvaro de Grijalba mandó “que no se junten en manera alguna, so pena de cada cien azotes. E que el dicho indio se vaya a hacer vida con su mujer e sirva a su amo, e la dicha Isabel mando que esté depositada en casa de su señor Juan Fernández El Viejo, tiempo y espacio de un año, e no lo quebrante so pena de que será castigada conforme a derecho. Y si durante el término del dicho año se quisiere casar, se case y sea libre del dicho depósito. E que el tiempo que sirva, se le pague medio peso cada mes. Y así lo proveyó e mandó, e lo firmó”.                                                                                                            |                       |                       |
|                                       El escribano Francisco López de Avecilla notificó la sentencia dictada por Álvaro de Grijalba a Pedro e Isabel, siendo testigos Melchor de los Reyes y Diego de Velasco, vecinos de Colima.^([9])                                                                                                                                                                                                                                                                                                                                                                                                                                                                                                    |                       |                       |
|                                                                                                                                                                                                                                                                                                                                                                                                                                                                                                                                                                                                                                                                                                                                            |                       |                       |
|   ----------------------------------- ---------------------------------------------------------------------------------------------------------------------------------------------------------------------------------------------------------------------------------------------------------------------------------------------------------------------------------------------------------------------------------------------------------------------------------------------------------------------------------------------------------------------------------------------------------------------------------------------------------------------------------------------------------------------------------------------------- |                       |                       |
|                                                                                                                                                                                                                                                                                                                                                                                                                                                                                                                                                                                                                                                                                                                                            |                       |                       |
| (1) Ocotlan, pueblo de la provincia de Tepetitango: Romero de Solís, Los pueblos de Colima… (2015).                                                                                                                                                                                                                                                                                                                                                                                                                                                                                                                                                                                                                                        |                       |                       |
|                                                                                                                                                                                                                                                                                                                                                                                                                                                                                                                                                                                                                                                                                                                                            |                       |                       |
| (2) Juan Fernández El Viejo era encomendero del pueblo de Ocotlan; esto explica que aquel natural trabajara en su huerta de Caxitlan.                                                                                                                                                                                                                                                                                                                                                                                                                                                                                                                                                                                                      |                       |                       |
|                                                                                                                                                                                                                                                                                                                                                                                                                                                                                                                                                                                                                                                                                                                                            |                       |                       |
| (3) Melchor Reyes era vecino de Colima desde 1577, aunque hacía años que moraba en la Villa de Colima. Era carpintero y mercader. Estaba casado con Elvira o Juana Hermoso. Fungió de alguacil, alcaide e intérprete: Romero de Solís, Andariegos… (2001]), 436-437.                                                                                                                                                                                                                                                                                                                                                                                                                                                                       |                       |                       |
|                                                                                                                                                                                                                                                                                                                                                                                                                                                                                                                                                                                                                                                                                                                                            |                       |                       |
| (4) Estamos ante un doloroso caso documentado de aborto por causa del miedo. Recuérdese que Lebrón de Quiñones también denunció que las naturales de la Provincia de Colima se provocaban el aborto.                                                                                                                                                                                                                                                                                                                                                                                                                                                                                                                                       |                       |                       |
|                                                                                                                                                                                                                                                                                                                                                                                                                                                                                                                                                                                                                                                                                                                                            |                       |                       |
| (5) Se entiende a la criatura que esperaba y que se malogró por el aborto provocado.                                                                                                                                                                                                                                                                                                                                                                                                                                                                                                                                                                                                                                                       |                       |                       |
|                                                                                                                                                                                                                                                                                                                                                                                                                                                                                                                                                                                                                                                                                                                                            |                       |                       |
| (6) La redacción es confusa. Parece que Pedro daba mala vida a su amante.                                                                                                                                                                                                                                                                                                                                                                                                                                                                                                                                                                                                                                                                  |                       |                       |
|                                                                                                                                                                                                                                                                                                                                                                                                                                                                                                                                                                                                                                                                                                                                            |                       |                       |
| (7) A pesar de que la línea está destruida, se alcanza a leer de dónde era natural el acusado.                                                                                                                                                                                                                                                                                                                                                                                                                                                                                                                                                                                                                                             |                       |                       |
|                                                                                                                                                                                                                                                                                                                                                                                                                                                                                                                                                                                                                                                                                                                                            |                       |                       |
| (8) Ilegible; la línea está destruida. Por el contexto de las declaraciones anteriores, se deduce que “por estar mal hecho, se movió y echó afuera la criatura”.                                                                                                                                                                                                                                                                                                                                                                                                                                                                                                                                                                           |                       |                       |
|                                                                                                                                                                                                                                                                                                                                                                                                                                                                                                                                                                                                                                                                                                                                            |                       |                       |
| (9) El escribano añadió una nota, donde dice: “Quatro tomines resebí de cacao destos derechos”.                                                                                                                                                                                                                                                                                                                                                                                                                                                                                                                                                                                                                                            |                       |                       |
|                                                                                                                                                                                                                                                                                                                                                                                                                                                                                                                                                                                                                                                                                                                                            |                       |                       |
|   ---------------------------------------------------------------------------------------------------                                                                                                                                                                                                                                                                                                                                                                                                                                                                                                                                                                                                                                      |                       |                       |
|    Documento(s) original(es)                                                                                                                                                                                                                                                                                                                                                                                                                                                                                                                                                                                                                                                                                                               |                       |                       |
|   --------------------------- ------- ------- ------- ------- ------- ------- ------- ------- -------                                                                                                                                                                                                                                                                                                                                                                                                                                                                                                                                                                                                                                      |                       |                       |
|               []                []      []      []      []      []                                                                                                                                                                                                                                                                                                                                                                                                                                                                                                                                                                                                                                                                         |                       |                       |
|               1f                1v      2f      2v      3f      3v                                                                                                                                                                                                                                                                                                                                                                                                                                                                                                                                                                                                                                                                         |                       |                       |
|                                                                                                                                                                                                                                                                                                                                                                                                                                                                                                                                                                                                                                                                                                                                            |                       |                       |
|   ---------------------------------------------------------------------------------------------------                                                                                                                                                                                                                                                                                                                                                                                                                                                                                                                                                                                                                                      |                       |                       |
+--------------------------------------------------------------------------------------------------------------------------------------------------------------------------------------------------------------------------------------------------------------------------------------------------------------------------------------------------------------------------------------------------------------------------------------------------------------------------------------------------------------------------------------------------------------------------------------------------------------------------------------------------------------------------------------------------------------------------------------------+-----------------------+-----------------------+
| +----------------------------------------------------------------------------+-----------------------------------------------:+                                                                                                                                                                                                                                                                                                                                                                                                                                                                                                                                                                                                            |                       |                       |
| | ISBN 978-607-701-024-1                                                     |   ---- ---- ---- ---- ---- ---- ---- ---- ---- |                                                                                                                                                                                                                                                                                                                                                                                                                                                                                                                                                                                                            |                       |                       |
| | © Derechos Reservados 2013. Archivo Histórico del Municipio de Colima. [*] |   []        []        []        []        []   |                                                                                                                                                                                                                                                                                                                                                                                                                                                                                                                                                                                                            |                       |                       |
| |                                                                            |   ---- ---- ---- ---- ---- ---- ---- ---- ---- |                                                                                                                                                                                                                                                                                                                                                                                                                                                                                                                                                                                                            |                       |                       |
| +----------------------------------------------------------------------------+------------------------------------------------+                                                                                                                                                                                                                                                                                                                                                                                                                                                                                                                                                                                                            |                       |                       |
| |                                                                            |                                                |                                                                                                                                                                                                                                                                                                                                                                                                                                                                                                                                                                                                            |                       |                       |
| +----------------------------------------------------------------------------+------------------------------------------------+                                                                                                                                                                                                                                                                                                                                                                                                                                                                                                                                                                                                            |                       |                       |
+--------------------------------------------------------------------------------------------------------------------------------------------------------------------------------------------------------------------------------------------------------------------------------------------------------------------------------------------------------------------------------------------------------------------------------------------------------------------------------------------------------------------------------------------------------------------------------------------------------------------------------------------------------------------------------------------------------------------------------------------+-----------------------+-----------------------+

636 visitas
