[]

LA VILLA DE COLIMA DE LA NUEVA ESPAÑA
SIGLO XVI

VOLUMEN I      (CAJAS 1-11)

[]

Inicio | Búsquedas | Siglas y bibliografía | Cartografía | Créditos | Más información

[]

Búsqueda rápida

+:-----------------------------------------------------------------------------------------------------------------------------------------------------------------------------------------------------------------------------------------------------------------------------------------------------------------------------------------------------------------------------------------------------------------------------------------------------------------------------------------------------------------------------------------------------------------------------------------------------------------------------------------------------------------------------------------------------------------------------------------------------------------------------------------------------------------------------------------------------------------------------------------------------------------------------------------------------------------------------------------------------------------------------------------------------------------------------------------------------------------------------------------------------------------------------------------------------------------------------------------------------------------------------------------------------------------------------------------------------------------------------------------------------------------------------------------------------------------------------------------------------------------------------------------------------------------------------------------------------------------------------------------------------------------------------------------------------------------------------------------------------------------------------------------------------------------------------------------------------------:+------------------------------------------:+
| Fecha:                                                                                                                                                                                                                                                                                                                                                                                                                                                                                                                                                                                                                                                                                                                                                                                                                                                                                                                                                                                                                                                                                                                                                                                                                                                                                                                                                                                                                                                                                                                                                                                                                                                                                                                                                                                                                                                      | Ubicación física del documento original:  |
| 1545 Septiembre, 1                                                                                                                                                                                                                                                                                                                                                                                                                                                                                                                                                                                                                                                                                                                                                                                                                                                                                                                                                                                                                                                                                                                                                                                                                                                                                                                                                                                                                                                                                                                                                                                                                                                                                                                                                                                                                                          | CAJA A-1, EXP. 7, 14 FF.                  |
|                                                                                                                                                                                                                                                                                                                                                                                                                                                                                                                                                                                                                                                                                                                                                                                                                                                                                                                                                                                                                                                                                                                                                                                                                                                                                                                                                                                                                                                                                                                                                                                                                                                                                                                                                                                                                                                             | Archivo Histórico del Municipio de Colima |
+-------------------------------------------------------------------------------------------------------------------------------------------------------------------------------------------------------------------------------------------------------------------------------------------------------------------------------------------------------------------------------------------------------------------------------------------------------------------------------------------------------------------------------------------------------------------------------------------------------------------------------------------------------------------------------------------------------------------------------------------------------------------------------------------------------------------------------------------------------------------------------------------------------------------------------------------------------------------------------------------------------------------------------------------------------------------------------------------------------------------------------------------------------------------------------------------------------------------------------------------------------------------------------------------------------------------------------------------------------------------------------------------------------------------------------------------------------------------------------------------------------------------------------------------------------------------------------------------------------------------------------------------------------------------------------------------------------------------------------------------------------------------------------------------------------------------------------------------------------------+-------------------------------------------+
| 10. 1545. Septiembre, 1.                                                                                                                                                                                                                                                                                                                                                                                                                                                                                                                                                                                                                                                                                                                                                                                                                                                                                                                                                                                                                                                                                                                                                                                                                                                                                                                                                                                                                                                                                                                                                                                                                                                                                                                                                                                                                                    |                                           |
|                                                                                                                                                                                                                                                                                                                                                                                                                                                                                                                                                                                                                                                                                                                                                                                                                                                                                                                                                                                                                                                                                                                                                                                                                                                                                                                                                                                                                                                                                                                                                                                                                                                                                                                                                                                                                                                             |                                           |
| El menor Juan López contra su tutor Hernán García, por mala administración de sus bienes.                                                                                                                                                                                                                                                                                                                                                                                                                                                                                                                                                                                                                                                                                                                                                                                                                                                                                                                                                                                                                                                                                                                                                                                                                                                                                                                                                                                                                                                                                                                                                                                                                                                                                                                                                                   |                                           |
|                                                                                                                                                                                                                                                                                                                                                                                                                                                                                                                                                                                                                                                                                                                                                                                                                                                                                                                                                                                                                                                                                                                                                                                                                                                                                                                                                                                                                                                                                                                                                                                                                                                                                                                                                                                                                                                             |                                           |
| Juan López, menor, hijo de Bartolomé López, difunto,^([1]) promueve pleito contra su tutor Hernán García por quince vacas chicas y grandes, tasadas en 70 pesos, según consta por su firma de haber recibido de Manuel de Cáceres, vecino de Colima. El menor exige, además, el censo que hubiera podido ganar en cinco años, a razón de 10 pesos anuales, por cuanto su tutor había descuidado la venta del ganado, y tener las vacas monteses.                                                                                                                                                                                                                                                                                                                                                                                                                                                                                                                                                                                                                                                                                                                                                                                                                                                                                                                                                                                                                                                                                                                                                                                                                                                                                                                                                                                                            |                                           |
|                                                                                                                                                                                                                                                                                                                                                                                                                                                                                                                                                                                                                                                                                                                                                                                                                                                                                                                                                                                                                                                                                                                                                                                                                                                                                                                                                                                                                                                                                                                                                                                                                                                                                                                                                                                                                                                             |                                           |
| Por su parte, en descargo, Hernán García pide primeramente que no se admita a juicio a Juan López, porque es menor de veinte años; asegura estar dispuesto a rendir cuentas, y dice que Manuel de Cáceres no le hizo entrega de las cabezas de ganado en cuestión. Aclara que firmó en efecto de recibido el ganado, "porque el dicho Manuel de Cáceres me dijo que firmase, porque quedaba de me las entregar, y nunca tal me entregó, como parece por la cuenta que dí ante Alonso Carrillo".^([2])                                                                                                                                                                                                                                                                                                                                                                                                                                                                                                                                                                                                                                                                                                                                                                                                                                                                                                                                                                                                                                                                                                                                                                                                                                                                                                                                                       |                                           |
|                                                                                                                                                                                                                                                                                                                                                                                                                                                                                                                                                                                                                                                                                                                                                                                                                                                                                                                                                                                                                                                                                                                                                                                                                                                                                                                                                                                                                                                                                                                                                                                                                                                                                                                                                                                                                                                             |                                           |
| Al cargo de tener monteses las vacas, Hernán García responde: "como V.m. sabe, y es público y notorio que todas las vacas de los vecinos desta Villa andan alzadas y montesas, con tener sus dueños negros y indios y buen recaudo en sus estancias, y a mí no me dieron con ellas ninguna guarda ni recaudo, ni yo era obligado a ser su vaquero, ni andar de contino^([3]) sobre ellas, porque aunque fueran mías, no lo hiciera".^([4])                                                                                                                                                                                                                                                                                                                                                                                                                                                                                                                                                                                                                                                                                                                                                                                                                                                                                                                                                                                                                                                                                                                                                                                                                                                                                                                                                                                                                  |                                           |
|                                                                                                                                                                                                                                                                                                                                                                                                                                                                                                                                                                                                                                                                                                                                                                                                                                                                                                                                                                                                                                                                                                                                                                                                                                                                                                                                                                                                                                                                                                                                                                                                                                                                                                                                                                                                                                                             |                                           |
| Dan información Diego de Almodóvar^([5]) y Diego Morán, vecinos de Colima.                                                                                                                                                                                                                                                                                                                                                                                                                                                                                                                                                                                                                                                                                                                                                                                                                                                                                                                                                                                                                                                                                                                                                                                                                                                                                                                                                                                                                                                                                                                                                                                                                                                                                                                                                                                  |                                           |
|                                                                                                                                                                                                                                                                                                                                                                                                                                                                                                                                                                                                                                                                                                                                                                                                                                                                                                                                                                                                                                                                                                                                                                                                                                                                                                                                                                                                                                                                                                                                                                                                                                                                                                                                                                                                                                                             |                                           |
| El primero dice conocer a Juan López y a Hernán García, desde hace unos diez años, y él es de treinta y cinco, poco más o menos. Diego Morán, por su parte, dice ser de treinta años. Ambos coinciden en afirmar que, en su opinión, Hernán García ha tenido poco cuidado de la hacienda del menor.                                                                                                                                                                                                                                                                                                                                                                                                                                                                                                                                                                                                                                                                                                                                                                                                                                                                                                                                                                                                                                                                                                                                                                                                                                                                                                                                                                                                                                                                                                                                                         |                                           |
|                                                                                                                                                                                                                                                                                                                                                                                                                                                                                                                                                                                                                                                                                                                                                                                                                                                                                                                                                                                                                                                                                                                                                                                                                                                                                                                                                                                                                                                                                                                                                                                                                                                                                                                                                                                                                                                             |                                           |
| El alcalde mandó que Hernán García diera cuenta, en el plazo de un día, cosa que protestó por ser breve.                                                                                                                                                                                                                                                                                                                                                                                                                                                                                                                                                                                                                                                                                                                                                                                                                                                                                                                                                                                                                                                                                                                                                                                                                                                                                                                                                                                                                                                                                                                                                                                                                                                                                                                                                    |                                           |
|                                                                                                                                                                                                                                                                                                                                                                                                                                                                                                                                                                                                                                                                                                                                                                                                                                                                                                                                                                                                                                                                                                                                                                                                                                                                                                                                                                                                                                                                                                                                                                                                                                                                                                                                                                                                                                                             |                                           |
| Juan López, en nuevo escrito, dice que el término probatorio ha pasado y pide que el alcalde "mande poner en el proceso las tutelas y cargos que se le hicieron al dicho Hernán García, mi tutor, por los señores alcaldes Jorge Carrillo y Alonso Carrillo".^([6])                                                                                                                                                                                                                                                                                                                                                                                                                                                                                                                                                                                                                                                                                                                                                                                                                                                                                                                                                                                                                                                                                                                                                                                                                                                                                                                                                                                                                                                                                                                                                                                         |                                           |
|                                                                                                                                                                                                                                                                                                                                                                                                                                                                                                                                                                                                                                                                                                                                                                                                                                                                                                                                                                                                                                                                                                                                                                                                                                                                                                                                                                                                                                                                                                                                                                                                                                                                                                                                                                                                                                                             |                                           |
| Visto el proceso, Hernán García fue condenado a pagar "sesenta pesos de oro de minas, en que fueron compradas las dichas vacas, y más en veinte pesos de oro de minas", por los réditos.                                                                                                                                                                                                                                                                                                                                                                                                                                                                                                                                                                                                                                                                                                                                                                                                                                                                                                                                                                                                                                                                                                                                                                                                                                                                                                                                                                                                                                                                                                                                                                                                                                                                    |                                           |
|                                                                                                                                                                                                                                                                                                                                                                                                                                                                                                                                                                                                                                                                                                                                                                                                                                                                                                                                                                                                                                                                                                                                                                                                                                                                                                                                                                                                                                                                                                                                                                                                                                                                                                                                                                                                                                                             |                                           |
| Diego Morán, Juan Gómez, Bartolomé Garrido, el Padre Oliveros,^([7]) Juan Pinzón, Alonso Carrillo, Francisco de Ayllón^([8]) y Juan Fernández El Viejo, aparecen como testigos de las sucesivas diligencias y autos.                                                                                                                                                                                                                                                                                                                                                                                                                                                                                                                                                                                                                                                                                                                                                                                                                                                                                                                                                                                                                                                                                                                                                                                                                                                                                                                                                                                                                                                                                                                                                                                                                                        |                                           |
|                                                                                                                                                                                                                                                                                                                                                                                                                                                                                                                                                                                                                                                                                                                                                                                                                                                                                                                                                                                                                                                                                                                                                                                                                                                                                                                                                                                                                                                                                                                                                                                                                                                                                                                                                                                                                                                             |                                           |
| Caja A–1, exp. 7, 14 ff.                                                                                                                                                                                                                                                                                                                                                                                                                                                                                                                                                                                                                                                                                                                                                                                                                                                                                                                                                                                                                                                                                                                                                                                                                                                                                                                                                                                                                                                                                                                                                                                                                                                                                                                                                                                                                                    |                                           |
|                                                                                                                                                                                                                                                                                                                                                                                                                                                                                                                                                                                                                                                                                                                                                                                                                                                                                                                                                                                                                                                                                                                                                                                                                                                                                                                                                                                                                                                                                                                                                                                                                                                                                                                                                                                                                                                             |                                           |
|                                                                                                                                                                                                                                                                                                                                                                                                                                                                                                                                                                                                                                                                                                                                                                                                                                                                                                                                                                                                                                                                                                                                                                                                                                                                                                                                                                                                                                                                                                                                                                                                                                                                                                                                                                                                                                                             |                                           |
|                                                                                                                                                                                                                                                                                                                                                                                                                                                                                                                                                                                                                                                                                                                                                                                                                                                                                                                                                                                                                                                                                                                                                                                                                                                                                                                                                                                                                                                                                                                                                                                                                                                                                                                                                                                                                                                             |                                           |
| ---------------                                                                                                                                                                                                                                                                                                                                                                                                                                                                                                                                                                                                                                                                                                                                                                                                                                                                                                                                                                                                                                                                                                                                                                                                                                                                                                                                                                                                                                                                                                                                                                                                                                                                                                                                                                                                                                             |                                           |
|                                                                                                                                                                                                                                                                                                                                                                                                                                                                                                                                                                                                                                                                                                                                                                                                                                                                                                                                                                                                                                                                                                                                                                                                                                                                                                                                                                                                                                                                                                                                                                                                                                                                                                                                                                                                                                                             |                                           |
| (1) Bartolomé López, conquistador y vecino fundador de Colima, recibió por encomienda los pueblos de Comala y Chapulcal: VP 34. Había casado con Francisca de Figueroa, la que al enviudar casó con Alonso Carrillo: Icaza (1969), I, nº 412, que siguió aprovechando aquellos pueblos, como lo informa la Relación sumaria (1554): Lebrón (1979), 55.                                                                                                                                                                                                                                                                                                                                                                                                                                                                                                                                                                                                                                                                                                                                                                                                                                                                                                                                                                                                                                                                                                                                                                                                                                                                                                                                                                                                                                                                                                      |                                           |
|                                                                                                                                                                                                                                                                                                                                                                                                                                                                                                                                                                                                                                                                                                                                                                                                                                                                                                                                                                                                                                                                                                                                                                                                                                                                                                                                                                                                                                                                                                                                                                                                                                                                                                                                                                                                                                                             |                                           |
| (2) Es la primera mención a un Alonso Carrillo de las muchas que aparecerán en los registros del antiguo Archivo de la Villa de Colima. Aquí debe tratarse del vecino de Colima Alonso Carrillo de Guzmán El Viejo, natural de Toledo, e hijo de Pedro Cuello Carrillo y Jerónima de la Dueña, quien pasó a Nueva España con Hernán Cortés hacia 1530: Icaza (1969), I, nº 412; Boyd–Bowman (1968), nº 11229; casó con Francisca de Figueroa, viuda de Bartolomé López, encomendero de Comala, con la que tuvo cuatro hijos: Dorantes (1987), 231; Icaza (1969), I, nº 412; infra, regº 237; Lebrón (1979), 55. En la Villa de Colima ocupó cargos en su Justicia y Regimiento: alcalde ordinario en 1537, 1544 y 1546: infra, 21, 34, 39; fue regidor en 1551: infra, regº 20. Fue corregidor de Izatlan, en 1544-1545: Ruiz Medrano (1991), 382; de Tuxpan–Tamazula–Zapotlan, en 1551: Paredes Martínez (1994), regº 39; Gerhard (1992), regº 2517. Falleció en 1564 siendo alcalde mayor de los Pueblos de Ávalos: infra, regº 237.                                                                                                                                                                                                                                                                                                                                                                                                                                                                                                                                                                                                                                                                                                                                                                                                                      |                                           |
|                                                                                                                                                                                                                                                                                                                                                                                                                                                                                                                                                                                                                                                                                                                                                                                                                                                                                                                                                                                                                                                                                                                                                                                                                                                                                                                                                                                                                                                                                                                                                                                                                                                                                                                                                                                                                                                             |                                           |
| (3) De contino: continuamente.                                                                                                                                                                                                                                                                                                                                                                                                                                                                                                                                                                                                                                                                                                                                                                                                                                                                                                                                                                                                                                                                                                                                                                                                                                                                                                                                                                                                                                                                                                                                                                                                                                                                                                                                                                                                                              |                                           |
|                                                                                                                                                                                                                                                                                                                                                                                                                                                                                                                                                                                                                                                                                                                                                                                                                                                                                                                                                                                                                                                                                                                                                                                                                                                                                                                                                                                                                                                                                                                                                                                                                                                                                                                                                                                                                                                             |                                           |
| (4) El alegato de Hernán García anticipa lo que tres años después se había convertido en un grave problema: véase infra, regº 17.                                                                                                                                                                                                                                                                                                                                                                                                                                                                                                                                                                                                                                                                                                                                                                                                                                                                                                                                                                                                                                                                                                                                                                                                                                                                                                                                                                                                                                                                                                                                                                                                                                                                                                                           |                                           |
|                                                                                                                                                                                                                                                                                                                                                                                                                                                                                                                                                                                                                                                                                                                                                                                                                                                                                                                                                                                                                                                                                                                                                                                                                                                                                                                                                                                                                                                                                                                                                                                                                                                                                                                                                                                                                                                             |                                           |
| (5) Vecino de Colima, al menos desde 1541: Romero de Solís, Protocolos... (1999), regº 135. Al parecer llegó a México, en 1530: Boyd–Bowman (1968), regº 3600. "Diego de Almodóuar, dize que es vezino de Colima y natural de Almodóuar del Campo [Ciudad Real], e hijo legítimo de Pedro de Almodóuar y de Inés Díaz, y que ha dezisiete años que pasó a esta Nueua Spaña y fué con el Marqués a la ysla [Baja California], y que es casado con hija de Antón López, conquistador; y tiene vna hija y su casa poblada, y padesçe neçesidad; y siruió a Su Magestad en la paçificaçión de Nochistlán": Icaza (1969), II, nº 690. Con su esposa Catalina López, procreó a Pedro, Tomás, Isabel y María de Almodóvar, nombradas éstas Isabel de Vargas y María de Saldívar: infra, II, regº 399 y IV, regº 977; también fue hija de ellos Inés Díaz de Ocampo. Es preciso agregar al número de sus hijos a Diego López de Almodóvar, a quien tal vez se refiera una noticia de la Lista de los conquistadores e hijos de ellos que había en México y en las demás ciudades y villas de Nueva España, formada por los conquistadores Gonzalo Cerezo y Andrés de Tapia (S/f.), donde se dice "Diego de Almodóvar por su padre": ENE, XIV, 150. Entre sus propiedades, Lebrón de Quiñones le asigna tres huertas de cacao pero sólo explicita dos: "la una, a tiro de arcabuz de Ticavacan, y la otra, media legua de Colima", calculándole a ambas 18,000 casas de cacao": Lebrón (1979), 63. Su viuda, al otorgar testamento, declaraba "una güerta de cacao que está a una legua desta Villa, que se dice Acuistlan": infra, II, 399. Según este mismo visitador, el encomendero Almodóvar "ha tenido un poblezuelo [...] y a él no ha mostrado título ni alegado derecho alguno por donde le pertenezca; nómbrase el dicho poblezuelo Aquixtlan": Ibid., 57. |                                           |
|                                                                                                                                                                                                                                                                                                                                                                                                                                                                                                                                                                                                                                                                                                                                                                                                                                                                                                                                                                                                                                                                                                                                                                                                                                                                                                                                                                                                                                                                                                                                                                                                                                                                                                                                                                                                                                                             |                                           |
| (6) Ambos eran de Toledo y, posiblemente, parientes cercanos. El sentido de la frase es que ambos alcaldes, en momentos distintos, designaron a los tutores.                                                                                                                                                                                                                                                                                                                                                                                                                                                                                                                                                                                                                                                                                                                                                                                                                                                                                                                                                                                                                                                                                                                                                                                                                                                                                                                                                                                                                                                                                                                                                                                                                                                                                                |                                           |
|                                                                                                                                                                                                                                                                                                                                                                                                                                                                                                                                                                                                                                                                                                                                                                                                                                                                                                                                                                                                                                                                                                                                                                                                                                                                                                                                                                                                                                                                                                                                                                                                                                                                                                                                                                                                                                                             |                                           |
| (7) El Padre Juan de Oliveros, cura de Colima entre 1544-1553, fue designado cura de encomenderos por el provisor de Michoacán, bachiller Juan García Zurnero, nombramiento que reproduce Sevilla del Río (1973), 211-212.                                                                                                                                                                                                                                                                                                                                                                                                                                                                                                                                                                                                                                                                                                                                                                                                                                                                                                                                                                                                                                                                                                                                                                                                                                                                                                                                                                                                                                                                                                                                                                                                                                  |                                           |
|                                                                                                                                                                                                                                                                                                                                                                                                                                                                                                                                                                                                                                                                                                                                                                                                                                                                                                                                                                                                                                                                                                                                                                                                                                                                                                                                                                                                                                                                                                                                                                                                                                                                                                                                                                                                                                                             |                                           |
| (8) Natural de Medina del Campo, hijo de Hernando (o Bernaldo) de Ayllón y Brígida de Velasco o García; inscrito en 1538 en Sevilla para pasar a Indias junto con su hermano Juan de Ayllón en la armada de Pedro de Alvarado: Icaza (1969), II, nº 1357; Romero de Solís, Andariegos y pobladores... (2001), 55.                                                                                                                                                                                                                                                                                                                                                                                                                                                                                                                                                                                                                                                                                                                                                                                                                                                                                                                                                                                                                                                                                                                                                                                                                                                                                                                                                                                                                                                                                                                                           |                                           |
+-------------------------------------------------------------------------------------------------------------------------------------------------------------------------------------------------------------------------------------------------------------------------------------------------------------------------------------------------------------------------------------------------------------------------------------------------------------------------------------------------------------------------------------------------------------------------------------------------------------------------------------------------------------------------------------------------------------------------------------------------------------------------------------------------------------------------------------------------------------------------------------------------------------------------------------------------------------------------------------------------------------------------------------------------------------------------------------------------------------------------------------------------------------------------------------------------------------------------------------------------------------------------------------------------------------------------------------------------------------------------------------------------------------------------------------------------------------------------------------------------------------------------------------------------------------------------------------------------------------------------------------------------------------------------------------------------------------------------------------------------------------------------------------------------------------------------------------------------------------+-------------------------------------------+

Documento(s) original(es)

Archivo no encontrado (CAJAS/CAJA1/EXP7/001F.jpg)

Archivo no encontrado (CAJAS/CAJA1/EXP7/001V.jpg)

Archivo no encontrado (CAJAS/CAJA1/EXP7/002F.jpg)

Archivo no encontrado (CAJAS/CAJA1/EXP7/002V.jpg)

Archivo no encontrado (CAJAS/CAJA1/EXP7/003F.jpg)

Archivo no encontrado (CAJAS/CAJA1/EXP7/003V.jpg)

Archivo no encontrado (CAJAS/CAJA1/EXP7/004F.jpg)

Archivo no encontrado (CAJAS/CAJA1/EXP7/004V.jpg)

Archivo no encontrado (CAJAS/CAJA1/EXP7/005F.jpg)

Archivo no encontrado (CAJAS/CAJA1/EXP7/005V.jpg)

Archivo no encontrado (CAJAS/CAJA1/EXP7/006F.jpg)

Archivo no encontrado (CAJAS/CAJA1/EXP7/006V.jpg)

Archivo no encontrado (CAJAS/CAJA1/EXP7/007F.jpg)

Archivo no encontrado (CAJAS/CAJA1/EXP7/007V.jpg)

Archivo no encontrado (CAJAS/CAJA1/EXP7/008F.jpg)

Archivo no encontrado (CAJAS/CAJA1/EXP7/008V.jpg)

Archivo no encontrado (CAJAS/CAJA1/EXP7/009F.jpg)

Archivo no encontrado (CAJAS/CAJA1/EXP7/009V.jpg)

Archivo no encontrado (CAJAS/CAJA1/EXP7/010F.jpg)

Archivo no encontrado (CAJAS/CAJA1/EXP7/010V.jpg)

Archivo no encontrado (CAJAS/CAJA1/EXP7/011V.jpg)

Archivo no encontrado (CAJAS/CAJA1/EXP7/013V.jpg)

Archivo no encontrado (CAJAS/CAJA1/EXP7/014V.jpg)

[]
11F

[]
12F

[]
12V

[]
13F

[]
14F

Proyecto interinstitucional del Archivo Histórico del Municipio de Colima y la Universidad de Colima,
realizado bajo los auspicios del fondo Ramón Álvarez-Buylla de Aldana.

------------------------------------------------------------------------

ISBN 978-968-7412-85-6
® Derechos Reservados 2008. Archivo Histórico del Municipio de Colima.

1,078 visitas
