+----------------------------------------------------------------------------------------------------------------------------------------------------------------------------------------------------------------------------------------------------------------------------------------------------------------------------------------------------------------------------------------------------------------------------------------------------------------+-----------------------+-----------------------+
| []                                                                                                                                                                                                                                                                                                                                                                                                                                                             |                       |                       |
|                                                                                                                                                                                                                                                                                                                                                                                                                                                                |                       |                       |
| +-----------------------------------+:-------------------------------------:+                                                                                                                                                                                                                                                                                                                                                                                  |                       |                       |
| | []                                | LA VILLA DE COLIMA DE LA NUEVA ESPAÑA |                                                                                                                                                                                                                                                                                                                                                                                  |                       |                       |
| |                                   | SIGLO XVI                             |                                                                                                                                                                                                                                                                                                                                                                                  |                       |                       |
| |                                   |                                       |                                                                                                                                                                                                                                                                                                                                                                                  |                       |                       |
| |                                   | VOLUMEN II      (CAJAS 12-20)         |                                                                                                                                                                                                                                                                                                                                                                                  |                       |                       |
| +-----------------------------------+---------------------------------------+                                                                                                                                                                                                                                                                                                                                                                                  |                       |                       |
+----------------------------------------------------------------------------------------------------------------------------------------------------------------------------------------------------------------------------------------------------------------------------------------------------------------------------------------------------------------------------------------------------------------------------------------------------------------+-----------------------+-----------------------+
| +------------------------------------------------------------------------+---------------------------+-----------------------+                                                                                                                                                                                                                                                                                                                                 |                       |                       |
| | Inicio | Búsqueda | Siglas y bibliografía | Créditos | Más información | (consulta las cajas 1-11) |    [ES]               |                                                                                                                                                                                                                                                                                                                                 |                       |                       |
| +------------------------------------------------------------------------+---------------------------+-----------------------+                                                                                                                                                                                                                                                                                                                                 |                       |                       |
+----------------------------------------------------------------------------------------------------------------------------------------------------------------------------------------------------------------------------------------------------------------------------------------------------------------------------------------------------------------------------------------------------------------------------------------------------------------+-----------------------+-----------------------+
| Búsqueda rápida                                                                                                                                                                                                                                                                                                                                                                                                                                                |                       |                       |
|                                                                                                                                                                                                                                                                                                                                                                                                                                                                |                       |                       |
| +:-------------------:+-----------------+:----------------------------------------:+----------------:+                                                                                                                                                                                                                                                                                                                                                         |                       |                       |
| | Documento de fecha: |                 | Ubicación física del documento original: | [] [] []        |                                                                                                                                                                                                                                                                                                                                                         |                       |                       |
| |                     |                 |                                          |                 |                                                                                                                                                                                                                                                                                                                                                         |                       |                       |
| | 1597. Julio, 1º     |                 | Caja 19, exp. 1, ff. 252-257.^([890])    |                 |                                                                                                                                                                                                                                                                                                                                                         |                       |                       |
| +---------------------+-----------------+------------------------------------------+-----------------+                                                                                                                                                                                                                                                                                                                                                         |                       |                       |
|                                                                                                                                                                                                                                                                                                                                                                                                                                                                |                       |                       |
|   ------------- ------------------------------------------------------                                                                                                                                                                                                                                                                                                                                                                                         |                       |                       |
|   Resumen:      Pedro Gómez Machorro denuncia el hurto de seis mulas                                                                                                                                                                                                                                                                                                                                                                                           |                       |                       |
|   ------------- ------------------------------------------------------                                                                                                                                                                                                                                                                                                                                                                                         |                       |                       |
|                                                                                                                                                                                                                                                                                                                                                                                                                                                                |                       |                       |
|   ----------------------------------- ------------------------------------------------------------------------------------------------------------------------------------------------------------------------------------------------------------------------------------------------------------------------------------------------------------------------------------------------------------------------------------------------------------------------ |                       |                       |
|   Contenido:                          El alcalde ordinario de la Villa de Colima Pedro Gómez Machorro denuncia ante el justicia mayor don Antonio Enríquez haber sido objeto de un robo, a saber, que le habían hurtado “de los ejidos y Llanos desta Villa de Colima, seis mulas de recua, conocidas y mansas, entre las cuales me faltaron tres del hierro del margen en el anca,^([883]) sin otros hierros diferentes”.                                     |                       |                       |
|                                       Una de ellas —dice— grande, castaña parda, era de Agustín de Alcalá. Ahora le han dicho que esta mula está en poder de Juan El Vizcaíno, en el pueblo de [...],^([884]) en la Provincia de Ávalos, y lleva la mula una carga de vino. Las otras tres mulas hurtadas también tenían el hierro.^([885]) Por ello, se querella criminalmente del susodicho y pide carta de justicia.                                        |                       |                       |
|                                       Agrega un cuestionario para el examen de los testigos, entre cuyas preguntas se interroga sobre un macho prieto que los indios arrieros llamaban Peñalosa.                                                                                                                                                                                                                                                               |                       |                       |
|                                       De las demás bestias no da el nombre, por no saberlo, pero sí informa que faltaban desde hacía un año, que es el tiempo que ha corrido desde que Juan Vizcaíno se ausentó de esta Villa, dejando ciertos encargos a un tal Domingo, residente en la Villa.                                                                                                                                                               |                       |                       |
|                                       Pedro Gómez Machorro presentó por testigo a Martín Cortés, indio, quien declaró mediante Juan de Espinosa, intérprete. El indio menciona al macho Peñalosa y a una mula tuerta que le decían Chirrionera.^([886]) Agrega que “viniendo después por la Provincia de Ávalos, en el pueblo de Amacueca, vido en la comunidad de él a un hombre Vizcaíno”, quien decía haber comprado “ciertas mulas a Antonio de Ocampo”.   |                       |                       |
|                                       Otro testigo, el indio Gabriel Miguel, fue interrogado mediante Pedro Ruiz de Vilches, intérprete. Dijo haber visto en Amacueca a “un cristiano español Vizcaíno que compró unas mulas a Antonio de Ocampo, amo deste testigo, y dejó aquí perdida una mula”. Dice que le vio en Amacueca cargar, con dos barriles, la mula Chirrionera.                                                                                 |                       |                       |
|                                       Un tercer testigo, el indio Alonso Martín, vecino de esta Villa, arriero y criado de Pedro Gómez Machorro, mediante el intérprete Diego de Alcaraz,^([887]) menciona a Chirrionera, y a otra mula que llaman Chancharraua.^([888]) Dice que Peñalosa está en poder de Francisco Ruiz, de Sayula.                                                                                                                         |                       |                       |
|                                       Alonso Gutiérrez, indio vecino de la Villa de Colima,^([889]) cuyo intérprete fue Cristóbal de Solórzano, agregó a los datos anteriores el nombre de La Tuerta, como era llamada otra de las mulas, y dice que La Chancharraua era de Francisca de Saldaña.                                                                                                                                                              |                       |                       |
|                                       El 31 de julio, Pedro Gómez Machorro reconocía tener ya en su poder el macho Peñalosa, adjudicado por la autoridad.                                                                                                                                                                                                                                                                                                      |                       |                       |
|                                                                                                                                                                                                                                                                                                                                                                                                                                                                |                       |                       |
|   ----------------------------------- ------------------------------------------------------------------------------------------------------------------------------------------------------------------------------------------------------------------------------------------------------------------------------------------------------------------------------------------------------------------------------------------------------------------------ |                       |                       |
|                                                                                                                                                                                                                                                                                                                                                                                                                                                                |                       |                       |
| (883) AQU Viene al margen dibujado el dicho hierro.                                                                                                                                                                                                                                                                                                                                                                                                            |                       |                       |
|                                                                                                                                                                                                                                                                                                                                                                                                                                                                |                       |                       |
| (884) Ilegible. Más adelante se menciona el pueblo de Amacueca.                                                                                                                                                                                                                                                                                                                                                                                                |                       |                       |
|                                                                                                                                                                                                                                                                                                                                                                                                                                                                |                       |                       |
| (885) AQU Dibujo al margen.                                                                                                                                                                                                                                                                                                                                                                                                                                    |                       |                       |
|                                                                                                                                                                                                                                                                                                                                                                                                                                                                |                       |                       |
| (886) El nombre puede aludir a una popular culebra de la región así llamada Chirrionera (Masticophis flagellum), tan larga que puede medir casi dos metros de longitud; es muy rápida al deslizarse con extraordinaria facilidad; se alimenta de aves y roedores.                                                                                                                                                                                              |                       |                       |
|                                                                                                                                                                                                                                                                                                                                                                                                                                                                |                       |                       |
| (887) Única referencia que, hasta el momento, hallamos de Diego de Alcaráz.                                                                                                                                                                                                                                                                                                                                                                                    |                       |                       |
|                                                                                                                                                                                                                                                                                                                                                                                                                                                                |                       |                       |
| (888) Podría ser también Chancharrana.                                                                                                                                                                                                                                                                                                                                                                                                                         |                       |                       |
|                                                                                                                                                                                                                                                                                                                                                                                                                                                                |                       |                       |
| (889) Tanto este testigo como el anterior Alonso Martín, siendo indios naturales, figuran empero como vecinos de Colima, lo que confirma una vez más la existencia de familias de naturales dentro del espacio urbano de la Villa de Colima.                                                                                                                                                                                                                   |                       |                       |
|                                                                                                                                                                                                                                                                                                                                                                                                                                                                |                       |                       |
| (890) Antes en caja 18, exp. 1.                                                                                                                                                                                                                                                                                                                                                                                                                                |                       |                       |
|                                                                                                                                                                                                                                                                                                                                                                                                                                                                |                       |                       |
|   ---------------------------------------------------------------------------------------------------                                                                                                                                                                                                                                                                                                                                                          |                       |                       |
|    Documento(s) original(es)                                                                                                                                                                                                                                                                                                                                                                                                                                   |                       |                       |
|   --------------------------- ------- ------- ------- ------- ------- ------- ------- ------- -------                                                                                                                                                                                                                                                                                                                                                          |                       |                       |
|               []                []      []      []      []      []      []      []      []      []                                                                                                                                                                                                                                                                                                                                                             |                       |                       |
|              252f              252v    253f    253v    254f    254v    255f    256f    256v    257f                                                                                                                                                                                                                                                                                                                                                            |                       |                       |
|                                                                                                                                                                                                                                                                                                                                                                                                                                                                |                       |                       |
|   ---------------------------------------------------------------------------------------------------                                                                                                                                                                                                                                                                                                                                                          |                       |                       |
+----------------------------------------------------------------------------------------------------------------------------------------------------------------------------------------------------------------------------------------------------------------------------------------------------------------------------------------------------------------------------------------------------------------------------------------------------------------+-----------------------+-----------------------+
| +----------------------------------------------------------------------------+------------------------------------------------+                                                                                                                                                                                                                                                                                                                                |                       |                       |
| | ISBN 978-607-701-024-1                                                     |   ---- ---- ---- ---- ---- ---- ---- ---- ---- |                                                                                                                                                                                                                                                                                                                                |                       |                       |
| | © Derechos Reservados 2013. Archivo Histórico del Municipio de Colima. [*] |   []        []        []        []        []   |                                                                                                                                                                                                                                                                                                                                |                       |                       |
| |                                                                            |   ---- ---- ---- ---- ---- ---- ---- ---- ---- |                                                                                                                                                                                                                                                                                                                                |                       |                       |
| +----------------------------------------------------------------------------+------------------------------------------------+                                                                                                                                                                                                                                                                                                                                |                       |                       |
| |                                                                            |                                                |                                                                                                                                                                                                                                                                                                                                |                       |                       |
| +----------------------------------------------------------------------------+------------------------------------------------+                                                                                                                                                                                                                                                                                                                                |                       |                       |
+----------------------------------------------------------------------------------------------------------------------------------------------------------------------------------------------------------------------------------------------------------------------------------------------------------------------------------------------------------------------------------------------------------------------------------------------------------------+-----------------------+-----------------------+

615 visitas
