+-------------------------------------------------------------------------------------------------------------------------------------------------------------------------------------------------------------------------------------------------------------------------------------------------------------------------------------------------------------------------------------------------------------------------------------------------------------------------------------------------------------------+-----------------------+-----------------------+
| []                                                                                                                                                                                                                                                                                                                                                                                                                                                                                                                |                       |                       |
|                                                                                                                                                                                                                                                                                                                                                                                                                                                                                                                   |                       |                       |
| +-----------------------------------+:-------------------------------------:+                                                                                                                                                                                                                                                                                                                                                                                                                                     |                       |                       |
| | []                                | LA VILLA DE COLIMA DE LA NUEVA ESPAÑA |                                                                                                                                                                                                                                                                                                                                                                                                                                     |                       |                       |
| |                                   | SIGLO XVI                             |                                                                                                                                                                                                                                                                                                                                                                                                                                     |                       |                       |
| |                                   |                                       |                                                                                                                                                                                                                                                                                                                                                                                                                                     |                       |                       |
| |                                   | VOLUMEN II      (CAJAS 12-20)         |                                                                                                                                                                                                                                                                                                                                                                                                                                     |                       |                       |
| +-----------------------------------+---------------------------------------+                                                                                                                                                                                                                                                                                                                                                                                                                                     |                       |                       |
+-------------------------------------------------------------------------------------------------------------------------------------------------------------------------------------------------------------------------------------------------------------------------------------------------------------------------------------------------------------------------------------------------------------------------------------------------------------------------------------------------------------------+-----------------------+-----------------------+
| +------------------------------------------------------------------------+-------------------------------+-----------------------+                                                                                                                                                                                                                                                                                                                                                                                |                       |                       |
| | Inicio | Búsqueda | Siglas y bibliografía | Créditos | Más información | Vol. I (1-11) Vol. II (12-20) |    [ES]               |                                                                                                                                                                                                                                                                                                                                                                                |                       |                       |
| +------------------------------------------------------------------------+-------------------------------+-----------------------+                                                                                                                                                                                                                                                                                                                                                                                |                       |                       |
+-------------------------------------------------------------------------------------------------------------------------------------------------------------------------------------------------------------------------------------------------------------------------------------------------------------------------------------------------------------------------------------------------------------------------------------------------------------------------------------------------------------------+-----------------------+-----------------------+
| Búsqueda rápida                                                                                                                                                                                                                                                                                                                                                                                                                                                                                                   |                       |                       |
|                                                                                                                                                                                                                                                                                                                                                                                                                                                                                                                   |                       |                       |
| +:-------------------:+-----------------+:----------------------------------------:+----------------:+                                                                                                                                                                                                                                                                                                                                                                                                            |                       |                       |
| | Documento de fecha: |                 | Ubicación física del documento original: | [] [] []        |                                                                                                                                                                                                                                                                                                                                                                                                            |                       |                       |
| |                     |                 |                                          |                 |                                                                                                                                                                                                                                                                                                                                                                                                            |                       |                       |
| | 1598. Agosto, 13    |                 | Caja 26, exp. 66, ff. 97 vta-98.         |                 |                                                                                                                                                                                                                                                                                                                                                                                                            |                       |                       |
| +---------------------+-----------------+------------------------------------------+-----------------+                                                                                                                                                                                                                                                                                                                                                                                                            |                       |                       |
|                                                                                                                                                                                                                                                                                                                                                                                                                                                                                                                   |                       |                       |
|   ------------- ----------------------------------------------------------                                                                                                                                                                                                                                                                                                                                                                                                                                        |                       |                       |
|   Resumen:      Testamento de Luis Vela de Grijalba, clérigo presbítero.                                                                                                                                                                                                                                                                                                                                                                                                                                          |                       |                       |
|   ------------- ----------------------------------------------------------                                                                                                                                                                                                                                                                                                                                                                                                                                        |                       |                       |
|                                                                                                                                                                                                                                                                                                                                                                                                                                                                                                                   |                       |                       |
|   ----------------------------------- --------------------------------------------------------------------------------------------------------------------------------------------------------------------------------------------------------------------------------------------------------------------------------------------------------------------------------------------------------------------------------------------------------------------------------------------------------------------------- |                       |                       |
|   Contenido:                          “En el nombre de la Santísima Trinidad[...].                                                                                                                                                                                                                                                                                                                                                                                                                                |                       |                       |
|                                       “Sepan cuántos esta carta vieren cómo yo, Luis Vela de Grijalba, clérigo presbítero, vecino desta Villa de Colima de la Nueva España, hijo legítimo de Bernaldino Cola y de Isabel de Grijalba, su mujer, mis padres ya difuntos, estando en mi cama enfermo del cuerpo y sano de la voluntad y en mi buen seso, memoria, entendimiento y voluntad [...], hago y ordeno mi testamento y última voluntad en la mejor vía que de derecho haya lugar en la manera siguiente:   |                       |                       |
|                                       “Primeramente mando mi ánima a Dios Nuestro Señor [...],^([1]) [y a su] Hijo por su sacratísima Pasión y Sangre que por ella derramó en el santo Árbol de la Vera Cruz,^([2]) y el cuerpo mando a la tierra de do fue formado.                                                                                                                                                                                                                                              |                       |                       |
|                                       “Iten digo que si Dios Nuestro Señor fuese servido de llamarme desta presente vida, que mi cuerpo sea sepultado en la iglesia parroquial desta dicha Villa en la parte y lugar que a mis albaceas les pareciere, y en la forma y manera y con la solemnidad que les pareciere, porque esto dejo a su disposición.                                                                                                                                                           |                       |                       |
|                                       “Iten digo que a las mandas forzosas se les dé de mis bienes medio real a cada una, con que las aparto de mis bienes.                                                                                                                                                                                                                                                                                                                                                       |                       |                       |
|                                       “Iten declaro que Domingo Vela de Grijalba, mi hermano, son [?] a todo lo que yo debo y a quién y cómo y cuánto y ansimismo someto de lo que me deben [...]. Mando que cobrado lo que me deban y de los dichos mis bienes [muebles y raíces] tome la parte que le pareciere, y entre él y mis albaceas paguen todo lo que yo debo”.                                                                                                                                         |                       |                       |
|                                       “Y para cumplimiento deste mi testamento, mandas y legados”, nombra por albacea a Cristóbal de Silva, vecino de esta Villa, a quien da poder cumplido.                                                                                                                                                                                                                                                                                                                      |                       |                       |
|                                       Designa por heredero universal a Domingo Vela de Grijalba, su hermano, a quien recomienda “haga bien por mi ánima, porque con esta confianza no lo declaro en este testamento más por extenso”.                                                                                                                                                                                                                                                                             |                       |                       |
|                                       Testigos: Alonso Carrillo de Guzmán, el Padre Diego Ruiz, Juan de la Zarza, presbítero, Antonio Carrillo de Guzmán, Andrés Ruiz y Rodrigo de Velasco, vecinos de esta Villa.                                                                                                                                                                                                                                                                                                |                       |                       |
|                                       [Rúbricas]: Luis de Grijalba. Diego Ruiz. Juan^([3]) de la Zarza. Alonso Carrillo de Guzmán. Antonio Carrillo de Guzmán. Rodrigo de Velasco. Andrés Ruiz.                                                                                                                                                                                                                                                                                                                   |                       |                       |
|                                       Pasó ante el escribano público Toribio de Casso.                                                                                                                                                                                                                                                                                                                                                                                                                            |                       |                       |
|                                                                                                                                                                                                                                                                                                                                                                                                                                                                                                                   |                       |                       |
|   ----------------------------------- --------------------------------------------------------------------------------------------------------------------------------------------------------------------------------------------------------------------------------------------------------------------------------------------------------------------------------------------------------------------------------------------------------------------------------------------------------------------------- |                       |                       |
|                                                                                                                                                                                                                                                                                                                                                                                                                                                                                                                   |                       |                       |
| (1) Destruido.                                                                                                                                                                                                                                                                                                                                                                                                                                                                                                    |                       |                       |
|                                                                                                                                                                                                                                                                                                                                                                                                                                                                                                                   |                       |                       |
| (2) Antítesis del árbol de la ciencia del bien y del mal del paraíso, donde Adán y Eva pecaron, desobedeciendo a Dios, es el árbol de la cruz donde muere Jesucristo, obedeciendo y salvando a todos.                                                                                                                                                                                                                                                                                                             |                       |                       |
|                                                                                                                                                                                                                                                                                                                                                                                                                                                                                                                   |                       |                       |
| (3) A la letra, Joan.                                                                                                                                                                                                                                                                                                                                                                                                                                                                                             |                       |                       |
|                                                                                                                                                                                                                                                                                                                                                                                                                                                                                                                   |                       |                       |
|   ---------------------------------------------------------------------------------------------------                                                                                                                                                                                                                                                                                                                                                                                                             |                       |                       |
|    Documento(s) original(es)                                                                                                                                                                                                                                                                                                                                                                                                                                                                                      |                       |                       |
|   --------------------------- ------- ------- ------- ------- ------- ------- ------- ------- -------                                                                                                                                                                                                                                                                                                                                                                                                             |                       |                       |
|               []                []      []                                                                                                                                                                                                                                                                                                                                                                                                                                                                        |                       |                       |
|               97v               98f     98v                                                                                                                                                                                                                                                                                                                                                                                                                                                                       |                       |                       |
|                                                                                                                                                                                                                                                                                                                                                                                                                                                                                                                   |                       |                       |
|   ---------------------------------------------------------------------------------------------------                                                                                                                                                                                                                                                                                                                                                                                                             |                       |                       |
+-------------------------------------------------------------------------------------------------------------------------------------------------------------------------------------------------------------------------------------------------------------------------------------------------------------------------------------------------------------------------------------------------------------------------------------------------------------------------------------------------------------------+-----------------------+-----------------------+
| +----------------------------------------------------------------------------+-----------------------------------------------:+                                                                                                                                                                                                                                                                                                                                                                                   |                       |                       |
| | ISBN 978-607-701-024-1                                                     |   ---- ---- ---- ---- ---- ---- ---- ---- ---- |                                                                                                                                                                                                                                                                                                                                                                                   |                       |                       |
| | © Derechos Reservados 2013. Archivo Histórico del Municipio de Colima. [*] |   []        []        []        []        []   |                                                                                                                                                                                                                                                                                                                                                                                   |                       |                       |
| |                                                                            |   ---- ---- ---- ---- ---- ---- ---- ---- ---- |                                                                                                                                                                                                                                                                                                                                                                                   |                       |                       |
| +----------------------------------------------------------------------------+------------------------------------------------+                                                                                                                                                                                                                                                                                                                                                                                   |                       |                       |
| |                                                                            |                                                |                                                                                                                                                                                                                                                                                                                                                                                   |                       |                       |
| +----------------------------------------------------------------------------+------------------------------------------------+                                                                                                                                                                                                                                                                                                                                                                                   |                       |                       |
+-------------------------------------------------------------------------------------------------------------------------------------------------------------------------------------------------------------------------------------------------------------------------------------------------------------------------------------------------------------------------------------------------------------------------------------------------------------------------------------------------------------------+-----------------------+-----------------------+

636 visitas
