[]

LA VILLA DE COLIMA DE LA NUEVA ESPAÑA
SIGLO XVI

VOLUMEN I      (CAJAS 1-11)

[]

Inicio | Búsquedas | Siglas y bibliografía | Cartografía | Créditos | Más información

[]

Búsqueda rápida

+:--------------------------------------------------------------------------------------------------------------------------------------------------------------------------------------------------------------------------------------------------------------------------------------------------------------------------------------------------------------------------------------------------------------------------------------------------------------------------------------------------------------------------------------------------------------------------------------------------------------------------------------------------------------------------:+------------------------------------------:+
| Fecha:                                                                                                                                                                                                                                                                                                                                                                                                                                                                                                                                                                                                                                                                     | Ubicación física del documento original:  |
| 1563 Marzo, 24                                                                                                                                                                                                                                                                                                                                                                                                                                                                                                                                                                                                                                                             | CAJA A-4, EXP. 1, 10 FF.                  |
|                                                                                                                                                                                                                                                                                                                                                                                                                                                                                                                                                                                                                                                                            | Archivo Histórico del Municipio de Colima |
+----------------------------------------------------------------------------------------------------------------------------------------------------------------------------------------------------------------------------------------------------------------------------------------------------------------------------------------------------------------------------------------------------------------------------------------------------------------------------------------------------------------------------------------------------------------------------------------------------------------------------------------------------------------------------+-------------------------------------------+
| 85. 1563. Marzo, 24.                                                                                                                                                                                                                                                                                                                                                                                                                                                                                                                                                                                                                                                       |                                           |
|                                                                                                                                                                                                                                                                                                                                                                                                                                                                                                                                                                                                                                                                            |                                           |
| Alonso Carvajal, con poder de Alonso de Ochoa, mercader de Pátzcuaro, presenta una obligación de Juan de Salcedo, vecino que fue de la Ciudad de los Ángeles.                                                                                                                                                                                                                                                                                                                                                                                                                                                                                                              |                                           |
|                                                                                                                                                                                                                                                                                                                                                                                                                                                                                                                                                                                                                                                                            |                                           |
| Don Alonso de Carvajal,^([1]) vecino de la villa de Colima, con poder de Alonso Ochoa,^([2]) mercader de la provincia de Pátzcuaro y vecino de la Ciudad de Mechuacan, otorgado en esta ciudad, el 15 de febrero de 1563 ante el escribano Francisco Troche,^([3]) y los testigos Diego Martín Infante y Andrés de Velasco, presenta una obligación de Juan de Salzedo, vecino de la Ciudad de los Ángeles,^([4]) por 80 pesos de tipuzque a favor del dicho Ochoa, por razón "de mercaderías que de vuestra tienda me distes e yo compré", fechada en Mechuacan el 30 de junio de 1558, ante el mismo escribano y Juan Fernández Madaleno^([5]) y Juan de Carvajal.^([6]) |                                           |
|                                                                                                                                                                                                                                                                                                                                                                                                                                                                                                                                                                                                                                                                            |                                           |
| Esta carta de obligación de pago, dice el peticionario, Ochoa se la "pasó en causa propia como parece por este poder, de que hago presentación". Pide, por cuanto Juan de Salzedo es ya finado, "que de los bienes que el susodicho difunto dejó y de lo más bien parado, se me haga entero pago".                                                                                                                                                                                                                                                                                                                                                                         |                                           |
|                                                                                                                                                                                                                                                                                                                                                                                                                                                                                                                                                                                                                                                                            |                                           |
| El alcalde ordinario Juan de la Torre, como no hay quien defienda los bienes mortuorios de Salzedo, nombra para el caso a Antonio de Carvajal, vecino de Colima.                                                                                                                                                                                                                                                                                                                                                                                                                                                                                                           |                                           |
|                                                                                                                                                                                                                                                                                                                                                                                                                                                                                                                                                                                                                                                                            |                                           |
| Antonio de Carvajal pide que Alonso, bajo juramento, explique "cómo y en qué y de qué manera hubo la dicha obligación"; a lo que respondió Alonso de Carvajal "haber dado ocho mantas". Sin embargo, el defensor de los bienes del finado Salzedo dice que Alonso de Carvajal "no declaró a cómo a él le costaron las dichas mantas, porque, como a V.m. consta, no valen en esta Villa a más de a cinco pesos".                                                                                                                                                                                                                                                           |                                           |
|                                                                                                                                                                                                                                                                                                                                                                                                                                                                                                                                                                                                                                                                            |                                           |
| El 22 de abril, Alonso de Carvajal pedía a Juan de Arana que tomase la causa en sí, lo que hizo el alcalde ordinario por estar ausente de la Villa el alcalde Juan de la Torre, dictando sentencia.                                                                                                                                                                                                                                                                                                                                                                                                                                                                        |                                           |
|                                                                                                                                                                                                                                                                                                                                                                                                                                                                                                                                                                                                                                                                            |                                           |
| Alonso de Carvajal apeló de ella ante el alcalde mayor Diego Núñez de Guzmán.                                                                                                                                                                                                                                                                                                                                                                                                                                                                                                                                                                                              |                                           |
|                                                                                                                                                                                                                                                                                                                                                                                                                                                                                                                                                                                                                                                                            |                                           |
| Caja A–4, exp. 1, 10 ff.                                                                                                                                                                                                                                                                                                                                                                                                                                                                                                                                                                                                                                                   |                                           |
|                                                                                                                                                                                                                                                                                                                                                                                                                                                                                                                                                                                                                                                                            |                                           |
|                                                                                                                                                                                                                                                                                                                                                                                                                                                                                                                                                                                                                                                                            |                                           |
|                                                                                                                                                                                                                                                                                                                                                                                                                                                                                                                                                                                                                                                                            |                                           |
| ---------------                                                                                                                                                                                                                                                                                                                                                                                                                                                                                                                                                                                                                                                            |                                           |
|                                                                                                                                                                                                                                                                                                                                                                                                                                                                                                                                                                                                                                                                            |                                           |
| (1) Al decir de Hillerkuss (1997), 223, era nacido en Úbeda y al parecer natural de Sevilla. Casó con Juana Jiménez, mujer allegada a doña Beatriz López de Ayala. Ras enviudar, don Alonso casó con Ana de Ojeda, hija de Juan de Ojeda El Viejo, contador de Nueva Galicia. Tuvo vecindad en Colima, como aquí es registrado, en México y Guadalajara. Véase además: Romero de Solís, Andariegos y pobladores... (2001), 92-93.                                                                                                                                                                                                                                          |                                           |
|                                                                                                                                                                                                                                                                                                                                                                                                                                                                                                                                                                                                                                                                            |                                           |
| (2) Todavía vivía en 1583, cuando concluyó un contrato de arrendamiento de su Estancia de Miraflores, situada en la Ciudad de Michoacan: Martínez Baracs–Espinosa Morales (1999), nº 299.                                                                                                                                                                                                                                                                                                                                                                                                                                                                                  |                                           |
|                                                                                                                                                                                                                                                                                                                                                                                                                                                                                                                                                                                                                                                                            |                                           |
| (3) Del escribano Francisco Troche, vecino de la Ciudad de Michoacán, se conservan escrituras desde 1542 hasta 1569: Martínez Baracs–Espinosa Morales (1999), nº 1 y 184.                                                                                                                                                                                                                                                                                                                                                                                                                                                                                                  |                                           |
|                                                                                                                                                                                                                                                                                                                                                                                                                                                                                                                                                                                                                                                                            |                                           |
| (4) Puebla de los Ángeles.                                                                                                                                                                                                                                                                                                                                                                                                                                                                                                                                                                                                                                                 |                                           |
|                                                                                                                                                                                                                                                                                                                                                                                                                                                                                                                                                                                                                                                                            |                                           |
| (5) Ya aludimos a este importante escribano michoacano: supra, regº 17.                                                                                                                                                                                                                                                                                                                                                                                                                                                                                                                                                                                                    |                                           |
|                                                                                                                                                                                                                                                                                                                                                                                                                                                                                                                                                                                                                                                                            |                                           |
| (6) Quizá vecino de Pátzcuaro.                                                                                                                                                                                                                                                                                                                                                                                                                                                                                                                                                                                                                                             |                                           |
+----------------------------------------------------------------------------------------------------------------------------------------------------------------------------------------------------------------------------------------------------------------------------------------------------------------------------------------------------------------------------------------------------------------------------------------------------------------------------------------------------------------------------------------------------------------------------------------------------------------------------------------------------------------------------+-------------------------------------------+

Documento(s) original(es)

Archivo no encontrado (CAJAS/CAJA4/EXP1/001V.jpg)

Archivo no encontrado (CAJAS/CAJA4/EXP1/009V.jpg)

[]
1F

[]
2F

[]
2V

[]
3F

[]
3V

[]
4F

[]
4V

[]
5F

[]
5V

[]
6F

[]
6V

[]
7F

[]
7V

[]
8F

[]
8V

[]
9F

[]
10F

[]
10V

Proyecto interinstitucional del Archivo Histórico del Municipio de Colima y la Universidad de Colima,
realizado bajo los auspicios del fondo Ramón Álvarez-Buylla de Aldana.

------------------------------------------------------------------------

ISBN 978-968-7412-85-6
® Derechos Reservados 2008. Archivo Histórico del Municipio de Colima.

1,078 visitas
