+--------------------------------------------------------------------------------------------------------------------------------------------------------------------------------------------------------------------------------------------------------------------------------------------------------------------------------+-----------------------+-----------------------+
| []                                                                                                                                                                                                                                                                                                                             |                       |                       |
|                                                                                                                                                                                                                                                                                                                                |                       |                       |
| +-----------------------------------+:-------------------------------------:+                                                                                                                                                                                                                                                  |                       |                       |
| | []                                | LA VILLA DE COLIMA DE LA NUEVA ESPAÑA |                                                                                                                                                                                                                                                  |                       |                       |
| |                                   | SIGLO XVI                             |                                                                                                                                                                                                                                                  |                       |                       |
| |                                   |                                       |                                                                                                                                                                                                                                                  |                       |                       |
| |                                   | VOLUMEN II      (CAJAS 12-20)         |                                                                                                                                                                                                                                                  |                       |                       |
| +-----------------------------------+---------------------------------------+                                                                                                                                                                                                                                                  |                       |                       |
+--------------------------------------------------------------------------------------------------------------------------------------------------------------------------------------------------------------------------------------------------------------------------------------------------------------------------------+-----------------------+-----------------------+
| +------------------------------------------------------------------------+---------------------------+-----------------------+                                                                                                                                                                                                 |                       |                       |
| | Inicio | Búsqueda | Siglas y bibliografía | Créditos | Más información | (consulta las cajas 1-11) |    [ES]               |                                                                                                                                                                                                 |                       |                       |
| +------------------------------------------------------------------------+---------------------------+-----------------------+                                                                                                                                                                                                 |                       |                       |
+--------------------------------------------------------------------------------------------------------------------------------------------------------------------------------------------------------------------------------------------------------------------------------------------------------------------------------+-----------------------+-----------------------+
| Búsqueda rápida                                                                                                                                                                                                                                                                                                                |                       |                       |
|                                                                                                                                                                                                                                                                                                                                |                       |                       |
| +:--------------------:+-----------------+:----------------------------------------:+----------------:+                                                                                                                                                                                                                        |                       |                       |
| | Documento de fecha:  |                 | Ubicación física del documento original: | [] [] []        |                                                                                                                                                                                                                        |                       |                       |
| |                      |                 |                                          |                 |                                                                                                                                                                                                                        |                       |                       |
| | 1596. Septiembre, 14 |                 | Caja 19, exp. 1, ff. 131-151.^([853])    |                 |                                                                                                                                                                                                                        |                       |                       |
| +----------------------+-----------------+------------------------------------------+-----------------+                                                                                                                                                                                                                        |                       |                       |
|                                                                                                                                                                                                                                                                                                                                |                       |                       |
|   ------------- ---------------------------------------------------------------                                                                                                                                                                                                                                                |                       |                       |
|   Resumen:      Partición de bienes entre los herederos de Baltasar de Alcalá                                                                                                                                                                                                                                                  |                       |                       |
|   ------------- ---------------------------------------------------------------                                                                                                                                                                                                                                                |                       |                       |
|                                                                                                                                                                                                                                                                                                                                |                       |                       |
|   ----------------------------------- ---------------------------------------------------------------------------------------------------------------------------------------------------------------------------------------------------------------------------------------------------------------------------------------- |                       |                       |
|   Contenido:                          Los jueces árbitros Cristóbal Hernández de Tene y Diego Pérez de Espinosa proceden a la partición de bienes entre los herederos de Baltasar de Alcalá.                                                                                                                                   |                       |                       |
|                                       Primeramente, mandaron que se pagara a Francisca de Saldaña por 3,374 pesos y 3 tomines, con más los cien pesos contenidos y declarados de las arras que Baltasar de Alcalá recibió, como consta por carta de dote y matrimonio.                                                         |                       |                       |
|                                       Luego, procedieron a la partición general.                                                                                                                                                                                                                                               |                       |                       |
|                                       El cuerpo de los bienes partibles fue valuado en 1,401 pesos y 5 tomines de oro común, y 6,317 pesos y 3 tomines y 6 granos del dicho oro, en las deudas por partir, de los cuales, por ser bienes gananciales, le pertenecían a Francisca de Saldaña, su viuda, la mitad enteramente.   |                       |                       |
|                                       Los cuales se le adjudican, sumando un total de 5,490 pesos, 1 tomín y 6 granos de oro común.                                                                                                                                                                                            |                       |                       |
|                                       A Antonio de Ocampo y a María de Alcalá, su esposa, le corresponde una tercera parte de la otra mitad: 1,286 pesos, la misma cantidad que se adjudica a Agustín de Alcalá y a Francisca, menor, nieta del difunto.                                                                       |                       |                       |
|                                       El 25 de septiembre, los jueces terceros contadores y partidores, a petición de Antonio de Ocampo, tasaron las costas del proceso testamentario.                                                                                                                                         |                       |                       |
|                                       El 28 de septiembre, el justicia mayor don Antonio Enríquez aprobó cuentas y particiones.                                                                                                                                                                                                |                       |                       |
|                                                                                                                                                                                                                                                                                                                                |                       |                       |
|   ----------------------------------- ---------------------------------------------------------------------------------------------------------------------------------------------------------------------------------------------------------------------------------------------------------------------------------------- |                       |                       |
|                                                                                                                                                                                                                                                                                                                                |                       |                       |
| (853) Antes en caja 18, exp. 1.                                                                                                                                                                                                                                                                                                |                       |                       |
|                                                                                                                                                                                                                                                                                                                                |                       |                       |
|   ---------------------------------------------------------------------------------------------------                                                                                                                                                                                                                          |                       |                       |
|    Documento(s) original(es)                                                                                                                                                                                                                                                                                                   |                       |                       |
|   --------------------------- ------- ------- ------- ------- ------- ------- ------- ------- -------                                                                                                                                                                                                                          |                       |                       |
|               []                []      []      []      []      []      []      []      []      []                                                                                                                                                                                                                             |                       |                       |
|              131f              131v    132f    132v    133f    133v    134f    134v    135f    135v                                                                                                                                                                                                                            |                       |                       |
|                                                                                                                                                                                                                                                                                                                                |                       |                       |
|               []                []      []      []      []      []      []      []      []      []                                                                                                                                                                                                                             |                       |                       |
|              136f              136v    137f    137v    138f    138v    139f    139v    140f    140v                                                                                                                                                                                                                            |                       |                       |
|                                                                                                                                                                                                                                                                                                                                |                       |                       |
|               []                []      []      []      []      []      []      []      []      []                                                                                                                                                                                                                             |                       |                       |
|              141f              141v    142f    142v    143f    143v    144f    144v    145f    145v                                                                                                                                                                                                                            |                       |                       |
|                                                                                                                                                                                                                                                                                                                                |                       |                       |
|               []                []      []      []      []      []      []      []      []      []                                                                                                                                                                                                                             |                       |                       |
|              146f              146v    147f    147v    148f    148v    149f    149v    150f    151f                                                                                                                                                                                                                            |                       |                       |
|                                                                                                                                                                                                                                                                                                                                |                       |                       |
|               []                                                                                                                                                                                                                                                                                                               |                       |                       |
|              151v                                                                                                                                                                                                                                                                                                              |                       |                       |
|   ---------------------------------------------------------------------------------------------------                                                                                                                                                                                                                          |                       |                       |
+--------------------------------------------------------------------------------------------------------------------------------------------------------------------------------------------------------------------------------------------------------------------------------------------------------------------------------+-----------------------+-----------------------+
| +----------------------------------------------------------------------------+------------------------------------------------+                                                                                                                                                                                                |                       |                       |
| | ISBN 978-607-701-024-1                                                     |   ---- ---- ---- ---- ---- ---- ---- ---- ---- |                                                                                                                                                                                                |                       |                       |
| | © Derechos Reservados 2013. Archivo Histórico del Municipio de Colima. [*] |   []        []        []        []        []   |                                                                                                                                                                                                |                       |                       |
| |                                                                            |   ---- ---- ---- ---- ---- ---- ---- ---- ---- |                                                                                                                                                                                                |                       |                       |
| +----------------------------------------------------------------------------+------------------------------------------------+                                                                                                                                                                                                |                       |                       |
| |                                                                            |                                                |                                                                                                                                                                                                |                       |                       |
| +----------------------------------------------------------------------------+------------------------------------------------+                                                                                                                                                                                                |                       |                       |
+--------------------------------------------------------------------------------------------------------------------------------------------------------------------------------------------------------------------------------------------------------------------------------------------------------------------------------+-----------------------+-----------------------+

615 visitas
