+---------------------------------------------------------------------------------------------------------------------------------------------------------------------------------------------------------------------------------------------------------------------------------------------------------------------------------------------------------------------------------------------------------------------------+-----------------------+-----------------------+
| []                                                                                                                                                                                                                                                                                                                                                                                                                        |                       |                       |
|                                                                                                                                                                                                                                                                                                                                                                                                                           |                       |                       |
| +-----------------------------------+:-------------------------------------:+                                                                                                                                                                                                                                                                                                                                             |                       |                       |
| | []                                | LA VILLA DE COLIMA DE LA NUEVA ESPAÑA |                                                                                                                                                                                                                                                                                                                                             |                       |                       |
| |                                   | SIGLO XVI                             |                                                                                                                                                                                                                                                                                                                                             |                       |                       |
| |                                   |                                       |                                                                                                                                                                                                                                                                                                                                             |                       |                       |
| |                                   | VOLUMEN II      (CAJAS 12-20)         |                                                                                                                                                                                                                                                                                                                                             |                       |                       |
| +-----------------------------------+---------------------------------------+                                                                                                                                                                                                                                                                                                                                             |                       |                       |
+---------------------------------------------------------------------------------------------------------------------------------------------------------------------------------------------------------------------------------------------------------------------------------------------------------------------------------------------------------------------------------------------------------------------------+-----------------------+-----------------------+
| +------------------------------------------------------------------------+-------------------------------+-----------------------+                                                                                                                                                                                                                                                                                        |                       |                       |
| | Inicio | Búsqueda | Siglas y bibliografía | Créditos | Más información | Vol. I (1-11) Vol. II (12-20) |    [ES]               |                                                                                                                                                                                                                                                                                        |                       |                       |
| +------------------------------------------------------------------------+-------------------------------+-----------------------+                                                                                                                                                                                                                                                                                        |                       |                       |
+---------------------------------------------------------------------------------------------------------------------------------------------------------------------------------------------------------------------------------------------------------------------------------------------------------------------------------------------------------------------------------------------------------------------------+-----------------------+-----------------------+
| Búsqueda rápida                                                                                                                                                                                                                                                                                                                                                                                                           |                       |                       |
|                                                                                                                                                                                                                                                                                                                                                                                                                           |                       |                       |
| +:-------------------:+-----------------+:----------------------------------------:+----------------:+                                                                                                                                                                                                                                                                                                                    |                       |                       |
| | Documento de fecha: |                 | Ubicación física del documento original: | [] [] []        |                                                                                                                                                                                                                                                                                                                    |                       |                       |
| |                     |                 |                                          |                 |                                                                                                                                                                                                                                                                                                                    |                       |                       |
| | 1597. Febrero, 19   |                 | Caja 25, exp. 31, 2 ff.                  |                 |                                                                                                                                                                                                                                                                                                                    |                       |                       |
| +---------------------+-----------------+------------------------------------------+-----------------+                                                                                                                                                                                                                                                                                                                    |                       |                       |
|                                                                                                                                                                                                                                                                                                                                                                                                                           |                       |                       |
|   ------------- ---------------------------------------------------------------------------------------------                                                                                                                                                                                                                                                                                                             |                       |                       |
|   Resumen:      De oficio, contra un mulato que se dice Diego de Luna, por vivir amancebado con una mulata.                                                                                                                                                                                                                                                                                                               |                       |                       |
|   ------------- ---------------------------------------------------------------------------------------------                                                                                                                                                                                                                                                                                                             |                       |                       |
|                                                                                                                                                                                                                                                                                                                                                                                                                           |                       |                       |
|   ----------------------------------- ----------------------------------------------------------------------------------------------------------------------------------------------------------------------------------------------------------------------------------------------------------------------------------------------------------------------------------------------------------------------------------- |                       |                       |
|   Contenido:                          De oficio de la Real Justicia, el alcalde ordinario de la Villa de Colima Alonso García Nomparte procede contra Diego de Luna,^([1]) mulato, por tener noticia que vivía amancebado con María,^([2]) mulata de Cristóbal Hernández de Tene. El alcalde nombró por su defensor a Martín Guzmán Patiño.                                                                               |                       |                       |
|                                       Confesión                                                                                                                                                                                                                                                                                                                                                                           |                       |                       |
|                                       Alonso García Nomparte tomó la confesión al preso, quien dijo que “es mulato libre y criado de Cristóbal de Silva, que es su vaquero, y es de diez y nueve años, poco más o menos, y es soltero.                                                                                                                                                                                    |                       |                       |
|                                       Preguntado “porqué está preso y quién le prendió y cuándo y porqué causa, dijo que estando en casa de Cristóbal Hernández de Tene, el lunes pasado diez y siete deste mes de febrero, en la noche, le prendió Miguel Caballero^([3]) y lo llevó a la cárcel, y no sabe porqué, y que esto responde”.                                                                                |                       |                       |
|                                       Preguntado si era verdad que “está amancebado con María, mulata de Cristóbal Hernández de Tene, vecino desta dicha Villa, y cuántos años [hace], dijo que lo que sabe acerca de lo que se le pregunta es que este confesante tuvo acceso carnal con la dicha María, mulata, muchas veces ha dos años, y que habrá tres meses, poco más o menos, que la dejó y no trata con ella”.   |                       |                       |
|                                       El vecino Juan Agustín de la Puerta se ofreció por su fiador.                                                                                                                                                                                                                                                                                                                       |                       |                       |
|                                                                                                                                                                                                                                                                                                                                                                                                                           |                       |                       |
|   ----------------------------------- ----------------------------------------------------------------------------------------------------------------------------------------------------------------------------------------------------------------------------------------------------------------------------------------------------------------------------------------------------------------------------------- |                       |                       |
|                                                                                                                                                                                                                                                                                                                                                                                                                           |                       |                       |
| (1) Registrado Diego de Luna, mulato libre, en: Romero de Solís, Padrón de mulatos… (2007), 13, n° 87.                                                                                                                                                                                                                                                                                                                    |                       |                       |
|                                                                                                                                                                                                                                                                                                                                                                                                                           |                       |                       |
| (2) María está registrada, en: Romero de Solís, Padrón de mulatos… (2007), 13, n° 86.                                                                                                                                                                                                                                                                                                                                     |                       |                       |
|                                                                                                                                                                                                                                                                                                                                                                                                                           |                       |                       |
| (3) Da la impresión que Miguel Caballero era entonces teniente de alguacil: Romero de Solís, Conquistas e instituciones de gobierno… (2007), 342.                                                                                                                                                                                                                                                                         |                       |                       |
|                                                                                                                                                                                                                                                                                                                                                                                                                           |                       |                       |
|   ---------------------------------------------------------------------------------------------------                                                                                                                                                                                                                                                                                                                     |                       |                       |
|    Documento(s) original(es)                                                                                                                                                                                                                                                                                                                                                                                              |                       |                       |
|   --------------------------- ------- ------- ------- ------- ------- ------- ------- ------- -------                                                                                                                                                                                                                                                                                                                     |                       |                       |
|               []                []      []      []                                                                                                                                                                                                                                                                                                                                                                        |                       |                       |
|               1f                1v      2f      2v                                                                                                                                                                                                                                                                                                                                                                        |                       |                       |
|                                                                                                                                                                                                                                                                                                                                                                                                                           |                       |                       |
|   ---------------------------------------------------------------------------------------------------                                                                                                                                                                                                                                                                                                                     |                       |                       |
+---------------------------------------------------------------------------------------------------------------------------------------------------------------------------------------------------------------------------------------------------------------------------------------------------------------------------------------------------------------------------------------------------------------------------+-----------------------+-----------------------+
| +----------------------------------------------------------------------------+-----------------------------------------------:+                                                                                                                                                                                                                                                                                           |                       |                       |
| | ISBN 978-607-701-024-1                                                     |   ---- ---- ---- ---- ---- ---- ---- ---- ---- |                                                                                                                                                                                                                                                                                           |                       |                       |
| | © Derechos Reservados 2013. Archivo Histórico del Municipio de Colima. [*] |   []        []        []        []        []   |                                                                                                                                                                                                                                                                                           |                       |                       |
| |                                                                            |   ---- ---- ---- ---- ---- ---- ---- ---- ---- |                                                                                                                                                                                                                                                                                           |                       |                       |
| +----------------------------------------------------------------------------+------------------------------------------------+                                                                                                                                                                                                                                                                                           |                       |                       |
| |                                                                            |                                                |                                                                                                                                                                                                                                                                                           |                       |                       |
| +----------------------------------------------------------------------------+------------------------------------------------+                                                                                                                                                                                                                                                                                           |                       |                       |
+---------------------------------------------------------------------------------------------------------------------------------------------------------------------------------------------------------------------------------------------------------------------------------------------------------------------------------------------------------------------------------------------------------------------------+-----------------------+-----------------------+

636 visitas
