[]

LA VILLA DE COLIMA DE LA NUEVA ESPAÑA
SIGLO XVI

VOLUMEN I      (CAJAS 1-11)

[]

Inicio | Búsquedas | Siglas y bibliografía | Cartografía | Créditos | Más información

[]

Búsqueda rápida

+:---------------------------------------------------------------------------------------------------------------------------------------------------------------------------------------------------------------------------------------------------------------------------------------------------------------------------------------------------------------------------------------------------------------------------------------------------------------------------------------------------------------------------------------------------------------------------------------------------------------------------------------------------------------------------------------------------------------------------------:+------------------------------------------:+
| Fecha:                                                                                                                                                                                                                                                                                                                                                                                                                                                                                                                                                                                                                                                                                                                            | Ubicación física del documento original:  |
| 1566 Septiembre, 5                                                                                                                                                                                                                                                                                                                                                                                                                                                                                                                                                                                                                                                                                                                | CAJA A-5, EXP. 11, 7 FF.                  |
|                                                                                                                                                                                                                                                                                                                                                                                                                                                                                                                                                                                                                                                                                                                                   | Archivo Histórico del Municipio de Colima |
+-----------------------------------------------------------------------------------------------------------------------------------------------------------------------------------------------------------------------------------------------------------------------------------------------------------------------------------------------------------------------------------------------------------------------------------------------------------------------------------------------------------------------------------------------------------------------------------------------------------------------------------------------------------------------------------------------------------------------------------+-------------------------------------------+
| 125. 1566. Septiembre, 5.                                                                                                                                                                                                                                                                                                                                                                                                                                                                                                                                                                                                                                                                                                         |                                           |
|                                                                                                                                                                                                                                                                                                                                                                                                                                                                                                                                                                                                                                                                                                                                   |                                           |
| Juan de Iniesta reclama el pago de una cuenta de mercaderías a Álvaro de Grijalba.                                                                                                                                                                                                                                                                                                                                                                                                                                                                                                                                                                                                                                                |                                           |
|                                                                                                                                                                                                                                                                                                                                                                                                                                                                                                                                                                                                                                                                                                                                   |                                           |
| Álvaro de Grijalba, vecino de la Villa de Colima, había llevado de la tienda de Juan de Iniesta varias mercaderías obligándose a pagarlas.                                                                                                                                                                                                                                                                                                                                                                                                                                                                                                                                                                                        |                                           |
|                                                                                                                                                                                                                                                                                                                                                                                                                                                                                                                                                                                                                                                                                                                                   |                                           |
| La cuenta decía así:                                                                                                                                                                                                                                                                                                                                                                                                                                                                                                                                                                                                                                                                                                              |                                           |
|                                                                                                                                                                                                                                                                                                                                                                                                                                                                                                                                                                                                                                                                                                                                   |                                           |
| Memoria                                                                                                                                                                                                                                                                                                                                                                                                                                                                                                                                                                                                                                                                                                                           |                                           |
|                                                                                                                                                                                                                                                                                                                                                                                                                                                                                                                                                                                                                                                                                                                                   |                                           |
| "Llevó el dicho Álvaro de Grijalba un talabarte de terciopelo en cinco pesos; más, llevó la señora Catalina Ruiz ocho varas y tres cuartas de cotonia de Valencia, a peso la vara; más, llevó la dicha cinco varas de presilla a seis tomines vara; más, llevó vara y media de ruán oro, a peso vara; más, llevó la señora mujer del señor Álvaro de Grijalba una vara de holanda, en dos pesos".                                                                                                                                                                                                                                                                                                                                 |                                           |
|                                                                                                                                                                                                                                                                                                                                                                                                                                                                                                                                                                                                                                                                                                                                   |                                           |
| "Llevó Álvaro de Grijalba vara y cuarta de paño blanco a seis pesos la vara; más, llevó el dicho Álvaro de Grijalba siete varas de presilla a seis tomines vara; más, llevó el dicho una cuarta de paño blanco; más llevó el dicho una gorra de paño de Toledo, en dos pesos; más, llevó el dicho cuatro varas de presilla a seis tomines vara; más, llevó Álvaro de Grijalba una vara y media de holanda, a dos pesos vara; más, debe la señora Catalina Ruiz, su mujer, de un capillejo, tres pesos y medio; más, llevó una gorguera de hilo portugués, en tres pesos y medio".^([1])                                                                                                                                           |                                           |
|                                                                                                                                                                                                                                                                                                                                                                                                                                                                                                                                                                                                                                                                                                                                   |                                           |
| Al pie de esta cuenta, con fecha de 5 de septiembre de 1566, Álvaro de Grijalba reconoce ser verdad que de esta cuenta debe 37 pesos y 7 tomines y se obliga a pagarlos, estando por testigos Juan Martín y Alonso de Carrillo, quien firmó junto con Grijalba.                                                                                                                                                                                                                                                                                                                                                                                                                                                                   |                                           |
|                                                                                                                                                                                                                                                                                                                                                                                                                                                                                                                                                                                                                                                                                                                                   |                                           |
| Como Grijalba no había pagado a tiempo, Juan de Iniesta hizo presentación de esta carta cuenta ante el alcalde ordinario Diego de Velasco. Por mandado del alcalde, Grijalba volvió a reconocer este saldo el 9 de abril de 1567; fueron testigos Pedro de Arévalo, Cristóbal de Silva y Juan de Arrúe, vecinos de la Villa. Luego, Juan de Iniesta pidió al alcalde Velasco su mandamiento de ejecución. El 13 de abril así lo dispuso Velasco: "Alguacil mayor desta Villa u otro cualquier alguacil della, y a vos mando que hagáis entrega e ejecución en la persona e bienes de Álvaro de Grijalba", por 37 pesos y 7 tomines que está obligado a pagar a Iniesta por virtud de una carta cuenta reconocida de plazo pasado. |                                           |
|                                                                                                                                                                                                                                                                                                                                                                                                                                                                                                                                                                                                                                                                                                                                   |                                           |
| Sin embargo la tal ejecución parece no haberse hecho como se deduce por un nuevo dado al alguacil mayor por el alcalde Juan Fernández el 8 de julio del mismo año, exigiendo cumplir y guardar el anterior mandamiento. El 24 de ese mes, el alguacil mayor Juan Muñoz requirió a Grijalba, quien nombró por sus bienes "las casas de su morada en las que este alguacil hizo la dicha ejecución". Álvaro de Grijalba designó por su fiador a Bernaldino Cola. Estaban presentes como testigos Andrés García y Diego Morán, vecinos de Colima. Dio fe el escribano Juan Vázquez.                                                                                                                                                  |                                           |
|                                                                                                                                                                                                                                                                                                                                                                                                                                                                                                                                                                                                                                                                                                                                   |                                           |
| Los pregones se gritaron el 29 de julio, el 7 y 16 de agosto "por voz de Gaspar, indio ladino en la lengua mexicana". Fueron testigos de los mismos Francisco de Hoyos, Bernaldino de Guzmán, Gerónimo Serrano y Juan de Arrúe, vecinos de Colima.                                                                                                                                                                                                                                                                                                                                                                                                                                                                                |                                           |
|                                                                                                                                                                                                                                                                                                                                                                                                                                                                                                                                                                                                                                                                                                                                   |                                           |
| El 31 de julio, ante el escribano Miguel Rodríguez, Juan de Iniesta otorgó todo su poder "a vos, Nicolás Bote, mi cuñado, e Andrés Martel, vecinos desta Villa". Testigos: Baltasar de Alcalá, Bernaldino de Guzmán y Bernardino Cola, vecinos de la Villa.                                                                                                                                                                                                                                                                                                                                                                                                                                                                       |                                           |
|                                                                                                                                                                                                                                                                                                                                                                                                                                                                                                                                                                                                                                                                                                                                   |                                           |
| El 25 de agosto, Nicolás Bote, en nombre de Iniesta, decía que el término de los pregones ya había transcurrido, por lo que pedía hacer trance y remate.                                                                                                                                                                                                                                                                                                                                                                                                                                                                                                                                                                          |                                           |
|                                                                                                                                                                                                                                                                                                                                                                                                                                                                                                                                                                                                                                                                                                                                   |                                           |
| El alcalde Diego de Velasco, el 24 de septiembre, dictó su fallo de "avivar la voz del almoneda y hacer trance y remate de los bienes ejecutados, e de su precio e valor hacer entero e cumplido pago de los pesos de oro y costas porque pidió esta ejecución a la parte del dicho Juan de Iniesta".                                                                                                                                                                                                                                                                                                                                                                                                                             |                                           |
|                                                                                                                                                                                                                                                                                                                                                                                                                                                                                                                                                                                                                                                                                                                                   |                                           |
| Dos días después, ante el escribano Juan Vázquez y los testigos Juan Fernández y Juan Muñoz, "paresció Juan Griego,^([2]) vecino desta Villa", haciéndose fiador de Juan de Iniesta.                                                                                                                                                                                                                                                                                                                                                                                                                                                                                                                                              |                                           |
|                                                                                                                                                                                                                                                                                                                                                                                                                                                                                                                                                                                                                                                                                                                                   |                                           |
| Caja A–5, exp. 11, 7 ff.                                                                                                                                                                                                                                                                                                                                                                                                                                                                                                                                                                                                                                                                                                          |                                           |
|                                                                                                                                                                                                                                                                                                                                                                                                                                                                                                                                                                                                                                                                                                                                   |                                           |
|                                                                                                                                                                                                                                                                                                                                                                                                                                                                                                                                                                                                                                                                                                                                   |                                           |
|                                                                                                                                                                                                                                                                                                                                                                                                                                                                                                                                                                                                                                                                                                                                   |                                           |
| ---------------                                                                                                                                                                                                                                                                                                                                                                                                                                                                                                                                                                                                                                                                                                                   |                                           |
|                                                                                                                                                                                                                                                                                                                                                                                                                                                                                                                                                                                                                                                                                                                                   |                                           |
| (1) Al margen: "Recibí de la señora Catalina Ruiz, 3 pesos 4 tomines".                                                                                                                                                                                                                                                                                                                                                                                                                                                                                                                                                                                                                                                            |                                           |
|                                                                                                                                                                                                                                                                                                                                                                                                                                                                                                                                                                                                                                                                                                                                   |                                           |
| (2) Juan Griego: ver regº 121, 130, 186, 241, 251.                                                                                                                                                                                                                                                                                                                                                                                                                                                                                                                                                                                                                                                                                |                                           |
+-----------------------------------------------------------------------------------------------------------------------------------------------------------------------------------------------------------------------------------------------------------------------------------------------------------------------------------------------------------------------------------------------------------------------------------------------------------------------------------------------------------------------------------------------------------------------------------------------------------------------------------------------------------------------------------------------------------------------------------+-------------------------------------------+

Documento(s) original(es)

Archivo no encontrado (CAJAS/CAJA5/EXP11/004V.jpg)

Archivo no encontrado (CAJAS/CAJA5/EXP11/007F.jpg)

[]
1F

[]
1V

[]
2F

[]
2V

[]
3F

[]
3V

[]
4F

[]
5F

[]
5V

[]
6F

[]
6V

[]
7V

Proyecto interinstitucional del Archivo Histórico del Municipio de Colima y la Universidad de Colima,
realizado bajo los auspicios del fondo Ramón Álvarez-Buylla de Aldana.

------------------------------------------------------------------------

ISBN 978-968-7412-85-6
® Derechos Reservados 2008. Archivo Histórico del Municipio de Colima.

1,078 visitas
