+----------------------------------------------------------------------------------------------------------------------------------------------------------------------------------------------------------------------------------------------------------------------------------------------------------------------------------------------------------------------------+---------------------------------------+-----------------------+
| []                                                                                                                                                                                                                                                                                                                                                                         | LA VILLA DE COLIMA DE LA NUEVA ESPAÑA | []                    |
|                                                                                                                                                                                                                                                                                                                                                                            | SIGLO XVI                             |                       |
|                                                                                                                                                                                                                                                                                                                                                                            |                                       |                       |
|                                                                                                                                                                                                                                                                                                                                                                            | VOLUMEN I      (CAJAS 1-11)           |                       |
+----------------------------------------------------------------------------------------------------------------------------------------------------------------------------------------------------------------------------------------------------------------------------------------------------------------------------------------------------------------------------+---------------------------------------+-----------------------+
| Inicio | Búsquedas | Siglas y bibliografía | Cartografía | Créditos | Más información                                                                                                                                                                                                                                                                                      |                                       | []                    |
+----------------------------------------------------------------------------------------------------------------------------------------------------------------------------------------------------------------------------------------------------------------------------------------------------------------------------------------------------------------------------+---------------------------------------+-----------------------+
| Búsqueda rápida                                                                                                                                                                                                                                                                                                                                                            |                                       |                       |
|                                                                                                                                                                                                                                                                                                                                                                            |                                       |                       |
| +:--------------------------------------------------------------------------------------------------------------------------------------------------------------------------------------------------------------------------------------------------------------------------------------------------------------------------:+------------------------------------------:+ |                                       |                       |
| | Fecha:                                                                                                                                                                                                                                                                                                                     | Ubicación física del documento original:  | |                                       |                       |
| | 1566 Octubre, 12                                                                                                                                                                                                                                                                                                           | CAJA A-5, EXP. 13, F. 19 FTE.             | |                                       |                       |
| |                                                                                                                                                                                                                                                                                                                            | Archivo Histórico del Municipio de Colima | |                                       |                       |
| +----------------------------------------------------------------------------------------------------------------------------------------------------------------------------------------------------------------------------------------------------------------------------------------------------------------------------+-------------------------------------------+ |                                       |                       |
| | 148. 1566. Octubre, 12.                                                                                                                                                                                                                                                                                                    |                                           | |                                       |                       |
| |                                                                                                                                                                                                                                                                                                                            |                                           | |                                       |                       |
| | Remate de tributos del pueblo de Tecoman.                                                                                                                                                                                                                                                                                  |                                           | |                                       |                       |
| |                                                                                                                                                                                                                                                                                                                            |                                           | |                                       |                       |
| | [Al margen: Ticoman].                                                                                                                                                                                                                                                                                                      |                                           | |                                       |                       |
| |                                                                                                                                                                                                                                                                                                                            |                                           | |                                       |                       |
| | El alcalde mayor Alonso Sánchez de Figueroa dijo que por cuanto "los indios del pueblo de Ticoman e su partido,^([1]) donde Su Merced es corregidor por Su Majestad, tienen cinco mantas de los cuatro meses de vacación e para que se vendan en la persona que más por ellos diere", mandó su remate en almoneda pública. |                                           | |                                       |                       |
| |                                                                                                                                                                                                                                                                                                                            |                                           | |                                       |                       |
| | Juan, indio ladino en lengua castellana, gritó los pregones, presentándose Baltasar de Alcalá, quien puso cada manta a 3 pesos de oro común. Fuéle adjudicado el remate ante los testigos Diego de Aguilar, Juan Gómez y Suero Vázquez. Pasó ante el escribano Miguel Rodríguez.                                           |                                           | |                                       |                       |
| |                                                                                                                                                                                                                                                                                                                            |                                           | |                                       |                       |
| | Caja A–5, exp. 13, f. 19 fte.                                                                                                                                                                                                                                                                                              |                                           | |                                       |                       |
| |                                                                                                                                                                                                                                                                                                                            |                                           | |                                       |                       |
| |                                                                                                                                                                                                                                                                                                                            |                                           | |                                       |                       |
| |                                                                                                                                                                                                                                                                                                                            |                                           | |                                       |                       |
| | ---------------                                                                                                                                                                                                                                                                                                            |                                           | |                                       |                       |
| |                                                                                                                                                                                                                                                                                                                            |                                           | |                                       |                       |
| | (1) Véase supra, regº 142.                                                                                                                                                                                                                                                                                                 |                                           | |                                       |                       |
| +----------------------------------------------------------------------------------------------------------------------------------------------------------------------------------------------------------------------------------------------------------------------------------------------------------------------------+-------------------------------------------+ |                                       |                       |
|                                                                                                                                                                                                                                                                                                                                                                            |                                       |                       |
|   ---------------------------------------------------------------------------------------------------                                                                                                                                                                                                                                                                      |                                       |                       |
|    Documento(s) original(es)                                                                                                                                                                                                                                                                                                                                               |                                       |                       |
|   --------------------------- ------- ------- ------- ------- ------- ------- ------- ------- -------                                                                                                                                                                                                                                                                      |                                       |                       |
|               []                                                                                                                                                                                                                                                                                                                                                           |                                       |                       |
|               19F                                                                                                                                                                                                                                                                                                                                                          |                                       |                       |
|                                                                                                                                                                                                                                                                                                                                                                            |                                       |                       |
|   ---------------------------------------------------------------------------------------------------                                                                                                                                                                                                                                                                      |                                       |                       |
+----------------------------------------------------------------------------------------------------------------------------------------------------------------------------------------------------------------------------------------------------------------------------------------------------------------------------------------------------------------------------+---------------------------------------+-----------------------+
| Proyecto interinstitucional del Archivo Histórico del Municipio de Colima y la Universidad de Colima,                                                                                                                                                                                                                                                                      |                                       |                       |
| realizado bajo los auspicios del fondo Ramón Álvarez-Buylla de Aldana.                                                                                                                                                                                                                                                                                                     |                                       |                       |
|                                                                                                                                                                                                                                                                                                                                                                            |                                       |                       |
| ------------------------------------------------------------------------                                                                                                                                                                                                                                                                                                   |                                       |                       |
|                                                                                                                                                                                                                                                                                                                                                                            |                                       |                       |
| ISBN 978-968-7412-85-6                                                                                                                                                                                                                                                                                                                                                     |                                       |                       |
| ® Derechos Reservados 2008. Archivo Histórico del Municipio de Colima.                                                                                                                                                                                                                                                                                                     |                                       |                       |
+----------------------------------------------------------------------------------------------------------------------------------------------------------------------------------------------------------------------------------------------------------------------------------------------------------------------------------------------------------------------------+---------------------------------------+-----------------------+

1,078 visitas
