[]

LA VILLA DE COLIMA DE LA NUEVA ESPAÑA
SIGLO XVI

VOLUMEN I      (CAJAS 1-11)

[]

Inicio | Búsquedas | Siglas y bibliografía | Cartografía | Créditos | Más información

[]

Búsqueda rápida

+:-----------------------------------------------------------------------------------------------------------------------------------------------------------------------------------------------------------------------------------------------------------------------------------------------------------------------------------------------------------------------------------------------------------------------------------------------------------------------------------------------------------------------------------------------------------------------------------------------------------------------------:+------------------------------------------:+
| Fecha:                                                                                                                                                                                                                                                                                                                                                                                                                                                                                                                                                                                                                        | Ubicación física del documento original:  |
| 1562 Mayo, 30                                                                                                                                                                                                                                                                                                                                                                                                                                                                                                                                                                                                                 | CAJA A-3, EXP. 14, 6 FF.                  |
|                                                                                                                                                                                                                                                                                                                                                                                                                                                                                                                                                                                                                               | Archivo Histórico del Municipio de Colima |
+-------------------------------------------------------------------------------------------------------------------------------------------------------------------------------------------------------------------------------------------------------------------------------------------------------------------------------------------------------------------------------------------------------------------------------------------------------------------------------------------------------------------------------------------------------------------------------------------------------------------------------+-------------------------------------------+
| 77. 1562. Mayo, 30.                                                                                                                                                                                                                                                                                                                                                                                                                                                                                                                                                                                                           |                                           |
|                                                                                                                                                                                                                                                                                                                                                                                                                                                                                                                                                                                                                               |                                           |
| Gonzalo López de Ayala pide ser emancipado de la tutela de su madre, Beatriz López.                                                                                                                                                                                                                                                                                                                                                                                                                                                                                                                                           |                                           |
|                                                                                                                                                                                                                                                                                                                                                                                                                                                                                                                                                                                                                               |                                           |
| "Gonzalo López de Ayala, hijo legítimo de Alonso de Arévalo, difunto, que sea en gloria, y de doña Beatriz López, su legítima mujer, ante V.m. parezco [...] y digo que al tiempo que el dicho mi padre murió, dejó muchos bienes de los cuales me pertenescen a mí parte dellos como uno de sus legítimos herederos, y hasta agora, como menor, los ha tenido y tiene la dicha doña Beatriz, mi madre; y porque yo soy hábil y suficiente para poder regir y gobernar" y tener la edad de 25 años que el derecho dispone para comparecer en juicio sin curador de persona y bienes, "tengo necesidad de me emancipar".^([1]) |                                           |
|                                                                                                                                                                                                                                                                                                                                                                                                                                                                                                                                                                                                                               |                                           |
| El alcalde mayor Diego Núñez de Guzmán dispuso que fuese notificada Beatriz López. El escribano Diego Veedor así lo hizo en la persona de Diego de Mendoza, como marido de doña Beatriz, siendo testigos Luis de Grijalba y Melchor Pérez, vecinos de Colima.                                                                                                                                                                                                                                                                                                                                                                 |                                           |
|                                                                                                                                                                                                                                                                                                                                                                                                                                                                                                                                                                                                                               |                                           |
| El mismo día, Diego de Mendoza y Beatriz López firmaban un escrito donde decían haber recibido del alcalde mayor "traslado de una petición que Gonzalo López, nuestro hijo, ante V.m. presentó pidiendo V.m. le emancipase"; agregan en su escrito: "V.m. lo debe proveer como lo pide, pues el susodicho Gonzalo López es hábil y suficiente para ello, y mozo de buena vida y fama, y quitado de todo vicio, y ansí lo pedimos y suplicamos".                                                                                                                                                                               |                                           |
|                                                                                                                                                                                                                                                                                                                                                                                                                                                                                                                                                                                                                               |                                           |
| El alcalde mandó que el menor hiciera información. Gonzalo López presentó por testigos a Juan Preciado, Alonso Miguel, Andrés de Madrid y Diego de Velasco, vecinos de la Villa de Colima.                                                                                                                                                                                                                                                                                                                                                                                                                                    |                                           |
|                                                                                                                                                                                                                                                                                                                                                                                                                                                                                                                                                                                                                               |                                           |
| Preciado dice conocer a Gonzalo "de tiempo de quince años a esta parte", que quizá no tenga 25 años, sino 22 poco más o menos pero tiene habilidad "como si fuese de treinta y que lo tiene por mancebo muy honrado e de buena crianza, e que después que le conoce no le ha visto hacer cosa que no deba". En su opinión, se le puede emancipar. Juan Preciado dice tener más de 25 años.                                                                                                                                                                                                                                    |                                           |
|                                                                                                                                                                                                                                                                                                                                                                                                                                                                                                                                                                                                                               |                                           |
| Alonso Miguel, quien dijo tener más de 30 años, declaró conocer a Gonzalo desde hace 22 años, y opina que es hábil y suficiente para que se le entregue su hacienda y sea emancipado.                                                                                                                                                                                                                                                                                                                                                                                                                                         |                                           |
|                                                                                                                                                                                                                                                                                                                                                                                                                                                                                                                                                                                                                               |                                           |
| Andrés de Madrid dice conocerlo desde hace 13 o 14 años. Agrega: "porque aunque no sea de veinte e cinco años sino de veinte e dos, tiene prudencia de hombre viejo". En su opinión se le puede emancipar y entregar su hacienda, ya que "no tiene vicio de juego ni de otra cosa". Dice el testigo tener más de 25 años.                                                                                                                                                                                                                                                                                                     |                                           |
|                                                                                                                                                                                                                                                                                                                                                                                                                                                                                                                                                                                                                               |                                           |
| Diego de Velasco, quien declara tener más de 30 años de edad, dice que Gonzalo "es mancebo muy honrado", a quien el alcalde mayor puede emancipar; que tiene "seso y juicio de más edad".                                                                                                                                                                                                                                                                                                                                                                                                                                     |                                           |
|                                                                                                                                                                                                                                                                                                                                                                                                                                                                                                                                                                                                                               |                                           |
| El alcalde mayor, recibida la información, mandó que por cuanto Gonzalo López de Ayala no ha cumplido aún los 25 años, que para ser emancipado y recibir su hacienda, deberá dar fianzas.                                                                                                                                                                                                                                                                                                                                                                                                                                     |                                           |
|                                                                                                                                                                                                                                                                                                                                                                                                                                                                                                                                                                                                                               |                                           |
| El mismo día, Gonzalo López compareció y en presencia de Diego de Velasco, Tomás Herades y Melchor Pérez, vecinos de la Villa, puso por fiador a su hermano Pedro de Arévalo, quien dijo que fiaba y fió.                                                                                                                                                                                                                                                                                                                                                                                                                     |                                           |
|                                                                                                                                                                                                                                                                                                                                                                                                                                                                                                                                                                                                                               |                                           |
| Finalmente, el alcalde firmó la emancipación.                                                                                                                                                                                                                                                                                                                                                                                                                                                                                                                                                                                 |                                           |
|                                                                                                                                                                                                                                                                                                                                                                                                                                                                                                                                                                                                                               |                                           |
| Caja A–3, exp. 14, 6 ff.                                                                                                                                                                                                                                                                                                                                                                                                                                                                                                                                                                                                      |                                           |
|                                                                                                                                                                                                                                                                                                                                                                                                                                                                                                                                                                                                                               |                                           |
|                                                                                                                                                                                                                                                                                                                                                                                                                                                                                                                                                                                                                               |                                           |
|                                                                                                                                                                                                                                                                                                                                                                                                                                                                                                                                                                                                                               |                                           |
| ---------------                                                                                                                                                                                                                                                                                                                                                                                                                                                                                                                                                                                                               |                                           |
|                                                                                                                                                                                                                                                                                                                                                                                                                                                                                                                                                                                                                               |                                           |
| (1) Una vez emancipado, Gonzalo se trasladó a Zacatecas y México, donde falleció en 1569, otorgando testamento el 11 de octubre de ese año. Más información, en: Romero de Solís, Andariegos y pobladores... (2001), 259-261.                                                                                                                                                                                                                                                                                                                                                                                                 |                                           |
+-------------------------------------------------------------------------------------------------------------------------------------------------------------------------------------------------------------------------------------------------------------------------------------------------------------------------------------------------------------------------------------------------------------------------------------------------------------------------------------------------------------------------------------------------------------------------------------------------------------------------------+-------------------------------------------+

Documento(s) original(es)

Archivo no encontrado (CAJAS/CAJA3/EXP14/006V.jpg)

[]
1F

[]
1V

[]
2F

[]
2V

[]
3F

[]
3V

[]
4F

[]
4V

[]
5F

[]
5V

[]
6F

Proyecto interinstitucional del Archivo Histórico del Municipio de Colima y la Universidad de Colima,
realizado bajo los auspicios del fondo Ramón Álvarez-Buylla de Aldana.

------------------------------------------------------------------------

ISBN 978-968-7412-85-6
® Derechos Reservados 2008. Archivo Histórico del Municipio de Colima.

1,078 visitas
