+---------------------------------------------------------------------------------------------------------------------------------------------------------------------------------------------------------------------------------------------------------------------------------------------------------------------------------------------------------------------------------------------------------------------------------+-----------------------+-----------------------+
| []                                                                                                                                                                                                                                                                                                                                                                                                                              |                       |                       |
|                                                                                                                                                                                                                                                                                                                                                                                                                                 |                       |                       |
| +-----------------------------------+:-------------------------------------:+                                                                                                                                                                                                                                                                                                                                                   |                       |                       |
| | []                                | LA VILLA DE COLIMA DE LA NUEVA ESPAÑA |                                                                                                                                                                                                                                                                                                                                                   |                       |                       |
| |                                   | SIGLO XVI                             |                                                                                                                                                                                                                                                                                                                                                   |                       |                       |
| |                                   |                                       |                                                                                                                                                                                                                                                                                                                                                   |                       |                       |
| |                                   | VOLUMEN II      (CAJAS 12-20)         |                                                                                                                                                                                                                                                                                                                                                   |                       |                       |
| +-----------------------------------+---------------------------------------+                                                                                                                                                                                                                                                                                                                                                   |                       |                       |
+---------------------------------------------------------------------------------------------------------------------------------------------------------------------------------------------------------------------------------------------------------------------------------------------------------------------------------------------------------------------------------------------------------------------------------+-----------------------+-----------------------+
| +------------------------------------------------------------------------+---------------------------+-----------------------+                                                                                                                                                                                                                                                                                                  |                       |                       |
| | Inicio | Búsqueda | Siglas y bibliografía | Créditos | Más información | (consulta las cajas 1-11) |    [ES]               |                                                                                                                                                                                                                                                                                                  |                       |                       |
| +------------------------------------------------------------------------+---------------------------+-----------------------+                                                                                                                                                                                                                                                                                                  |                       |                       |
+---------------------------------------------------------------------------------------------------------------------------------------------------------------------------------------------------------------------------------------------------------------------------------------------------------------------------------------------------------------------------------------------------------------------------------+-----------------------+-----------------------+
| Búsqueda rápida                                                                                                                                                                                                                                                                                                                                                                                                                 |                       |                       |
|                                                                                                                                                                                                                                                                                                                                                                                                                                 |                       |                       |
| +:-------------------:+-----------------+:----------------------------------------:+----------------:+                                                                                                                                                                                                                                                                                                                          |                       |                       |
| | Documento de fecha: |                 | Ubicación física del documento original: | [] [] []        |                                                                                                                                                                                                                                                                                                                          |                       |                       |
| |                     |                 |                                          |                 |                                                                                                                                                                                                                                                                                                                          |                       |                       |
| | 1594. Agosto, 3     |                 | Caja 18, exp. 15, ff. 153-155.           |                 |                                                                                                                                                                                                                                                                                                                          |                       |                       |
| +---------------------+-----------------+------------------------------------------+-----------------+                                                                                                                                                                                                                                                                                                                          |                       |                       |
|                                                                                                                                                                                                                                                                                                                                                                                                                                 |                       |                       |
|   ------------- ------------------------------------------------------------------------------------------------------------------------------------------------------                                                                                                                                                                                                                                                          |                       |                       |
|   Resumen:      De oficio, contra Francisco y Juan Núñez porque pretendieron matar a Álvaro Fernández, cuando en compañía de muchas personas iban a ganar el Jubileo                                                                                                                                                                                                                                                            |                       |                       |
|   ------------- ------------------------------------------------------------------------------------------------------------------------------------------------------                                                                                                                                                                                                                                                          |                       |                       |
|                                                                                                                                                                                                                                                                                                                                                                                                                                 |                       |                       |
|   ----------------------------------- ----------------------------------------------------------------------------------------------------------------------------------------------------------------------------------------------------------------------------------------------------------------------------------------------------------------------------------------------------------------------------------------- |                       |                       |
|   Contenido:                          El alcalde ordinario de la Villa de Colima Antonio Carrillo de Guzmán procede de oficio, porque ha tenido noticias acerca de un incidente surgido “entre el pueblo de San Francisco y esta Villa”, cuando el médico Álvaro Fernández iba a dicho pueblo y a su convento “en compañía de muchas personas que iban a ganar el Jubileo, que ayer se celebró en el dicho convento”.^([751])   |                       |                       |
|                                       Según parece, Francisco Núñez, Pillo salió al dicho Camino Real en compañía de su hermano Juan, armados con lanzas y espadas, pretendiendo matar a Álvaro Fernández, a quien, delante de toda la gente, desafiaron.                                                                                                                                                                       |                       |                       |
|                                       Además, porque “hoy como a las diez”, cuando estaba Álvaro Fernández en casa de Juan Sánchez El Viejo, llegó Francisco Núñez, Pillo, y le volvió a desafiar. “Y se apeó de la bestia en que venía, y echaron mano a sus espadas, de lo cual mandó se haga información”.                                                                                                                   |                       |                       |
|                                       Declaran Juan Sánchez El Viejo y Juan Alonso Mejía, vecino y estante en la Villa, respectivamente.                                                                                                                                                                                                                                                                                        |                       |                       |
|                                       Luego atestiguó Martín de Segura: Núñez “con un cuchillo despuntado”, hirió en un muslo al médico.                                                                                                                                                                                                                                                                                        |                       |                       |
|                                       El alcalde Carrillo de Guzmán dictó entonces orden de aprehensión contra Núñez.                                                                                                                                                                                                                                                                                                           |                       |                       |
|                                       Un año después, el alcalde ordinario Diego Mejía de la Torre notificó a Álvaro Fernández, querellante, para que presentara su formal acusación, pero éste dijo que se apartaba de la querella.                                                                                                                                                                                            |                       |                       |
|                                       El alcalde Mejía mandó al teniente de alguacil y alcaide de la cárcel Pero Gómez Nájera a que mantuviese preso y a buen recaudo al preso “con pena de quinientos pesos para la Cámara de Su Majestad, e pagar las penas en que fuese condenado el dicho Francisco Núñez”, si se le escapaba.                                                                                              |                       |                       |
|                                                                                                                                                                                                                                                                                                                                                                                                                                 |                       |                       |
|   ----------------------------------- ----------------------------------------------------------------------------------------------------------------------------------------------------------------------------------------------------------------------------------------------------------------------------------------------------------------------------------------------------------------------------------------- |                       |                       |
|                                                                                                                                                                                                                                                                                                                                                                                                                                 |                       |                       |
| (751) Jubileo de la Porciúncula, como se comentó en el regº 699.                                                                                                                                                                                                                                                                                                                                                                |                       |                       |
|                                                                                                                                                                                                                                                                                                                                                                                                                                 |                       |                       |
|   ---------------------------------------------------------------------------------------------------                                                                                                                                                                                                                                                                                                                           |                       |                       |
|    Documento(s) original(es)                                                                                                                                                                                                                                                                                                                                                                                                    |                       |                       |
|   --------------------------- ------- ------- ------- ------- ------- ------- ------- ------- -------                                                                                                                                                                                                                                                                                                                           |                       |                       |
|               []                []      []      []      []      []                                                                                                                                                                                                                                                                                                                                                              |                       |                       |
|              153f              153v    154f    154v    155f    155v                                                                                                                                                                                                                                                                                                                                                             |                       |                       |
|                                                                                                                                                                                                                                                                                                                                                                                                                                 |                       |                       |
|   ---------------------------------------------------------------------------------------------------                                                                                                                                                                                                                                                                                                                           |                       |                       |
+---------------------------------------------------------------------------------------------------------------------------------------------------------------------------------------------------------------------------------------------------------------------------------------------------------------------------------------------------------------------------------------------------------------------------------+-----------------------+-----------------------+
| +----------------------------------------------------------------------------+------------------------------------------------+                                                                                                                                                                                                                                                                                                 |                       |                       |
| | ISBN 978-607-701-024-1                                                     |   ---- ---- ---- ---- ---- ---- ---- ---- ---- |                                                                                                                                                                                                                                                                                                 |                       |                       |
| | © Derechos Reservados 2013. Archivo Histórico del Municipio de Colima. [*] |   []        []        []        []        []   |                                                                                                                                                                                                                                                                                                 |                       |                       |
| |                                                                            |   ---- ---- ---- ---- ---- ---- ---- ---- ---- |                                                                                                                                                                                                                                                                                                 |                       |                       |
| +----------------------------------------------------------------------------+------------------------------------------------+                                                                                                                                                                                                                                                                                                 |                       |                       |
| |                                                                            |                                                |                                                                                                                                                                                                                                                                                                 |                       |                       |
| +----------------------------------------------------------------------------+------------------------------------------------+                                                                                                                                                                                                                                                                                                 |                       |                       |
+---------------------------------------------------------------------------------------------------------------------------------------------------------------------------------------------------------------------------------------------------------------------------------------------------------------------------------------------------------------------------------------------------------------------------------+-----------------------+-----------------------+

615 visitas
