+---------------------------------------------------------------------------------------------------------------------------------+-----------------------+-----------------------+
| []                                                                                                                              |                       |                       |
|                                                                                                                                 |                       |                       |
| +-----------------------------------+:-------------------------------------:+                                                   |                       |                       |
| | []                                | LA VILLA DE COLIMA DE LA NUEVA ESPAÑA |                                                   |                       |                       |
| |                                   | SIGLO XVI                             |                                                   |                       |                       |
| |                                   |                                       |                                                   |                       |                       |
| |                                   | VOLUMEN II      (CAJAS 12-20)         |                                                   |                       |                       |
| +-----------------------------------+---------------------------------------+                                                   |                       |                       |
+---------------------------------------------------------------------------------------------------------------------------------+-----------------------+-----------------------+
| +------------------------------------------------------------------------+---------------------------+-----------------------+  |                       |                       |
| | Inicio | Búsqueda | Siglas y bibliografía | Créditos | Más información | (consulta las cajas 1-11) |    [ES]               |  |                       |                       |
| +------------------------------------------------------------------------+---------------------------+-----------------------+  |                       |                       |
+---------------------------------------------------------------------------------------------------------------------------------+-----------------------+-----------------------+
| Búsqueda rápida                                                                                                                 |                       |                       |
|                                                                                                                                 |                       |                       |
| +:-------------------:+-----------------+:----------------------------------------:+----------------:+                          |                       |                       |
| | Documento de fecha: |                 | Ubicación física del documento original: | [] [] []        |                          |                       |                       |
| |                     |                 |                                          |                 |                          |                       |                       |
| | 1595. Diciembre, 1º |                 | Caja 12, exp. 8, f. 51                   |                 |                          |                       |                       |
| |                     |                 |                                          |                 |                          |                       |                       |
| |                     |                 | Nota(s): Antes ff. 39 fte y vta.         |                 |                          |                       |                       |
| +---------------------+-----------------+------------------------------------------+-----------------+                          |                       |                       |
|                                                                                                                                 |                       |                       |
|   ------------- --------------------------------------------------------------------------------------------------              |                       |                       |
|   Resumen:      Gaspar Román y Pero Gómez Machorro, mancomunadamente, otorgan poder a la Justicia de Su Majestad                |                       |                       |
|   ------------- --------------------------------------------------------------------------------------------------              |                       |                       |
|                                                                                                                                 |                       |                       |
|   ----------------------------------- -------------------------------------------------------------------------------           |                       |                       |
|   Contenido:                          Testigos: Diego Arias Arellano, Jusepe Herrera y el Padre Pedro de Solórzano.             |                       |                       |
|                                       Escribano: Cristóbal Hernández de Tene.                                                   |                       |                       |
|                                                                                                                                 |                       |                       |
|   ----------------------------------- -------------------------------------------------------------------------------           |                       |                       |
|                                                                                                                                 |                       |                       |
|   ---------------------------------------------------------------------------------------------------                           |                       |                       |
|    Documento(s) original(es)                                                                                                    |                       |                       |
|   --------------------------- ------- ------- ------- ------- ------- ------- ------- ------- -------                           |                       |                       |
|               []                []                                                                                              |                       |                       |
|               51f               51v                                                                                             |                       |                       |
|                                                                                                                                 |                       |                       |
|   ---------------------------------------------------------------------------------------------------                           |                       |                       |
+---------------------------------------------------------------------------------------------------------------------------------+-----------------------+-----------------------+
| +----------------------------------------------------------------------------+------------------------------------------------+ |                       |                       |
| | ISBN 978-607-701-024-1                                                     |   ---- ---- ---- ---- ---- ---- ---- ---- ---- | |                       |                       |
| | © Derechos Reservados 2013. Archivo Histórico del Municipio de Colima. [*] |   []        []        []        []        []   | |                       |                       |
| |                                                                            |   ---- ---- ---- ---- ---- ---- ---- ---- ---- | |                       |                       |
| +----------------------------------------------------------------------------+------------------------------------------------+ |                       |                       |
| |                                                                            |                                                | |                       |                       |
| +----------------------------------------------------------------------------+------------------------------------------------+ |                       |                       |
+---------------------------------------------------------------------------------------------------------------------------------+-----------------------+-----------------------+

615 visitas
