+--------------------------------------------------------------------------------------------------------------------------------------------------------------------------------------------------------------------------------------------------------------+-----------------------+-----------------------+
| []                                                                                                                                                                                                                                                           |                       |                       |
|                                                                                                                                                                                                                                                              |                       |                       |
| +-----------------------------------+:-------------------------------------:+                                                                                                                                                                                |                       |                       |
| | []                                | LA VILLA DE COLIMA DE LA NUEVA ESPAÑA |                                                                                                                                                                                |                       |                       |
| |                                   | SIGLO XVI                             |                                                                                                                                                                                |                       |                       |
| |                                   |                                       |                                                                                                                                                                                |                       |                       |
| |                                   | VOLUMEN II      (CAJAS 12-20)         |                                                                                                                                                                                |                       |                       |
| +-----------------------------------+---------------------------------------+                                                                                                                                                                                |                       |                       |
+--------------------------------------------------------------------------------------------------------------------------------------------------------------------------------------------------------------------------------------------------------------+-----------------------+-----------------------+
| +------------------------------------------------------------------------+-------------------------------+-----------------------+                                                                                                                           |                       |                       |
| | Inicio | Búsqueda | Siglas y bibliografía | Créditos | Más información | Vol. I (1-11) Vol. II (12-20) |    [ES]               |                                                                                                                           |                       |                       |
| +------------------------------------------------------------------------+-------------------------------+-----------------------+                                                                                                                           |                       |                       |
+--------------------------------------------------------------------------------------------------------------------------------------------------------------------------------------------------------------------------------------------------------------+-----------------------+-----------------------+
| Búsqueda rápida                                                                                                                                                                                                                                              |                       |                       |
|                                                                                                                                                                                                                                                              |                       |                       |
| +:-------------------:+-----------------+:----------------------------------------:+----------------:+                                                                                                                                                       |                       |                       |
| | Documento de fecha: |                 | Ubicación física del documento original: | [] [] []        |                                                                                                                                                       |                       |                       |
| |                     |                 |                                          |                 |                                                                                                                                                       |                       |                       |
| | 1590. Mayo, 21      |                 | Caja 30, exp. 17, 11 ff.                 |                 |                                                                                                                                                       |                       |                       |
| +---------------------+-----------------+------------------------------------------+-----------------+                                                                                                                                                       |                       |                       |
|                                                                                                                                                                                                                                                              |                       |                       |
|   ------------- ------------------------------------------------------                                                                                                                                                                                       |                       |                       |
|   Resumen:      Los naturales de Coquimatlan contra Diego de Monroy.                                                                                                                                                                                         |                       |                       |
|   ------------- ------------------------------------------------------                                                                                                                                                                                       |                       |                       |
|                                                                                                                                                                                                                                                              |                       |                       |
|   ----------------------------------- ---------------------------------------------------------------------------------------------------------------------------------------------------------------------------------------------------------------------- |                       |                       |
|   Contenido:                          Ante el alguacil Juan Flores Cinacaste, prendieron a Bernabé, ladrón criado de Diego de Monroy de 35 años aproximadamente. Amenazó al alcalde de Coquimatlan diciéndole que le daría de palos.                         |                       |                       |
|                                       El 21 de mayo de 1591, ante Juan de Villasina Alarcón, alcalde mayor de la Villa de Colima, presentaron Juan de la Cruz, vecino, mayordomo y alcalde del pueblo de Coquimatlan un documento en lengua náhuatl.^([1])   |                       |                       |
|                                       Se quejan de un español porque no los deja sembrar y mandó que despoblaran el pueblo aporreando a unos indios en las sementeras.                                                                                       |                       |                       |
|                                       Se quejan también de un mulato llamado Lorenzo que es de Diego de Monroy y que hacía un año les robó las sementeras y todo lo que hallaba dentro de sus casas, que se llevó hasta los metates y piedras de moler.      |                       |                       |
|                                       Suplican al señor alcalde les oiga y de justicia y ampare, porque además azotó a un indio Juan Pablo y a su mujer le dio bofetones y rempujones y a otro que se llama Guzmán.                                          |                       |                       |
|                                       El alcalde dice que hará justicia.                                                                                                                                                                                     |                       |                       |
|                                       Se toman las declaraciones.                                                                                                                                                                                            |                       |                       |
|                                       Firman Francisco López, escribano público. García Martínez, Francisco Ortiz, Justicia Mayor.                                                                                                                           |                       |                       |
|                                       Antonio de Caso, escribano público.^([2])                                                                                                                                                                              |                       |                       |
|                                                                                                                                                                                                                                                              |                       |                       |
|   ----------------------------------- ---------------------------------------------------------------------------------------------------------------------------------------------------------------------------------------------------------------------- |                       |                       |
|                                                                                                                                                                                                                                                              |                       |                       |
| (1) En el expediente se encuentra la traducción.                                                                                                                                                                                                             |                       |                       |
|                                                                                                                                                                                                                                                              |                       |                       |
| (2) Expediente trunco y dañado.                                                                                                                                                                                                                              |                       |                       |
|                                                                                                                                                                                                                                                              |                       |                       |
|   ---------------------------------------------------------------------------------------------------                                                                                                                                                        |                       |                       |
|    Documento(s) original(es)                                                                                                                                                                                                                                 |                       |                       |
|   --------------------------- ------- ------- ------- ------- ------- ------- ------- ------- -------                                                                                                                                                        |                       |                       |
|               []                []      []      []      []      []      []      []      []      []                                                                                                                                                           |                       |                       |
|               1f                1v      2f      3f      3v      4f      4v      5f      6f      6v                                                                                                                                                           |                       |                       |
|                                                                                                                                                                                                                                                              |                       |                       |
|               []                []      []      []      []      []      []      []      []                                                                                                                                                                   |                       |                       |
|               7f                7v      8f      9f      9v      10f     10v     11f     11v                                                                                                                                                                  |                       |                       |
|   ---------------------------------------------------------------------------------------------------                                                                                                                                                        |                       |                       |
+--------------------------------------------------------------------------------------------------------------------------------------------------------------------------------------------------------------------------------------------------------------+-----------------------+-----------------------+
| +----------------------------------------------------------------------------+-----------------------------------------------:+                                                                                                                              |                       |                       |
| | ISBN 978-607-701-024-1                                                     |   ---- ---- ---- ---- ---- ---- ---- ---- ---- |                                                                                                                              |                       |                       |
| | © Derechos Reservados 2013. Archivo Histórico del Municipio de Colima. [*] |   []        []        []        []        []   |                                                                                                                              |                       |                       |
| |                                                                            |   ---- ---- ---- ---- ---- ---- ---- ---- ---- |                                                                                                                              |                       |                       |
| +----------------------------------------------------------------------------+------------------------------------------------+                                                                                                                              |                       |                       |
| |                                                                            |                                                |                                                                                                                              |                       |                       |
| +----------------------------------------------------------------------------+------------------------------------------------+                                                                                                                              |                       |                       |
+--------------------------------------------------------------------------------------------------------------------------------------------------------------------------------------------------------------------------------------------------------------+-----------------------+-----------------------+

636 visitas
