+--------------------------------------------------------------------------------------------------------------------------------------------------------------------------------------------------------------------------------------------------------------------------------------------------------+-----------------------+-----------------------+
| []                                                                                                                                                                                                                                                                                                     |                       |                       |
|                                                                                                                                                                                                                                                                                                        |                       |                       |
| +-----------------------------------+:-------------------------------------:+                                                                                                                                                                                                                          |                       |                       |
| | []                                | LA VILLA DE COLIMA DE LA NUEVA ESPAÑA |                                                                                                                                                                                                                          |                       |                       |
| |                                   | SIGLO XVI                             |                                                                                                                                                                                                                          |                       |                       |
| |                                   |                                       |                                                                                                                                                                                                                          |                       |                       |
| |                                   | VOLUMEN II      (CAJAS 12-20)         |                                                                                                                                                                                                                          |                       |                       |
| +-----------------------------------+---------------------------------------+                                                                                                                                                                                                                          |                       |                       |
+--------------------------------------------------------------------------------------------------------------------------------------------------------------------------------------------------------------------------------------------------------------------------------------------------------+-----------------------+-----------------------+
| +------------------------------------------------------------------------+---------------------------+-----------------------+                                                                                                                                                                         |                       |                       |
| | Inicio | Búsqueda | Siglas y bibliografía | Créditos | Más información | (consulta las cajas 1-11) |    [ES]               |                                                                                                                                                                         |                       |                       |
| +------------------------------------------------------------------------+---------------------------+-----------------------+                                                                                                                                                                         |                       |                       |
+--------------------------------------------------------------------------------------------------------------------------------------------------------------------------------------------------------------------------------------------------------------------------------------------------------+-----------------------+-----------------------+
| Búsqueda rápida                                                                                                                                                                                                                                                                                        |                       |                       |
|                                                                                                                                                                                                                                                                                                        |                       |                       |
| +:--------------------:+-----------------+:----------------------------------------:+----------------:+                                                                                                                                                                                                |                       |                       |
| | Documento de fecha:  |                 | Ubicación física del documento original: | [] [] []        |                                                                                                                                                                                                |                       |                       |
| |                      |                 |                                          |                 |                                                                                                                                                                                                |                       |                       |
| | 1595. Septiembre, 11 |                 | Caja 13, exp. 21, 1 f.^([406])           |                 |                                                                                                                                                                                                |                       |                       |
| +----------------------+-----------------+------------------------------------------+-----------------+                                                                                                                                                                                                |                       |                       |
|                                                                                                                                                                                                                                                                                                        |                       |                       |
|   ------------- ---------------------------------------------------------------------------------------------------                                                                                                                                                                                    |                       |                       |
|   Resumen:      Juan de Arana solicita el proceso y autos hechos sobre los bienes de Isabel de Monjaraz, su madre                                                                                                                                                                                      |                       |                       |
|   ------------- ---------------------------------------------------------------------------------------------------                                                                                                                                                                                    |                       |                       |
|                                                                                                                                                                                                                                                                                                        |                       |                       |
|   ----------------------------------- ---------------------------------------------------------------------------------------------------------------------------------------------------------------------------------------------------------------------------------------------------------------- |                       |                       |
|   Contenido:                          Juan de Arana, vecino de Colima, pide ante Cristóbal de Silva, alcalde ordinario, el “proceso y autos, e inventario y lo demás que se hizo sobre los bienes de Isabel de Monjaraz, mi madre, y la partición que de algunos dellos se hizo entre mis hermanos”.   |                       |                       |
|                                       El alcalde dijo “que se busque en el Archivo e, buscado, se le dé por seis días”, a su procurador.                                                                                                                                                               |                       |                       |
|                                                                                                                                                                                                                                                                                                        |                       |                       |
|   ----------------------------------- ---------------------------------------------------------------------------------------------------------------------------------------------------------------------------------------------------------------------------------------------------------------- |                       |                       |
|                                                                                                                                                                                                                                                                                                        |                       |                       |
| (406) Antes en caja 13, exp. 8.                                                                                                                                                                                                                                                                        |                       |                       |
|                                                                                                                                                                                                                                                                                                        |                       |                       |
|   ---------------------------------------------------------------------------------------------------                                                                                                                                                                                                  |                       |                       |
|    Documento(s) original(es)                                                                                                                                                                                                                                                                           |                       |                       |
|   --------------------------- ------- ------- ------- ------- ------- ------- ------- ------- -------                                                                                                                                                                                                  |                       |                       |
|               []                []                                                                                                                                                                                                                                                                     |                       |                       |
|               1f                1v                                                                                                                                                                                                                                                                     |                       |                       |
|                                                                                                                                                                                                                                                                                                        |                       |                       |
|   ---------------------------------------------------------------------------------------------------                                                                                                                                                                                                  |                       |                       |
+--------------------------------------------------------------------------------------------------------------------------------------------------------------------------------------------------------------------------------------------------------------------------------------------------------+-----------------------+-----------------------+
| +----------------------------------------------------------------------------+------------------------------------------------+                                                                                                                                                                        |                       |                       |
| | ISBN 978-607-701-024-1                                                     |   ---- ---- ---- ---- ---- ---- ---- ---- ---- |                                                                                                                                                                        |                       |                       |
| | © Derechos Reservados 2013. Archivo Histórico del Municipio de Colima. [*] |   []        []        []        []        []   |                                                                                                                                                                        |                       |                       |
| |                                                                            |   ---- ---- ---- ---- ---- ---- ---- ---- ---- |                                                                                                                                                                        |                       |                       |
| +----------------------------------------------------------------------------+------------------------------------------------+                                                                                                                                                                        |                       |                       |
| |                                                                            |                                                |                                                                                                                                                                        |                       |                       |
| +----------------------------------------------------------------------------+------------------------------------------------+                                                                                                                                                                        |                       |                       |
+--------------------------------------------------------------------------------------------------------------------------------------------------------------------------------------------------------------------------------------------------------------------------------------------------------+-----------------------+-----------------------+

615 visitas
