[]

LA VILLA DE COLIMA DE LA NUEVA ESPAÑA
SIGLO XVI

VOLUMEN I      (CAJAS 1-11)

[]

Inicio | Búsquedas | Siglas y bibliografía | Cartografía | Créditos | Más información

[]

Búsqueda rápida

+:-------------------------------------------------------------------------------------------------------------------------------------------------------------------------------------------------------------------------------------------------------------------------------------------------------------------------------------------------------------------------------------------------------------------------------------------------------------------------------------------------------------------------------------------------------------------------------------------------------------------------------------------------------------------------------------------------------------------------------------------------------------------------------------------------------------------------------------------------------------------------------------:+------------------------------------------:+
| Fecha:                                                                                                                                                                                                                                                                                                                                                                                                                                                                                                                                                                                                                                                                                                                                                                                                                                                                                | Ubicación física del documento original:  |
| 1566 Mayo, 12                                                                                                                                                                                                                                                                                                                                                                                                                                                                                                                                                                                                                                                                                                                                                                                                                                                                         | CAJA A-4, EXP. 15, FF. 26-28.             |
|                                                                                                                                                                                                                                                                                                                                                                                                                                                                                                                                                                                                                                                                                                                                                                                                                                                                                       | Archivo Histórico del Municipio de Colima |
+---------------------------------------------------------------------------------------------------------------------------------------------------------------------------------------------------------------------------------------------------------------------------------------------------------------------------------------------------------------------------------------------------------------------------------------------------------------------------------------------------------------------------------------------------------------------------------------------------------------------------------------------------------------------------------------------------------------------------------------------------------------------------------------------------------------------------------------------------------------------------------------+-------------------------------------------+
| 105. 1566. Mayo, 12.                                                                                                                                                                                                                                                                                                                                                                                                                                                                                                                                                                                                                                                                                                                                                                                                                                                                  |                                           |
|                                                                                                                                                                                                                                                                                                                                                                                                                                                                                                                                                                                                                                                                                                                                                                                                                                                                                       |                                           |
| Sigue el pleito pendiente de ejecución entre Andrés de Segura y Elvira Lorenzo, viuda de Domingo López.                                                                                                                                                                                                                                                                                                                                                                                                                                                                                                                                                                                                                                                                                                                                                                               |                                           |
|                                                                                                                                                                                                                                                                                                                                                                                                                                                                                                                                                                                                                                                                                                                                                                                                                                                                                       |                                           |
| El alcalde ordinario Juan Fernández dio el siguiente auto:^([1])                                                                                                                                                                                                                                                                                                                                                                                                                                                                                                                                                                                                                                                                                                                                                                                                                      |                                           |
|                                                                                                                                                                                                                                                                                                                                                                                                                                                                                                                                                                                                                                                                                                                                                                                                                                                                                       |                                           |
| "Hago saber a vos, Pedro Ruiz de Vilches, vecino desta Villa, que pleito pendiente de ejecución se ha tratado ante mí entre partes de la una ante demandante, Andrés de Segura, vecino desta Villa, y de la otra reo defendiente Elvira Lorenzo y Lázaro del Valle en su nombre, sobre los ciento e cincuenta e ocho pesos que el dicho Andrés de Segura le ejecutó. Y siguiéndose la ejecución, conforme a derecho, fue dada sentencia de remate en la dicha causa y le fue notificado en los estrados de mi audiencia".                                                                                                                                                                                                                                                                                                                                                             |                                           |
|                                                                                                                                                                                                                                                                                                                                                                                                                                                                                                                                                                                                                                                                                                                                                                                                                                                                                       |                                           |
| Agrega el alcalde: "E agora, la parte del dicho Andrés de Segura me hizo relación que la dicha Elvira Lorenzo no estaba en esta Villa sino en una huerta de cacao que tiene fuera della, y que a su derecho conviene le sea notificada la dicha sentencia y me pidió le diese un escribano para el dicho efecto, que él está presto de le pagar sus derechos". Visto lo cual, "en nombre de Su Majestad os nombro por tal escribano para que podáis ir y vayáis en cualesquier partes desta mi jurisdicción y Provincia de Colima y notifiquéis la dicha sentencia y proceso".                                                                                                                                                                                                                                                                                                        |                                           |
|                                                                                                                                                                                                                                                                                                                                                                                                                                                                                                                                                                                                                                                                                                                                                                                                                                                                                       |                                           |
| El escribano Pero Ruiz de Vilches fue a "la huerta de cacao que es Elvira Lorenzo, que es en el Valle de Caxitlan, término y jurisdicción desta Villa de Colima desta Nueva España", el 17 de mayo, y leyó y notificó la sentencia de remate a Elvira Lorenzo, viuda, en su persona, estando presentes por testigos Diego Dávila, Andrés Toscano y Gonzalo Morán.                                                                                                                                                                                                                                                                                                                                                                                                                                                                                                                     |                                           |
|                                                                                                                                                                                                                                                                                                                                                                                                                                                                                                                                                                                                                                                                                                                                                                                                                                                                                       |                                           |
| El día 18, Segura pedía al alcalde que "mande hacer trance e remate y avivar la voz del almoneda en los bienes ejecutados en esta causa, y de su valor se le haga entero e cumplido pago del prencipal e costas".                                                                                                                                                                                                                                                                                                                                                                                                                                                                                                                                                                                                                                                                     |                                           |
|                                                                                                                                                                                                                                                                                                                                                                                                                                                                                                                                                                                                                                                                                                                                                                                                                                                                                       |                                           |
| Sin embargo, el 20 de mayo, Juan de Iniesta, en nombre de Elvira Lorenzo, por virtud del poder que de ella tenía, decía que su parte había sido notificada de la sentencia "que en el caso por V.m. fue dada, por la cual paresce que V.m. la absuelve y da por libre de cincuenta pesos, y la condena en los ciento y ocho restantes, por lo cual V.m. no mandó hacer trance y remate de los bienes ejecutados". Agrega Iniesta: la absolución de los 50 pesos, "la apruebo", pero en lo demás, "lo rescibo por notorio agravio", porque está claro por la información dada,^([2]) que la deuda es "de juego prohibido y vedado". Concluye su escrito Juan de Iniesta: en el caso que el alcalde no la diera por libre, entonces, "con el acatamiento que debo, apelo de V.m. para ante la justicia mayor desta Villa, ante quien pienso expresar agravios y alegar de mi justicia". |                                           |
|                                                                                                                                                                                                                                                                                                                                                                                                                                                                                                                                                                                                                                                                                                                                                                                                                                                                                       |                                           |
| El alcalde respondió que si la parte de Elvira Lorenzo depositaba la cuantía de pesos contenidos en la ejecución y las costas del proceso, que otorgaba y otorgó la apelación ante el alcalde mayor.                                                                                                                                                                                                                                                                                                                                                                                                                                                                                                                                                                                                                                                                                  |                                           |
|                                                                                                                                                                                                                                                                                                                                                                                                                                                                                                                                                                                                                                                                                                                                                                                                                                                                                       |                                           |
| Baltasar de Alcalá, a nombre de Andrés de Segura, protestaba por este auto en el que el alcalde ordinario otorgaba la apelación "sin que primero pague realmente de contado, conforme a la sentencia de trance y remate que está dada en esta causa". Por consiguiente, sintiéndose muy agraviado, apelaba también ante el alcalde mayor Alonso Sánchez de Figueroa, lo que fue concedido por el alcalde Juan Fernández.                                                                                                                                                                                                                                                                                                                                                                                                                                                              |                                           |
|                                                                                                                                                                                                                                                                                                                                                                                                                                                                                                                                                                                                                                                                                                                                                                                                                                                                                       |                                           |
| Caja A–4, exp. 15, ff. 26-28.                                                                                                                                                                                                                                                                                                                                                                                                                                                                                                                                                                                                                                                                                                                                                                                                                                                         |                                           |
|                                                                                                                                                                                                                                                                                                                                                                                                                                                                                                                                                                                                                                                                                                                                                                                                                                                                                       |                                           |
|                                                                                                                                                                                                                                                                                                                                                                                                                                                                                                                                                                                                                                                                                                                                                                                                                                                                                       |                                           |
|                                                                                                                                                                                                                                                                                                                                                                                                                                                                                                                                                                                                                                                                                                                                                                                                                                                                                       |                                           |
| ---------------                                                                                                                                                                                                                                                                                                                                                                                                                                                                                                                                                                                                                                                                                                                                                                                                                                                                       |                                           |
|                                                                                                                                                                                                                                                                                                                                                                                                                                                                                                                                                                                                                                                                                                                                                                                                                                                                                       |                                           |
| (1) En este año de 1566, se mencionan por alcaldes ordinarios dos Juan Fernández: uno, el apodado El Viejo: infra, regº 110; y el otro, Juan Fernández Ladrillero, de cuya elección había protestado Melchor Pérez: supra, regº 101 e infra, regº 120.                                                                                                                                                                                                                                                                                                                                                                                                                                                                                                                                                                                                                                |                                           |
|                                                                                                                                                                                                                                                                                                                                                                                                                                                                                                                                                                                                                                                                                                                                                                                                                                                                                       |                                           |
| (2) Supra, regº 103.                                                                                                                                                                                                                                                                                                                                                                                                                                                                                                                                                                                                                                                                                                                                                                                                                                                                  |                                           |
+---------------------------------------------------------------------------------------------------------------------------------------------------------------------------------------------------------------------------------------------------------------------------------------------------------------------------------------------------------------------------------------------------------------------------------------------------------------------------------------------------------------------------------------------------------------------------------------------------------------------------------------------------------------------------------------------------------------------------------------------------------------------------------------------------------------------------------------------------------------------------------------+-------------------------------------------+

Documento(s) original(es)

Archivo no encontrado (CAJAS/CAJA4/EXP15/026F.jpg)

Archivo no encontrado (CAJAS/CAJA4/EXP15/026V.jpg)

Archivo no encontrado (CAJAS/CAJA4/EXP15/027F.jpg)

Archivo no encontrado (CAJAS/CAJA4/EXP15/027V.jpg)

[]
28F

[]
28V

Proyecto interinstitucional del Archivo Histórico del Municipio de Colima y la Universidad de Colima,
realizado bajo los auspicios del fondo Ramón Álvarez-Buylla de Aldana.

------------------------------------------------------------------------

ISBN 978-968-7412-85-6
® Derechos Reservados 2008. Archivo Histórico del Municipio de Colima.

1,078 visitas
