+-----------------------------------------------------------------------------------------------------------------------------------------------------------------------------------------------------------------------------------------------------------------------------------------------------------------------------------------------------------------------------------------------------------------------------------------------------------------------------------------------------------------------------------------------------------------------------------------------------------------------------------------------------------------------------------------------------------------+-----------------------+-----------------------+
| []                                                                                                                                                                                                                                                                                                                                                                                                                                                                                                                                                                                                                                                                                                              |                       |                       |
|                                                                                                                                                                                                                                                                                                                                                                                                                                                                                                                                                                                                                                                                                                                 |                       |                       |
| +-----------------------------------+:-------------------------------------:+                                                                                                                                                                                                                                                                                                                                                                                                                                                                                                                                                                                                                                   |                       |                       |
| | []                                | LA VILLA DE COLIMA DE LA NUEVA ESPAÑA |                                                                                                                                                                                                                                                                                                                                                                                                                                                                                                                                                                                                                                   |                       |                       |
| |                                   | SIGLO XVI                             |                                                                                                                                                                                                                                                                                                                                                                                                                                                                                                                                                                                                                                   |                       |                       |
| |                                   |                                       |                                                                                                                                                                                                                                                                                                                                                                                                                                                                                                                                                                                                                                   |                       |                       |
| |                                   | VOLUMEN II      (CAJAS 12-20)         |                                                                                                                                                                                                                                                                                                                                                                                                                                                                                                                                                                                                                                   |                       |                       |
| +-----------------------------------+---------------------------------------+                                                                                                                                                                                                                                                                                                                                                                                                                                                                                                                                                                                                                                   |                       |                       |
+-----------------------------------------------------------------------------------------------------------------------------------------------------------------------------------------------------------------------------------------------------------------------------------------------------------------------------------------------------------------------------------------------------------------------------------------------------------------------------------------------------------------------------------------------------------------------------------------------------------------------------------------------------------------------------------------------------------------+-----------------------+-----------------------+
| +------------------------------------------------------------------------+-------------------------------+-----------------------+                                                                                                                                                                                                                                                                                                                                                                                                                                                                                                                                                                              |                       |                       |
| | Inicio | Búsqueda | Siglas y bibliografía | Créditos | Más información | Vol. I (1-11) Vol. II (12-20) |    [ES]               |                                                                                                                                                                                                                                                                                                                                                                                                                                                                                                                                                                              |                       |                       |
| +------------------------------------------------------------------------+-------------------------------+-----------------------+                                                                                                                                                                                                                                                                                                                                                                                                                                                                                                                                                                              |                       |                       |
+-----------------------------------------------------------------------------------------------------------------------------------------------------------------------------------------------------------------------------------------------------------------------------------------------------------------------------------------------------------------------------------------------------------------------------------------------------------------------------------------------------------------------------------------------------------------------------------------------------------------------------------------------------------------------------------------------------------------+-----------------------+-----------------------+
| Búsqueda rápida                                                                                                                                                                                                                                                                                                                                                                                                                                                                                                                                                                                                                                                                                                 |                       |                       |
|                                                                                                                                                                                                                                                                                                                                                                                                                                                                                                                                                                                                                                                                                                                 |                       |                       |
| +:-------------------:+-----------------+:----------------------------------------:+----------------:+                                                                                                                                                                                                                                                                                                                                                                                                                                                                                                                                                                                                          |                       |                       |
| | Documento de fecha: |                 | Ubicación física del documento original: | [] [] []        |                                                                                                                                                                                                                                                                                                                                                                                                                                                                                                                                                                                                          |                       |                       |
| |                     |                 |                                          |                 |                                                                                                                                                                                                                                                                                                                                                                                                                                                                                                                                                                                                          |                       |                       |
| | 1598. Julio, 9      |                 | Caja 26, exp. 89, 2 ff.                  |                 |                                                                                                                                                                                                                                                                                                                                                                                                                                                                                                                                                                                                          |                       |                       |
| +---------------------+-----------------+------------------------------------------+-----------------+                                                                                                                                                                                                                                                                                                                                                                                                                                                                                                                                                                                                          |                       |                       |
|                                                                                                                                                                                                                                                                                                                                                                                                                                                                                                                                                                                                                                                                                                                 |                       |                       |
|   ------------- -------------------------------------------------------------------------------------------------------------------------------------------------------------------------                                                                                                                                                                                                                                                                                                                                                                                                                                                                                                                       |                       |                       |
|   Resumen:      Ana de Robles, viuda de Tomás de Salas, contra el escribano real Alonso Morán porque no pagó el flete de unas cargas de cacao de Villa de Colima a la Ciudad de México.                                                                                                                                                                                                                                                                                                                                                                                                                                                                                                                         |                       |                       |
|   ------------- -------------------------------------------------------------------------------------------------------------------------------------------------------------------------                                                                                                                                                                                                                                                                                                                                                                                                                                                                                                                       |                       |                       |
|                                                                                                                                                                                                                                                                                                                                                                                                                                                                                                                                                                                                                                                                                                                 |                       |                       |
|   ----------------------------------- ------------------------------------------------------------------------------------------------------------------------------------------------------------------------------------------------------------------------------------------------------------------------------------------------------------------------------------------------------------------------------------------------------------------------------------------------------------------------------------------------------------------------------------------------------------------------------------------------------------------------------------------------------------------------- |                       |                       |
|   Contenido:                          Ante Cristóbal Hernández de Tene, alcalde ordinario de la Villa de Colima, “Ana de Robles, viuda vecina desta Villa, mujer que fui de Tomás^([1]) de Salas, que es ya difunto, digo que el dicho mi marido, estando enfermo de la enfermedad que Dios fue servido de llevallo y falleció, fletó seis bestias de carga a Alonso Morán, escribano real que estuvo en esta Villa, para que le llevasen ciertas cargas de cacao y otras cosas a la Ciudad de México.                                                                                                                                                                                                          |                       |                       |
|                                       “Por cada bestia le había de dar 10 pesos de flete, de lo cual hicieron concierto el dicho mi marido con el dicho Alonso Morán, de que por cada una de las dichas bestias le había de dar diez pesos de flete poniéndole las dichas cargas en la dicha Ciudad de México.                                                                                                                                                                                                                                                                                                                                                                                                  |                       |                       |
|                                       “Y fue así que, por estar el dicho mi marido con la dispusición que refiero, encargó a Pedro Ruiz de Vilches, vecino desta dicha Villa, persona que iba a la dicha Ciudad y llevaba otras bestias cargadas de don Antonio Enríquez, llevase las dichas bestias del dicho mi marido a su cargo y, entregando en la dicha Ciudad las dichas cargas al dicho Alonso Morán, cobrase de resto del dicho fletamiento treinta y seis pesos de oro común del dicho Alonso Morán, porque lo demás del dicho dinero lo había recibido el dicho mi marido para principio de paga, porque así había sido el dicho concierto que en la dicha Ciudad había de pagar los dichos pesos.   |                       |                       |
|                                       “Y habiendo ido el dicho Pedro Ruiz, según dicho es, y vuelto a esta Villa, dijo no habelle pagado el dicho Alonso Morán cosa alguna de lo susodicho aunque le entregó las dichas cargas del dicho cacao”.                                                                                                                                                                                                                                                                                                                                                                                                                                                                |                       |                       |
|                                       Añadía Ana de Robles: “Tengo necesidad que ante V.m. y el presente escribano, declare el dicho Pedro Ruiz al tenor deste mi pedimiento, según y cómo lo refiero, y de su declaración en pública forma se me mande dar testimonio para en guarda de mi derecho y para pedir mi justicia contra el dicho Alonso Morán, donde me convenga.                                                                                                                                                                                                                                                                                                                                   |                       |                       |
|                                       “A V.m. pido y suplico así lo provea y mande apremiando al dicho Pedro Ruiz que haga la dicha declaración en forma. Y pido justicia”.                                                                                                                                                                                                                                                                                                                                                                                                                                                                                                                                     |                       |                       |
|                                       El alcalde entonces mandó que Pedro Ruiz de Vilches declarase como lo pedía Ana de Robles.                                                                                                                                                                                                                                                                                                                                                                                                                                                                                                                                                                                |                       |                       |
|                                       Al día siguiente y ante el dicho alcalde ordinario, después de prestar juramento, Pedro Ruiz de Vilches “dijo que este declarante fue a la Ciudad de México y llevó seis caballos de Tomás de Salas cargados con cargas de Alonso Morán. Y estando en México, le entregó las dichas cargas; y fue concierto que en la dicha Ciudad de México había de dar el dicho Alonso Morán a este declarante veinte y seis pesos de resto del flete de los caballos del dicho Tomás de Salas para el susodicho.                                                                                                                                                                      |                       |                       |
|                                       “Y parece que a la ida del dicho Alonso Morán llevaba ciertos caballos flacos y con cargas y ansí se cansaron y se quedaron en el camino cansados. Y después en la dicha Ciudad de México, al tiempo que este declarante se venía, pidió al dicho Alonso Morán los dichos veinte y seis pesos para el dicho Tomás de Salas, el cual le dijo que no los tenía y que de camino tomase los caballos que habían quedado cansados y los entregase al dicho Tomás de Salas, que con ellos le quería hacer pago.                                                                                                                                                                 |                       |                       |
|                                       Y este declarante le dijo que si habían quedado cansados que cómo los había de traer, y por no tener allá poder de Tomás de Salas, no se los pidió por Justicia.                                                                                                                                                                                                                                                                                                                                                                                                                                                                                                          |                       |                       |
|                                       Y después, en el camino, halló que los dichos caballos que el dicho Alonso Morán había dejado, estaban muertos y comidos de auras.^([2]) Y que esto es la verdad”.                                                                                                                                                                                                                                                                                                                                                                                                                                                                                                        |                       |                       |
|                                       El alcalde mandó al escribano Toribio de Casso dar testimonio de esta declaración a Ana de Robles, lo que así se hizo.                                                                                                                                                                                                                                                                                                                                                                                                                                                                                                                                                    |                       |                       |
|                                                                                                                                                                                                                                                                                                                                                                                                                                                                                                                                                                                                                                                                                                                 |                       |                       |
|   ----------------------------------- ------------------------------------------------------------------------------------------------------------------------------------------------------------------------------------------------------------------------------------------------------------------------------------------------------------------------------------------------------------------------------------------------------------------------------------------------------------------------------------------------------------------------------------------------------------------------------------------------------------------------------------------------------------------------- |                       |                       |
|                                                                                                                                                                                                                                                                                                                                                                                                                                                                                                                                                                                                                                                                                                                 |                       |                       |
| (1) A la letra, Thomas.                                                                                                                                                                                                                                                                                                                                                                                                                                                                                                                                                                                                                                                                                         |                       |                       |
|                                                                                                                                                                                                                                                                                                                                                                                                                                                                                                                                                                                                                                                                                                                 |                       |                       |
| (2) Aura: “ave de las rapaces diurnas del tamaño de una gallina”: Casares. La palabra no está documentada en Boyd–Bowman (1971).                                                                                                                                                                                                                                                                                                                                                                                                                                                                                                                                                                                |                       |                       |
|                                                                                                                                                                                                                                                                                                                                                                                                                                                                                                                                                                                                                                                                                                                 |                       |                       |
|   ---------------------------------------------------------------------------------------------------                                                                                                                                                                                                                                                                                                                                                                                                                                                                                                                                                                                                           |                       |                       |
|    Documento(s) original(es)                                                                                                                                                                                                                                                                                                                                                                                                                                                                                                                                                                                                                                                                                    |                       |                       |
|   --------------------------- ------- ------- ------- ------- ------- ------- ------- ------- -------                                                                                                                                                                                                                                                                                                                                                                                                                                                                                                                                                                                                           |                       |                       |
|               []                []      []      []                                                                                                                                                                                                                                                                                                                                                                                                                                                                                                                                                                                                                                                              |                       |                       |
|               1f                1v      2f      2v                                                                                                                                                                                                                                                                                                                                                                                                                                                                                                                                                                                                                                                              |                       |                       |
|                                                                                                                                                                                                                                                                                                                                                                                                                                                                                                                                                                                                                                                                                                                 |                       |                       |
|   ---------------------------------------------------------------------------------------------------                                                                                                                                                                                                                                                                                                                                                                                                                                                                                                                                                                                                           |                       |                       |
+-----------------------------------------------------------------------------------------------------------------------------------------------------------------------------------------------------------------------------------------------------------------------------------------------------------------------------------------------------------------------------------------------------------------------------------------------------------------------------------------------------------------------------------------------------------------------------------------------------------------------------------------------------------------------------------------------------------------+-----------------------+-----------------------+
| +----------------------------------------------------------------------------+-----------------------------------------------:+                                                                                                                                                                                                                                                                                                                                                                                                                                                                                                                                                                                 |                       |                       |
| | ISBN 978-607-701-024-1                                                     |   ---- ---- ---- ---- ---- ---- ---- ---- ---- |                                                                                                                                                                                                                                                                                                                                                                                                                                                                                                                                                                                 |                       |                       |
| | © Derechos Reservados 2013. Archivo Histórico del Municipio de Colima. [*] |   []        []        []        []        []   |                                                                                                                                                                                                                                                                                                                                                                                                                                                                                                                                                                                 |                       |                       |
| |                                                                            |   ---- ---- ---- ---- ---- ---- ---- ---- ---- |                                                                                                                                                                                                                                                                                                                                                                                                                                                                                                                                                                                 |                       |                       |
| +----------------------------------------------------------------------------+------------------------------------------------+                                                                                                                                                                                                                                                                                                                                                                                                                                                                                                                                                                                 |                       |                       |
| |                                                                            |                                                |                                                                                                                                                                                                                                                                                                                                                                                                                                                                                                                                                                                 |                       |                       |
| +----------------------------------------------------------------------------+------------------------------------------------+                                                                                                                                                                                                                                                                                                                                                                                                                                                                                                                                                                                 |                       |                       |
+-----------------------------------------------------------------------------------------------------------------------------------------------------------------------------------------------------------------------------------------------------------------------------------------------------------------------------------------------------------------------------------------------------------------------------------------------------------------------------------------------------------------------------------------------------------------------------------------------------------------------------------------------------------------------------------------------------------------+-----------------------+-----------------------+

636 visitas
