+------------------------------------------------------------------------------------------------------------------------------------------------------------------------------------------------------------------------------------------------------------------+-----------------------+-----------------------+
| []                                                                                                                                                                                                                                                               |                       |                       |
|                                                                                                                                                                                                                                                                  |                       |                       |
| +-----------------------------------+:-------------------------------------:+                                                                                                                                                                                    |                       |                       |
| | []                                | LA VILLA DE COLIMA DE LA NUEVA ESPAÑA |                                                                                                                                                                                    |                       |                       |
| |                                   | SIGLO XVI                             |                                                                                                                                                                                    |                       |                       |
| |                                   |                                       |                                                                                                                                                                                    |                       |                       |
| |                                   | VOLUMEN II      (CAJAS 12-20)         |                                                                                                                                                                                    |                       |                       |
| +-----------------------------------+---------------------------------------+                                                                                                                                                                                    |                       |                       |
+------------------------------------------------------------------------------------------------------------------------------------------------------------------------------------------------------------------------------------------------------------------+-----------------------+-----------------------+
| +------------------------------------------------------------------------+---------------------------+-----------------------+                                                                                                                                   |                       |                       |
| | Inicio | Búsqueda | Siglas y bibliografía | Créditos | Más información | (consulta las cajas 1-11) |    [ES]               |                                                                                                                                   |                       |                       |
| +------------------------------------------------------------------------+---------------------------+-----------------------+                                                                                                                                   |                       |                       |
+------------------------------------------------------------------------------------------------------------------------------------------------------------------------------------------------------------------------------------------------------------------+-----------------------+-----------------------+
| Búsqueda rápida                                                                                                                                                                                                                                                  |                       |                       |
|                                                                                                                                                                                                                                                                  |                       |                       |
| +:-------------------:+-----------------+:----------------------------------------:+----------------:+                                                                                                                                                           |                       |                       |
| | Documento de fecha: |                 | Ubicación física del documento original: | [] [] []        |                                                                                                                                                           |                       |                       |
| |                     |                 |                                          |                 |                                                                                                                                                           |                       |                       |
| | 1591. Enero, 11     |                 | Caja 12, exp. 7, ff. 158-180.            |                 |                                                                                                                                                           |                       |                       |
| +---------------------+-----------------+------------------------------------------+-----------------+                                                                                                                                                           |                       |                       |
|                                                                                                                                                                                                                                                                  |                       |                       |
|   ------------- ----------------------------------------------------------------------------------------------------------------------------                                                                                                                     |                       |                       |
|   Resumen:      Cuentas de la administración de los bienes de Isabel de Monjaraz que da Diego Pérez de Espinosa, depositario de los mismos                                                                                                                       |                       |                       |
|   ------------- ----------------------------------------------------------------------------------------------------------------------------                                                                                                                     |                       |                       |
|                                                                                                                                                                                                                                                                  |                       |                       |
|   ----------------------------------- -------------------------------------------------------------------------------------------------------------------------------------------------------------------------------------------------------------------------- |                       |                       |
|   Contenido:                          Por orden de Francisco Marbán de Valdés,^([275]) alcalde mayor de los Motines y juez de comisión, el depositario de los bienes de Isabel de Monjaraz —Diego Pérez de Espinosa—,^([276]) da cuentas de su administración.   |                       |                       |
|                                       Se dispone que el contador nombrado Diego de Monroy haga los cargos y descargos. Cuentas. Mandamientos de pago y recibos correspondientes. Cuenta del cacao. Almoneda y remate. Otras diligencias.                         |                       |                       |
|                                                                                                                                                                                                                                                                  |                       |                       |
|   ----------------------------------- -------------------------------------------------------------------------------------------------------------------------------------------------------------------------------------------------------------------------- |                       |                       |
|                                                                                                                                                                                                                                                                  |                       |                       |
| (275) Acerca de Marbán de Valdés, dimos alguna noticia: supra, regº 423.                                                                                                                                                                                         |                       |                       |
|                                                                                                                                                                                                                                                                  |                       |                       |
| (276) Sobre Diego Pérez de Espinosa: supra, II, regº 269. Además, el extenso artículo que presentamos en: Romero de Solís, Andariegos... (2001), 400-402.                                                                                                        |                       |                       |
|                                                                                                                                                                                                                                                                  |                       |                       |
|   ---------------------------------------------------------------------------------------------------                                                                                                                                                            |                       |                       |
|    Documento(s) original(es)                                                                                                                                                                                                                                     |                       |                       |
|   --------------------------- ------- ------- ------- ------- ------- ------- ------- ------- -------                                                                                                                                                            |                       |                       |
|               []                []      []      []      []      []      []      []      []      []                                                                                                                                                               |                       |                       |
|              158f              158v    159f    159v    160f    160v    161f    161v    162f    162v                                                                                                                                                              |                       |                       |
|                                                                                                                                                                                                                                                                  |                       |                       |
|               []                []      []      []      []      []      []      []      []      []                                                                                                                                                               |                       |                       |
|              163f              163v    164f    164v    165f    165v    166f    166v    167f    167v                                                                                                                                                              |                       |                       |
|                                                                                                                                                                                                                                                                  |                       |                       |
|               []                []      []      []      []      []      []      []      []      []                                                                                                                                                               |                       |                       |
|              168f              168v    169f    169v    170f    170v    171f    171v    172f    172v                                                                                                                                                              |                       |                       |
|                                                                                                                                                                                                                                                                  |                       |                       |
|               []                []      []      []      []      []      []      []      []      []                                                                                                                                                               |                       |                       |
|              173f              173v    174f    174v    175f    175v    176f    177f    177v    178f                                                                                                                                                              |                       |                       |
|                                                                                                                                                                                                                                                                  |                       |                       |
|               []                []      []      []                                                                                                                                                                                                               |                       |                       |
|              179f              179v    180f    180v                                                                                                                                                                                                              |                       |                       |
|   ---------------------------------------------------------------------------------------------------                                                                                                                                                            |                       |                       |
+------------------------------------------------------------------------------------------------------------------------------------------------------------------------------------------------------------------------------------------------------------------+-----------------------+-----------------------+
| +----------------------------------------------------------------------------+------------------------------------------------+                                                                                                                                  |                       |                       |
| | ISBN 978-607-701-024-1                                                     |   ---- ---- ---- ---- ---- ---- ---- ---- ---- |                                                                                                                                  |                       |                       |
| | © Derechos Reservados 2013. Archivo Histórico del Municipio de Colima. [*] |   []        []        []        []        []   |                                                                                                                                  |                       |                       |
| |                                                                            |   ---- ---- ---- ---- ---- ---- ---- ---- ---- |                                                                                                                                  |                       |                       |
| +----------------------------------------------------------------------------+------------------------------------------------+                                                                                                                                  |                       |                       |
| |                                                                            |                                                |                                                                                                                                  |                       |                       |
| +----------------------------------------------------------------------------+------------------------------------------------+                                                                                                                                  |                       |                       |
+------------------------------------------------------------------------------------------------------------------------------------------------------------------------------------------------------------------------------------------------------------------+-----------------------+-----------------------+

615 visitas
