+------------------------------------------------------------------------------------------------------------------------------------------+-----------------------+-----------------------+
| []                                                                                                                                       |                       |                       |
|                                                                                                                                          |                       |                       |
| +-----------------------------------+:-------------------------------------:+                                                            |                       |                       |
| | []                                | LA VILLA DE COLIMA DE LA NUEVA ESPAÑA |                                                            |                       |                       |
| |                                   | SIGLO XVI                             |                                                            |                       |                       |
| |                                   |                                       |                                                            |                       |                       |
| |                                   | VOLUMEN II      (CAJAS 12-20)         |                                                            |                       |                       |
| +-----------------------------------+---------------------------------------+                                                            |                       |                       |
+------------------------------------------------------------------------------------------------------------------------------------------+-----------------------+-----------------------+
| +------------------------------------------------------------------------+-------------------------------+-----------------------+       |                       |                       |
| | Inicio | Búsqueda | Siglas y bibliografía | Créditos | Más información | Vol. I (1-11) Vol. II (12-20) |    [ES]               |       |                       |                       |
| +------------------------------------------------------------------------+-------------------------------+-----------------------+       |                       |                       |
+------------------------------------------------------------------------------------------------------------------------------------------+-----------------------+-----------------------+
| Búsqueda rápida                                                                                                                          |                       |                       |
|                                                                                                                                          |                       |                       |
| +:-------------------:+-----------------+:----------------------------------------:+----------------:+                                   |                       |                       |
| | Documento de fecha: |                 | Ubicación física del documento original: | [] [] []        |                                   |                       |                       |
| |                     |                 |                                          |                 |                                   |                       |                       |
| | Sin fecha           |                 | Caja 29, exp. 16, 1 f.                   |                 |                                   |                       |                       |
| +---------------------+-----------------+------------------------------------------+-----------------+                                   |                       |                       |
|                                                                                                                                          |                       |                       |
|   ------------- -------------------------------------------------------------------------------                                          |                       |                       |
|   Resumen:      Traslado de un poder otorgado a Juan de Santiago, juez de bienes de difuntos.                                            |                       |                       |
|   ------------- -------------------------------------------------------------------------------                                          |                       |                       |
|                                                                                                                                          |                       |                       |
|   ----------------------------------- -------------------------------------------------------------------------------------------------- |                       |                       |
|   Contenido:                          Testimonio del traslado de un poder otorgado a Juan de Santiago, juez de bienes de difuntos.       |                       |                       |
|                                       Ante el escribano público Francisco López.                                                         |                       |                       |
|                                       Siendo testigos Gerónimo Mejía, Juan Ruiz y Bernardino de Alcalá, vecinos de la Villa de Colima.   |                       |                       |
|                                                                                                                                          |                       |                       |
|   ----------------------------------- -------------------------------------------------------------------------------------------------- |                       |                       |
|                                                                                                                                          |                       |                       |
|   ---------------------------------------------------------------------------------------------------                                    |                       |                       |
|    Documento(s) original(es)                                                                                                             |                       |                       |
|   --------------------------- ------- ------- ------- ------- ------- ------- ------- ------- -------                                    |                       |                       |
|               []                []                                                                                                       |                       |                       |
|               1f                1v                                                                                                       |                       |                       |
|                                                                                                                                          |                       |                       |
|   ---------------------------------------------------------------------------------------------------                                    |                       |                       |
+------------------------------------------------------------------------------------------------------------------------------------------+-----------------------+-----------------------+
| +----------------------------------------------------------------------------+-----------------------------------------------:+          |                       |                       |
| | ISBN 978-607-701-024-1                                                     |   ---- ---- ---- ---- ---- ---- ---- ---- ---- |          |                       |                       |
| | © Derechos Reservados 2013. Archivo Histórico del Municipio de Colima. [*] |   []        []        []        []        []   |          |                       |                       |
| |                                                                            |   ---- ---- ---- ---- ---- ---- ---- ---- ---- |          |                       |                       |
| +----------------------------------------------------------------------------+------------------------------------------------+          |                       |                       |
| |                                                                            |                                                |          |                       |                       |
| +----------------------------------------------------------------------------+------------------------------------------------+          |                       |                       |
+------------------------------------------------------------------------------------------------------------------------------------------+-----------------------+-----------------------+

636 visitas
