+--------------------------------------------------------------------------------------------------------------------------------------------------------------------------------------------------------------------------------------------------------------------------------------------------------------------------------------------------------------------------------------------------------------------------------------------------------------------------------------------------+-----------------------+-----------------------+
| []                                                                                                                                                                                                                                                                                                                                                                                                                                                                                               |                       |                       |
|                                                                                                                                                                                                                                                                                                                                                                                                                                                                                                  |                       |                       |
| +-----------------------------------+:-------------------------------------:+                                                                                                                                                                                                                                                                                                                                                                                                                    |                       |                       |
| | []                                | LA VILLA DE COLIMA DE LA NUEVA ESPAÑA |                                                                                                                                                                                                                                                                                                                                                                                                                    |                       |                       |
| |                                   | SIGLO XVI                             |                                                                                                                                                                                                                                                                                                                                                                                                                    |                       |                       |
| |                                   |                                       |                                                                                                                                                                                                                                                                                                                                                                                                                    |                       |                       |
| |                                   | VOLUMEN II      (CAJAS 12-20)         |                                                                                                                                                                                                                                                                                                                                                                                                                    |                       |                       |
| +-----------------------------------+---------------------------------------+                                                                                                                                                                                                                                                                                                                                                                                                                    |                       |                       |
+--------------------------------------------------------------------------------------------------------------------------------------------------------------------------------------------------------------------------------------------------------------------------------------------------------------------------------------------------------------------------------------------------------------------------------------------------------------------------------------------------+-----------------------+-----------------------+
| +------------------------------------------------------------------------+-------------------------------+-----------------------+                                                                                                                                                                                                                                                                                                                                                               |                       |                       |
| | Inicio | Búsqueda | Siglas y bibliografía | Créditos | Más información | Vol. I (1-11) Vol. II (12-20) |    [ES]               |                                                                                                                                                                                                                                                                                                                                                               |                       |                       |
| +------------------------------------------------------------------------+-------------------------------+-----------------------+                                                                                                                                                                                                                                                                                                                                                               |                       |                       |
+--------------------------------------------------------------------------------------------------------------------------------------------------------------------------------------------------------------------------------------------------------------------------------------------------------------------------------------------------------------------------------------------------------------------------------------------------------------------------------------------------+-----------------------+-----------------------+
| Búsqueda rápida                                                                                                                                                                                                                                                                                                                                                                                                                                                                                  |                       |                       |
|                                                                                                                                                                                                                                                                                                                                                                                                                                                                                                  |                       |                       |
| +:-------------------:+-----------------+:----------------------------------------:+----------------:+                                                                                                                                                                                                                                                                                                                                                                                           |                       |                       |
| | Documento de fecha: |                 | Ubicación física del documento original: | [] [] []        |                                                                                                                                                                                                                                                                                                                                                                                           |                       |                       |
| |                     |                 |                                          |                 |                                                                                                                                                                                                                                                                                                                                                                                           |                       |                       |
| | 1582. Julio, 30     |                 | Caja 23, exp. 19, 5 ff.                  |                 |                                                                                                                                                                                                                                                                                                                                                                                           |                       |                       |
| +---------------------+-----------------+------------------------------------------+-----------------+                                                                                                                                                                                                                                                                                                                                                                                           |                       |                       |
|                                                                                                                                                                                                                                                                                                                                                                                                                                                                                                  |                       |                       |
|   ------------- ------------------------------------------------------------------------------------------------                                                                                                                                                                                                                                                                                                                                                                                 |                       |                       |
|   Resumen:      Catalina López de la Chica contra Juan Muñoz y sus perros, por le haber muerto ciertas cabras.                                                                                                                                                                                                                                                                                                                                                                                   |                       |                       |
|   ------------- ------------------------------------------------------------------------------------------------                                                                                                                                                                                                                                                                                                                                                                                 |                       |                       |
|                                                                                                                                                                                                                                                                                                                                                                                                                                                                                                  |                       |                       |
|   ----------------------------------- ---------------------------------------------------------------------------------------------------------------------------------------------------------------------------------------------------------------------------------------------------------------------------------------------------------------------------------------------------------------------------------------------------------------------------------------------------------- |                       |                       |
|   Contenido:                          Ante el alcalde mayor Juan Núñez del Castillo, Catalina López de la Chica,^([1]) “viuda y pobre”, se querella “de los criados de Juan Muñoz, vecino de esta Villa”, porque sus perros atacaron en los ejidos de esta Villa una manada suya de cabras y ovejas, y mataron algunas.                                                                                                                                                                          |                       |                       |
|                                       Información                                                                                                                                                                                                                                                                                                                                                                                                                                                |                       |                       |
|                                       El Padre Álvaro de Grijalba dice que estando en casa del vecino Juan Gómez y al asomarse a una ventana, “vido en los exidos desta Villa, cerca de las casas del dicho Juan Gómez, una manada de cabras e ovejas, las cuales son de la dicha querellante, que andaban paciendo; y a la sazón, vido un perro blanco manchado arremeter a la manada de cabras[...], y tomó una cabra y la mató”. También vio otras dos cabras muertas junto al dicho perro.   |                       |                       |
|                                       Juan Gómez, por su parte, declaró haber visto dos o tres perros atacando la manada.                                                                                                                                                                                                                                                                                                                                                                        |                       |                       |
|                                       El alcalde mandó notificar a Juan Muñoz a que luego “mate los dichos perros, y no los tenga más en su casa”, so pena de 40 pesos; además, se le mandó a que pague a Catalina López tres pesos por las tres cabras muertas.                                                                                                                                                                                                                                 |                       |                       |
|                                       Juan Muñoz protestó del auto del alcalde, diciendo que tiene perros como los tienen los demás vecinos y es costumbre en las demás ciudades y villas tenerlos para guarda de su casa. Además, Catalina López tiene muchas cabras y ovejas que trae por la Villa sin guarda alguna, las cuales “se entran en las casas de los vecinos y les roen los árboles, y se los comen y son muy perjudiciales”.                                                       |                       |                       |
|                                                                                                                                                                                                                                                                                                                                                                                                                                                                                                  |                       |                       |
|   ----------------------------------- ---------------------------------------------------------------------------------------------------------------------------------------------------------------------------------------------------------------------------------------------------------------------------------------------------------------------------------------------------------------------------------------------------------------------------------------------------------- |                       |                       |
|                                                                                                                                                                                                                                                                                                                                                                                                                                                                                                  |                       |                       |
| (1) Catalina López de la Chica era hija de Andrés Toscano y María de Herrera. Casó primero con Martín Goyte, vecino de Acapulco, y después con Martín Alonso, vecino de Colima, con quien tuvo descendencia: Romero de Solís, Andariegos… (2001), 271.                                                                                                                                                                                                                                           |                       |                       |
|                                                                                                                                                                                                                                                                                                                                                                                                                                                                                                  |                       |                       |
|   ---------------------------------------------------------------------------------------------------                                                                                                                                                                                                                                                                                                                                                                                            |                       |                       |
|    Documento(s) original(es)                                                                                                                                                                                                                                                                                                                                                                                                                                                                     |                       |                       |
|   --------------------------- ------- ------- ------- ------- ------- ------- ------- ------- -------                                                                                                                                                                                                                                                                                                                                                                                            |                       |                       |
|               []                []      []      []      []      []      []      []      []      []                                                                                                                                                                                                                                                                                                                                                                                               |                       |                       |
|               1f                1v      2f      2v      3f      3v      4f      4v      5f      5v                                                                                                                                                                                                                                                                                                                                                                                               |                       |                       |
|                                                                                                                                                                                                                                                                                                                                                                                                                                                                                                  |                       |                       |
|   ---------------------------------------------------------------------------------------------------                                                                                                                                                                                                                                                                                                                                                                                            |                       |                       |
+--------------------------------------------------------------------------------------------------------------------------------------------------------------------------------------------------------------------------------------------------------------------------------------------------------------------------------------------------------------------------------------------------------------------------------------------------------------------------------------------------+-----------------------+-----------------------+
| +----------------------------------------------------------------------------+-----------------------------------------------:+                                                                                                                                                                                                                                                                                                                                                                  |                       |                       |
| | ISBN 978-607-701-024-1                                                     |   ---- ---- ---- ---- ---- ---- ---- ---- ---- |                                                                                                                                                                                                                                                                                                                                                                  |                       |                       |
| | © Derechos Reservados 2013. Archivo Histórico del Municipio de Colima. [*] |   []        []        []        []        []   |                                                                                                                                                                                                                                                                                                                                                                  |                       |                       |
| |                                                                            |   ---- ---- ---- ---- ---- ---- ---- ---- ---- |                                                                                                                                                                                                                                                                                                                                                                  |                       |                       |
| +----------------------------------------------------------------------------+------------------------------------------------+                                                                                                                                                                                                                                                                                                                                                                  |                       |                       |
| |                                                                            |                                                |                                                                                                                                                                                                                                                                                                                                                                  |                       |                       |
| +----------------------------------------------------------------------------+------------------------------------------------+                                                                                                                                                                                                                                                                                                                                                                  |                       |                       |
+--------------------------------------------------------------------------------------------------------------------------------------------------------------------------------------------------------------------------------------------------------------------------------------------------------------------------------------------------------------------------------------------------------------------------------------------------------------------------------------------------+-----------------------+-----------------------+

636 visitas
