+----------------------------------------------------------------------------------------------------------------------------------------------------------------------------------------------------------------------------------------------------------------------------------------------------------------------------------------------------------------------------------------------------------------------------------------------------------------------------------------------------------------------------------------------------------------------------------------------------------------------------------------------------------------------------------------------------------------------+-----------------------+-----------------------+
| []                                                                                                                                                                                                                                                                                                                                                                                                                                                                                                                                                                                                                                                                                                                   |                       |                       |
|                                                                                                                                                                                                                                                                                                                                                                                                                                                                                                                                                                                                                                                                                                                      |                       |                       |
| +-----------------------------------+:-------------------------------------:+                                                                                                                                                                                                                                                                                                                                                                                                                                                                                                                                                                                                                                        |                       |                       |
| | []                                | LA VILLA DE COLIMA DE LA NUEVA ESPAÑA |                                                                                                                                                                                                                                                                                                                                                                                                                                                                                                                                                                                                                                        |                       |                       |
| |                                   | SIGLO XVI                             |                                                                                                                                                                                                                                                                                                                                                                                                                                                                                                                                                                                                                                        |                       |                       |
| |                                   |                                       |                                                                                                                                                                                                                                                                                                                                                                                                                                                                                                                                                                                                                                        |                       |                       |
| |                                   | VOLUMEN II      (CAJAS 12-20)         |                                                                                                                                                                                                                                                                                                                                                                                                                                                                                                                                                                                                                                        |                       |                       |
| +-----------------------------------+---------------------------------------+                                                                                                                                                                                                                                                                                                                                                                                                                                                                                                                                                                                                                                        |                       |                       |
+----------------------------------------------------------------------------------------------------------------------------------------------------------------------------------------------------------------------------------------------------------------------------------------------------------------------------------------------------------------------------------------------------------------------------------------------------------------------------------------------------------------------------------------------------------------------------------------------------------------------------------------------------------------------------------------------------------------------+-----------------------+-----------------------+
| +------------------------------------------------------------------------+-------------------------------+-----------------------+                                                                                                                                                                                                                                                                                                                                                                                                                                                                                                                                                                                   |                       |                       |
| | Inicio | Búsqueda | Siglas y bibliografía | Créditos | Más información | Vol. I (1-11) Vol. II (12-20) |    [ES]               |                                                                                                                                                                                                                                                                                                                                                                                                                                                                                                                                                                                   |                       |                       |
| +------------------------------------------------------------------------+-------------------------------+-----------------------+                                                                                                                                                                                                                                                                                                                                                                                                                                                                                                                                                                                   |                       |                       |
+----------------------------------------------------------------------------------------------------------------------------------------------------------------------------------------------------------------------------------------------------------------------------------------------------------------------------------------------------------------------------------------------------------------------------------------------------------------------------------------------------------------------------------------------------------------------------------------------------------------------------------------------------------------------------------------------------------------------+-----------------------+-----------------------+
| Búsqueda rápida                                                                                                                                                                                                                                                                                                                                                                                                                                                                                                                                                                                                                                                                                                      |                       |                       |
|                                                                                                                                                                                                                                                                                                                                                                                                                                                                                                                                                                                                                                                                                                                      |                       |                       |
| +:--------------------:+-----------------+:----------------------------------------:+----------------:+                                                                                                                                                                                                                                                                                                                                                                                                                                                                                                                                                                                                              |                       |                       |
| | Documento de fecha:  |                 | Ubicación física del documento original: | [] [] []        |                                                                                                                                                                                                                                                                                                                                                                                                                                                                                                                                                                                                              |                       |                       |
| |                      |                 |                                          |                 |                                                                                                                                                                                                                                                                                                                                                                                                                                                                                                                                                                                                              |                       |                       |
| | 1598. Agosto.[10228] |                 | Caja 26, exp. 60, ff. 89 vta-90.         |                 |                                                                                                                                                                                                                                                                                                                                                                                                                                                                                                                                                                                                              |                       |                       |
| +----------------------+-----------------+------------------------------------------+-----------------+                                                                                                                                                                                                                                                                                                                                                                                                                                                                                                                                                                                                              |                       |                       |
|                                                                                                                                                                                                                                                                                                                                                                                                                                                                                                                                                                                                                                                                                                                      |                       |                       |
|   ------------- -----------------------------------------------------------------------------------------------------------------------------------------------------------------------------------------------------------                                                                                                                                                                                                                                                                                                                                                                                                                                                                                          |                       |                       |
|   Resumen:      Obligación que suscribe Diego de Monroy en favor de Diego Pérez de Espinosa, mayordomo de las Cofradías de Nuestra Señora y del Rosario, por censos y réditos, y mercadurías que se sacaron de su tienda.                                                                                                                                                                                                                                                                                                                                                                                                                                                                                            |                       |                       |
|   ------------- -----------------------------------------------------------------------------------------------------------------------------------------------------------------------------------------------------------                                                                                                                                                                                                                                                                                                                                                                                                                                                                                          |                       |                       |
|                                                                                                                                                                                                                                                                                                                                                                                                                                                                                                                                                                                                                                                                                                                      |                       |                       |
|   ----------------------------------- ------------------------------------------------------------------------------------------------------------------------------------------------------------------------------------------------------------------------------------------------------------------------------------------------------------------------------------------------------------------------------------------------------------------------------------------------------------------------------------------------------------------------------------------------------------------------------------------------------------------------------------------------------------------------------ |                       |                       |
|   Contenido:                          Diego de Monroy, vecino de Colima, se obliga a dar y pagar a Diego Pérez de Espinosa la cantidad de 1,381 pesos y 6 tomines de oro común que le debe en esta manera:                                                                                                                                                                                                                                                                                                                                                                                                                                                                                                           |                       |                       |
|                                       “Por una cédula y carta firmada de mi nombre y del bachiller Santiago^([1]) y Cristóbal de Silva, como testigos”, 167 pesos y 3 tomines del dicho oro; y 984 pesos y 7 tomines, “de otra cédula firmada de mi nombre como deudor della y de Juan Ramírez de Alarcón y el Padre Juan de la Zarza y Juan Agustín de la Puerta, como testigos”; y 44 pesos y 6 tomines del dicho oro, “de una carta cuenta de mercadurías que de la tienda del dicho Diego Pérez de Espinosa sacó Beatriz Núñez, mi mujer”.                                                                                                                                                                       |                       |                       |
|                                       Y 444 pesos y 6 tomines del dicho oro, “por los corridos de una escriptura de cuatrocientos pesos de minas de censo principal que son de tipuzque seiscientos y sesenta y dos pesos y cuatro tomines, impuesto sobre mi Güerta de Aguacatitlan, en esta Provincia, pertenecientes a la Cofradía de Nuestra Señora, cuyo mayordomo es el dicho Diego Pérez de Espinosa, y le pertenece la cobranza de los dichos réditos que se cumplieron hasta primero de octubre del año pasado de noventa y siete años [1597] que cada año montó cuarenta y siete pesos y dos tomines del dicho oro, y montó hasta el dicho día trescientos y treinta pesos y seis tomines del dicho oro.   |                       |                       |
|                                       Y 114 pesos del dicho oro “de réditos de otra escriptura de censo principal impuesto sobre la dicha mi güerta de cuantía de ducientos pesos del dicho oro de principal, que corrió hasta dieciocho de mayo pasado deste pasado año de la fecha desta carta”.                                                                                                                                                                                                                                                                                                                                                                                                                   |                       |                       |
|                                       Y 49 pesos del dicho oro “que yo le debo por un mandamiento ejecutorio que contra mí tiene, de réditos corridos de las dichas escripturas de censo, como poseedor que soy de la dicha güerta sobre que están impuestos”.                                                                                                                                                                                                                                                                                                                                                                                                                                                       |                       |                       |
|                                       Y 48 pesos del dicho oro “que le debo de la limosna de las entradas^([2]) que yo y Beatriz Núñez, mi mujer, y mis hijos, le debemos. E yo por mí e por ellos los salgo a pagar, conforme al asiento en el Libro de la dicha Cofradía”.                                                                                                                                                                                                                                                                                                                                                                                                                                         |                       |                       |
|                                       Y 22 pesos del dicho oro que “debo por otras seis entradas mías y de mi mujer y hijos [que] hicimos en la Cofradía de Nuestra Señora del Rosario, como parecerá por el asiento del Libro della”.                                                                                                                                                                                                                                                                                                                                                                                                                                                                               |                       |                       |
|                                       Y 27 pesos “de las entradas de ambas Cofradías del bachiller Juan Rodríguez Santiago y de doña Catalina,^([3]) su mujer, mi hija, cuyo mayordomo de ambas Cofradías es el dicho Diego Pérez de Espinosa.                                                                                                                                                                                                                                                                                                                                                                                                                                                                       |                       |                       |
|                                       “Que la limosna destas dichas entradas destas Cofradías y réditos de los censos susodichos y del dicho mandamiento de resto de las dichas entradas e réditos susodichos, debo líquidamente cuatrocientos y cuarenta y cuatro pesos y seis tomines del dicho oro común, para los cuales le he pagado ducientos y sesenta pesos del dicho oro por libranza firmada de mi nombre para que, en mi Hacienda de Aguacatitlan -que es la güerta suso referida-, se le paguen”.                                                                                                                                                                                                        |                       |                       |
|                                       “Las cédulas firmadas de mi nombre y otras simples, recaudos susodichos todos rubricados del presente escribano yuso escripto -que todas son trece-, me entregó Gaspar de Espinosa, hijo del dicho Diego Pérez de Espinosa, en su nombre, y yo los recibí y son en mi poder realmente”.                                                                                                                                                                                                                                                                                                                                                                                        |                       |                       |
|                                       Diego de Monroy se compromete a pagar “para la cosecha de cacao que viene del año primero venidero” de 1599, en esta manera: 853 pesos en cacao, a 20 pesos carga de a 24,000 almendras, gordo, bueno y escogido, de dar y recibir; y los 528 pesos y 6 tomines restantes para cumplimiento de los 1,381 pesos y 6 tomines, “en reales de plata y no en otra moneda, puestos en esta dicha Villa, en su poder o en otra parte donde me lo pidiere y demandare, a mi costa”.                                                                                                                                                                                                    |                       |                       |
|                                       Testigos: el bachiller Juan Rodríguez Santiago, Juan Bautista de Quirós y Francisco Ortiz, vecinos de Colima.                                                                                                                                                                                                                                                                                                                                                                                                                                                                                                                                                                  |                       |                       |
|                                       Pasó ante el escribano público Toribio de Casso.                                                                                                                                                                                                                                                                                                                                                                                                                                                                                                                                                                                                                               |                       |                       |
|                                                                                                                                                                                                                                                                                                                                                                                                                                                                                                                                                                                                                                                                                                                      |                       |                       |
|   ----------------------------------- ------------------------------------------------------------------------------------------------------------------------------------------------------------------------------------------------------------------------------------------------------------------------------------------------------------------------------------------------------------------------------------------------------------------------------------------------------------------------------------------------------------------------------------------------------------------------------------------------------------------------------------------------------------------------------ |                       |                       |
|                                                                                                                                                                                                                                                                                                                                                                                                                                                                                                                                                                                                                                                                                                                      |                       |                       |
| (1) Juan Rodríguez Santiago.                                                                                                                                                                                                                                                                                                                                                                                                                                                                                                                                                                                                                                                                                         |                       |                       |
|                                                                                                                                                                                                                                                                                                                                                                                                                                                                                                                                                                                                                                                                                                                      |                       |                       |
| (2) Es decir, cuotas por el ingreso de varios miembros de su familia en las mencionadas Cofradías.                                                                                                                                                                                                                                                                                                                                                                                                                                                                                                                                                                                                                   |                       |                       |
|                                                                                                                                                                                                                                                                                                                                                                                                                                                                                                                                                                                                                                                                                                                      |                       |                       |
| (3) Catalina de Monroy.                                                                                                                                                                                                                                                                                                                                                                                                                                                                                                                                                                                                                                                                                              |                       |                       |
|                                                                                                                                                                                                                                                                                                                                                                                                                                                                                                                                                                                                                                                                                                                      |                       |                       |
|   ---------------------------------------------------------------------------------------------------                                                                                                                                                                                                                                                                                                                                                                                                                                                                                                                                                                                                                |                       |                       |
|    Documento(s) original(es)                                                                                                                                                                                                                                                                                                                                                                                                                                                                                                                                                                                                                                                                                         |                       |                       |
|   --------------------------- ------- ------- ------- ------- ------- ------- ------- ------- -------                                                                                                                                                                                                                                                                                                                                                                                                                                                                                                                                                                                                                |                       |                       |
|               []                []      []                                                                                                                                                                                                                                                                                                                                                                                                                                                                                                                                                                                                                                                                           |                       |                       |
|               89v               90f     90v                                                                                                                                                                                                                                                                                                                                                                                                                                                                                                                                                                                                                                                                          |                       |                       |
|                                                                                                                                                                                                                                                                                                                                                                                                                                                                                                                                                                                                                                                                                                                      |                       |                       |
|   ---------------------------------------------------------------------------------------------------                                                                                                                                                                                                                                                                                                                                                                                                                                                                                                                                                                                                                |                       |                       |
+----------------------------------------------------------------------------------------------------------------------------------------------------------------------------------------------------------------------------------------------------------------------------------------------------------------------------------------------------------------------------------------------------------------------------------------------------------------------------------------------------------------------------------------------------------------------------------------------------------------------------------------------------------------------------------------------------------------------+-----------------------+-----------------------+
| +----------------------------------------------------------------------------+-----------------------------------------------:+                                                                                                                                                                                                                                                                                                                                                                                                                                                                                                                                                                                      |                       |                       |
| | ISBN 978-607-701-024-1                                                     |   ---- ---- ---- ---- ---- ---- ---- ---- ---- |                                                                                                                                                                                                                                                                                                                                                                                                                                                                                                                                                                                      |                       |                       |
| | © Derechos Reservados 2013. Archivo Histórico del Municipio de Colima. [*] |   []        []        []        []        []   |                                                                                                                                                                                                                                                                                                                                                                                                                                                                                                                                                                                      |                       |                       |
| |                                                                            |   ---- ---- ---- ---- ---- ---- ---- ---- ---- |                                                                                                                                                                                                                                                                                                                                                                                                                                                                                                                                                                                      |                       |                       |
| +----------------------------------------------------------------------------+------------------------------------------------+                                                                                                                                                                                                                                                                                                                                                                                                                                                                                                                                                                                      |                       |                       |
| |                                                                            |                                                |                                                                                                                                                                                                                                                                                                                                                                                                                                                                                                                                                                                      |                       |                       |
| +----------------------------------------------------------------------------+------------------------------------------------+                                                                                                                                                                                                                                                                                                                                                                                                                                                                                                                                                                                      |                       |                       |
+----------------------------------------------------------------------------------------------------------------------------------------------------------------------------------------------------------------------------------------------------------------------------------------------------------------------------------------------------------------------------------------------------------------------------------------------------------------------------------------------------------------------------------------------------------------------------------------------------------------------------------------------------------------------------------------------------------------------+-----------------------+-----------------------+

636 visitas
