+--------------------------------------------------------------------------------------------------------------------------------------------------------------------------------------------------------------------------------------------------------------------------------------------------------------------------------------------------------------------------------------------------+-----------------------+-----------------------+
| []                                                                                                                                                                                                                                                                                                                                                                                               |                       |                       |
|                                                                                                                                                                                                                                                                                                                                                                                                  |                       |                       |
| +-----------------------------------+:-------------------------------------:+                                                                                                                                                                                                                                                                                                                    |                       |                       |
| | []                                | LA VILLA DE COLIMA DE LA NUEVA ESPAÑA |                                                                                                                                                                                                                                                                                                                    |                       |                       |
| |                                   | SIGLO XVI                             |                                                                                                                                                                                                                                                                                                                    |                       |                       |
| |                                   |                                       |                                                                                                                                                                                                                                                                                                                    |                       |                       |
| |                                   | VOLUMEN II      (CAJAS 12-20)         |                                                                                                                                                                                                                                                                                                                    |                       |                       |
| +-----------------------------------+---------------------------------------+                                                                                                                                                                                                                                                                                                                    |                       |                       |
+--------------------------------------------------------------------------------------------------------------------------------------------------------------------------------------------------------------------------------------------------------------------------------------------------------------------------------------------------------------------------------------------------+-----------------------+-----------------------+
| +------------------------------------------------------------------------+-------------------------------+-----------------------+                                                                                                                                                                                                                                                               |                       |                       |
| | Inicio | Búsqueda | Siglas y bibliografía | Créditos | Más información | Vol. I (1-11) Vol. II (12-20) |    [ES]               |                                                                                                                                                                                                                                                               |                       |                       |
| +------------------------------------------------------------------------+-------------------------------+-----------------------+                                                                                                                                                                                                                                                               |                       |                       |
+--------------------------------------------------------------------------------------------------------------------------------------------------------------------------------------------------------------------------------------------------------------------------------------------------------------------------------------------------------------------------------------------------+-----------------------+-----------------------+
| Búsqueda rápida                                                                                                                                                                                                                                                                                                                                                                                  |                       |                       |
|                                                                                                                                                                                                                                                                                                                                                                                                  |                       |                       |
| +:-------------------:+-----------------+:----------------------------------------:+----------------:+                                                                                                                                                                                                                                                                                           |                       |                       |
| | Documento de fecha: |                 | Ubicación física del documento original: | [] [] []        |                                                                                                                                                                                                                                                                                           |                       |                       |
| |                     |                 |                                          |                 |                                                                                                                                                                                                                                                                                           |                       |                       |
| | 1585. Marzo, 12     |                 | Caja 23, exp. 25, ff. 1-5.               |                 |                                                                                                                                                                                                                                                                                           |                       |                       |
| +---------------------+-----------------+------------------------------------------+-----------------+                                                                                                                                                                                                                                                                                           |                       |                       |
|                                                                                                                                                                                                                                                                                                                                                                                                  |                       |                       |
|   ------------- -----------------------------------------------------------------------------------------------------------------------------------                                                                                                                                                                                                                                              |                       |                       |
|   Resumen:      Pedro de Ceballos presenta una real provisión por la que se manda que los escribanos le den en testimonio cualesquier escrituras.                                                                                                                                                                                                                                                |                       |                       |
|   ------------- -----------------------------------------------------------------------------------------------------------------------------------                                                                                                                                                                                                                                              |                       |                       |
|                                                                                                                                                                                                                                                                                                                                                                                                  |                       |                       |
|   ----------------------------------- ---------------------------------------------------------------------------------------------------------------------------------------------------------------------------------------------------------------------------------------------------------------------------------------------------------------------------------------------------------- |                       |                       |
|   Contenido:                          Real provisión emanada por la Real Audiencia de México a petición de Pedro de Ceballos, vecino de Colima, para que los escribanos le den en testimonio cualesquier escrituras y provisiones, de la que hizo presentación el 26 de abril de ese mismo año, ante el alcalde mayor Luis Carrillo de Guzmán.                                                   |                       |                       |
|                                       Al día siguiente, el escribano Francisco López Avecilla dijo “que no sabe ni recuerda que el dicho Pedro de Ceballos haya presentado ante él provisión ni proceso ni otro recaudo alguno, y que él buscará en el Archivo, donde están los procesos, y si parescieren algunos dellos, está presto de los exhibir para que se le dé el traslado que pide”.   |                       |                       |
|                                       Poder de Pedro de Ceballos a Alonso de Aguilar, vecino de Colima, fechado el 28 de enero de 1585.                                                                                                                                                                                                                                                          |                       |                       |
|                                                                                                                                                                                                                                                                                                                                                                                                  |                       |                       |
|   ----------------------------------- ---------------------------------------------------------------------------------------------------------------------------------------------------------------------------------------------------------------------------------------------------------------------------------------------------------------------------------------------------------- |                       |                       |
|                                                                                                                                                                                                                                                                                                                                                                                                  |                       |                       |
|   ---------------------------------------------------------------------------------------------------                                                                                                                                                                                                                                                                                            |                       |                       |
|    Documento(s) original(es)                                                                                                                                                                                                                                                                                                                                                                     |                       |                       |
|   --------------------------- ------- ------- ------- ------- ------- ------- ------- ------- -------                                                                                                                                                                                                                                                                                            |                       |                       |
|               []                []      []      []      []      []      []      []                                                                                                                                                                                                                                                                                                               |                       |                       |
|               1f                1v      2f      3f      4f      4v      5f      5v                                                                                                                                                                                                                                                                                                               |                       |                       |
|                                                                                                                                                                                                                                                                                                                                                                                                  |                       |                       |
|   ---------------------------------------------------------------------------------------------------                                                                                                                                                                                                                                                                                            |                       |                       |
+--------------------------------------------------------------------------------------------------------------------------------------------------------------------------------------------------------------------------------------------------------------------------------------------------------------------------------------------------------------------------------------------------+-----------------------+-----------------------+
| +----------------------------------------------------------------------------+-----------------------------------------------:+                                                                                                                                                                                                                                                                  |                       |                       |
| | ISBN 978-607-701-024-1                                                     |   ---- ---- ---- ---- ---- ---- ---- ---- ---- |                                                                                                                                                                                                                                                                  |                       |                       |
| | © Derechos Reservados 2013. Archivo Histórico del Municipio de Colima. [*] |   []        []        []        []        []   |                                                                                                                                                                                                                                                                  |                       |                       |
| |                                                                            |   ---- ---- ---- ---- ---- ---- ---- ---- ---- |                                                                                                                                                                                                                                                                  |                       |                       |
| +----------------------------------------------------------------------------+------------------------------------------------+                                                                                                                                                                                                                                                                  |                       |                       |
| |                                                                            |                                                |                                                                                                                                                                                                                                                                  |                       |                       |
| +----------------------------------------------------------------------------+------------------------------------------------+                                                                                                                                                                                                                                                                  |                       |                       |
+--------------------------------------------------------------------------------------------------------------------------------------------------------------------------------------------------------------------------------------------------------------------------------------------------------------------------------------------------------------------------------------------------+-----------------------+-----------------------+

636 visitas
