+---------------------------------------------------------------------------------------------------------------------------------------------------------------------------------------------------------------------------------------------------------------------------------------------------------------------------------------------------------------------------------------------------------------+-----------------------+-----------------------+
| []                                                                                                                                                                                                                                                                                                                                                                                                            |                       |                       |
|                                                                                                                                                                                                                                                                                                                                                                                                               |                       |                       |
| +-----------------------------------+:-------------------------------------:+                                                                                                                                                                                                                                                                                                                                 |                       |                       |
| | []                                | LA VILLA DE COLIMA DE LA NUEVA ESPAÑA |                                                                                                                                                                                                                                                                                                                                 |                       |                       |
| |                                   | SIGLO XVI                             |                                                                                                                                                                                                                                                                                                                                 |                       |                       |
| |                                   |                                       |                                                                                                                                                                                                                                                                                                                                 |                       |                       |
| |                                   | VOLUMEN II      (CAJAS 12-20)         |                                                                                                                                                                                                                                                                                                                                 |                       |                       |
| +-----------------------------------+---------------------------------------+                                                                                                                                                                                                                                                                                                                                 |                       |                       |
+---------------------------------------------------------------------------------------------------------------------------------------------------------------------------------------------------------------------------------------------------------------------------------------------------------------------------------------------------------------------------------------------------------------+-----------------------+-----------------------+
| +------------------------------------------------------------------------+-------------------------------+-----------------------+                                                                                                                                                                                                                                                                            |                       |                       |
| | Inicio | Búsqueda | Siglas y bibliografía | Créditos | Más información | Vol. I (1-11) Vol. II (12-20) |    [ES]               |                                                                                                                                                                                                                                                                            |                       |                       |
| +------------------------------------------------------------------------+-------------------------------+-----------------------+                                                                                                                                                                                                                                                                            |                       |                       |
+---------------------------------------------------------------------------------------------------------------------------------------------------------------------------------------------------------------------------------------------------------------------------------------------------------------------------------------------------------------------------------------------------------------+-----------------------+-----------------------+
| Búsqueda rápida                                                                                                                                                                                                                                                                                                                                                                                               |                       |                       |
|                                                                                                                                                                                                                                                                                                                                                                                                               |                       |                       |
| +:-------------------:+-----------------+:----------------------------------------:+----------------:+                                                                                                                                                                                                                                                                                                        |                       |                       |
| | Documento de fecha: |                 | Ubicación física del documento original: | [] [] []        |                                                                                                                                                                                                                                                                                                        |                       |                       |
| |                     |                 |                                          |                 |                                                                                                                                                                                                                                                                                                        |                       |                       |
| | 1591. Agosto, 3     |                 | Caja 30, exp. 25, 30 ff.                 |                 |                                                                                                                                                                                                                                                                                                        |                       |                       |
| +---------------------+-----------------+------------------------------------------+-----------------+                                                                                                                                                                                                                                                                                                        |                       |                       |
|                                                                                                                                                                                                                                                                                                                                                                                                               |                       |                       |
|   ------------- -------------------------------------------------------------------                                                                                                                                                                                                                                                                                                                           |                       |                       |
|   Resumen:      Pedro Ruiz de Padilla reclama la escritura de la sumaria pública.                                                                                                                                                                                                                                                                                                                             |                       |                       |
|   ------------- -------------------------------------------------------------------                                                                                                                                                                                                                                                                                                                           |                       |                       |
|                                                                                                                                                                                                                                                                                                                                                                                                               |                       |                       |
|   ----------------------------------- ----------------------------------------------------------------------------------------------------------------------------------------------------------------------------------------------------------------------------------------------------------------------------------------------------------------------------------------------------------------------- |                       |                       |
|   Contenido:                          Ante Gaspar Román, justicia mayor, Pedro Ruiz de Padilla, vecino de la Villa de Colima, dijo que pidió a Vuestra Merced, que Baltasar de Alcalá, escribano de su Magestad exhibiese una Real Provisión que Francisco López, su suegro, se le dé la escritura y traslados que le convengan.                                                                              |                       |                       |
|                                       Pedro Ruiz de Padilla, pide que demandaba y demandó se otorgara un poder que le notifique a Baltasar de Alcalá y se saque un traslado de la Real Provisión.                                                                                                                                                                                                             |                       |                       |
|                                       El 7 de agosto de 1591, Pedro Ruiz de Padilla otorga su poder a Joan Rodríguez Santiago para que en su nombre siga la causa que tiene contra Francisco López Avecilla su suegro, sobre la venta que le hizo de oficio de escribano público y del cabildo, porque el dicho Francisco, suegro de Pedro Ruiz de Padilla, contradijo se le de la Real Provisión que pide.   |                       |                       |
|                                       Baltasar de Alcalá dijo que vendió a Toribio de Casso en mil ducados de castilla el oficio, pero el dicho Pedro Ruiz de Padilla, por quererle sacar unos pesos le mandó terceros porque pretende que en una misma causa haya dos juicios y porque cometió delito en ello y pidió se siga la causa.^([1])                                                                |                       |                       |
|                                                                                                                                                                                                                                                                                                                                                                                                               |                       |                       |
|   ----------------------------------- ----------------------------------------------------------------------------------------------------------------------------------------------------------------------------------------------------------------------------------------------------------------------------------------------------------------------------------------------------------------------- |                       |                       |
|                                                                                                                                                                                                                                                                                                                                                                                                               |                       |                       |
| (1) Expediente dañado.                                                                                                                                                                                                                                                                                                                                                                                        |                       |                       |
|                                                                                                                                                                                                                                                                                                                                                                                                               |                       |                       |
|   ---------------------------------------------------------------------------------------------------                                                                                                                                                                                                                                                                                                         |                       |                       |
|    Documento(s) original(es)                                                                                                                                                                                                                                                                                                                                                                                  |                       |                       |
|   --------------------------- ------- ------- ------- ------- ------- ------- ------- ------- -------                                                                                                                                                                                                                                                                                                         |                       |                       |
|               []                []      []      []      []      []      []      []      []      []                                                                                                                                                                                                                                                                                                            |                       |                       |
|               1f                1v      2f      3f      4f      5f      5v      6f      6v      7f                                                                                                                                                                                                                                                                                                            |                       |                       |
|                                                                                                                                                                                                                                                                                                                                                                                                               |                       |                       |
|               []                []      []      []      []      []      []      []      []      []                                                                                                                                                                                                                                                                                                            |                       |                       |
|               7v                8f      8v      9f      9v      10f     10v     11f     11v     12f                                                                                                                                                                                                                                                                                                           |                       |                       |
|                                                                                                                                                                                                                                                                                                                                                                                                               |                       |                       |
|               []                []      []      []      []      []      []      []      []      []                                                                                                                                                                                                                                                                                                            |                       |                       |
|               13f               13v     14f     14v     15f     15v     16f     16v     17f     18f                                                                                                                                                                                                                                                                                                           |                       |                       |
|                                                                                                                                                                                                                                                                                                                                                                                                               |                       |                       |
|               []                []      []      []      []      []      []      []      []      []                                                                                                                                                                                                                                                                                                            |                       |                       |
|               19f               19v     20f     20v     21f     21v     22f     22v     23f     24f                                                                                                                                                                                                                                                                                                           |                       |                       |
|                                                                                                                                                                                                                                                                                                                                                                                                               |                       |                       |
|               []                []      []      []      []      []      []      []      []      []                                                                                                                                                                                                                                                                                                            |                       |                       |
|               24v               25f     25v     26f     26v     27f     27v     28f     28v     29f                                                                                                                                                                                                                                                                                                           |                       |                       |
|                                                                                                                                                                                                                                                                                                                                                                                                               |                       |                       |
|               []                []                                                                                                                                                                                                                                                                                                                                                                            |                       |                       |
|               30f               30v                                                                                                                                                                                                                                                                                                                                                                           |                       |                       |
|   ---------------------------------------------------------------------------------------------------                                                                                                                                                                                                                                                                                                         |                       |                       |
+---------------------------------------------------------------------------------------------------------------------------------------------------------------------------------------------------------------------------------------------------------------------------------------------------------------------------------------------------------------------------------------------------------------+-----------------------+-----------------------+
| +----------------------------------------------------------------------------+-----------------------------------------------:+                                                                                                                                                                                                                                                                               |                       |                       |
| | ISBN 978-607-701-024-1                                                     |   ---- ---- ---- ---- ---- ---- ---- ---- ---- |                                                                                                                                                                                                                                                                               |                       |                       |
| | © Derechos Reservados 2013. Archivo Histórico del Municipio de Colima. [*] |   []        []        []        []        []   |                                                                                                                                                                                                                                                                               |                       |                       |
| |                                                                            |   ---- ---- ---- ---- ---- ---- ---- ---- ---- |                                                                                                                                                                                                                                                                               |                       |                       |
| +----------------------------------------------------------------------------+------------------------------------------------+                                                                                                                                                                                                                                                                               |                       |                       |
| |                                                                            |                                                |                                                                                                                                                                                                                                                                               |                       |                       |
| +----------------------------------------------------------------------------+------------------------------------------------+                                                                                                                                                                                                                                                                               |                       |                       |
+---------------------------------------------------------------------------------------------------------------------------------------------------------------------------------------------------------------------------------------------------------------------------------------------------------------------------------------------------------------------------------------------------------------+-----------------------+-----------------------+

636 visitas
