[]

LA VILLA DE COLIMA DE LA NUEVA ESPAÑA
SIGLO XVI

VOLUMEN I      (CAJAS 1-11)

[]

Inicio | Búsquedas | Siglas y bibliografía | Cartografía | Créditos | Más información

[]

Búsqueda rápida

+:------------------------------------------------------------------------------------------------------------------------------------------------------------------------------------------------------------------------------------------------------------------------------------------------------------------------------------------------------------------------------------------------------------------------------------------------------------------------------------------------------------------------------------------------------------------------------------------------------------------:+------------------------------------------:+
| Fecha:                                                                                                                                                                                                                                                                                                                                                                                                                                                                                                                                                                                                             | Ubicación física del documento original:  |
| 1573 Agosto, 27                                                                                                                                                                                                                                                                                                                                                                                                                                                                                                                                                                                                    | CAJA A-6, EXP. 9, F. 48.                  |
|                                                                                                                                                                                                                                                                                                                                                                                                                                                                                                                                                                                                                    | Archivo Histórico del Municipio de Colima |
+--------------------------------------------------------------------------------------------------------------------------------------------------------------------------------------------------------------------------------------------------------------------------------------------------------------------------------------------------------------------------------------------------------------------------------------------------------------------------------------------------------------------------------------------------------------------------------------------------------------------+-------------------------------------------+
| 214. 1573. Agosto, 27.                                                                                                                                                                                                                                                                                                                                                                                                                                                                                                                                                                                             |                                           |
|                                                                                                                                                                                                                                                                                                                                                                                                                                                                                                                                                                                                                    |                                           |
| Cristóbal de Solórzano, curador ad litem de los menores hijos de Francisco Preciado, pide dineros para seguir la causa.                                                                                                                                                                                                                                                                                                                                                                                                                                                                                            |                                           |
|                                                                                                                                                                                                                                                                                                                                                                                                                                                                                                                                                                                                                    |                                           |
| Ante el alcalde mayor Martín de Montúfar, "Cristóbal de Solórzano, curador de los menores de Francisco Preciado, digo que por mandado de V.m. me fue notificado^([1]) el martes que se contaron veinte y siete días del mes de agosto que respondiese a cierto proceso tocante a los dichos mis menores; a la primera audiencia dije que yo pedí al escribano el proceso para alegar la justicia de los dichos mis menores, el cual me respondió no me lo podía dar si no solamente traslado de la sustancia de él, y que para esto era menester ante todas cosas pagalle sus derechos para que se me pudiese dar. |                                           |
|                                                                                                                                                                                                                                                                                                                                                                                                                                                                                                                                                                                                                    |                                           |
| Por tanto a V.m. pido mande al tutor de los dichos menores que de sus bienes se me den cincuenta pesos para seguir esta causa, que yo daré cuenta y razón en lo que se hubieren gastado, y pido justicia. Otrosí pido a V.m. que en el inter que no se me dieren dineros para seguir la causa, pido no pare perjuicios a mis menores".                                                                                                                                                                                                                                                                             |                                           |
|                                                                                                                                                                                                                                                                                                                                                                                                                                                                                                                                                                                                                    |                                           |
| El alcalde mayor ordenó que le dieran 24 pesos de oro común, los cuales le dé Juan Núñez de Alvarado "del alcance que le fue fecho y el dicho Cristóbal de Solórzano tenga cuenta y razón"; además dispuso, que si Núñez no los quería pagar, "sea a su cargo e culpa el daño que viniere a los dichos menores".                                                                                                                                                                                                                                                                                                   |                                           |
|                                                                                                                                                                                                                                                                                                                                                                                                                                                                                                                                                                                                                    |                                           |
| Caja A–6, exp. 9, f. 48.                                                                                                                                                                                                                                                                                                                                                                                                                                                                                                                                                                                           |                                           |
|                                                                                                                                                                                                                                                                                                                                                                                                                                                                                                                                                                                                                    |                                           |
|                                                                                                                                                                                                                                                                                                                                                                                                                                                                                                                                                                                                                    |                                           |
|                                                                                                                                                                                                                                                                                                                                                                                                                                                                                                                                                                                                                    |                                           |
| ---------------                                                                                                                                                                                                                                                                                                                                                                                                                                                                                                                                                                                                    |                                           |
|                                                                                                                                                                                                                                                                                                                                                                                                                                                                                                                                                                                                                    |                                           |
| (1) Véase supra, otra notificación al final del regº 212.                                                                                                                                                                                                                                                                                                                                                                                                                                                                                                                                                          |                                           |
+--------------------------------------------------------------------------------------------------------------------------------------------------------------------------------------------------------------------------------------------------------------------------------------------------------------------------------------------------------------------------------------------------------------------------------------------------------------------------------------------------------------------------------------------------------------------------------------------------------------------+-------------------------------------------+

Documento(s) original(es)

Archivo no encontrado (CAJAS/CAJA6/EXP9/048F.jpg)

Archivo no encontrado (CAJAS/CAJA6/EXP9/048V.jpg)

Proyecto interinstitucional del Archivo Histórico del Municipio de Colima y la Universidad de Colima,
realizado bajo los auspicios del fondo Ramón Álvarez-Buylla de Aldana.

------------------------------------------------------------------------

ISBN 978-968-7412-85-6
® Derechos Reservados 2008. Archivo Histórico del Municipio de Colima.

1,078 visitas
