+-------------------------------------------------------------------------------------------------------------------------------------------------------------------------------------------------------------------------------------------------------------------------------------------------------------+-----------------------+-----------------------+
| []                                                                                                                                                                                                                                                                                                          |                       |                       |
|                                                                                                                                                                                                                                                                                                             |                       |                       |
| +-----------------------------------+:-------------------------------------:+                                                                                                                                                                                                                               |                       |                       |
| | []                                | LA VILLA DE COLIMA DE LA NUEVA ESPAÑA |                                                                                                                                                                                                                               |                       |                       |
| |                                   | SIGLO XVI                             |                                                                                                                                                                                                                               |                       |                       |
| |                                   |                                       |                                                                                                                                                                                                                               |                       |                       |
| |                                   | VOLUMEN II      (CAJAS 12-20)         |                                                                                                                                                                                                                               |                       |                       |
| +-----------------------------------+---------------------------------------+                                                                                                                                                                                                                               |                       |                       |
+-------------------------------------------------------------------------------------------------------------------------------------------------------------------------------------------------------------------------------------------------------------------------------------------------------------+-----------------------+-----------------------+
| +------------------------------------------------------------------------+---------------------------+-----------------------+                                                                                                                                                                              |                       |                       |
| | Inicio | Búsqueda | Siglas y bibliografía | Créditos | Más información | (consulta las cajas 1-11) |    [ES]               |                                                                                                                                                                              |                       |                       |
| +------------------------------------------------------------------------+---------------------------+-----------------------+                                                                                                                                                                              |                       |                       |
+-------------------------------------------------------------------------------------------------------------------------------------------------------------------------------------------------------------------------------------------------------------------------------------------------------------+-----------------------+-----------------------+
| Búsqueda rápida                                                                                                                                                                                                                                                                                             |                       |                       |
|                                                                                                                                                                                                                                                                                                             |                       |                       |
| +:--------------------:+-----------------+:----------------------------------------:+----------------:+                                                                                                                                                                                                     |                       |                       |
| | Documento de fecha:  |                 | Ubicación física del documento original: | [] [] []        |                                                                                                                                                                                                     |                       |                       |
| |                      |                 |                                          |                 |                                                                                                                                                                                                     |                       |                       |
| | 1595. Septiembre, 16 |                 | Caja 12, exp. 8, f. 37                   |                 |                                                                                                                                                                                                     |                       |                       |
| |                      |                 |                                          |                 |                                                                                                                                                                                                     |                       |                       |
| |                      |                 | Nota(s): Antes ff. 25 fte y vta.         |                 |                                                                                                                                                                                                     |                       |                       |
| +----------------------+-----------------+------------------------------------------+-----------------+                                                                                                                                                                                                     |                       |                       |
|                                                                                                                                                                                                                                                                                                             |                       |                       |
|   ------------- ----------------------------------------------------------------------------------------------------------------------                                                                                                                                                                      |                       |                       |
|   Resumen:      Francisco Rojas, también nombrado Garci Polo, se reconoce deudor de Juan Agustín de la Puerta, por cantidad de pesos                                                                                                                                                                        |                       |                       |
|   ------------- ----------------------------------------------------------------------------------------------------------------------                                                                                                                                                                      |                       |                       |
|                                                                                                                                                                                                                                                                                                             |                       |                       |
|   ----------------------------------- --------------------------------------------------------------------------------------------------------------------------------------------------------------------------------------------------------------------------------------------------------------------- |                       |                       |
|   Contenido:                          Francisco de Rojas, “que por otro nombre, me llaman Garci Polo”, reconoce que es deudor a Juan Agustín de la Puerta, por ciento diecisiete pesos y un tomín de oro común, de valor cada un peso de ocho reales de plata de buena moneda, que “de vos he rescibido”.   |                       |                       |
|                                       Testigos: el Padre Beneficiado Martín de Heredia, Florián de Vascones^([319]) y Juan Montana.                                                                                                                                                                         |                       |                       |
|                                       Escribano: Cristóbal Hernández de Tene.                                                                                                                                                                                                                               |                       |                       |
|                                                                                                                                                                                                                                                                                                             |                       |                       |
|   ----------------------------------- --------------------------------------------------------------------------------------------------------------------------------------------------------------------------------------------------------------------------------------------------------------------- |                       |                       |
|                                                                                                                                                                                                                                                                                                             |                       |                       |
| (319) Acaso una mala lectura en lugar de Juan de Vascones, quien aparece más adelante: infra, regº 474, 476.                                                                                                                                                                                                |                       |                       |
|                                                                                                                                                                                                                                                                                                             |                       |                       |
|   ---------------------------------------------------------------------------------------------------                                                                                                                                                                                                       |                       |                       |
|    Documento(s) original(es)                                                                                                                                                                                                                                                                                |                       |                       |
|   --------------------------- ------- ------- ------- ------- ------- ------- ------- ------- -------                                                                                                                                                                                                       |                       |                       |
|               []                []                                                                                                                                                                                                                                                                          |                       |                       |
|               37f               37v                                                                                                                                                                                                                                                                         |                       |                       |
|                                                                                                                                                                                                                                                                                                             |                       |                       |
|   ---------------------------------------------------------------------------------------------------                                                                                                                                                                                                       |                       |                       |
+-------------------------------------------------------------------------------------------------------------------------------------------------------------------------------------------------------------------------------------------------------------------------------------------------------------+-----------------------+-----------------------+
| +----------------------------------------------------------------------------+------------------------------------------------+                                                                                                                                                                             |                       |                       |
| | ISBN 978-607-701-024-1                                                     |   ---- ---- ---- ---- ---- ---- ---- ---- ---- |                                                                                                                                                                             |                       |                       |
| | © Derechos Reservados 2013. Archivo Histórico del Municipio de Colima. [*] |   []        []        []        []        []   |                                                                                                                                                                             |                       |                       |
| |                                                                            |   ---- ---- ---- ---- ---- ---- ---- ---- ---- |                                                                                                                                                                             |                       |                       |
| +----------------------------------------------------------------------------+------------------------------------------------+                                                                                                                                                                             |                       |                       |
| |                                                                            |                                                |                                                                                                                                                                             |                       |                       |
| +----------------------------------------------------------------------------+------------------------------------------------+                                                                                                                                                                             |                       |                       |
+-------------------------------------------------------------------------------------------------------------------------------------------------------------------------------------------------------------------------------------------------------------------------------------------------------------+-----------------------+-----------------------+

615 visitas
