+------------------------------------------------------------------------------------------------------------------------------------------------------------------------------------------------------------------------------------------------------------------------------+-----------------------+-----------------------+
| []                                                                                                                                                                                                                                                                           |                       |                       |
|                                                                                                                                                                                                                                                                              |                       |                       |
| +-----------------------------------+:-------------------------------------:+                                                                                                                                                                                                |                       |                       |
| | []                                | LA VILLA DE COLIMA DE LA NUEVA ESPAÑA |                                                                                                                                                                                                |                       |                       |
| |                                   | SIGLO XVI                             |                                                                                                                                                                                                |                       |                       |
| |                                   |                                       |                                                                                                                                                                                                |                       |                       |
| |                                   | VOLUMEN II      (CAJAS 12-20)         |                                                                                                                                                                                                |                       |                       |
| +-----------------------------------+---------------------------------------+                                                                                                                                                                                                |                       |                       |
+------------------------------------------------------------------------------------------------------------------------------------------------------------------------------------------------------------------------------------------------------------------------------+-----------------------+-----------------------+
| +------------------------------------------------------------------------+-------------------------------+-----------------------+                                                                                                                                           |                       |                       |
| | Inicio | Búsqueda | Siglas y bibliografía | Créditos | Más información | Vol. I (1-11) Vol. II (12-20) |    [ES]               |                                                                                                                                           |                       |                       |
| +------------------------------------------------------------------------+-------------------------------+-----------------------+                                                                                                                                           |                       |                       |
+------------------------------------------------------------------------------------------------------------------------------------------------------------------------------------------------------------------------------------------------------------------------------+-----------------------+-----------------------+
| Búsqueda rápida                                                                                                                                                                                                                                                              |                       |                       |
|                                                                                                                                                                                                                                                                              |                       |                       |
| +:-------------------:+-----------------+:----------------------------------------:+----------------:+                                                                                                                                                                       |                       |                       |
| | Documento de fecha: |                 | Ubicación física del documento original: | [] [] []        |                                                                                                                                                                       |                       |                       |
| |                     |                 |                                          |                 |                                                                                                                                                                       |                       |                       |
| | 1598. Julio, 4      |                 | Caja 26, exp. 47, f. 73.                 |                 |                                                                                                                                                                       |                       |                       |
| +---------------------+-----------------+------------------------------------------+-----------------+                                                                                                                                                                       |                       |                       |
|                                                                                                                                                                                                                                                                              |                       |                       |
|   ------------- ------------------------------------------------------------------------------------------------------------------------------------------------------------------------------                                                                               |                       |                       |
|   Resumen:      Poder general que otorga Francisco López Avecilla en favor de su yerno Pedro Ruiz de Padilla y revocación del poder que tenía antes concedido a Francisco Rodríguez Machuca.                                                                                 |                       |                       |
|   ------------- ------------------------------------------------------------------------------------------------------------------------------------------------------------------------------                                                                               |                       |                       |
|                                                                                                                                                                                                                                                                              |                       |                       |
|   ----------------------------------- ---------------------------------------------------------------------------------------------------------------------------------------------------------------------------------------------------------                              |                       |                       |
|   Contenido:                          Francisco López Avecilla, vecino de Colima, otorga todo su poder^([1]) a Pedro Ruiz de Padilla, su yerno, y por lo mismo, anula el concedido anteriormente a Francisco Rodríguez, vecino de esta Villa.                                |                       |                       |
|                                       Testigos fueron: el alcalde ordinario Cristóbal Hernández de Tene, alférez real de la Villa García Martínez y Juan Martínez de Olalde, vecinos de Colima.                                                                              |                       |                       |
|                                       Pasó ante el escribano público Toribio de Casso.                                                                                                                                                                                       |                       |                       |
|                                       Al pie y al margen izquierdo, con la misma fecha, el escribano anota haber dado a conocer la revocación del poder a Francisco Rodríguez Machuca en su persona.                                                                         |                       |                       |
|                                       Testigos de ello: el alcalde ordinario Cristóbal Hernández de Tene, Juan López Avecilla^([2]) y Pedro Ruiz de Padilla, vecinos de Colima.                                                                                              |                       |                       |
|                                                                                                                                                                                                                                                                              |                       |                       |
|   ----------------------------------- ---------------------------------------------------------------------------------------------------------------------------------------------------------------------------------------------------------                              |                       |                       |
|                                                                                                                                                                                                                                                                              |                       |                       |
| (1) Como en casos anteriores, el escribano utiliza machotes impresos a los que agrega con letra a mano los datos particulares.                                                                                                                                               |                       |                       |
|                                                                                                                                                                                                                                                                              |                       |                       |
| (2) El vecino de Colima Juan López de Avecilla era hijo del escribano Francisco López de Avecilla y María de Vargas. Padre de Juan López de Avecilla El Mozo y Mariana de Avecilla quien casó con Francisco Rodríguez Machuca: Romero de Solís, Andariegos… (2001), 257-258. |                       |                       |
|                                                                                                                                                                                                                                                                              |                       |                       |
|   ---------------------------------------------------------------------------------------------------                                                                                                                                                                        |                       |                       |
|    Documento(s) original(es)                                                                                                                                                                                                                                                 |                       |                       |
|   --------------------------- ------- ------- ------- ------- ------- ------- ------- ------- -------                                                                                                                                                                        |                       |                       |
|               []                []                                                                                                                                                                                                                                           |                       |                       |
|               73f               73v                                                                                                                                                                                                                                          |                       |                       |
|                                                                                                                                                                                                                                                                              |                       |                       |
|   ---------------------------------------------------------------------------------------------------                                                                                                                                                                        |                       |                       |
+------------------------------------------------------------------------------------------------------------------------------------------------------------------------------------------------------------------------------------------------------------------------------+-----------------------+-----------------------+
| +----------------------------------------------------------------------------+-----------------------------------------------:+                                                                                                                                              |                       |                       |
| | ISBN 978-607-701-024-1                                                     |   ---- ---- ---- ---- ---- ---- ---- ---- ---- |                                                                                                                                              |                       |                       |
| | © Derechos Reservados 2013. Archivo Histórico del Municipio de Colima. [*] |   []        []        []        []        []   |                                                                                                                                              |                       |                       |
| |                                                                            |   ---- ---- ---- ---- ---- ---- ---- ---- ---- |                                                                                                                                              |                       |                       |
| +----------------------------------------------------------------------------+------------------------------------------------+                                                                                                                                              |                       |                       |
| |                                                                            |                                                |                                                                                                                                              |                       |                       |
| +----------------------------------------------------------------------------+------------------------------------------------+                                                                                                                                              |                       |                       |
+------------------------------------------------------------------------------------------------------------------------------------------------------------------------------------------------------------------------------------------------------------------------------+-----------------------+-----------------------+

636 visitas
