+--------------------------------------------------------------------------------------------------------------------------------------------------------------------------------------------------------------------------------------------------------------------------------------------------------------------------------------------------------------------------------------------------------------------------------------------------------------------------------------------------------------------------------------------------------------------------------------------------------------------------------------------------------------------------------------------------------------------------------------------------------------------------------------------------------------------------------------------------------------------------------------------------+---------------------------------------+-----------------------+
| []                                                                                                                                                                                                                                                                                                                                                                                                                                                                                                                                                                                                                                                                                                                                                                                                                                                                                               | LA VILLA DE COLIMA DE LA NUEVA ESPAÑA | []                    |
|                                                                                                                                                                                                                                                                                                                                                                                                                                                                                                                                                                                                                                                                                                                                                                                                                                                                                                  | SIGLO XVI                             |                       |
|                                                                                                                                                                                                                                                                                                                                                                                                                                                                                                                                                                                                                                                                                                                                                                                                                                                                                                  |                                       |                       |
|                                                                                                                                                                                                                                                                                                                                                                                                                                                                                                                                                                                                                                                                                                                                                                                                                                                                                                  | VOLUMEN I      (CAJAS 1-11)           |                       |
+--------------------------------------------------------------------------------------------------------------------------------------------------------------------------------------------------------------------------------------------------------------------------------------------------------------------------------------------------------------------------------------------------------------------------------------------------------------------------------------------------------------------------------------------------------------------------------------------------------------------------------------------------------------------------------------------------------------------------------------------------------------------------------------------------------------------------------------------------------------------------------------------------+---------------------------------------+-----------------------+
| Inicio | Búsquedas | Siglas y bibliografía | Cartografía | Créditos | Más información                                                                                                                                                                                                                                                                                                                                                                                                                                                                                                                                                                                                                                                                                                                                                                                                            |                                       | []                    |
+--------------------------------------------------------------------------------------------------------------------------------------------------------------------------------------------------------------------------------------------------------------------------------------------------------------------------------------------------------------------------------------------------------------------------------------------------------------------------------------------------------------------------------------------------------------------------------------------------------------------------------------------------------------------------------------------------------------------------------------------------------------------------------------------------------------------------------------------------------------------------------------------------+---------------------------------------+-----------------------+
| Búsqueda rápida                                                                                                                                                                                                                                                                                                                                                                                                                                                                                                                                                                                                                                                                                                                                                                                                                                                                                  |                                       |                       |
|                                                                                                                                                                                                                                                                                                                                                                                                                                                                                                                                                                                                                                                                                                                                                                                                                                                                                                  |                                       |                       |
| +:------------------------------------------------------------------------------------------------------------------------------------------------------------------------------------------------------------------------------------------------------------------------------------------------------------------------------------------------------------------------------------------------------------------------------------------------------------------------------------------------------------------------------------------------------------------------------------------------------------------------------------------------------------------------------------------------------------------------------------------------------------------------------------------------------------------------------------------------:+------------------------------------------:+ |                                       |                       |
| | Fecha:                                                                                                                                                                                                                                                                                                                                                                                                                                                                                                                                                                                                                                                                                                                                                                                                                                           | Ubicación física del documento original:  | |                                       |                       |
| | 1571 Abril, 18                                                                                                                                                                                                                                                                                                                                                                                                                                                                                                                                                                                                                                                                                                                                                                                                                                   | CAJA A-7, EXP. 1, 4 FF.                   | |                                       |                       |
| |                                                                                                                                                                                                                                                                                                                                                                                                                                                                                                                                                                                                                                                                                                                                                                                                                                                  | Archivo Histórico del Municipio de Colima | |                                       |                       |
| +--------------------------------------------------------------------------------------------------------------------------------------------------------------------------------------------------------------------------------------------------------------------------------------------------------------------------------------------------------------------------------------------------------------------------------------------------------------------------------------------------------------------------------------------------------------------------------------------------------------------------------------------------------------------------------------------------------------------------------------------------------------------------------------------------------------------------------------------------+-------------------------------------------+ |                                       |                       |
| | 236. 1571. Abril, 18.                                                                                                                                                                                                                                                                                                                                                                                                                                                                                                                                                                                                                                                                                                                                                                                                                            |                                           | |                                       |                       |
| |                                                                                                                                                                                                                                                                                                                                                                                                                                                                                                                                                                                                                                                                                                                                                                                                                                                  |                                           | |                                       |                       |
| | Contra Juan Fernández Ladrillero y García Rodríguez, vecinos de Colima, por darse cuchilladas.                                                                                                                                                                                                                                                                                                                                                                                                                                                                                                                                                                                                                                                                                                                                                   |                                           | |                                       |                       |
| |                                                                                                                                                                                                                                                                                                                                                                                                                                                                                                                                                                                                                                                                                                                                                                                                                                                  |                                           | |                                       |                       |
| | El alcalde ordinario Cristóbal de Solórzano^([1]) dijo que "el martes pasado después de la oración, Juan Fernández Ladrillero e Garcia Rodríguez se dieron de cuchilladas y Su Merced los tomó in fragante y los prendió; y para saber porqué fue y la causa, hizo en ello lo siguiente".                                                                                                                                                                                                                                                                                                                                                                                                                                                                                                                                                        |                                           | |                                       |                       |
| |                                                                                                                                                                                                                                                                                                                                                                                                                                                                                                                                                                                                                                                                                                                                                                                                                                                  |                                           | |                                       |                       |
| | Se toma la información al testigo Francisco Hernández, vecino de Colima, quien declaró "que en la noche contenida en la cabeza de proceso, estando este tesgido a la puerta de las casas del dicho Juan Fernández Ladrillero, el susodicho estaba litigando con el dicho García Rodríguez sobre ciertas cuentas"; entonces Juan Fernández "arremetió al dicho García Rodríguez" y éste "echó mano a su espada, y el dicho Juan Fernández entró en su casa y sacó una espada y se vino contra el dicho García Rodríguez". Cuando estaban con las espadas desnudas frente a frente, "metiéndose en medio este testigo y otros vecinos, los pusieron en paz. Y esto es lo que sabe y es la verdad". Dijo que no le tocaban las generales y tener más de 30 años.                                                                                    |                                           | |                                       |                       |
| |                                                                                                                                                                                                                                                                                                                                                                                                                                                                                                                                                                                                                                                                                                                                                                                                                                                  |                                           | |                                       |                       |
| | Luego compareció Marco Antonio de Nápoles, vecino de Colima. Este declaró que aquella noche, "estando este testigo con Juan Fernández Ladrillero hablando, llegó el dicho García Rodríguez, e sobre ciertas palabras e cuentas vinieron a reñir, y el dicho Juan Fernández se fue para el dicho García Rodríguez, el cual echó mano a su espada, y este testigo echó mano a la suya con otros vecinos y los metieron en paz. Y esta es la verdad e lo que sabe en lo cual se afirmó e dijo que no le tocan las generales e firmólo y dijo ser de edad de más de cuarenta años".                                                                                                                                                                                                                                                                  |                                           | |                                       |                       |
| |                                                                                                                                                                                                                                                                                                                                                                                                                                                                                                                                                                                                                                                                                                                                                                                                                                                  |                                           | |                                       |                       |
| | Al día siguiente, 19 de abril, mandó que se presentara García Rodríguez, "para le tomar su confesión". "Preguntado cómo se llama e la edad que tiene, dijo que se llama García Rodríguez, e que es vecino desta Villa y de edad de cuarenta años. Preguntado si es verdad que el martes pasado, después de la oración, tuvo ciertas palabras con Juan Fernández Ladrillero, de suerte que echó mano a su espada y desnuda se dio con el dicho Juan Fernández Ladrillero munchas cuchilladas hasta que los metieron en paz, el cual dijo que es verdad que tuvo ciertas palabras con el dicho Juan Fernández Ladrillero, el cual se vino para él con las manos alzadas a lastimalle, y este testigo echó mano a su espada para se defender de él, e no hizo otra cosa. Y esta es la verdad y lo que sabe so cargo del juramento que fecho tiene". |                                           | |                                       |                       |
| |                                                                                                                                                                                                                                                                                                                                                                                                                                                                                                                                                                                                                                                                                                                                                                                                                                                  |                                           | |                                       |                       |
| | El alcalde Solórzano, entonces, mandó hacer cabeza de proceso contra García Rodríguez, y dispuso que se le diera copia y traslado de todo lo actuado, para que "dentro de tercero día", alegara lo que le conviniese. El acusado que estaba presente respondió que "daba e dio por dichos e jurados los testigos tomados en la sumaria información", se ratificaba en su confesión y renunciaba al término de prueba pública. Testigos: Juan Fernández y Pero López de Herrera, vecinos de Colima.                                                                                                                                                                                                                                                                                                                                               |                                           | |                                       |                       |
| |                                                                                                                                                                                                                                                                                                                                                                                                                                                                                                                                                                                                                                                                                                                                                                                                                                                  |                                           | |                                       |                       |
| | El alcalde Cristóbal de Solórzano dictó sentencia: "le debo de condenar y condeno en [...](2) pesos de oro común para la Cámara de Su Majestad e gastos de justicia, por mitad, y en las costas".                                                                                                                                                                                                                                                                                                                                                                                                                                                                                                                                                                                                                                                |                                           | |                                       |                       |
| |                                                                                                                                                                                                                                                                                                                                                                                                                                                                                                                                                                                                                                                                                                                                                                                                                                                  |                                           | |                                       |                       |
| | El 20 de abril, el alcalde mandó comparecer a Juan Fernández Ladrillero para tomarle su confesión. A la primera pregunta dijo que se llamaba Juan Fernández Ladrillero, que era vecino de Colima y que tenía más de 50 años de edad. "Preguntado si es verdad que el miércoles,^([3]) después de la oración, tuvo cierta pendencia con García Rodríguez, y echó mano a una espada e con ella se dio de cuchilladas", a lo cual respondió Ladrillero: "por ciertos pesos de oro que debía al dicho García Rodríguez, [dijeron] ciertas palabras, de suerte que porque le dijo «Válolo el diablo»", el susodicho "echó mano a su espada, e este testigo se entró en su casa y luego los metieron en paz, pero que él no tenía espada. Y esta es la verdad".                                                                                        |                                           | |                                       |                       |
| |                                                                                                                                                                                                                                                                                                                                                                                                                                                                                                                                                                                                                                                                                                                                                                                                                                                  |                                           | |                                       |                       |
| | El alcalde mandó hacer e hizo cabeza de proceso contra Juan Fernández "e le puso por culpa e cargo lo que resulta de los dichos de los testigos tomados en la sumaria información y de su confesión", dando orden que le dieran copia y traslado de todo lo actuado para que según ello, dentro de tercero día, alegase lo que le convenía. El acusado respondió que renunciaba al término probatorio. Testigos: Juan Fernández y Juan Preciado, vecinos de Colima.                                                                                                                                                                                                                                                                                                                                                                              |                                           | |                                       |                       |
| |                                                                                                                                                                                                                                                                                                                                                                                                                                                                                                                                                                                                                                                                                                                                                                                                                                                  |                                           | |                                       |                       |
| | "En nombre de la Real Justicia" lo sentenció "en las costas de este proceso y en la prisión que ha tenido por pena, y así lo pronunció y mandó". Escribano, Baltasar de Alcalá.                                                                                                                                                                                                                                                                                                                                                                                                                                                                                                                                                                                                                                                                  |                                           | |                                       |                       |
| |                                                                                                                                                                                                                                                                                                                                                                                                                                                                                                                                                                                                                                                                                                                                                                                                                                                  |                                           | |                                       |                       |
| | Caja A–7, exp. 1, 4 ff.                                                                                                                                                                                                                                                                                                                                                                                                                                                                                                                                                                                                                                                                                                                                                                                                                          |                                           | |                                       |                       |
| |                                                                                                                                                                                                                                                                                                                                                                                                                                                                                                                                                                                                                                                                                                                                                                                                                                                  |                                           | |                                       |                       |
| |                                                                                                                                                                                                                                                                                                                                                                                                                                                                                                                                                                                                                                                                                                                                                                                                                                                  |                                           | |                                       |                       |
| |                                                                                                                                                                                                                                                                                                                                                                                                                                                                                                                                                                                                                                                                                                                                                                                                                                                  |                                           | |                                       |                       |
| | ---------------                                                                                                                                                                                                                                                                                                                                                                                                                                                                                                                                                                                                                                                                                                                                                                                                                                  |                                           | |                                       |                       |
| |                                                                                                                                                                                                                                                                                                                                                                                                                                                                                                                                                                                                                                                                                                                                                                                                                                                  |                                           | |                                       |                       |
| | (1) Cristóbal de Solórzano era el primogénito de Juan de Aguilar y Ana Martel. Con fecha 11 de mayo de 1560, el virrey don Luis de Velasco le encomendó "los naturales del dicho pueblo de Xicotlan con sus sujetos, según e como los tuvo en encomienda el dicho vuestro padre e, como a tal, hayais y lleveis los tributos en que están tasados": Reyes G. (1981), 39-40. De Fernández Ladrillero y Garci Rodríguez dimos información: supra, regº 47 y 54, respectivamente.                                                                                                                                                                                                                                                                                                                                                                   |                                           | |                                       |                       |
| |                                                                                                                                                                                                                                                                                                                                                                                                                                                                                                                                                                                                                                                                                                                                                                                                                                                  |                                           | |                                       |                       |
| | (2) Aquí el texto aparece deteriorado y no es posible leer la cifra de pesos en la que fue condenado.                                                                                                                                                                                                                                                                                                                                                                                                                                                                                                                                                                                                                                                                                                                                            |                                           | |                                       |                       |
| |                                                                                                                                                                                                                                                                                                                                                                                                                                                                                                                                                                                                                                                                                                                                                                                                                                                  |                                           | |                                       |                       |
| | (3) Antes se informó que los hechos ocurrieron el día martes.                                                                                                                                                                                                                                                                                                                                                                                                                                                                                                                                                                                                                                                                                                                                                                                    |                                           | |                                       |                       |
| +--------------------------------------------------------------------------------------------------------------------------------------------------------------------------------------------------------------------------------------------------------------------------------------------------------------------------------------------------------------------------------------------------------------------------------------------------------------------------------------------------------------------------------------------------------------------------------------------------------------------------------------------------------------------------------------------------------------------------------------------------------------------------------------------------------------------------------------------------+-------------------------------------------+ |                                       |                       |
|                                                                                                                                                                                                                                                                                                                                                                                                                                                                                                                                                                                                                                                                                                                                                                                                                                                                                                  |                                       |                       |
|   ---------------------------------------------------------------------------------------------------                                                                                                                                                                                                                                                                                                                                                                                                                                                                                                                                                                                                                                                                                                                                                                                            |                                       |                       |
|    Documento(s) original(es)                                                                                                                                                                                                                                                                                                                                                                                                                                                                                                                                                                                                                                                                                                                                                                                                                                                                     |                                       |                       |
|   --------------------------- ------- ------- ------- ------- ------- ------- ------- ------- -------                                                                                                                                                                                                                                                                                                                                                                                                                                                                                                                                                                                                                                                                                                                                                                                            |                                       |                       |
|               []                []      []      []      []      []      []      []                                                                                                                                                                                                                                                                                                                                                                                                                                                                                                                                                                                                                                                                                                                                                                                                               |                                       |                       |
|               1F                1V      2F      2V      3F      3V      4F      4V                                                                                                                                                                                                                                                                                                                                                                                                                                                                                                                                                                                                                                                                                                                                                                                                               |                                       |                       |
|                                                                                                                                                                                                                                                                                                                                                                                                                                                                                                                                                                                                                                                                                                                                                                                                                                                                                                  |                                       |                       |
|   ---------------------------------------------------------------------------------------------------                                                                                                                                                                                                                                                                                                                                                                                                                                                                                                                                                                                                                                                                                                                                                                                            |                                       |                       |
+--------------------------------------------------------------------------------------------------------------------------------------------------------------------------------------------------------------------------------------------------------------------------------------------------------------------------------------------------------------------------------------------------------------------------------------------------------------------------------------------------------------------------------------------------------------------------------------------------------------------------------------------------------------------------------------------------------------------------------------------------------------------------------------------------------------------------------------------------------------------------------------------------+---------------------------------------+-----------------------+
| Proyecto interinstitucional del Archivo Histórico del Municipio de Colima y la Universidad de Colima,                                                                                                                                                                                                                                                                                                                                                                                                                                                                                                                                                                                                                                                                                                                                                                                            |                                       |                       |
| realizado bajo los auspicios del fondo Ramón Álvarez-Buylla de Aldana.                                                                                                                                                                                                                                                                                                                                                                                                                                                                                                                                                                                                                                                                                                                                                                                                                           |                                       |                       |
|                                                                                                                                                                                                                                                                                                                                                                                                                                                                                                                                                                                                                                                                                                                                                                                                                                                                                                  |                                       |                       |
| ------------------------------------------------------------------------                                                                                                                                                                                                                                                                                                                                                                                                                                                                                                                                                                                                                                                                                                                                                                                                                         |                                       |                       |
|                                                                                                                                                                                                                                                                                                                                                                                                                                                                                                                                                                                                                                                                                                                                                                                                                                                                                                  |                                       |                       |
| ISBN 978-968-7412-85-6                                                                                                                                                                                                                                                                                                                                                                                                                                                                                                                                                                                                                                                                                                                                                                                                                                                                           |                                       |                       |
| ® Derechos Reservados 2008. Archivo Histórico del Municipio de Colima.                                                                                                                                                                                                                                                                                                                                                                                                                                                                                                                                                                                                                                                                                                                                                                                                                           |                                       |                       |
+--------------------------------------------------------------------------------------------------------------------------------------------------------------------------------------------------------------------------------------------------------------------------------------------------------------------------------------------------------------------------------------------------------------------------------------------------------------------------------------------------------------------------------------------------------------------------------------------------------------------------------------------------------------------------------------------------------------------------------------------------------------------------------------------------------------------------------------------------------------------------------------------------+---------------------------------------+-----------------------+

1,078 visitas
