[]

LA VILLA DE COLIMA DE LA NUEVA ESPAÑA
SIGLO XVI

VOLUMEN I      (CAJAS 1-11)

[]

Inicio | Búsquedas | Siglas y bibliografía | Cartografía | Créditos | Más información

[]

Búsqueda rápida

+:----------------------------------------------------------------------------------------------------------------------------------------------------------------------------------------------------------------------------------------------------------------------------------------------------------------------------------------------------------------------------------------------------------------------------------------------------------------------------------------------------------------------------------------------------------------------------------------------------------------------------------------------------------------------------------------------------------------------------------------------------------------------------------------------------------------------------------------------------------------------------------------------------------------------------------------------------------------------------------------------------------------------------------------------------------------------------------------------------------------------------------------------------------------------------------------------------------------------------------------------------------------------------------------------------------------------------------------------------------------------------------------------------------------------------------------------------------------------------------------------------------------------------------------------------------------------------------------------------------------------------:+------------------------------------------:+
| Fecha:                                                                                                                                                                                                                                                                                                                                                                                                                                                                                                                                                                                                                                                                                                                                                                                                                                                                                                                                                                                                                                                                                                                                                                                                                                                                                                                                                                                                                                                                                                                                                                                                                       | Ubicación física del documento original:  |
| 1564 Julio, 24                                                                                                                                                                                                                                                                                                                                                                                                                                                                                                                                                                                                                                                                                                                                                                                                                                                                                                                                                                                                                                                                                                                                                                                                                                                                                                                                                                                                                                                                                                                                                                                                               | CAJA A-4, EXP. 9, 11 FF.                  |
|                                                                                                                                                                                                                                                                                                                                                                                                                                                                                                                                                                                                                                                                                                                                                                                                                                                                                                                                                                                                                                                                                                                                                                                                                                                                                                                                                                                                                                                                                                                                                                                                                              | Archivo Histórico del Municipio de Colima |
+------------------------------------------------------------------------------------------------------------------------------------------------------------------------------------------------------------------------------------------------------------------------------------------------------------------------------------------------------------------------------------------------------------------------------------------------------------------------------------------------------------------------------------------------------------------------------------------------------------------------------------------------------------------------------------------------------------------------------------------------------------------------------------------------------------------------------------------------------------------------------------------------------------------------------------------------------------------------------------------------------------------------------------------------------------------------------------------------------------------------------------------------------------------------------------------------------------------------------------------------------------------------------------------------------------------------------------------------------------------------------------------------------------------------------------------------------------------------------------------------------------------------------------------------------------------------------------------------------------------------------+-------------------------------------------+
| 93. 1564. Julio, 24.                                                                                                                                                                                                                                                                                                                                                                                                                                                                                                                                                                                                                                                                                                                                                                                                                                                                                                                                                                                                                                                                                                                                                                                                                                                                                                                                                                                                                                                                                                                                                                                                         |                                           |
|                                                                                                                                                                                                                                                                                                                                                                                                                                                                                                                                                                                                                                                                                                                                                                                                                                                                                                                                                                                                                                                                                                                                                                                                                                                                                                                                                                                                                                                                                                                                                                                                                              |                                           |
| Juan de la Torre reclama de los bienes de Juan de Aztiguieta, difunto, cantidad de pesos.                                                                                                                                                                                                                                                                                                                                                                                                                                                                                                                                                                                                                                                                                                                                                                                                                                                                                                                                                                                                                                                                                                                                                                                                                                                                                                                                                                                                                                                                                                                                    |                                           |
|                                                                                                                                                                                                                                                                                                                                                                                                                                                                                                                                                                                                                                                                                                                                                                                                                                                                                                                                                                                                                                                                                                                                                                                                                                                                                                                                                                                                                                                                                                                                                                                                                              |                                           |
| "Juan de la Torre,^([1]) vecino desta Villa, parezco ante V.m. e digo que yo, por ruego de Juanes de Aztigueta,^([2]) mercader difunto, eché sobre mi huerta de cacao dozientos pesos de oro de tipuzque a censo, los cuales él rescibió de Diego Veedor, vecino desta Villa; e no obstante que yo me obligué al dicho censo, no rescibí cosa dellos". Todo ello consta tanto por la cédula firmada por su nombre como por lo que dejó declarado en su testamento. Pide que de los bienes de Juan de Aztiguieta "se quiten e me den por libre e quito dello, pagando el censo que hubiese corrido".                                                                                                                                                                                                                                                                                                                                                                                                                                                                                                                                                                                                                                                                                                                                                                                                                                                                                                                                                                                                                          |                                           |
|                                                                                                                                                                                                                                                                                                                                                                                                                                                                                                                                                                                                                                                                                                                                                                                                                                                                                                                                                                                                                                                                                                                                                                                                                                                                                                                                                                                                                                                                                                                                                                                                                              |                                           |
| Juan de la Torre hizo presentación de la cédula que le firmara el mercader y fechada el 7 de enero de ese mismo año, cuyo tenor es el siguiente: "Digo yo Juan de Azteguieta, que por cuanto Juan de la Torre, vecino desta Villa de Colima, tomó a censo sobre su Güerta de Diego Veedor, tutor de los menores de Maestre Jácome, difunto,^([3]) dozientos pesos de oro común, los cuales por me hazer buena obra los tomó para mí e los cuales dichos dozientos pesos por ésta digo de vos pagar los dichos dozientos pesos con más el censo que corre e que corrieren hasta que los quite, y me obligo de lo quitar dentro de seis meses primeros siguientes y obligo mi persona y bienes, y doy poder cumplido a todas las justicias de Su Majestad para que así me lo hagan cumplir. Y lo firmé de mi nombre. Fecho en Colima,^([4]) a siete de enero de mil e quinientos y sesenta y cuatro años [1564]. Testigos: Domingo López y Tomás Herades, vecino y estante en esta Villa de Colima. Jhoan de Azteguieta".                                                                                                                                                                                                                                                                                                                                                                                                                                                                                                                                                                                                      |                                           |
|                                                                                                                                                                                                                                                                                                                                                                                                                                                                                                                                                                                                                                                                                                                                                                                                                                                                                                                                                                                                                                                                                                                                                                                                                                                                                                                                                                                                                                                                                                                                                                                                                              |                                           |
| Notificado Diego Núñez de Guzmán, defensor de los bienes de Aztiguieta, respondiendo al escrito de Juan de la Torre donde pide mandamiento ejecutorio contra dichos bienes, dice que ante todo Juan de la Torre debe comprobar que la firma que aparece en la cédula simple, es la del difunto; agrega que debe presentar también la escritura del censo.                                                                                                                                                                                                                                                                                                                                                                                                                                                                                                                                                                                                                                                                                                                                                                                                                                                                                                                                                                                                                                                                                                                                                                                                                                                                    |                                           |
|                                                                                                                                                                                                                                                                                                                                                                                                                                                                                                                                                                                                                                                                                                                                                                                                                                                                                                                                                                                                                                                                                                                                                                                                                                                                                                                                                                                                                                                                                                                                                                                                                              |                                           |
| Contestó de la Torre diciendo que el alcalde debe mandar hacer ejecución en los bienes del difunto, porque dejó declarado en su testamento que le adeudaba los doscientos pesos del censo.                                                                                                                                                                                                                                                                                                                                                                                                                                                                                                                                                                                                                                                                                                                                                                                                                                                                                                                                                                                                                                                                                                                                                                                                                                                                                                                                                                                                                                   |                                           |
|                                                                                                                                                                                                                                                                                                                                                                                                                                                                                                                                                                                                                                                                                                                                                                                                                                                                                                                                                                                                                                                                                                                                                                                                                                                                                                                                                                                                                                                                                                                                                                                                                              |                                           |
| El alcalde mayor Pedro de Ávila Quiñones^([5]) pronunció sentencia de prueba el 31 de julio. El mismo día, Juan de la Torre presentó por testigos a Juan de Iniesta y al escribano de Su Majestad Miguel Rodríguez, vecinos de esta Villa, a quienes se mostró la cédula "y la firma donde dize Juan de Azteguieta". Juan de Iniesta dijo que "le parece e cree e tiene por cierto" que la firma "es fecha por la propia mano del dicho Juan de Azteguieta, porque este testigo la vido escrebir y firmar muchas y diversas veces y tiene otras muchas firmas". Declaro tener 30 años de edad y que no le tocaba ninguna de las generales. Firmó de su mano.                                                                                                                                                                                                                                                                                                                                                                                                                                                                                                                                                                                                                                                                                                                                                                                                                                                                                                                                                                 |                                           |
|                                                                                                                                                                                                                                                                                                                                                                                                                                                                                                                                                                                                                                                                                                                                                                                                                                                                                                                                                                                                                                                                                                                                                                                                                                                                                                                                                                                                                                                                                                                                                                                                                              |                                           |
| El 4 de agosto, Juan de la Torre presentú nuevos testigos: Pedro de Bobadilla, Pedro Ruiz, Juan de Arana, vecinos de la Villa, a quienes fue mostrada igualmente cédula y firma.                                                                                                                                                                                                                                                                                                                                                                                                                                                                                                                                                                                                                                                                                                                                                                                                                                                                                                                                                                                                                                                                                                                                                                                                                                                                                                                                                                                                                                             |                                           |
|                                                                                                                                                                                                                                                                                                                                                                                                                                                                                                                                                                                                                                                                                                                                                                                                                                                                                                                                                                                                                                                                                                                                                                                                                                                                                                                                                                                                                                                                                                                                                                                                                              |                                           |
| Juan de Arana dijo tener en su poder muchas firmas de Aztiguieta, y que cédula y firma que le son mostradas parecen ser hechas de su propia mano. Declaró 40 años de edad. Bobadilla, por su parte, dijo también que firma y letra de la cédula "que es fecha por la propia mano" del difunto, ya que este testigo "le vido escrebir e firmar munchas e diversas veces". Edad: "más de treinta y dos años". Pedro Ruiz, de más de 25 años de edad, dijo que reconocía firma y cédula como hechas por Aztiguieta. Por último, atestiguó el escribano Miguel Rodríguez, y dijo: "lo que este testigo sabe que un día antes que el dicho Juan de Aztiagueta muriese, este testigo fue a casa del dicho Juan de la Torre donde el dicho Juan de Aztiagueta estaba enfermo, para hacer su testamento; y el dicho Juanes lo hizo ante este testigo como escribano de Su Majestad hasta la revocación del dicho testamento, y que entre otras cláusulas que en el dicho testamento otorgó el dicho Juan de Aztiagueta declaró ante este testigo que debía al dicho Juan de la Torre dozientos pesos de oro común para el efecto y razón como la cédula lo dice, y que se los debía por una cédula firmada de su nombre; y que mandaba y mandó que le fuesen pagados de sus bienes con más el censo corrido hasta el día que se les pagasen. Y que este testigo tiene la letra y firma de la dicha cédula presentada en esta causa, fecha de la propia mano del dicho Juan de Aztiagueta, porque este testigo le vido escrebir e firmar escrituras que ante este testigo otorgó".^([6]) El testigo declaró que tenía más de 25 años. |                                           |
|                                                                                                                                                                                                                                                                                                                                                                                                                                                                                                                                                                                                                                                                                                                                                                                                                                                                                                                                                                                                                                                                                                                                                                                                                                                                                                                                                                                                                                                                                                                                                                                                                              |                                           |
| El 7 de agosto, Juan de la Torre decía que "los testigos que se hallaron presentes al tiempo que el dicho Juanes hizo la dicha cédula, al presente no están en esta Villa para tomarles sus dichos; e pues el dicho difunto lo dejó declarado en su testamento ante el escribano de la causa, e tengo comprobada la firma e letra de la dicha cédula", renunciaba al término de la prueba. Lo mismo hizo Núñez de Guzmán, defensor de los bienes de Aztiguieta al día siguiente.                                                                                                                                                                                                                                                                                                                                                                                                                                                                                                                                                                                                                                                                                                                                                                                                                                                                                                                                                                                                                                                                                                                                             |                                           |
|                                                                                                                                                                                                                                                                                                                                                                                                                                                                                                                                                                                                                                                                                                                                                                                                                                                                                                                                                                                                                                                                                                                                                                                                                                                                                                                                                                                                                                                                                                                                                                                                                              |                                           |
| El alcalde mayor dictó sentencia el 9 de agosto. "Fallo que el dicho Juan de la Torre probó bien"; en consecuencia, mandaba que se le pagaran los doscientos pesos más el censo corrido conforme a la cédula; también las costas del proceso se cargaban a los bienes del difunto. Testigos de la sentencia fueron: Melchor Pérez, Baltasar de Alcalá, Diego de Velasco y Pedro de Vivanco.                                                                                                                                                                                                                                                                                                                                                                                                                                                                                                                                                                                                                                                                                                                                                                                                                                                                                                                                                                                                                                                                                                                                                                                                                                  |                                           |
|                                                                                                                                                                                                                                                                                                                                                                                                                                                                                                                                                                                                                                                                                                                                                                                                                                                                                                                                                                                                                                                                                                                                                                                                                                                                                                                                                                                                                                                                                                                                                                                                                              |                                           |
| Caja A–4, exp. 9, 11 ff.                                                                                                                                                                                                                                                                                                                                                                                                                                                                                                                                                                                                                                                                                                                                                                                                                                                                                                                                                                                                                                                                                                                                                                                                                                                                                                                                                                                                                                                                                                                                                                                                     |                                           |
|                                                                                                                                                                                                                                                                                                                                                                                                                                                                                                                                                                                                                                                                                                                                                                                                                                                                                                                                                                                                                                                                                                                                                                                                                                                                                                                                                                                                                                                                                                                                                                                                                              |                                           |
|                                                                                                                                                                                                                                                                                                                                                                                                                                                                                                                                                                                                                                                                                                                                                                                                                                                                                                                                                                                                                                                                                                                                                                                                                                                                                                                                                                                                                                                                                                                                                                                                                              |                                           |
|                                                                                                                                                                                                                                                                                                                                                                                                                                                                                                                                                                                                                                                                                                                                                                                                                                                                                                                                                                                                                                                                                                                                                                                                                                                                                                                                                                                                                                                                                                                                                                                                                              |                                           |
| ---------------                                                                                                                                                                                                                                                                                                                                                                                                                                                                                                                                                                                                                                                                                                                                                                                                                                                                                                                                                                                                                                                                                                                                                                                                                                                                                                                                                                                                                                                                                                                                                                                                              |                                           |
|                                                                                                                                                                                                                                                                                                                                                                                                                                                                                                                                                                                                                                                                                                                                                                                                                                                                                                                                                                                                                                                                                                                                                                                                                                                                                                                                                                                                                                                                                                                                                                                                                              |                                           |
| (1) Entre Juan de la Torre (supra, regº 41) y Aztiguieta, además de intereses comerciales, hubo sin duda amistad. En el regº 92, el escribano de la Villa Miguel Rodríguez menciona cómo el mercader, sintiéndose enfermo, se acogió al cuidado de Juan de la Torre, quien lo tuvo hospedado en su casa. Lo mismo se atestigua en el presente regº.                                                                                                                                                                                                                                                                                                                                                                                                                                                                                                                                                                                                                                                                                                                                                                                                                                                                                                                                                                                                                                                                                                                                                                                                                                                                          |                                           |
|                                                                                                                                                                                                                                                                                                                                                                                                                                                                                                                                                                                                                                                                                                                                                                                                                                                                                                                                                                                                                                                                                                                                                                                                                                                                                                                                                                                                                                                                                                                                                                                                                              |                                           |
| (2) De diversos modos es nombrado el mercader difunto: Juanes, a secas, que bien podría ser el apelativo familiar; Aztiguieta, Azteguieta y Aztiagueta, como lo designa el escribano Miguel Rodríguez en su declaración que se verá más adelante.                                                                                                                                                                                                                                                                                                                                                                                                                                                                                                                                                                                                                                                                                                                                                                                                                                                                                                                                                                                                                                                                                                                                                                                                                                                                                                                                                                            |                                           |
|                                                                                                                                                                                                                                                                                                                                                                                                                                                                                                                                                                                                                                                                                                                                                                                                                                                                                                                                                                                                                                                                                                                                                                                                                                                                                                                                                                                                                                                                                                                                                                                                                              |                                           |
| (3) Maestre o Maese Jácome: se trata de Andrés Jácome de Mónaco (Demonago), genovés, padre de Andrés Jácome, mudo, y de Antón Domíngurez, mulato: infra, regº 184.                                                                                                                                                                                                                                                                                                                                                                                                                                                                                                                                                                                                                                                                                                                                                                                                                                                                                                                                                                                                                                                                                                                                                                                                                                                                                                                                                                                                                                                           |                                           |
|                                                                                                                                                                                                                                                                                                                                                                                                                                                                                                                                                                                                                                                                                                                                                                                                                                                                                                                                                                                                                                                                                                                                                                                                                                                                                                                                                                                                                                                                                                                                                                                                                              |                                           |
| (4) Nótese la forma como se data la cédula, diciendo simplemente "Colima".                                                                                                                                                                                                                                                                                                                                                                                                                                                                                                                                                                                                                                                                                                                                                                                                                                                                                                                                                                                                                                                                                                                                                                                                                                                                                                                                                                                                                                                                                                                                                   |                                           |
|                                                                                                                                                                                                                                                                                                                                                                                                                                                                                                                                                                                                                                                                                                                                                                                                                                                                                                                                                                                                                                                                                                                                                                                                                                                                                                                                                                                                                                                                                                                                                                                                                              |                                           |
| (5) Generalmente aparece nombrado Dávila Quiñones.                                                                                                                                                                                                                                                                                                                                                                                                                                                                                                                                                                                                                                                                                                                                                                                                                                                                                                                                                                                                                                                                                                                                                                                                                                                                                                                                                                                                                                                                                                                                                                           |                                           |
|                                                                                                                                                                                                                                                                                                                                                                                                                                                                                                                                                                                                                                                                                                                                                                                                                                                                                                                                                                                                                                                                                                                                                                                                                                                                                                                                                                                                                                                                                                                                                                                                                              |                                           |
| (6) Tanto el escribano como otros testigos reconocieron la firma del mercader arriero con facilidad, alegando que le vieron en vida "escrebir y firmar muchas y diversas veces y tiene otras muchas firmas", como dijera Juan de Iniesta. Tales testimonios indican con claridad la intensa actividad mercantil de Aztiguieta y, por tanto, de Alonso de la Puerta, en la Villa y Provincia de Colima.                                                                                                                                                                                                                                                                                                                                                                                                                                                                                                                                                                                                                                                                                                                                                                                                                                                                                                                                                                                                                                                                                                                                                                                                                       |                                           |
+------------------------------------------------------------------------------------------------------------------------------------------------------------------------------------------------------------------------------------------------------------------------------------------------------------------------------------------------------------------------------------------------------------------------------------------------------------------------------------------------------------------------------------------------------------------------------------------------------------------------------------------------------------------------------------------------------------------------------------------------------------------------------------------------------------------------------------------------------------------------------------------------------------------------------------------------------------------------------------------------------------------------------------------------------------------------------------------------------------------------------------------------------------------------------------------------------------------------------------------------------------------------------------------------------------------------------------------------------------------------------------------------------------------------------------------------------------------------------------------------------------------------------------------------------------------------------------------------------------------------------+-------------------------------------------+

Documento(s) original(es)

Archivo no encontrado (CAJAS/CAJA4/EXP9/002V.jpg)

Archivo no encontrado (CAJAS/CAJA4/EXP9/009V.jpg)

Archivo no encontrado (CAJAS/CAJA4/EXP9/010V.jpg)

[]
1F

[]
1V

[]
2F

[]
3F

[]
3V

[]
4F

[]
4V

[]
5F

[]
5V

[]
6F

[]
6V

[]
7F

[]
7V

[]
8F

[]
8V

[]
9F

[]
10F

[]
11F

[]
11V

Proyecto interinstitucional del Archivo Histórico del Municipio de Colima y la Universidad de Colima,
realizado bajo los auspicios del fondo Ramón Álvarez-Buylla de Aldana.

------------------------------------------------------------------------

ISBN 978-968-7412-85-6
® Derechos Reservados 2008. Archivo Histórico del Municipio de Colima.

1,078 visitas
