[]

LA VILLA DE COLIMA DE LA NUEVA ESPAÑA
SIGLO XVI

VOLUMEN I      (CAJAS 1-11)

[]

Inicio | Búsquedas | Siglas y bibliografía | Cartografía | Créditos | Más información

[]

Búsqueda rápida

+:------------------------------------------------------------------------------------------------------------------------------------------------------------------------------------------------------------------------------------------------------------------------------------------------------------------------------------------------------------------------------------------------------------------------------------------------------------------------------------------------------------------------------------------------------------------------------------------------------------------------------------------------------------------------------------------------------:+------------------------------------------:+
| Fecha:                                                                                                                                                                                                                                                                                                                                                                                                                                                                                                                                                                                                                                                                                                 | Ubicación física del documento original:  |
| 1576 Noviembre, 24                                                                                                                                                                                                                                                                                                                                                                                                                                                                                                                                                                                                                                                                                     | CAJA A-8, EXP. 19, FF. 56-63.             |
|                                                                                                                                                                                                                                                                                                                                                                                                                                                                                                                                                                                                                                                                                                        | Archivo Histórico del Municipio de Colima |
+--------------------------------------------------------------------------------------------------------------------------------------------------------------------------------------------------------------------------------------------------------------------------------------------------------------------------------------------------------------------------------------------------------------------------------------------------------------------------------------------------------------------------------------------------------------------------------------------------------------------------------------------------------------------------------------------------------+-------------------------------------------+
| 283. 1576. Noviembre, 24.                                                                                                                                                                                                                                                                                                                                                                                                                                                                                                                                                                                                                                                                              |                                           |
|                                                                                                                                                                                                                                                                                                                                                                                                                                                                                                                                                                                                                                                                                                        |                                           |
| Testamento de Juan Domínguez.                                                                                                                                                                                                                                                                                                                                                                                                                                                                                                                                                                                                                                                                          |                                           |
|                                                                                                                                                                                                                                                                                                                                                                                                                                                                                                                                                                                                                                                                                                        |                                           |
| En la Ciudad de Guayangareo de la Provincia de Mechuacan, ante el escribano de Su Majestad Hernando Sánchez Urdiales y de los testigos Pero Gutiérrez de Cuevas, Gonzalo López –clérigo presbítero–(1) y Pero Gómez de Arellano,(2) vecinos de esta ciudad, y Polonia de Gamboa "en cuya posada estaba y está el dicho otorgante", Juan Domínguez dictó su última voluntad.                                                                                                                                                                                                                                                                                                                            |                                           |
|                                                                                                                                                                                                                                                                                                                                                                                                                                                                                                                                                                                                                                                                                                        |                                           |
| In Dei nomine. Amen.                                                                                                                                                                                                                                                                                                                                                                                                                                                                                                                                                                                                                                                                                   |                                           |
|                                                                                                                                                                                                                                                                                                                                                                                                                                                                                                                                                                                                                                                                                                        |                                           |
| "Sepan cuantos esta carta de testamento vieren, cómo yo Juan Domínguez, vecino que soy de la Villa de Colima, estante al presente en esta ciudad de Guayangareo, otorgo y conozco por esta presente carta de mi testamento que hago y ordeno a servicio de Dios Nuestro Señor, estando enfermo del cuerpo y sano de la voluntad, en mi seso y entendimiento y juicio natural, tal cual Dios Nuestro Señor me lo quiso dar, creyendo como firmemente creo en la Santísima Trinidad Padre, e Hijo y Espíritu Santo, tres personas y una esencia divina, ruego y suplico a la Virgen María, Madre de Dios, que ruegue por mí a su precioso Hijo, que me perdone mis pecados y lleve mi ánima a su gloria. |                                           |
|                                                                                                                                                                                                                                                                                                                                                                                                                                                                                                                                                                                                                                                                                                        |                                           |
| "Y temiéndome de la muerte por ser cosa natural, hago y ordeno este mi testamento y postrimera voluntad, en la forma y manera siguientes:                                                                                                                                                                                                                                                                                                                                                                                                                                                                                                                                                              |                                           |
|                                                                                                                                                                                                                                                                                                                                                                                                                                                                                                                                                                                                                                                                                                        |                                           |
| "Primeramente mando mi ánima a Dios Nuestro Señor que la crió y redimió por su preciosa sangre, y mi cuerpo a la tierra de que fue formado.                                                                                                                                                                                                                                                                                                                                                                                                                                                                                                                                                            |                                           |
|                                                                                                                                                                                                                                                                                                                                                                                                                                                                                                                                                                                                                                                                                                        |                                           |
| "Iten mando que si Dios Nuestro Señor fuere servido de me llevar en esta ciudad desta enfermedad [...], me echen el hábito del bienaventurado señor San Francisco para que yo muera con él y me entierren en su iglesia, en esta ciudad, en la sepultura que el Padre guardián y conventuales me dieren; y paguen de mis bienes la limosna del hábito y con mi cuerpo a la iglesia, mando cinco pesos de oro común en limosna".                                                                                                                                                                                                                                                                        |                                           |
|                                                                                                                                                                                                                                                                                                                                                                                                                                                                                                                                                                                                                                                                                                        |                                           |
| Manda que "el día de mi enterramiento, si fuere hora suficiente, me digan en la dicha iglesia una misa cantada con diácono y subdiácono,(3) el cuerpo presente, y si no otro día siguiente y se pague la limosna acostumbrada, y sea ofrendada de pan y vino y cera". Manda que después de su enterramiento, "en el dicho monasterio me digan en nueve días otras nueve misas rezadas"; manda 10 pesos de oro común para que se celebren misas por las ánimas de las personas que están a su cargo y no se acuerda; otras 10 misas por las Ánimas del Purgatorio "para que rueguen a Dios por mí".                                                                                                     |                                           |
|                                                                                                                                                                                                                                                                                                                                                                                                                                                                                                                                                                                                                                                                                                        |                                           |
| "Iten declaro que yo llevo al presente quince cargas de cacao, que compré de Diego Morán y le hice una cédula por ellas a veinte pesos carga; que se le paguen de mis bienes; iten mando que le paguen a una hija del dicho Diego Morán, lo que pareciere que le debo por una cédula que le hice; iten declaro para descargo de mi conciencia que a mí me encomendaron en la Villa de Colima algunas personas que les llevase de México algunas cosas; mando que la persona que paresciere jurando que yo le debo de seis pesos abajo, se le pague sin otra prueba alguna.                                                                                                                             |                                           |
|                                                                                                                                                                                                                                                                                                                                                                                                                                                                                                                                                                                                                                                                                                        |                                           |
| "Iten declaro que el bachiller Grijalba me dio un jarro de plata para que lo hiciese aderezar en México y lo tengo en mi poder, y ansimismo me dio doce pesos para que diese a una persona, por él, en México y ansimismo me dio otros doce pesos para aceite para el Santísimo Sacramento de la iglesia de Colima; todo esto mando que se le pague de mis bienes".                                                                                                                                                                                                                                                                                                                                    |                                           |
|                                                                                                                                                                                                                                                                                                                                                                                                                                                                                                                                                                                                                                                                                                        |                                           |
| "Iten declaro que yo he vivido en una casa de Polonia de Gamboa en la Villa de Colima dos años –que se cumplen por la Pascua de los Reyes(4) del año de setenta y siete [1577]– y está concertado en cada un año veinte y seis pesos de alquiler, y no le he pagado cosa ninguna dello, mas de que agora le truje a esta ciudad de Guayangareo cuatro caballos cargados de cacao, y se lo he entregado a la susodicha y los fletes montan veinte e cuatro pesos; réstole debiendo lo demás. Mando que se lo paguen de mis bienes.                                                                                                                                                                      |                                           |
|                                                                                                                                                                                                                                                                                                                                                                                                                                                                                                                                                                                                                                                                                                        |                                           |
| "Iten declaro que yo fui casado primera vez con Francisca Hernández, mi mujer difunta, en la cual hube dos hijos que se nombran Francisco Hernández y Francisco Domínguez, y declaro que la dicha mi mujer trujo a mi poder en dote en cosillas que valdrían hasta cincuenta pesos de oro común. Mando que estos dichos pesos de oro los hayan los dichos mis hijos, como bienes dotales de la dicha su madre.                                                                                                                                                                                                                                                                                         |                                           |
|                                                                                                                                                                                                                                                                                                                                                                                                                                                                                                                                                                                                                                                                                                        |                                           |
| "Iten declaro que durante el matrimonio que tuvimos yo y la dicha Francisca Hernández, mi primera mujer, ganamos y multiplicamos la huerta de cacao que al presente tengo, y un negro que se dice Antón, y algunos caballos y otros bienes que al presente no me acuerdo, porque yo no truje caudal ninguno a poder de la dicha mi mujer cuando con ella me casé. Mando que la mitad de los dichos bienes que tengo declarados, que son bienes ganados entre mí y la dicha mi mujer, los hayan los dichos mis hijos Francisco Hernández y Francisco Domínguez con los del dote de la dicha su madre.                                                                                                   |                                           |
|                                                                                                                                                                                                                                                                                                                                                                                                                                                                                                                                                                                                                                                                                                        |                                           |
| "Iten declaro que habrá tres años, poco más o menos, que yo me casé [por] segunda vez con Luisa de León, mi segunda mujer, en la cual he habido una hija que se dice Elvira, que será de edad de dos meses, poco más o menos, y hube en dote y casamiento con la dicha mi mujer hasta doscientos pesos de oro común en ropa y otras cosas, porque ella era viuda. Mando que éstos se los den de mis bienes, que [no] le hice escriptura de dote ninguna".                                                                                                                                                                                                                                              |                                           |
|                                                                                                                                                                                                                                                                                                                                                                                                                                                                                                                                                                                                                                                                                                        |                                           |
| "Iten mando a la dicha mi hija Elvira y hija de la dicha Luisa de León, mi mujer, porque es niña y por criar, para que se críe y case, la tercera parte de todos mis bienes muebles y raíces".(5)                                                                                                                                                                                                                                                                                                                                                                                                                                                                                                      |                                           |
|                                                                                                                                                                                                                                                                                                                                                                                                                                                                                                                                                                                                                                                                                                        |                                           |
| Agrega que "en el tiempo del matrimonio desta segunda mujer que agora tengo, hemos ganado y multiplicado una negra, que se dice Antona, y alguno del cacao que agora tengo en esta ciudad, y algunos caballos de la harria, y otros bienes que al presente no me acuerdo. Mando que todo lo que pareciere que hemos ganado y multiplicado durante el dicho matrimonio, la mitad dello haya y herede la dicha Luisa de León, mi mujer, como cosa suya propia.                                                                                                                                                                                                                                           |                                           |
|                                                                                                                                                                                                                                                                                                                                                                                                                                                                                                                                                                                                                                                                                                        |                                           |
| "Iten mando a tres cofradías de que soy cofrade en Colima, a cada una, cinco pesos en limosna                                                                                                                                                                                                                                                                                                                                                                                                                                                                                                                                                                                                          |                                           |
|                                                                                                                                                                                                                                                                                                                                                                                                                                                                                                                                                                                                                                                                                                        |                                           |
| "Nombro y señalo por mis bienes para el cumplimiento deste testamento, los siguientes: primeramente, una huerta de cacao en la Villa de Colima; iten veinte y cuatro costales de cacao que tengo en esta casa de Polonia de Gamboa y otros cuatro costales de cacao de la mujer de Jorge Carrillo;(6) iten veinte fanegas de sal; iten seis mulas y machos de harria; iten nueve caballos de harria con sus aderezos de enjalmas y mecates;(7) iten declaro que tengo un negrito, hijo de la dicha negra Antona, que se dice Jerónimo, y éste mando que se lo den a la dicha Elvira, mi hija, en el tercio de mis bienes que le mando".                                                                |                                           |
|                                                                                                                                                                                                                                                                                                                                                                                                                                                                                                                                                                                                                                                                                                        |                                           |
| Designa por sus albaceas y testamentarios a Polonia de Gamboa, viuda, vecina de esta ciudad, y a Alonso Miguel, vecino de Colima. También designa al dicho Alonso Miguel por tutor y curador de sus hijos, Francisco Hernández y Francisco Domínguez, "durante el tiempo que no se casaren o tuvieren edad suficiente para se los entregar", y señala "por tutriz y curadora y administradora, como de derecho lo es, [a] la dicha Luisa de León, mi mujer, de la dicha mi hija Elvira y de sus bienes".                                                                                                                                                                                               |                                           |
|                                                                                                                                                                                                                                                                                                                                                                                                                                                                                                                                                                                                                                                                                                        |                                           |
| Del resto de sus bienes, nombra por herederos universales a sus tres hijos "por iguales partes, fuera de la mejora que tengo fecha a la dicha mi hija Elvira, sin llevarse el uno más que el otro".                                                                                                                                                                                                                                                                                                                                                                                                                                                                                                    |                                           |
|                                                                                                                                                                                                                                                                                                                                                                                                                                                                                                                                                                                                                                                                                                        |                                           |
| Caja A–8, exp. 19, ff. 56-63.                                                                                                                                                                                                                                                                                                                                                                                                                                                                                                                                                                                                                                                                          |                                           |
|                                                                                                                                                                                                                                                                                                                                                                                                                                                                                                                                                                                                                                                                                                        |                                           |
|                                                                                                                                                                                                                                                                                                                                                                                                                                                                                                                                                                                                                                                                                                        |                                           |
|                                                                                                                                                                                                                                                                                                                                                                                                                                                                                                                                                                                                                                                                                                        |                                           |
| ---------------                                                                                                                                                                                                                                                                                                                                                                                                                                                                                                                                                                                                                                                                                        |                                           |
|                                                                                                                                                                                                                                                                                                                                                                                                                                                                                                                                                                                                                                                                                                        |                                           |
| (1) Fue cura de Tuzantla, en 1567; y después, vicario en Pénjamo (1580-1581): León Alanís (1997), 311 y 315.                                                                                                                                                                                                                                                                                                                                                                                                                                                                                                                                                                                           |                                           |
|                                                                                                                                                                                                                                                                                                                                                                                                                                                                                                                                                                                                                                                                                                        |                                           |
| (2) También nombrado a veces Pedro de Arellano, según Hillerkuss (2001), 254, quien proporciona noticias complementarias.                                                                                                                                                                                                                                                                                                                                                                                                                                                                                                                                                                              |                                           |
|                                                                                                                                                                                                                                                                                                                                                                                                                                                                                                                                                                                                                                                                                                        |                                           |
| (3) Textualmente: "sodiácono". La palabra era conocida en Puebla en 1554: Boyd–Bowman (1971), 872.                                                                                                                                                                                                                                                                                                                                                                                                                                                                                                                                                                                                     |                                           |
|                                                                                                                                                                                                                                                                                                                                                                                                                                                                                                                                                                                                                                                                                                        |                                           |
| (4) Fiesta de los Reyes Magos o Epifanía, cuya celebración es el 6 de enero de cada año.                                                                                                                                                                                                                                                                                                                                                                                                                                                                                                                                                                                                               |                                           |
|                                                                                                                                                                                                                                                                                                                                                                                                                                                                                                                                                                                                                                                                                                        |                                           |
| (5) Al margen: "Mejora del tercio a Elvira, su hija".                                                                                                                                                                                                                                                                                                                                                                                                                                                                                                                                                                                                                                                  |                                           |
|                                                                                                                                                                                                                                                                                                                                                                                                                                                                                                                                                                                                                                                                                                        |                                           |
| (6) A saber, Francisca de Nava, hija de Antonio de Nava y Juana de la Cuadra: Icaza (1969), I, nº 378 y II, nº 527; Romero de Solís, Andariegos… (2001), 357.                                                                                                                                                                                                                                                                                                                                                                                                                                                                                                                                          |                                           |
|                                                                                                                                                                                                                                                                                                                                                                                                                                                                                                                                                                                                                                                                                                        |                                           |
| (7) De mecatl, cuerda o soga hecha de ixtle del maguey: Cabrera (1984), 90.                                                                                                                                                                                                                                                                                                                                                                                                                                                                                                                                                                                                                            |                                           |
+--------------------------------------------------------------------------------------------------------------------------------------------------------------------------------------------------------------------------------------------------------------------------------------------------------------------------------------------------------------------------------------------------------------------------------------------------------------------------------------------------------------------------------------------------------------------------------------------------------------------------------------------------------------------------------------------------------+-------------------------------------------+

Documento(s) original(es)

Archivo no encontrado (CAJAS/CAJA8/EXP19/056F.jpg)

Archivo no encontrado (CAJAS/CAJA8/EXP19/056V.jpg)

Archivo no encontrado (CAJAS/CAJA8/EXP19/057F.jpg)

Archivo no encontrado (CAJAS/CAJA8/EXP19/057V.jpg)

Archivo no encontrado (CAJAS/CAJA8/EXP19/058F.jpg)

Archivo no encontrado (CAJAS/CAJA8/EXP19/058V.jpg)

Archivo no encontrado (CAJAS/CAJA8/EXP19/059F.jpg)

Archivo no encontrado (CAJAS/CAJA8/EXP19/059V.jpg)

Archivo no encontrado (CAJAS/CAJA8/EXP19/060F.jpg)

Archivo no encontrado (CAJAS/CAJA8/EXP19/060V.jpg)

Archivo no encontrado (CAJAS/CAJA8/EXP19/061F.jpg)

Archivo no encontrado (CAJAS/CAJA8/EXP19/061V.jpg)

Archivo no encontrado (CAJAS/CAJA8/EXP19/062F.jpg)

Archivo no encontrado (CAJAS/CAJA8/EXP19/062V.jpg)

Archivo no encontrado (CAJAS/CAJA8/EXP19/063F.jpg)

Archivo no encontrado (CAJAS/CAJA8/EXP19/063V.jpg)

Proyecto interinstitucional del Archivo Histórico del Municipio de Colima y la Universidad de Colima,
realizado bajo los auspicios del fondo Ramón Álvarez-Buylla de Aldana.

------------------------------------------------------------------------

ISBN 978-968-7412-85-6
® Derechos Reservados 2008. Archivo Histórico del Municipio de Colima.

1,078 visitas
