+------------------------------------------------------------------------------------------------------------------------------------------------------------------+-----------------------+-----------------------+
| []                                                                                                                                                               |                       |                       |
|                                                                                                                                                                  |                       |                       |
| +-----------------------------------+:-------------------------------------:+                                                                                    |                       |                       |
| | []                                | LA VILLA DE COLIMA DE LA NUEVA ESPAÑA |                                                                                    |                       |                       |
| |                                   | SIGLO XVI                             |                                                                                    |                       |                       |
| |                                   |                                       |                                                                                    |                       |                       |
| |                                   | VOLUMEN II      (CAJAS 12-20)         |                                                                                    |                       |                       |
| +-----------------------------------+---------------------------------------+                                                                                    |                       |                       |
+------------------------------------------------------------------------------------------------------------------------------------------------------------------+-----------------------+-----------------------+
| +------------------------------------------------------------------------+-------------------------------+-----------------------+                               |                       |                       |
| | Inicio | Búsqueda | Siglas y bibliografía | Créditos | Más información | Vol. I (1-11) Vol. II (12-20) |    [ES]               |                               |                       |                       |
| +------------------------------------------------------------------------+-------------------------------+-----------------------+                               |                       |                       |
+------------------------------------------------------------------------------------------------------------------------------------------------------------------+-----------------------+-----------------------+
| Búsqueda rápida                                                                                                                                                  |                       |                       |
|                                                                                                                                                                  |                       |                       |
| +:-------------------:+-----------------+:----------------------------------------:+----------------:+                                                           |                       |                       |
| | Documento de fecha: |                 | Ubicación física del documento original: | [] [] []        |                                                           |                       |                       |
| |                     |                 |                                          |                 |                                                           |                       |                       |
| | 1598.[10143]        |                 | Caja 26, exp. 30, f. 41 vta.             |                 |                                                           |                       |                       |
| +---------------------+-----------------+------------------------------------------+-----------------+                                                           |                       |                       |
|                                                                                                                                                                  |                       |                       |
|   ------------- -------------------------------------------------------------                                                                                    |                       |                       |
|   Resumen:      Poder general de Francisco Ortiz a Juan Rodríguez Santiago.                                                                                      |                       |                       |
|   ------------- -------------------------------------------------------------                                                                                    |                       |                       |
|                                                                                                                                                                  |                       |                       |
|   ----------------------------------- -----------------------------------------------------------------------------------------------------                      |                       |                       |
|   Contenido:                          Francisco Ortiz otorgó todo su poder al bachiller Juan Rodríguez Santiago, vecinos ambos de Colima.                        |                       |                       |
|                                       Testigos: Juan Cornejo, Antonio de Ocampo y Bernabé Díez,^([1]) vecinos de Colima.                                         |                       |                       |
|                                       Pasó ante el escribano público Toribio de Casso.                                                                           |                       |                       |
|                                                                                                                                                                  |                       |                       |
|   ----------------------------------- -----------------------------------------------------------------------------------------------------                      |                       |                       |
|                                                                                                                                                                  |                       |                       |
| (1) O Bernabé Díaz, vecino de Colima desde 1579; en 1588 fue designado defensor de Felipe Jacobo, indio de Tlaquitipa: Romero de Solís, Andariegos… (2001), 133. |                       |                       |
|                                                                                                                                                                  |                       |                       |
|   ---------------------------------------------------------------------------------------------------                                                            |                       |                       |
|    Documento(s) original(es)                                                                                                                                     |                       |                       |
|   --------------------------- ------- ------- ------- ------- ------- ------- ------- ------- -------                                                            |                       |                       |
|               []                                                                                                                                                 |                       |                       |
|               41v                                                                                                                                                |                       |                       |
|                                                                                                                                                                  |                       |                       |
|   ---------------------------------------------------------------------------------------------------                                                            |                       |                       |
+------------------------------------------------------------------------------------------------------------------------------------------------------------------+-----------------------+-----------------------+
| +----------------------------------------------------------------------------+-----------------------------------------------:+                                  |                       |                       |
| | ISBN 978-607-701-024-1                                                     |   ---- ---- ---- ---- ---- ---- ---- ---- ---- |                                  |                       |                       |
| | © Derechos Reservados 2013. Archivo Histórico del Municipio de Colima. [*] |   []        []        []        []        []   |                                  |                       |                       |
| |                                                                            |   ---- ---- ---- ---- ---- ---- ---- ---- ---- |                                  |                       |                       |
| +----------------------------------------------------------------------------+------------------------------------------------+                                  |                       |                       |
| |                                                                            |                                                |                                  |                       |                       |
| +----------------------------------------------------------------------------+------------------------------------------------+                                  |                       |                       |
+------------------------------------------------------------------------------------------------------------------------------------------------------------------+-----------------------+-----------------------+

636 visitas
