+------------------------------------------------------------------------------------------------------------------------------------------------------------------------------------------------------------------------------------------------------------------------------------------------------------------------------------------------------------------------------------------------------------------------------------------------------------------------------------------------------------------------------------------------------------------------------------------------------------------------------------------------------------------------------------------------+-----------------------+-----------------------+
| []                                                                                                                                                                                                                                                                                                                                                                                                                                                                                                                                                                                                                                                                                             |                       |                       |
|                                                                                                                                                                                                                                                                                                                                                                                                                                                                                                                                                                                                                                                                                                |                       |                       |
| +-----------------------------------+:-------------------------------------:+                                                                                                                                                                                                                                                                                                                                                                                                                                                                                                                                                                                                                  |                       |                       |
| | []                                | LA VILLA DE COLIMA DE LA NUEVA ESPAÑA |                                                                                                                                                                                                                                                                                                                                                                                                                                                                                                                                                                                                                  |                       |                       |
| |                                   | SIGLO XVI                             |                                                                                                                                                                                                                                                                                                                                                                                                                                                                                                                                                                                                                  |                       |                       |
| |                                   |                                       |                                                                                                                                                                                                                                                                                                                                                                                                                                                                                                                                                                                                                  |                       |                       |
| |                                   | VOLUMEN II      (CAJAS 12-20)         |                                                                                                                                                                                                                                                                                                                                                                                                                                                                                                                                                                                                                  |                       |                       |
| +-----------------------------------+---------------------------------------+                                                                                                                                                                                                                                                                                                                                                                                                                                                                                                                                                                                                                  |                       |                       |
+------------------------------------------------------------------------------------------------------------------------------------------------------------------------------------------------------------------------------------------------------------------------------------------------------------------------------------------------------------------------------------------------------------------------------------------------------------------------------------------------------------------------------------------------------------------------------------------------------------------------------------------------------------------------------------------------+-----------------------+-----------------------+
| +------------------------------------------------------------------------+-------------------------------+-----------------------+                                                                                                                                                                                                                                                                                                                                                                                                                                                                                                                                                             |                       |                       |
| | Inicio | Búsqueda | Siglas y bibliografía | Créditos | Más información | Vol. I (1-11) Vol. II (12-20) |    [ES]               |                                                                                                                                                                                                                                                                                                                                                                                                                                                                                                                                                             |                       |                       |
| +------------------------------------------------------------------------+-------------------------------+-----------------------+                                                                                                                                                                                                                                                                                                                                                                                                                                                                                                                                                             |                       |                       |
+------------------------------------------------------------------------------------------------------------------------------------------------------------------------------------------------------------------------------------------------------------------------------------------------------------------------------------------------------------------------------------------------------------------------------------------------------------------------------------------------------------------------------------------------------------------------------------------------------------------------------------------------------------------------------------------------+-----------------------+-----------------------+
| Búsqueda rápida                                                                                                                                                                                                                                                                                                                                                                                                                                                                                                                                                                                                                                                                                |                       |                       |
|                                                                                                                                                                                                                                                                                                                                                                                                                                                                                                                                                                                                                                                                                                |                       |                       |
| +:------------------------:+-----------------+:----------------------------------------:+----------------:+                                                                                                                                                                                                                                                                                                                                                                                                                                                                                                                                                                                    |                       |                       |
| | Documento de fecha:      |                 | Ubicación física del documento original: | [] [] []        |                                                                                                                                                                                                                                                                                                                                                                                                                                                                                                                                                                                    |                       |                       |
| |                          |                 |                                          |                 |                                                                                                                                                                                                                                                                                                                                                                                                                                                                                                                                                                                    |                       |                       |
| | 1558. Febrero 19.[10506] |                 | Caja 27, exp. 1, 18 ff.                  |                 |                                                                                                                                                                                                                                                                                                                                                                                                                                                                                                                                                                                    |                       |                       |
| +--------------------------+-----------------+------------------------------------------+-----------------+                                                                                                                                                                                                                                                                                                                                                                                                                                                                                                                                                                                    |                       |                       |
|                                                                                                                                                                                                                                                                                                                                                                                                                                                                                                                                                                                                                                                                                                |                       |                       |
|   ------------- ----------------------------------------------------------------------------------------------------------------                                                                                                                                                                                                                                                                                                                                                                                                                                                                                                                                                               |                       |                       |
|   Resumen:      Querella entre Juan Fernández Ladrillero y Diego de Almodóvar sobre la mitad de la huerta de cacao de Mezcala.                                                                                                                                                                                                                                                                                                                                                                                                                                                                                                                                                                 |                       |                       |
|   ------------- ----------------------------------------------------------------------------------------------------------------                                                                                                                                                                                                                                                                                                                                                                                                                                                                                                                                                               |                       |                       |
|                                                                                                                                                                                                                                                                                                                                                                                                                                                                                                                                                                                                                                                                                                |                       |                       |
|   ----------------------------------- -------------------------------------------------------------------------------------------------------------------------------------------------------------------------------------------------------------------------------------------------------------------------------------------------------------------------------------------------------------------------------------------------------------------------------------------------------------------------------------------------------------------------------------------------------------------------------------------------------------------------------------------------------- |                       |                       |
|   Contenido:                          Demanda de Juan Fernández Ladrillero                                                                                                                                                                                                                                                                                                                                                                                                                                                                                                                                                                                                                     |                       |                       |
|                                       contra Diego de Almodóvar, sobre la heredad de cacao                                                                                                                                                                                                                                                                                                                                                                                                                                                                                                                                                                                                     |                       |                       |
|                                       En 19 de febrero de 1558, Juan Fernández Ladrillero dice que estando en la Villa de Colima en octubre de 1548, enfermó de cámaras de sangre muchos meses, de lo que llegó “muy al cabo de la vida y a punto de morir”.                                                                                                                                                                                                                                                                                                                                                                                                                                   |                       |                       |
|                                       Estaba curándose en la casa de Ginesa López, vecina viuda, cuando Diego de Almodóvar, “con palabras blandas y amorosas, mostrando tener compasión de mí”, le dijo que en las casas de su morada tendría mejor cuidado, a lo que dio crédito, y estando en ellas le vendió “sin tener libre consentimiento, antes forzado y compelido”, una heredad que tenía en Alima en 625 pesos “valiendo como valían y valen” más de 1,500 pesos oro, y que después, en la heredad que tenía 30 árboles, plantó otros tantos y la vendió a Luis de Grijalba por 4,800 pesos de tepuzque.                                                                             |                       |                       |
|                                       Que estando todavía enfermo “y no acabando de cenar”, el alcalde mayor Cristóbal de Espíndola, muy íntimo amigo de Diego de Almodóvar, lo prendió por no querer ser piloto de un navío para los reinos de Pirú que enviaba a saber los términos en que estaba cuando las rebeliones de Pizarro, y que estando en la dicha prisión, Almodóvar pidió que aprobase y ratificase la venta de su heredad, para lo cual el dicho alcalde mayor lo importunó con palabras de rigor y amenaza para “poner en mí miedo por tenerme como me temía de ser reo de un morro”,^([1]) por lo que aprobó dicha venta, a lo cual le dieron otros 50 pesos de oro común.   |                       |                       |
|                                       Pide que se declare como “ninguna y de ningún valor” dicha venta y aprobación, y que Diego de Almodóvar sea obligado a devolverle su heredad con sus pertenencias y lo en ella plantado “en total restitución”.                                                                                                                                                                                                                                                                                                                                                                                                                                          |                       |                       |
|                                       Al día siguiente por el escribano Diego Veedor le fue leída esta demanda a Diego de Almodóvar, quien contesta que recibió la demanda que puso en su contra Joan Fernández Ladrillero por la venta que le hizo de la mitad de la huerta de Mezcala, que tiene al dicho “por odioso y sospechoso”, y para lo cual presenta el poder que le otorgó.                                                                                                                                                                                                                                                                                                         |                       |                       |
|                                       Diego de Almodóvar                                                                                                                                                                                                                                                                                                                                                                                                                                                                                                                                                                                                                                       |                       |                       |
|                                       contra Juan Fernández Ladrillero                                                                                                                                                                                                                                                                                                                                                                                                                                                                                                                                                                                                                         |                       |                       |
|                                       Diego de Almodóvar dice que la mitad de la huerta de Mexcala se la vendió “justa y jurídicamente” Juan Fernández Ladrillero “según consta de la carta de venta” que presenta, por lo que pide que al mismo no se le debe admitir causa sino poner “perpetuo silencio”.                                                                                                                                                                                                                                                                                                                                                                                   |                       |                       |
|                                       Dice que en febrero de 1549, le quiso poner demanda por la mitad de la huerta de cacao y que, por ruego de ciertos vecinos de la Villa, para que no le pidiera ni demandara cosa alguna, le dio 50 pesos de oro común y 3 cabezas de yeguas que valían otros 50 pesos, y que el dicho Juan Fernández Ladrillero le otorgó entonces una obligación de que no le pediría ni demandaría nada.                                                                                                                                                                                                                                                               |                       |                       |
|                                       Testado de la carta de venta que otorgó                                                                                                                                                                                                                                                                                                                                                                                                                                                                                                                                                                                                                  |                       |                       |
|                                       Juan Fernández Ladrillero a Diego de Almodóvar ante Juan de la Torre, escribano de Su Magestad, el 25 de octubre de 1558                                                                                                                                                                                                                                                                                                                                                                                                                                                                                                                                 |                       |                       |
|                                       Juan Fernández Ladrillero, piloto estante en la Villa de Colima, otorga a Diego de Almodóvar la mitad de una huerta de cacao que tiene en la estancia que se dice Mezcala, que está en el pueblo de Alima, la que tuvo y compró de Ginés Pinzón, misma que vendió sin censo o hipoteca en 625 pesos de oro de minas y oferta de 450 maravedíes, que recibió y son en su poder.                                                                                                                                                                                                                                                                           |                       |                       |
|                                       Testigos: Juan Gómez, Bartolomé Sánchez, Diego de Velasco y Juan Fernández El Mozo, vecinos de Colima.                                                                                                                                                                                                                                                                                                                                                                                                                                                                                                                                                   |                       |                       |
|                                       Por Juan Fernández Ladrillero que no sabe escribir, firmó Juan Gómez.                                                                                                                                                                                                                                                                                                                                                                                                                                                                                                                                                                                    |                       |                       |
|                                       El 18 de febrero de 1559 Juan Fernández Ladrillero dijo ante el alcalde mayor de Colima, Cristóbal de Espíndola y el escribano Juan de la Torre, que vendió en 625 pesos de oro de minas a Diego de Almodóvar la mitad de una huerta de cacao en Mezcala que compró a Ginés Pinzón, y que se halla agraviado de haberla vendido por una cantidad de pesos menor de lo que valía.                                                                                                                                                                                                                                                                         |                       |                       |
|                                       Dice que Diego de Almodóvar quiere que se desista de su derecho a dicha huerta y que no le ponga demanda alguna, para lo cual le da 50 pesos de oro de tepuzque y 3 cabezas de yeguas, dos de ellas sembradas, los que acepta en presencia de dicho alcalde “que me dejo e desisto de todo el derecho y sanción” y aprueba la venta de dicha huerta.                                                                                                                                                                                                                                                                                                     |                       |                       |
|                                       Testigos: Francisco Cervantes y Francisco Lepuzcano, vecinos de Colima.                                                                                                                                                                                                                                                                                                                                                                                                                                                                                                                                                                                  |                       |                       |
|                                       Joan Fernández Ladrillero dice que Diego de Almodóvar no quiere responder derechamente “sino antes pone causas y dilaciones y malicias diciendo no ser yo parte ni poderle pedir nada” en la demanda que le tiene puesta, por lo que pide se le mande que responda derecha y jurídicamente conforme a derecho y justicia, y que señale casa y procurador para los avisos del negocio.                                                                                                                                                                                                                                                                    |                       |                       |
|                                       En 2 de marzo de 1562, Joan Fernández Ladrillero apeló ante el alcalde mayor Lope de Arellano un auto en su contra que pronunciaron Diego de Mendoza y Diego de Velasco, alcaldes ordinarios, en la demanda que tiene puesta sobre una huerta de cacao a Diego de Almodóvar.                                                                                                                                                                                                                                                                                                                                                                             |                       |                       |
|                                       El alcalde mandó “que se junte todo el mismo juicio que traiga el caso para verlo”, y sobre ello proveerá. Diego Veedor, escribano.                                                                                                                                                                                                                                                                                                                                                                                                                                                                                                                      |                       |                       |
|                                       El 24 de marzo de 1562, Joan Fernández Ladrillero dijo que Diego de Almodóvar tiene como procurador a un “fulano de Hoyos”, y pide manden que éste no entienda el dicho negocio y que se señale a otra persona como procurador Juan de Hoyos declaró ante Lope de Arellano y el escribano Diego Veedor ser mayor de 25 años y que su padre Francisco de Hoyos le dejó una herencia que está en poder Juan Ramírez de Alarcón.                                                                                                                                                                                                                            |                       |                       |
|                                                                                                                                                                                                                                                                                                                                                                                                                                                                                                                                                                                                                                                                                                |                       |                       |
|   ----------------------------------- -------------------------------------------------------------------------------------------------------------------------------------------------------------------------------------------------------------------------------------------------------------------------------------------------------------------------------------------------------------------------------------------------------------------------------------------------------------------------------------------------------------------------------------------------------------------------------------------------------------------------------------------------------- |                       |                       |
|                                                                                                                                                                                                                                                                                                                                                                                                                                                                                                                                                                                                                                                                                                |                       |                       |
| (1) Boyd-Bowman, Léxico… (1971), 603.                                                                                                                                                                                                                                                                                                                                                                                                                                                                                                                                                                                                                                                          |                       |                       |
|                                                                                                                                                                                                                                                                                                                                                                                                                                                                                                                                                                                                                                                                                                |                       |                       |
|   ---------------------------------------------------------------------------------------------------                                                                                                                                                                                                                                                                                                                                                                                                                                                                                                                                                                                          |                       |                       |
|    Documento(s) original(es)                                                                                                                                                                                                                                                                                                                                                                                                                                                                                                                                                                                                                                                                   |                       |                       |
|   --------------------------- ------- ------- ------- ------- ------- ------- ------- ------- -------                                                                                                                                                                                                                                                                                                                                                                                                                                                                                                                                                                                          |                       |                       |
|               []                []      []      []      []      []      []      []      []      []                                                                                                                                                                                                                                                                                                                                                                                                                                                                                                                                                                                             |                       |                       |
|               1f                1v      2f      2v      3f      3v      4f      4v      5f      5v                                                                                                                                                                                                                                                                                                                                                                                                                                                                                                                                                                                             |                       |                       |
|                                                                                                                                                                                                                                                                                                                                                                                                                                                                                                                                                                                                                                                                                                |                       |                       |
|               []                []      []      []      []      []      []      []      []      []                                                                                                                                                                                                                                                                                                                                                                                                                                                                                                                                                                                             |                       |                       |
|               6f                6v      7f      7v      8f      8v      9f      9v      10f     10v                                                                                                                                                                                                                                                                                                                                                                                                                                                                                                                                                                                            |                       |                       |
|                                                                                                                                                                                                                                                                                                                                                                                                                                                                                                                                                                                                                                                                                                |                       |                       |
|               []                []      []      []      []      []      []      []      []      []                                                                                                                                                                                                                                                                                                                                                                                                                                                                                                                                                                                             |                       |                       |
|               11f               12f     12v     13f     13v     14f     14v     15f     15v     16f                                                                                                                                                                                                                                                                                                                                                                                                                                                                                                                                                                                            |                       |                       |
|                                                                                                                                                                                                                                                                                                                                                                                                                                                                                                                                                                                                                                                                                                |                       |                       |
|               []                []      []      []                                                                                                                                                                                                                                                                                                                                                                                                                                                                                                                                                                                                                                             |                       |                       |
|               17f               17v     18f     18v                                                                                                                                                                                                                                                                                                                                                                                                                                                                                                                                                                                                                                            |                       |                       |
|   ---------------------------------------------------------------------------------------------------                                                                                                                                                                                                                                                                                                                                                                                                                                                                                                                                                                                          |                       |                       |
+------------------------------------------------------------------------------------------------------------------------------------------------------------------------------------------------------------------------------------------------------------------------------------------------------------------------------------------------------------------------------------------------------------------------------------------------------------------------------------------------------------------------------------------------------------------------------------------------------------------------------------------------------------------------------------------------+-----------------------+-----------------------+
| +----------------------------------------------------------------------------+-----------------------------------------------:+                                                                                                                                                                                                                                                                                                                                                                                                                                                                                                                                                                |                       |                       |
| | ISBN 978-607-701-024-1                                                     |   ---- ---- ---- ---- ---- ---- ---- ---- ---- |                                                                                                                                                                                                                                                                                                                                                                                                                                                                                                                                                                |                       |                       |
| | © Derechos Reservados 2013. Archivo Histórico del Municipio de Colima. [*] |   []        []        []        []        []   |                                                                                                                                                                                                                                                                                                                                                                                                                                                                                                                                                                |                       |                       |
| |                                                                            |   ---- ---- ---- ---- ---- ---- ---- ---- ---- |                                                                                                                                                                                                                                                                                                                                                                                                                                                                                                                                                                |                       |                       |
| +----------------------------------------------------------------------------+------------------------------------------------+                                                                                                                                                                                                                                                                                                                                                                                                                                                                                                                                                                |                       |                       |
| |                                                                            |                                                |                                                                                                                                                                                                                                                                                                                                                                                                                                                                                                                                                                |                       |                       |
| +----------------------------------------------------------------------------+------------------------------------------------+                                                                                                                                                                                                                                                                                                                                                                                                                                                                                                                                                                |                       |                       |
+------------------------------------------------------------------------------------------------------------------------------------------------------------------------------------------------------------------------------------------------------------------------------------------------------------------------------------------------------------------------------------------------------------------------------------------------------------------------------------------------------------------------------------------------------------------------------------------------------------------------------------------------------------------------------------------------+-----------------------+-----------------------+

636 visitas
