+-------------------------------------------------------------------------------------------------------------------------------------------------------------------------------------------------------------------------+-----------------------+-----------------------+
| []                                                                                                                                                                                                                      |                       |                       |
|                                                                                                                                                                                                                         |                       |                       |
| +-----------------------------------+:-------------------------------------:+                                                                                                                                           |                       |                       |
| | []                                | LA VILLA DE COLIMA DE LA NUEVA ESPAÑA |                                                                                                                                           |                       |                       |
| |                                   | SIGLO XVI                             |                                                                                                                                           |                       |                       |
| |                                   |                                       |                                                                                                                                           |                       |                       |
| |                                   | VOLUMEN II      (CAJAS 12-20)         |                                                                                                                                           |                       |                       |
| +-----------------------------------+---------------------------------------+                                                                                                                                           |                       |                       |
+-------------------------------------------------------------------------------------------------------------------------------------------------------------------------------------------------------------------------+-----------------------+-----------------------+
| +------------------------------------------------------------------------+-------------------------------+-----------------------+                                                                                      |                       |                       |
| | Inicio | Búsqueda | Siglas y bibliografía | Créditos | Más información | Vol. I (1-11) Vol. II (12-20) |    [ES]               |                                                                                      |                       |                       |
| +------------------------------------------------------------------------+-------------------------------+-----------------------+                                                                                      |                       |                       |
+-------------------------------------------------------------------------------------------------------------------------------------------------------------------------------------------------------------------------+-----------------------+-----------------------+
| Búsqueda rápida                                                                                                                                                                                                         |                       |                       |
|                                                                                                                                                                                                                         |                       |                       |
| +:-------------------:+-----------------+:----------------------------------------:+----------------:+                                                                                                                  |                       |                       |
| | Documento de fecha: |                 | Ubicación física del documento original: | [] [] []        |                                                                                                                  |                       |                       |
| |                     |                 |                                          |                 |                                                                                                                  |                       |                       |
| | 1598. Junio, 5      |                 | Caja 26, exp. 40, f. 63 fte.             |                 |                                                                                                                  |                       |                       |
| +---------------------+-----------------+------------------------------------------+-----------------+                                                                                                                  |                       |                       |
|                                                                                                                                                                                                                         |                       |                       |
|   ------------- -----------------------------------------------------------------------------------                                                                                                                     |                       |                       |
|   Resumen:      Antonio Gómez Maya, vecino de Toluca, compra 27 potros a Juan Ramírez de Alarcón.                                                                                                                       |                       |                       |
|   ------------- -----------------------------------------------------------------------------------                                                                                                                     |                       |                       |
|                                                                                                                                                                                                                         |                       |                       |
|   ----------------------------------- --------------------------------------------------------------------------------------------------------------------------------------------------------------------------------- |                       |                       |
|   Contenido:                          Antonio Gómez Maya, vecino de la villa de Toluca y, estante al presente en esta Villa de Colima, se obligó a pagar a Juan Ramírez de Alarcón 101 pesos, por razón de 27 potros.   |                       |                       |
|                                       Pagará a fin de enero del próximo año de 1599.                                                                                                                                    |                       |                       |
|                                       Testigos fueron: Juan Ruiz Quintero, Luis de Grijalba^([1]) y Juan Agustín de la Puerta.                                                                                          |                       |                       |
|                                       Pasó ante el escribano público Toribio de Casso.                                                                                                                                  |                       |                       |
|                                                                                                                                                                                                                         |                       |                       |
|   ----------------------------------- --------------------------------------------------------------------------------------------------------------------------------------------------------------------------------- |                       |                       |
|                                                                                                                                                                                                                         |                       |                       |
| (1) Se trata del Padre Luis Vela de Grijalba.                                                                                                                                                                           |                       |                       |
|                                                                                                                                                                                                                         |                       |                       |
|   ---------------------------------------------------------------------------------------------------                                                                                                                   |                       |                       |
|    Documento(s) original(es)                                                                                                                                                                                            |                       |                       |
|   --------------------------- ------- ------- ------- ------- ------- ------- ------- ------- -------                                                                                                                   |                       |                       |
|               []                                                                                                                                                                                                        |                       |                       |
|               63f                                                                                                                                                                                                       |                       |                       |
|                                                                                                                                                                                                                         |                       |                       |
|   ---------------------------------------------------------------------------------------------------                                                                                                                   |                       |                       |
+-------------------------------------------------------------------------------------------------------------------------------------------------------------------------------------------------------------------------+-----------------------+-----------------------+
| +----------------------------------------------------------------------------+-----------------------------------------------:+                                                                                         |                       |                       |
| | ISBN 978-607-701-024-1                                                     |   ---- ---- ---- ---- ---- ---- ---- ---- ---- |                                                                                         |                       |                       |
| | © Derechos Reservados 2013. Archivo Histórico del Municipio de Colima. [*] |   []        []        []        []        []   |                                                                                         |                       |                       |
| |                                                                            |   ---- ---- ---- ---- ---- ---- ---- ---- ---- |                                                                                         |                       |                       |
| +----------------------------------------------------------------------------+------------------------------------------------+                                                                                         |                       |                       |
| |                                                                            |                                                |                                                                                         |                       |                       |
| +----------------------------------------------------------------------------+------------------------------------------------+                                                                                         |                       |                       |
+-------------------------------------------------------------------------------------------------------------------------------------------------------------------------------------------------------------------------+-----------------------+-----------------------+

636 visitas
