+----------------------------------------------------------------------------------------------------------------------------------------------------------------------+-----------------------+-----------------------+
| []                                                                                                                                                                   |                       |                       |
|                                                                                                                                                                      |                       |                       |
| +-----------------------------------+:-------------------------------------:+                                                                                        |                       |                       |
| | []                                | LA VILLA DE COLIMA DE LA NUEVA ESPAÑA |                                                                                        |                       |                       |
| |                                   | SIGLO XVI                             |                                                                                        |                       |                       |
| |                                   |                                       |                                                                                        |                       |                       |
| |                                   | VOLUMEN II      (CAJAS 12-20)         |                                                                                        |                       |                       |
| +-----------------------------------+---------------------------------------+                                                                                        |                       |                       |
+----------------------------------------------------------------------------------------------------------------------------------------------------------------------+-----------------------+-----------------------+
| +------------------------------------------------------------------------+---------------------------+-----------------------+                                       |                       |                       |
| | Inicio | Búsqueda | Siglas y bibliografía | Créditos | Más información | (consulta las cajas 1-11) |    [ES]               |                                       |                       |                       |
| +------------------------------------------------------------------------+---------------------------+-----------------------+                                       |                       |                       |
+----------------------------------------------------------------------------------------------------------------------------------------------------------------------+-----------------------+-----------------------+
| Búsqueda rápida                                                                                                                                                      |                       |                       |
|                                                                                                                                                                      |                       |                       |
| +:-------------------:+-----------------+:----------------------------------------:+----------------:+                                                               |                       |                       |
| | Documento de fecha: |                 | Ubicación física del documento original: | [] [] []        |                                                               |                       |                       |
| |                     |                 |                                          |                 |                                                               |                       |                       |
| | 1595. Octubre, 11   |                 | Caja 12, exp. 8, f. 83                   |                 |                                                               |                       |                       |
| |                     |                 |                                          |                 |                                                               |                       |                       |
| |                     |                 | Nota(s): Antes ff. 69 fte y vta.         |                 |                                                               |                       |                       |
| +---------------------+-----------------+------------------------------------------+-----------------+                                                               |                       |                       |
|                                                                                                                                                                      |                       |                       |
|   ------------- ---------------------------------------                                                                                                              |                       |                       |
|   Resumen:      Poder de Bernabé Macías a Martín Ruiz                                                                                                                |                       |                       |
|   ------------- ---------------------------------------                                                                                                              |                       |                       |
|                                                                                                                                                                      |                       |                       |
|   ----------------------------------- ------------------------------------------------------------------------------------------------------------------------------ |                       |                       |
|   Contenido:                          Bernabé Macías, residente en la Villa de Colima, otorga carta poder al vecino Martín Ruiz.                                     |                       |                       |
|                                       Testigos: Cristóbal de Silva, justicia mayor, Juan Agustín de la Puerta, Antonio de Cárdenas y Juan Ruiz, vecinos de Colima.   |                       |                       |
|                                       Escribano ante quien pasó, Cristóbal Hernández de Tene.                                                                        |                       |                       |
|                                                                                                                                                                      |                       |                       |
|   ----------------------------------- ------------------------------------------------------------------------------------------------------------------------------ |                       |                       |
|                                                                                                                                                                      |                       |                       |
|   ---------------------------------------------------------------------------------------------------                                                                |                       |                       |
|    Documento(s) original(es)                                                                                                                                         |                       |                       |
|   --------------------------- ------- ------- ------- ------- ------- ------- ------- ------- -------                                                                |                       |                       |
|               []                []                                                                                                                                   |                       |                       |
|               83f               83v                                                                                                                                  |                       |                       |
|                                                                                                                                                                      |                       |                       |
|   ---------------------------------------------------------------------------------------------------                                                                |                       |                       |
+----------------------------------------------------------------------------------------------------------------------------------------------------------------------+-----------------------+-----------------------+
| +----------------------------------------------------------------------------+------------------------------------------------+                                      |                       |                       |
| | ISBN 978-607-701-024-1                                                     |   ---- ---- ---- ---- ---- ---- ---- ---- ---- |                                      |                       |                       |
| | © Derechos Reservados 2013. Archivo Histórico del Municipio de Colima. [*] |   []        []        []        []        []   |                                      |                       |                       |
| |                                                                            |   ---- ---- ---- ---- ---- ---- ---- ---- ---- |                                      |                       |                       |
| +----------------------------------------------------------------------------+------------------------------------------------+                                      |                       |                       |
| |                                                                            |                                                |                                      |                       |                       |
| +----------------------------------------------------------------------------+------------------------------------------------+                                      |                       |                       |
+----------------------------------------------------------------------------------------------------------------------------------------------------------------------+-----------------------+-----------------------+

615 visitas
