% $ biblatex auxiliary file $
% $ biblatex bbl format version 2.9 $
% Do not modify the above lines!
%
% This is an auxiliary file used by the 'biblatex' package.
% This file may safely be deleted. It will be recreated by
% biber as required.
%
\begingroup
\makeatletter
\@ifundefined{ver@biblatex.sty}
  {\@latex@error
     {Missing 'biblatex' package}
     {The bibliography requires the 'biblatex' package.}
      \aftergroup\endinput}
  {}
\endgroup


\refsection{0}
  \datalist[entry]{apa/global//global/global}
    \entry{dove2014a}{misc}{}
      \name{author}{1}{}{%
        {{uniquename=0,uniquepart=base,hash=7ffff00eed286e2576d7924eaecd8ef9}{%
           family={Dove},
           familyi={D\bibinitperiod},
           given={Laurie\bibnamedelima L.},
           giveni={L\bibinitperiod\bibinitdelim L\bibinitperiod},
           givenun=0}}%
      }
      \strng{namehash}{7ffff00eed286e2576d7924eaecd8ef9}
      \strng{fullhash}{7ffff00eed286e2576d7924eaecd8ef9}
      \strng{bibnamehash}{7ffff00eed286e2576d7924eaecd8ef9}
      \strng{authorbibnamehash}{7ffff00eed286e2576d7924eaecd8ef9}
      \strng{authornamehash}{7ffff00eed286e2576d7924eaecd8ef9}
      \strng{authorfullhash}{7ffff00eed286e2576d7924eaecd8ef9}
      \field{sortinit}{D}
      \field{sortinithash}{2ef1bd9a78cc71eb74d7231c635177b8}
      \field{extradatescope}{labelyear}
      \field{labeldatesource}{year}
      \true{uniqueprimaryauthor}
      \field{labelnamesource}{author}
      \field{labeltitlesource}{title}
      \field{title}{\textit{Do plants feel pain?}}
      \field{year}{2014}
      \verb{urlraw}
      \verb https://science.howstuffworks.com/life/botany/plants-feel-pain.htm
      \endverb
      \verb{url}
      \verb https://science.howstuffworks.com/life/botany/plants-feel-pain.htm
      \endverb
    \endentry
    \entry{freud2002a}{inbook}{}
      \name{author}{1}{}{%
        {{uniquename=0,uniquepart=base,hash=58227b8cb75750689aafd0bdb2b63408}{%
           family={Freud},
           familyi={F\bibinitperiod},
           given={Sigmund},
           giveni={S\bibinitperiod},
           givenun=0}}%
      }
      \list{publisher}{1}{%
        {Editorial Biblioteca Nueva}%
      }
      \strng{namehash}{58227b8cb75750689aafd0bdb2b63408}
      \strng{fullhash}{58227b8cb75750689aafd0bdb2b63408}
      \strng{bibnamehash}{58227b8cb75750689aafd0bdb2b63408}
      \strng{authorbibnamehash}{58227b8cb75750689aafd0bdb2b63408}
      \strng{authornamehash}{58227b8cb75750689aafd0bdb2b63408}
      \strng{authorfullhash}{58227b8cb75750689aafd0bdb2b63408}
      \field{sortinit}{F}
      \field{sortinithash}{669c706c6f1fbf3b5a83d26f1d9e9e72}
      \field{extradatescope}{labelyear}
      \field{labeldatesource}{year}
      \true{uniqueprimaryauthor}
      \field{labelnamesource}{author}
      \field{labeltitlesource}{title}
      \field{chapter}{Más allá del principio del placer}
      \field{title}{\textit{Más allá del principio del placer. Psicología de las masas y análisis del yo. El yo y el ello.}}
      \field{year}{2002}
      \field{pages}{5\bibrangedash 46}
      \range{pages}{42}
    \endentry
    \entry{keith2009a}{book}{}
      \name{author}{1}{}{%
        {{uniquename=0,uniquepart=base,hash=21acf10b6b61c94cfcd17be93dc6b20c}{%
           family={Keith},
           familyi={K\bibinitperiod},
           given={Lierre},
           giveni={L\bibinitperiod},
           givenun=0}}%
      }
      \list{publisher}{1}{%
        {Flashpoint Press -- PM Press}%
      }
      \strng{namehash}{21acf10b6b61c94cfcd17be93dc6b20c}
      \strng{fullhash}{21acf10b6b61c94cfcd17be93dc6b20c}
      \strng{bibnamehash}{21acf10b6b61c94cfcd17be93dc6b20c}
      \strng{authorbibnamehash}{21acf10b6b61c94cfcd17be93dc6b20c}
      \strng{authornamehash}{21acf10b6b61c94cfcd17be93dc6b20c}
      \strng{authorfullhash}{21acf10b6b61c94cfcd17be93dc6b20c}
      \field{sortinit}{K}
      \field{sortinithash}{9fd838a31ba64d981e8f44562bd33f89}
      \field{extradatescope}{labelyear}
      \field{labeldatesource}{year}
      \true{uniqueprimaryauthor}
      \field{labelnamesource}{author}
      \field{labeltitlesource}{title}
      \field{isbn}{9781604860801}
      \field{title}{The Vegetarian Myth}
      \field{year}{2009}
    \endentry
  \enddatalist
\endrefsection
\endinput

