{
    "accounting": [
        {
            "firstName": "John",
            "lastName": "Doe",
            "birthDate": "1982-03-25",
            "active": true
        },
        {
            "firstName": "Mary",
            "lastName": "Smith",
            "birthDate": "1977-08-01",
            "active": true
        }
    ],
    "sales": [
        {
            "firstName": "Sally",
            "lastName": "Green",
            "birthDate": "1979-10-26",
            "active": false
        },
        {
            "firstName": "Jim",
            "lastName": "Galley",
            "birthDate": "1997-12-14",
            "active": true
        }
    ]
}
