{
  "Models": [
    {
      "Id": "entity",
      "Components": {
        "MonoPanda.Components.DrawComponent": {
          "ContentId": "content-id",
          "Scale": 2
        },
        "MonoPanda.Components.SpineComponent": {}
      }
    }
  ]
}
