<?xml version="1.0"?>
<font>
  <info face="Tahoma" size="32" bold="0" italic="0" charset="" unicode="1" stretchH="100" smooth="1" aa="1" padding="0,0,0,0" spacing="1,1" outline="0"/>
  <common lineHeight="32" base="27" scaleW="600" scaleH="600" pages="1" packed="0" alphaChnl="1" redChnl="4" greenChnl="4" blueChnl="4"/>
  <pages>
    <page id="0" file="121245_0.png" />
  </pages>
  <chars count="527">
    <char id="32" x="273" y="429" width="3" height="32" xoffset="-1" yoffset="0" xadvance="8" page="0" chnl="15" />
    <char id="33" x="199" y="429" width="5" height="32" xoffset="2" yoffset="0" xadvance="9" page="0" chnl="15" />
    <char id="34" x="126" y="429" width="8" height="32" xoffset="1" yoffset="0" xadvance="10" page="0" chnl="15" />
    <char id="35" x="474" y="99" width="17" height="32" xoffset="1" yoffset="0" xadvance="19" page="0" chnl="15" />
    <char id="36" x="462" y="330" width="13" height="32" xoffset="1" yoffset="0" xadvance="14" page="0" chnl="15" />
    <char id="37" x="335" y="0" width="24" height="32" xoffset="1" yoffset="0" xadvance="25" page="0" chnl="15" />
    <char id="38" x="488" y="33" width="19" height="32" xoffset="0" yoffset="0" xadvance="18" page="0" chnl="15" />
    <char id="39" x="211" y="429" width="5" height="32" xoffset="0" yoffset="0" xadvance="5" page="0" chnl="15" />
    <char id="40" x="27" y="429" width="8" height="32" xoffset="1" yoffset="0" xadvance="10" page="0" chnl="15" />
    <char id="41" x="45" y="429" width="8" height="32" xoffset="1" yoffset="0" xadvance="10" page="0" chnl="15" />
    <char id="42" x="236" y="363" width="12" height="32" xoffset="1" yoffset="0" xadvance="14" page="0" chnl="15" />
    <char id="43" x="564" y="99" width="17" height="32" xoffset="1" yoffset="0" xadvance="19" page="0" chnl="15" />
    <char id="44" x="151" y="429" width="7" height="32" xoffset="0" yoffset="0" xadvance="8" page="0" chnl="15" />
    <char id="45" x="555" y="396" width="9" height="32" xoffset="0" yoffset="0" xadvance="9" page="0" chnl="15" />
    <char id="46" x="259" y="429" width="4" height="32" xoffset="2" yoffset="0" xadvance="8" page="0" chnl="15" />
    <char id="47" x="126" y="396" width="11" height="32" xoffset="-1" yoffset="0" xadvance="10" page="0" chnl="15" />
    <char id="48" x="30" y="231" width="14" height="32" xoffset="0" yoffset="0" xadvance="14" page="0" chnl="15" />
    <char id="49" x="114" y="396" width="11" height="32" xoffset="2" yoffset="0" xadvance="14" page="0" chnl="15" />
    <char id="50" x="476" y="330" width="13" height="32" xoffset="1" yoffset="0" xadvance="14" page="0" chnl="15" />
    <char id="51" x="490" y="330" width="13" height="32" xoffset="0" yoffset="0" xadvance="14" page="0" chnl="15" />
    <char id="52" x="75" y="231" width="14" height="32" xoffset="0" yoffset="0" xadvance="14" page="0" chnl="15" />
    <char id="53" x="301" y="363" width="12" height="32" xoffset="1" yoffset="0" xadvance="14" page="0" chnl="15" />
    <char id="54" x="90" y="231" width="14" height="32" xoffset="0" yoffset="0" xadvance="14" page="0" chnl="15" />
    <char id="55" x="105" y="231" width="14" height="32" xoffset="0" yoffset="0" xadvance="14" page="0" chnl="15" />
    <char id="56" x="120" y="231" width="14" height="32" xoffset="0" yoffset="0" xadvance="14" page="0" chnl="15" />
    <char id="57" x="135" y="231" width="14" height="32" xoffset="0" yoffset="0" xadvance="14" page="0" chnl="15" />
    <char id="58" x="187" y="429" width="5" height="32" xoffset="2" yoffset="0" xadvance="9" page="0" chnl="15" />
    <char id="59" x="180" y="429" width="6" height="32" xoffset="1" yoffset="0" xadvance="9" page="0" chnl="15" />
    <char id="60" x="16" y="198" width="15" height="32" xoffset="2" yoffset="0" xadvance="19" page="0" chnl="15" />
    <char id="61" x="32" y="198" width="15" height="32" xoffset="2" yoffset="0" xadvance="19" page="0" chnl="15" />
    <char id="62" x="48" y="198" width="15" height="32" xoffset="2" yoffset="0" xadvance="19" page="0" chnl="15" />
    <char id="63" x="102" y="396" width="11" height="32" xoffset="1" yoffset="0" xadvance="12" page="0" chnl="15" />
    <char id="64" x="190" y="33" width="22" height="32" xoffset="1" yoffset="0" xadvance="24" page="0" chnl="15" />
    <char id="65" x="95" y="99" width="18" height="32" xoffset="-1" yoffset="0" xadvance="16" page="0" chnl="15" />
    <char id="66" x="330" y="264" width="14" height="32" xoffset="1" yoffset="0" xadvance="15" page="0" chnl="15" />
    <char id="67" x="272" y="165" width="16" height="32" xoffset="0" yoffset="0" xadvance="16" page="0" chnl="15" />
    <char id="68" x="324" y="132" width="17" height="32" xoffset="1" yoffset="0" xadvance="18" page="0" chnl="15" />
    <char id="69" x="435" y="231" width="14" height="32" xoffset="1" yoffset="0" xadvance="15" page="0" chnl="15" />
    <char id="70" x="518" y="330" width="13" height="32" xoffset="1" yoffset="0" xadvance="14" page="0" chnl="15" />
    <char id="71" x="360" y="132" width="17" height="32" xoffset="0" yoffset="0" xadvance="17" page="0" chnl="15" />
    <char id="72" x="306" y="165" width="16" height="32" xoffset="1" yoffset="0" xadvance="18" page="0" chnl="15" />
    <char id="73" x="81" y="429" width="8" height="32" xoffset="1" yoffset="0" xadvance="10" page="0" chnl="15" />
    <char id="74" x="588" y="33" width="11" height="32" xoffset="-1" yoffset="0" xadvance="11" page="0" chnl="15" />
    <char id="75" x="304" y="198" width="15" height="32" xoffset="1" yoffset="0" xadvance="15" page="0" chnl="15" />
    <char id="76" x="546" y="330" width="13" height="32" xoffset="1" yoffset="0" xadvance="13" page="0" chnl="15" />
    <char id="77" x="307" y="66" width="18" height="32" xoffset="1" yoffset="0" xadvance="20" page="0" chnl="15" />
    <char id="78" x="272" y="198" width="15" height="32" xoffset="1" yoffset="0" xadvance="17" page="0" chnl="15" />
    <char id="79" x="269" y="66" width="18" height="32" xoffset="0" yoffset="0" xadvance="18" page="0" chnl="15" />
    <char id="80" x="560" y="330" width="13" height="32" xoffset="1" yoffset="0" xadvance="14" page="0" chnl="15" />
    <char id="81" x="250" y="66" width="18" height="32" xoffset="0" yoffset="0" xadvance="18" page="0" chnl="15" />
    <char id="82" x="221" y="165" width="16" height="32" xoffset="1" yoffset="0" xadvance="16" page="0" chnl="15" />
    <char id="83" x="15" y="297" width="14" height="32" xoffset="0" yoffset="0" xadvance="14" page="0" chnl="15" />
    <char id="84" x="396" y="132" width="17" height="32" xoffset="-1" yoffset="0" xadvance="15" page="0" chnl="15" />
    <char id="85" x="192" y="198" width="15" height="32" xoffset="1" yoffset="0" xadvance="17" page="0" chnl="15" />
    <char id="86" x="57" y="99" width="18" height="32" xoffset="-1" yoffset="0" xadvance="16" page="0" chnl="15" />
    <char id="87" x="557" y="0" width="23" height="32" xoffset="0" yoffset="0" xadvance="23" page="0" chnl="15" />
    <char id="88" x="176" y="198" width="15" height="32" xoffset="0" yoffset="0" xadvance="15" page="0" chnl="15" />
    <char id="89" x="414" y="132" width="17" height="32" xoffset="-1" yoffset="0" xadvance="15" page="0" chnl="15" />
    <char id="90" x="160" y="198" width="15" height="32" xoffset="0" yoffset="0" xadvance="15" page="0" chnl="15" />
    <char id="91" x="565" y="396" width="9" height="32" xoffset="1" yoffset="0" xadvance="10" page="0" chnl="15" />
    <char id="92" x="78" y="396" width="11" height="32" xoffset="0" yoffset="0" xadvance="10" page="0" chnl="15" />
    <char id="93" x="495" y="396" width="9" height="32" xoffset="0" yoffset="0" xadvance="10" page="0" chnl="15" />
    <char id="94" x="450" y="132" width="17" height="32" xoffset="1" yoffset="0" xadvance="19" page="0" chnl="15" />
    <char id="95" x="238" y="165" width="16" height="32" xoffset="-1" yoffset="0" xadvance="14" page="0" chnl="15" />
    <char id="96" x="173" y="429" width="6" height="32" xoffset="3" yoffset="0" xadvance="14" page="0" chnl="15" />
    <char id="97" x="140" y="330" width="13" height="32" xoffset="0" yoffset="0" xadvance="14" page="0" chnl="15" />
    <char id="98" x="574" y="330" width="13" height="32" xoffset="1" yoffset="0" xadvance="14" page="0" chnl="15" />
    <char id="99" x="26" y="396" width="12" height="32" xoffset="0" yoffset="0" xadvance="12" page="0" chnl="15" />
    <char id="100" x="0" y="363" width="13" height="32" xoffset="0" yoffset="0" xadvance="14" page="0" chnl="15" />
    <char id="101" x="480" y="231" width="14" height="32" xoffset="0" yoffset="0" xadvance="14" page="0" chnl="15" />
    <char id="102" x="365" y="396" width="10" height="32" xoffset="0" yoffset="0" xadvance="8" page="0" chnl="15" />
    <char id="103" x="42" y="363" width="13" height="32" xoffset="0" yoffset="0" xadvance="14" page="0" chnl="15" />
    <char id="104" x="56" y="363" width="13" height="32" xoffset="1" yoffset="0" xadvance="15" page="0" chnl="15" />
    <char id="105" x="239" y="429" width="4" height="32" xoffset="1" yoffset="0" xadvance="6" page="0" chnl="15" />
    <char id="106" x="36" y="429" width="8" height="32" xoffset="-2" yoffset="0" xadvance="7" page="0" chnl="15" />
    <char id="107" x="70" y="363" width="13" height="32" xoffset="1" yoffset="0" xadvance="13" page="0" chnl="15" />
    <char id="108" x="234" y="429" width="4" height="32" xoffset="1" yoffset="0" xadvance="6" page="0" chnl="15" />
    <char id="109" x="301" y="33" width="20" height="32" xoffset="1" yoffset="0" xadvance="22" page="0" chnl="15" />
    <char id="110" x="98" y="363" width="13" height="32" xoffset="1" yoffset="0" xadvance="15" page="0" chnl="15" />
    <char id="111" x="360" y="231" width="14" height="32" xoffset="0" yoffset="0" xadvance="14" page="0" chnl="15" />
    <char id="112" x="126" y="363" width="13" height="32" xoffset="1" yoffset="0" xadvance="14" page="0" chnl="15" />
    <char id="113" x="154" y="363" width="13" height="32" xoffset="0" yoffset="0" xadvance="14" page="0" chnl="15" />
    <char id="114" x="485" y="396" width="9" height="32" xoffset="1" yoffset="0" xadvance="9" page="0" chnl="15" />
    <char id="115" x="522" y="363" width="12" height="32" xoffset="0" yoffset="0" xadvance="12" page="0" chnl="15" />
    <char id="116" x="420" y="396" width="10" height="32" xoffset="0" yoffset="0" xadvance="9" page="0" chnl="15" />
    <char id="117" x="182" y="363" width="13" height="32" xoffset="1" yoffset="0" xadvance="15" page="0" chnl="15" />
    <char id="118" x="44" y="297" width="13" height="32" xoffset="0" yoffset="0" xadvance="13" page="0" chnl="15" />
    <char id="119" x="40" y="66" width="19" height="32" xoffset="0" yoffset="0" xadvance="19" page="0" chnl="15" />
    <char id="120" x="58" y="297" width="13" height="32" xoffset="0" yoffset="0" xadvance="13" page="0" chnl="15" />
    <char id="121" x="86" y="297" width="13" height="32" xoffset="0" yoffset="0" xadvance="13" page="0" chnl="15" />
    <char id="122" x="483" y="363" width="12" height="32" xoffset="0" yoffset="0" xadvance="12" page="0" chnl="15" />
    <char id="123" x="470" y="363" width="12" height="32" xoffset="0" yoffset="0" xadvance="13" page="0" chnl="15" />
    <char id="124" x="264" y="429" width="4" height="32" xoffset="3" yoffset="0" xadvance="10" page="0" chnl="15" />
    <char id="125" x="444" y="363" width="12" height="32" xoffset="1" yoffset="0" xadvance="13" page="0" chnl="15" />
    <char id="126" x="510" y="99" width="17" height="32" xoffset="1" yoffset="0" xadvance="19" page="0" chnl="15" />
    <char id="160" x="269" y="429" width="3" height="32" xoffset="-1" yoffset="0" xadvance="8" page="0" chnl="15" />
    <char id="161" x="205" y="429" width="5" height="32" xoffset="2" yoffset="0" xadvance="9" page="0" chnl="15" />
    <char id="162" x="366" y="363" width="12" height="32" xoffset="1" yoffset="0" xadvance="14" page="0" chnl="15" />
    <char id="163" x="315" y="231" width="14" height="32" xoffset="0" yoffset="0" xadvance="14" page="0" chnl="15" />
    <char id="164" x="405" y="264" width="14" height="32" xoffset="0" yoffset="0" xadvance="14" page="0" chnl="15" />
    <char id="165" x="15" y="264" width="14" height="32" xoffset="0" yoffset="0" xadvance="14" page="0" chnl="15" />
    <char id="166" x="249" y="429" width="4" height="32" xoffset="3" yoffset="0" xadvance="10" page="0" chnl="15" />
    <char id="167" x="327" y="363" width="12" height="32" xoffset="1" yoffset="0" xadvance="14" page="0" chnl="15" />
    <char id="168" x="376" y="396" width="10" height="32" xoffset="2" yoffset="0" xadvance="14" page="0" chnl="15" />
    <char id="169" x="410" y="0" width="24" height="32" xoffset="0" yoffset="0" xadvance="24" page="0" chnl="15" />
    <char id="170" x="174" y="396" width="11" height="32" xoffset="1" yoffset="0" xadvance="13" page="0" chnl="15" />
    <char id="171" x="114" y="297" width="13" height="32" xoffset="1" yoffset="0" xadvance="15" page="0" chnl="15" />
    <char id="172" x="528" y="99" width="17" height="32" xoffset="1" yoffset="0" xadvance="19" page="0" chnl="15" />
    <char id="173" x="515" y="396" width="9" height="32" xoffset="0" yoffset="0" xadvance="9" page="0" chnl="15" />
    <char id="174" x="360" y="0" width="24" height="32" xoffset="0" yoffset="0" xadvance="24" page="0" chnl="15" />
    <char id="175" x="323" y="165" width="16" height="32" xoffset="-1" yoffset="0" xadvance="14" page="0" chnl="15" />
    <char id="176" x="162" y="396" width="11" height="32" xoffset="1" yoffset="0" xadvance="12" page="0" chnl="15" />
    <char id="177" x="546" y="99" width="17" height="32" xoffset="1" yoffset="0" xadvance="19" page="0" chnl="15" />
    <char id="178" x="255" y="396" width="10" height="32" xoffset="2" yoffset="0" xadvance="13" page="0" chnl="15" />
    <char id="179" x="332" y="396" width="10" height="32" xoffset="2" yoffset="0" xadvance="13" page="0" chnl="15" />
    <char id="180" x="593" y="396" width="6" height="32" xoffset="5" yoffset="0" xadvance="14" page="0" chnl="15" />
    <char id="181" x="128" y="297" width="13" height="32" xoffset="1" yoffset="0" xadvance="15" page="0" chnl="15" />
    <char id="182" x="142" y="297" width="13" height="32" xoffset="0" yoffset="0" xadvance="14" page="0" chnl="15" />
    <char id="183" x="217" y="429" width="5" height="32" xoffset="2" yoffset="0" xadvance="9" page="0" chnl="15" />
    <char id="184" x="143" y="429" width="7" height="32" xoffset="3" yoffset="0" xadvance="14" page="0" chnl="15" />
    <char id="185" x="18" y="429" width="8" height="32" xoffset="3" yoffset="0" xadvance="13" page="0" chnl="15" />
    <char id="186" x="156" y="297" width="13" height="32" xoffset="0" yoffset="0" xadvance="13" page="0" chnl="15" />
    <char id="187" x="170" y="297" width="13" height="32" xoffset="1" yoffset="0" xadvance="15" page="0" chnl="15" />
    <char id="188" x="96" y="33" width="23" height="32" xoffset="1" yoffset="0" xadvance="26" page="0" chnl="15" />
    <char id="189" x="205" y="0" width="25" height="32" xoffset="1" yoffset="0" xadvance="26" page="0" chnl="15" />
    <char id="190" x="435" y="0" width="24" height="32" xoffset="1" yoffset="0" xadvance="26" page="0" chnl="15" />
    <char id="191" x="509" y="363" width="12" height="32" xoffset="0" yoffset="0" xadvance="12" page="0" chnl="15" />
    <char id="192" x="285" y="99" width="18" height="32" xoffset="-1" yoffset="0" xadvance="16" page="0" chnl="15" />
    <char id="193" x="152" y="99" width="18" height="32" xoffset="-1" yoffset="0" xadvance="16" page="0" chnl="15" />
    <char id="194" x="76" y="99" width="18" height="32" xoffset="-1" yoffset="0" xadvance="16" page="0" chnl="15" />
    <char id="195" x="573" y="66" width="18" height="32" xoffset="-1" yoffset="0" xadvance="16" page="0" chnl="15" />
    <char id="196" x="0" y="99" width="18" height="32" xoffset="-1" yoffset="0" xadvance="16" page="0" chnl="15" />
    <char id="197" x="554" y="66" width="18" height="32" xoffset="-1" yoffset="0" xadvance="16" page="0" chnl="15" />
    <char id="198" x="283" y="0" width="25" height="32" xoffset="-1" yoffset="0" xadvance="24" page="0" chnl="15" />
    <char id="199" x="539" y="132" width="16" height="32" xoffset="0" yoffset="0" xadvance="16" page="0" chnl="15" />
    <char id="200" x="135" y="264" width="14" height="32" xoffset="1" yoffset="0" xadvance="15" page="0" chnl="15" />
    <char id="201" x="195" y="264" width="14" height="32" xoffset="1" yoffset="0" xadvance="15" page="0" chnl="15" />
    <char id="202" x="435" y="264" width="14" height="32" xoffset="1" yoffset="0" xadvance="15" page="0" chnl="15" />
    <char id="203" x="270" y="231" width="14" height="32" xoffset="1" yoffset="0" xadvance="15" page="0" chnl="15" />
    <char id="204" x="0" y="429" width="8" height="32" xoffset="1" yoffset="0" xadvance="10" page="0" chnl="15" />
    <char id="205" x="584" y="396" width="8" height="32" xoffset="1" yoffset="0" xadvance="10" page="0" chnl="15" />
    <char id="206" x="288" y="396" width="10" height="32" xoffset="0" yoffset="0" xadvance="10" page="0" chnl="15" />
    <char id="207" x="590" y="297" width="9" height="32" xoffset="1" yoffset="0" xadvance="10" page="0" chnl="15" />
    <char id="208" x="437" y="99" width="18" height="32" xoffset="0" yoffset="0" xadvance="18" page="0" chnl="15" />
    <char id="209" x="496" y="198" width="15" height="32" xoffset="1" yoffset="0" xadvance="17" page="0" chnl="15" />
    <char id="210" x="114" y="99" width="18" height="32" xoffset="0" yoffset="0" xadvance="18" page="0" chnl="15" />
    <char id="211" x="380" y="99" width="18" height="32" xoffset="0" yoffset="0" xadvance="18" page="0" chnl="15" />
    <char id="212" x="117" y="66" width="18" height="32" xoffset="0" yoffset="0" xadvance="18" page="0" chnl="15" />
    <char id="213" x="304" y="99" width="18" height="32" xoffset="0" yoffset="0" xadvance="18" page="0" chnl="15" />
    <char id="214" x="19" y="99" width="18" height="32" xoffset="0" yoffset="0" xadvance="18" page="0" chnl="15" />
    <char id="215" x="560" y="198" width="15" height="32" xoffset="2" yoffset="0" xadvance="19" page="0" chnl="15" />
    <char id="216" x="247" y="99" width="18" height="32" xoffset="0" yoffset="0" xadvance="18" page="0" chnl="15" />
    <char id="217" x="336" y="198" width="15" height="32" xoffset="1" yoffset="0" xadvance="17" page="0" chnl="15" />
    <char id="218" x="400" y="198" width="15" height="32" xoffset="1" yoffset="0" xadvance="17" page="0" chnl="15" />
    <char id="219" x="448" y="198" width="15" height="32" xoffset="1" yoffset="0" xadvance="17" page="0" chnl="15" />
    <char id="220" x="480" y="198" width="15" height="32" xoffset="1" yoffset="0" xadvance="17" page="0" chnl="15" />
    <char id="221" x="72" y="132" width="17" height="32" xoffset="-1" yoffset="0" xadvance="15" page="0" chnl="15" />
    <char id="222" x="150" y="264" width="14" height="32" xoffset="1" yoffset="0" xadvance="15" page="0" chnl="15" />
    <char id="223" x="198" y="297" width="13" height="32" xoffset="1" yoffset="0" xadvance="14" page="0" chnl="15" />
    <char id="224" x="226" y="297" width="13" height="32" xoffset="0" yoffset="0" xadvance="14" page="0" chnl="15" />
    <char id="225" x="240" y="297" width="13" height="32" xoffset="0" yoffset="0" xadvance="14" page="0" chnl="15" />
    <char id="226" x="254" y="297" width="13" height="32" xoffset="0" yoffset="0" xadvance="14" page="0" chnl="15" />
    <char id="227" x="268" y="297" width="13" height="32" xoffset="0" yoffset="0" xadvance="14" page="0" chnl="15" />
    <char id="228" x="282" y="297" width="13" height="32" xoffset="0" yoffset="0" xadvance="14" page="0" chnl="15" />
    <char id="229" x="296" y="297" width="13" height="32" xoffset="0" yoffset="0" xadvance="14" page="0" chnl="15" />
    <char id="230" x="0" y="33" width="23" height="32" xoffset="0" yoffset="0" xadvance="23" page="0" chnl="15" />
    <char id="231" x="405" y="363" width="12" height="32" xoffset="0" yoffset="0" xadvance="12" page="0" chnl="15" />
    <char id="232" x="195" y="231" width="14" height="32" xoffset="0" yoffset="0" xadvance="14" page="0" chnl="15" />
    <char id="233" x="210" y="231" width="14" height="32" xoffset="0" yoffset="0" xadvance="14" page="0" chnl="15" />
    <char id="234" x="225" y="231" width="14" height="32" xoffset="0" yoffset="0" xadvance="14" page="0" chnl="15" />
    <char id="235" x="240" y="231" width="14" height="32" xoffset="0" yoffset="0" xadvance="14" page="0" chnl="15" />
    <char id="236" x="166" y="429" width="6" height="32" xoffset="0" yoffset="0" xadvance="6" page="0" chnl="15" />
    <char id="237" x="592" y="66" width="7" height="32" xoffset="1" yoffset="0" xadvance="6" page="0" chnl="15" />
    <char id="238" x="575" y="396" width="8" height="32" xoffset="-1" yoffset="0" xadvance="6" page="0" chnl="15" />
    <char id="239" x="591" y="198" width="8" height="32" xoffset="-1" yoffset="0" xadvance="6" page="0" chnl="15" />
    <char id="240" x="255" y="231" width="14" height="32" xoffset="0" yoffset="0" xadvance="14" page="0" chnl="15" />
    <char id="241" x="310" y="297" width="13" height="32" xoffset="1" yoffset="0" xadvance="15" page="0" chnl="15" />
    <char id="242" x="285" y="231" width="14" height="32" xoffset="0" yoffset="0" xadvance="14" page="0" chnl="15" />
    <char id="243" x="300" y="231" width="14" height="32" xoffset="0" yoffset="0" xadvance="14" page="0" chnl="15" />
    <char id="244" x="570" y="264" width="14" height="32" xoffset="0" yoffset="0" xadvance="14" page="0" chnl="15" />
    <char id="245" x="510" y="264" width="14" height="32" xoffset="0" yoffset="0" xadvance="14" page="0" chnl="15" />
    <char id="246" x="465" y="264" width="14" height="32" xoffset="0" yoffset="0" xadvance="14" page="0" chnl="15" />
    <char id="247" x="108" y="132" width="17" height="32" xoffset="1" yoffset="0" xadvance="19" page="0" chnl="15" />
    <char id="248" x="450" y="264" width="14" height="32" xoffset="0" yoffset="0" xadvance="14" page="0" chnl="15" />
    <char id="249" x="324" y="297" width="13" height="32" xoffset="1" yoffset="0" xadvance="15" page="0" chnl="15" />
    <char id="250" x="338" y="297" width="13" height="32" xoffset="1" yoffset="0" xadvance="15" page="0" chnl="15" />
    <char id="251" x="366" y="297" width="13" height="32" xoffset="1" yoffset="0" xadvance="15" page="0" chnl="15" />
    <char id="252" x="380" y="297" width="13" height="32" xoffset="1" yoffset="0" xadvance="15" page="0" chnl="15" />
    <char id="253" x="394" y="297" width="13" height="32" xoffset="0" yoffset="0" xadvance="13" page="0" chnl="15" />
    <char id="254" x="422" y="297" width="13" height="32" xoffset="1" yoffset="0" xadvance="14" page="0" chnl="15" />
    <char id="255" x="450" y="297" width="13" height="32" xoffset="0" yoffset="0" xadvance="13" page="0" chnl="15" />
    <char id="256" x="190" y="99" width="18" height="32" xoffset="-1" yoffset="0" xadvance="16" page="0" chnl="15" />
    <char id="257" x="464" y="297" width="13" height="32" xoffset="0" yoffset="0" xadvance="14" page="0" chnl="15" />
    <char id="258" x="535" y="66" width="18" height="32" xoffset="-1" yoffset="0" xadvance="16" page="0" chnl="15" />
    <char id="259" x="478" y="297" width="13" height="32" xoffset="0" yoffset="0" xadvance="14" page="0" chnl="15" />
    <char id="260" x="98" y="66" width="18" height="32" xoffset="-1" yoffset="0" xadvance="16" page="0" chnl="15" />
    <char id="261" x="105" y="264" width="14" height="32" xoffset="0" yoffset="0" xadvance="14" page="0" chnl="15" />
    <char id="262" x="17" y="165" width="16" height="32" xoffset="0" yoffset="0" xadvance="16" page="0" chnl="15" />
    <char id="263" x="340" y="363" width="12" height="32" xoffset="0" yoffset="0" xadvance="12" page="0" chnl="15" />
    <char id="264" x="51" y="165" width="16" height="32" xoffset="0" yoffset="0" xadvance="16" page="0" chnl="15" />
    <char id="265" x="275" y="363" width="12" height="32" xoffset="0" yoffset="0" xadvance="12" page="0" chnl="15" />
    <char id="266" x="85" y="165" width="16" height="32" xoffset="0" yoffset="0" xadvance="16" page="0" chnl="15" />
    <char id="267" x="262" y="363" width="12" height="32" xoffset="0" yoffset="0" xadvance="12" page="0" chnl="15" />
    <char id="268" x="170" y="165" width="16" height="32" xoffset="0" yoffset="0" xadvance="16" page="0" chnl="15" />
    <char id="269" x="249" y="363" width="12" height="32" xoffset="0" yoffset="0" xadvance="12" page="0" chnl="15" />
    <char id="270" x="198" y="132" width="17" height="32" xoffset="1" yoffset="0" xadvance="18" page="0" chnl="15" />
    <char id="271" x="468" y="33" width="19" height="32" xoffset="0" yoffset="0" xadvance="18" page="0" chnl="15" />
    <char id="272" x="60" y="66" width="18" height="32" xoffset="0" yoffset="0" xadvance="18" page="0" chnl="15" />
    <char id="273" x="573" y="132" width="16" height="32" xoffset="0" yoffset="0" xadvance="15" page="0" chnl="15" />
    <char id="274" x="30" y="264" width="14" height="32" xoffset="1" yoffset="0" xadvance="15" page="0" chnl="15" />
    <char id="275" x="576" y="198" width="14" height="32" xoffset="0" yoffset="0" xadvance="14" page="0" chnl="15" />
    <char id="276" x="45" y="231" width="14" height="32" xoffset="1" yoffset="0" xadvance="15" page="0" chnl="15" />
    <char id="277" x="60" y="231" width="14" height="32" xoffset="0" yoffset="0" xadvance="14" page="0" chnl="15" />
    <char id="278" x="165" y="231" width="14" height="32" xoffset="1" yoffset="0" xadvance="15" page="0" chnl="15" />
    <char id="279" x="420" y="264" width="14" height="32" xoffset="0" yoffset="0" xadvance="14" page="0" chnl="15" />
    <char id="280" x="390" y="264" width="14" height="32" xoffset="1" yoffset="0" xadvance="15" page="0" chnl="15" />
    <char id="281" x="570" y="231" width="14" height="32" xoffset="0" yoffset="0" xadvance="14" page="0" chnl="15" />
    <char id="282" x="495" y="231" width="14" height="32" xoffset="1" yoffset="0" xadvance="15" page="0" chnl="15" />
    <char id="283" x="450" y="231" width="14" height="32" xoffset="0" yoffset="0" xadvance="14" page="0" chnl="15" />
    <char id="284" x="468" y="132" width="17" height="32" xoffset="0" yoffset="0" xadvance="17" page="0" chnl="15" />
    <char id="285" x="492" y="297" width="13" height="32" xoffset="0" yoffset="0" xadvance="14" page="0" chnl="15" />
    <char id="286" x="486" y="132" width="17" height="32" xoffset="0" yoffset="0" xadvance="17" page="0" chnl="15" />
    <char id="287" x="506" y="297" width="13" height="32" xoffset="0" yoffset="0" xadvance="14" page="0" chnl="15" />
    <char id="288" x="504" y="132" width="17" height="32" xoffset="0" yoffset="0" xadvance="17" page="0" chnl="15" />
    <char id="289" x="534" y="297" width="13" height="32" xoffset="0" yoffset="0" xadvance="14" page="0" chnl="15" />
    <char id="290" x="456" y="99" width="17" height="32" xoffset="0" yoffset="0" xadvance="17" page="0" chnl="15" />
    <char id="291" x="562" y="297" width="13" height="32" xoffset="0" yoffset="0" xadvance="14" page="0" chnl="15" />
    <char id="292" x="522" y="132" width="16" height="32" xoffset="1" yoffset="0" xadvance="18" page="0" chnl="15" />
    <char id="293" x="576" y="297" width="13" height="32" xoffset="1" yoffset="0" xadvance="15" page="0" chnl="15" />
    <char id="294" x="0" y="66" width="19" height="32" xoffset="0" yoffset="0" xadvance="19" page="0" chnl="15" />
    <char id="295" x="528" y="198" width="15" height="32" xoffset="-1" yoffset="0" xadvance="15" page="0" chnl="15" />
    <char id="296" x="39" y="396" width="12" height="32" xoffset="-1" yoffset="0" xadvance="10" page="0" chnl="15" />
    <char id="297" x="117" y="429" width="8" height="32" xoffset="-1" yoffset="0" xadvance="6" page="0" chnl="15" />
    <char id="298" x="453" y="396" width="10" height="32" xoffset="0" yoffset="0" xadvance="10" page="0" chnl="15" />
    <char id="299" x="90" y="429" width="8" height="32" xoffset="-1" yoffset="0" xadvance="6" page="0" chnl="15" />
    <char id="300" x="409" y="396" width="10" height="32" xoffset="0" yoffset="0" xadvance="10" page="0" chnl="15" />
    <char id="301" x="63" y="429" width="8" height="32" xoffset="-1" yoffset="0" xadvance="6" page="0" chnl="15" />
    <char id="302" x="9" y="429" width="8" height="32" xoffset="1" yoffset="0" xadvance="10" page="0" chnl="15" />
    <char id="303" x="159" y="429" width="6" height="32" xoffset="0" yoffset="0" xadvance="6" page="0" chnl="15" />
    <char id="304" x="72" y="429" width="8" height="32" xoffset="1" yoffset="0" xadvance="10" page="0" chnl="15" />
    <char id="305" x="244" y="429" width="4" height="32" xoffset="1" yoffset="0" xadvance="6" page="0" chnl="15" />
    <char id="306" x="231" y="66" width="18" height="32" xoffset="0" yoffset="0" xadvance="19" page="0" chnl="15" />
    <char id="307" x="186" y="396" width="11" height="32" xoffset="1" yoffset="0" xadvance="13" page="0" chnl="15" />
    <char id="308" x="223" y="363" width="12" height="32" xoffset="-1" yoffset="0" xadvance="11" page="0" chnl="15" />
    <char id="309" x="398" y="396" width="10" height="32" xoffset="-2" yoffset="0" xadvance="7" page="0" chnl="15" />
    <char id="310" x="352" y="198" width="15" height="32" xoffset="1" yoffset="0" xadvance="15" page="0" chnl="15" />
    <char id="311" x="0" y="330" width="13" height="32" xoffset="1" yoffset="0" xadvance="13" page="0" chnl="15" />
    <char id="312" x="14" y="330" width="13" height="32" xoffset="1" yoffset="0" xadvance="13" page="0" chnl="15" />
    <char id="313" x="28" y="330" width="13" height="32" xoffset="1" yoffset="0" xadvance="13" page="0" chnl="15" />
    <char id="314" x="135" y="429" width="7" height="32" xoffset="1" yoffset="0" xadvance="6" page="0" chnl="15" />
    <char id="315" x="42" y="330" width="13" height="32" xoffset="1" yoffset="0" xadvance="13" page="0" chnl="15" />
    <char id="316" x="223" y="429" width="5" height="32" xoffset="0" yoffset="0" xadvance="6" page="0" chnl="15" />
    <char id="317" x="70" y="330" width="13" height="32" xoffset="1" yoffset="0" xadvance="13" page="0" chnl="15" />
    <char id="318" x="310" y="396" width="10" height="32" xoffset="1" yoffset="0" xadvance="9" page="0" chnl="15" />
    <char id="319" x="84" y="330" width="13" height="32" xoffset="1" yoffset="0" xadvance="13" page="0" chnl="15" />
    <char id="320" x="266" y="396" width="10" height="32" xoffset="1" yoffset="0" xadvance="12" page="0" chnl="15" />
    <char id="321" x="384" y="198" width="15" height="32" xoffset="-1" yoffset="0" xadvance="13" page="0" chnl="15" />
    <char id="322" x="475" y="396" width="9" height="32" xoffset="-1" yoffset="0" xadvance="7" page="0" chnl="15" />
    <char id="323" x="96" y="198" width="15" height="32" xoffset="1" yoffset="0" xadvance="17" page="0" chnl="15" />
    <char id="324" x="98" y="330" width="13" height="32" xoffset="1" yoffset="0" xadvance="15" page="0" chnl="15" />
    <char id="325" x="406" y="165" width="15" height="32" xoffset="1" yoffset="0" xadvance="17" page="0" chnl="15" />
    <char id="326" x="112" y="330" width="13" height="32" xoffset="1" yoffset="0" xadvance="15" page="0" chnl="15" />
    <char id="327" x="566" y="165" width="15" height="32" xoffset="1" yoffset="0" xadvance="17" page="0" chnl="15" />
    <char id="328" x="56" y="330" width="13" height="32" xoffset="1" yoffset="0" xadvance="15" page="0" chnl="15" />
    <char id="329" x="126" y="132" width="17" height="32" xoffset="0" yoffset="0" xadvance="18" page="0" chnl="15" />
    <char id="330" x="368" y="198" width="15" height="32" xoffset="1" yoffset="0" xadvance="17" page="0" chnl="15" />
    <char id="331" x="168" y="330" width="13" height="32" xoffset="1" yoffset="0" xadvance="15" page="0" chnl="15" />
    <char id="332" x="133" y="99" width="18" height="32" xoffset="0" yoffset="0" xadvance="18" page="0" chnl="15" />
    <char id="333" x="330" y="231" width="14" height="32" xoffset="0" yoffset="0" xadvance="14" page="0" chnl="15" />
    <char id="334" x="136" y="66" width="18" height="32" xoffset="0" yoffset="0" xadvance="18" page="0" chnl="15" />
    <char id="335" x="180" y="264" width="14" height="32" xoffset="0" yoffset="0" xadvance="14" page="0" chnl="15" />
    <char id="336" x="174" y="66" width="18" height="32" xoffset="0" yoffset="0" xadvance="18" page="0" chnl="15" />
    <char id="337" x="375" y="264" width="14" height="32" xoffset="0" yoffset="0" xadvance="14" page="0" chnl="15" />
    <char id="338" x="231" y="0" width="25" height="32" xoffset="0" yoffset="0" xadvance="25" page="0" chnl="15" />
    <char id="339" x="460" y="0" width="24" height="32" xoffset="0" yoffset="0" xadvance="24" page="0" chnl="15" />
    <char id="340" x="136" y="165" width="16" height="32" xoffset="1" yoffset="0" xadvance="16" page="0" chnl="15" />
    <char id="341" x="525" y="396" width="9" height="32" xoffset="1" yoffset="0" xadvance="9" page="0" chnl="15" />
    <char id="342" x="153" y="165" width="16" height="32" xoffset="1" yoffset="0" xadvance="16" page="0" chnl="15" />
    <char id="343" x="590" y="132" width="9" height="32" xoffset="1" yoffset="0" xadvance="9" page="0" chnl="15" />
    <char id="344" x="204" y="165" width="16" height="32" xoffset="1" yoffset="0" xadvance="16" page="0" chnl="15" />
    <char id="345" x="505" y="396" width="9" height="32" xoffset="1" yoffset="0" xadvance="9" page="0" chnl="15" />
    <char id="346" x="360" y="264" width="14" height="32" xoffset="0" yoffset="0" xadvance="14" page="0" chnl="15" />
    <char id="347" x="353" y="363" width="12" height="32" xoffset="0" yoffset="0" xadvance="12" page="0" chnl="15" />
    <char id="348" x="90" y="264" width="14" height="32" xoffset="0" yoffset="0" xadvance="14" page="0" chnl="15" />
    <char id="349" x="314" y="363" width="12" height="32" xoffset="0" yoffset="0" xadvance="12" page="0" chnl="15" />
    <char id="350" x="345" y="231" width="14" height="32" xoffset="0" yoffset="0" xadvance="14" page="0" chnl="15" />
    <char id="351" x="65" y="396" width="12" height="32" xoffset="0" yoffset="0" xadvance="12" page="0" chnl="15" />
    <char id="352" x="120" y="264" width="14" height="32" xoffset="0" yoffset="0" xadvance="14" page="0" chnl="15" />
    <char id="353" x="52" y="396" width="12" height="32" xoffset="0" yoffset="0" xadvance="12" page="0" chnl="15" />
    <char id="354" x="582" y="99" width="17" height="32" xoffset="-1" yoffset="0" xadvance="15" page="0" chnl="15" />
    <char id="355" x="233" y="396" width="10" height="32" xoffset="0" yoffset="0" xadvance="9" page="0" chnl="15" />
    <char id="356" x="162" y="132" width="17" height="32" xoffset="-1" yoffset="0" xadvance="15" page="0" chnl="15" />
    <char id="357" x="464" y="198" width="15" height="32" xoffset="-1" yoffset="0" xadvance="12" page="0" chnl="15" />
    <char id="358" x="144" y="132" width="17" height="32" xoffset="-1" yoffset="0" xadvance="15" page="0" chnl="15" />
    <char id="359" x="244" y="396" width="10" height="32" xoffset="0" yoffset="0" xadvance="9" page="0" chnl="15" />
    <char id="360" x="256" y="198" width="15" height="32" xoffset="1" yoffset="0" xadvance="17" page="0" chnl="15" />
    <char id="361" x="182" y="330" width="13" height="32" xoffset="1" yoffset="0" xadvance="15" page="0" chnl="15" />
    <char id="362" x="240" y="198" width="15" height="32" xoffset="1" yoffset="0" xadvance="17" page="0" chnl="15" />
    <char id="363" x="210" y="330" width="13" height="32" xoffset="1" yoffset="0" xadvance="15" page="0" chnl="15" />
    <char id="364" x="224" y="198" width="15" height="32" xoffset="1" yoffset="0" xadvance="17" page="0" chnl="15" />
    <char id="365" x="238" y="330" width="13" height="32" xoffset="1" yoffset="0" xadvance="15" page="0" chnl="15" />
    <char id="366" x="208" y="198" width="15" height="32" xoffset="1" yoffset="0" xadvance="17" page="0" chnl="15" />
    <char id="367" x="252" y="330" width="13" height="32" xoffset="1" yoffset="0" xadvance="15" page="0" chnl="15" />
    <char id="368" x="128" y="198" width="15" height="32" xoffset="1" yoffset="0" xadvance="17" page="0" chnl="15" />
    <char id="369" x="266" y="330" width="13" height="32" xoffset="1" yoffset="0" xadvance="15" page="0" chnl="15" />
    <char id="370" x="320" y="198" width="15" height="32" xoffset="1" yoffset="0" xadvance="17" page="0" chnl="15" />
    <char id="371" x="180" y="231" width="14" height="32" xoffset="1" yoffset="0" xadvance="15" page="0" chnl="15" />
    <char id="372" x="72" y="33" width="23" height="32" xoffset="0" yoffset="0" xadvance="23" page="0" chnl="15" />
    <char id="373" x="20" y="66" width="19" height="32" xoffset="0" yoffset="0" xadvance="19" page="0" chnl="15" />
    <char id="374" x="36" y="132" width="17" height="32" xoffset="-1" yoffset="0" xadvance="15" page="0" chnl="15" />
    <char id="375" x="280" y="330" width="13" height="32" xoffset="0" yoffset="0" xadvance="13" page="0" chnl="15" />
    <char id="376" x="18" y="132" width="17" height="32" xoffset="-1" yoffset="0" xadvance="15" page="0" chnl="15" />
    <char id="377" x="416" y="198" width="15" height="32" xoffset="0" yoffset="0" xadvance="15" page="0" chnl="15" />
    <char id="378" x="535" y="363" width="12" height="32" xoffset="0" yoffset="0" xadvance="12" page="0" chnl="15" />
    <char id="379" x="432" y="198" width="15" height="32" xoffset="0" yoffset="0" xadvance="15" page="0" chnl="15" />
    <char id="380" x="561" y="363" width="12" height="32" xoffset="0" yoffset="0" xadvance="12" page="0" chnl="15" />
    <char id="381" x="512" y="198" width="15" height="32" xoffset="0" yoffset="0" xadvance="15" page="0" chnl="15" />
    <char id="382" x="587" y="363" width="12" height="32" xoffset="0" yoffset="0" xadvance="12" page="0" chnl="15" />
    <char id="383" x="535" y="396" width="9" height="32" xoffset="1" yoffset="0" xadvance="7" page="0" chnl="15" />
    <char id="384" x="544" y="198" width="15" height="32" xoffset="-1" yoffset="0" xadvance="14" page="0" chnl="15" />
    <char id="385" x="568" y="33" width="19" height="32" xoffset="-1" yoffset="0" xadvance="18" page="0" chnl="15" />
    <char id="386" x="60" y="264" width="14" height="32" xoffset="1" yoffset="0" xadvance="15" page="0" chnl="15" />
    <char id="387" x="294" y="330" width="13" height="32" xoffset="1" yoffset="0" xadvance="14" page="0" chnl="15" />
    <char id="388" x="289" y="165" width="16" height="32" xoffset="-1" yoffset="0" xadvance="15" page="0" chnl="15" />
    <char id="389" x="390" y="165" width="15" height="32" xoffset="-1" yoffset="0" xadvance="14" page="0" chnl="15" />
    <char id="390" x="68" y="165" width="16" height="32" xoffset="0" yoffset="0" xadvance="16" page="0" chnl="15" />
    <char id="391" x="364" y="33" width="20" height="32" xoffset="0" yoffset="0" xadvance="16" page="0" chnl="15" />
    <char id="392" x="102" y="165" width="16" height="32" xoffset="0" yoffset="0" xadvance="12" page="0" chnl="15" />
    <char id="393" x="79" y="66" width="18" height="32" xoffset="0" yoffset="0" xadvance="18" page="0" chnl="15" />
    <char id="394" x="257" y="33" width="21" height="32" xoffset="-1" yoffset="0" xadvance="20" page="0" chnl="15" />
    <char id="395" x="390" y="231" width="14" height="32" xoffset="0" yoffset="0" xadvance="15" page="0" chnl="15" />
    <char id="396" x="322" y="330" width="13" height="32" xoffset="0" yoffset="0" xadvance="14" page="0" chnl="15" />
    <char id="397" x="405" y="231" width="14" height="32" xoffset="0" yoffset="0" xadvance="14" page="0" chnl="15" />
    <char id="398" x="420" y="231" width="14" height="32" xoffset="0" yoffset="0" xadvance="15" page="0" chnl="15" />
    <char id="399" x="228" y="99" width="18" height="32" xoffset="0" yoffset="0" xadvance="18" page="0" chnl="15" />
    <char id="400" x="270" y="264" width="14" height="32" xoffset="0" yoffset="0" xadvance="14" page="0" chnl="15" />
    <char id="401" x="492" y="99" width="17" height="32" xoffset="-3" yoffset="0" xadvance="14" page="0" chnl="15" />
    <char id="402" x="550" y="165" width="15" height="32" xoffset="-1" yoffset="0" xadvance="14" page="0" chnl="15" />
    <char id="403" x="343" y="33" width="20" height="32" xoffset="0" yoffset="0" xadvance="17" page="0" chnl="15" />
    <char id="404" x="38" y="99" width="18" height="32" xoffset="-1" yoffset="0" xadvance="16" page="0" chnl="15" />
    <char id="405" x="279" y="33" width="21" height="32" xoffset="1" yoffset="0" xadvance="23" page="0" chnl="15" />
    <char id="406" x="254" y="429" width="4" height="32" xoffset="1" yoffset="0" xadvance="6" page="0" chnl="15" />
    <char id="407" x="277" y="396" width="10" height="32" xoffset="0" yoffset="0" xadvance="10" page="0" chnl="15" />
    <char id="408" x="64" y="198" width="15" height="32" xoffset="1" yoffset="0" xadvance="15" page="0" chnl="15" />
    <char id="409" x="350" y="330" width="13" height="32" xoffset="1" yoffset="0" xadvance="13" page="0" chnl="15" />
    <char id="410" x="99" y="429" width="8" height="32" xoffset="0" yoffset="0" xadvance="7" page="0" chnl="15" />
    <char id="411" x="364" y="330" width="13" height="32" xoffset="0" yoffset="0" xadvance="13" page="0" chnl="15" />
    <char id="412" x="427" y="33" width="20" height="32" xoffset="1" yoffset="0" xadvance="22" page="0" chnl="15" />
    <char id="413" x="548" y="33" width="19" height="32" xoffset="-3" yoffset="0" xadvance="17" page="0" chnl="15" />
    <char id="414" x="378" y="330" width="13" height="32" xoffset="1" yoffset="0" xadvance="15" page="0" chnl="15" />
    <char id="415" x="402" y="66" width="18" height="32" xoffset="0" yoffset="0" xadvance="18" page="0" chnl="15" />
    <char id="416" x="213" y="33" width="21" height="32" xoffset="0" yoffset="0" xadvance="20" page="0" chnl="15" />
    <char id="417" x="357" y="165" width="16" height="32" xoffset="0" yoffset="0" xadvance="15" page="0" chnl="15" />
    <char id="418" x="533" y="0" width="23" height="32" xoffset="0" yoffset="0" xadvance="24" page="0" chnl="15" />
    <char id="419" x="432" y="132" width="17" height="32" xoffset="0" yoffset="0" xadvance="18" page="0" chnl="15" />
    <char id="420" x="212" y="66" width="18" height="32" xoffset="-1" yoffset="0" xadvance="17" page="0" chnl="15" />
    <char id="421" x="392" y="330" width="13" height="32" xoffset="1" yoffset="0" xadvance="14" page="0" chnl="15" />
    <char id="422" x="119" y="165" width="16" height="32" xoffset="1" yoffset="0" xadvance="15" page="0" chnl="15" />
    <char id="423" x="585" y="264" width="14" height="32" xoffset="0" yoffset="0" xadvance="14" page="0" chnl="15" />
    <char id="424" x="379" y="363" width="12" height="32" xoffset="0" yoffset="0" xadvance="12" page="0" chnl="15" />
    <char id="425" x="150" y="231" width="14" height="32" xoffset="0" yoffset="0" xadvance="14" page="0" chnl="15" />
    <char id="426" x="0" y="198" width="15" height="32" xoffset="-1" yoffset="0" xadvance="14" page="0" chnl="15" />
    <char id="427" x="354" y="396" width="10" height="32" xoffset="0" yoffset="0" xadvance="9" page="0" chnl="15" />
    <char id="428" x="180" y="132" width="17" height="32" xoffset="-1" yoffset="0" xadvance="15" page="0" chnl="15" />
    <char id="429" x="299" y="396" width="10" height="32" xoffset="0" yoffset="0" xadvance="9" page="0" chnl="15" />
    <char id="430" x="90" y="132" width="17" height="32" xoffset="-1" yoffset="0" xadvance="15" page="0" chnl="15" />
    <char id="431" x="322" y="33" width="20" height="32" xoffset="1" yoffset="0" xadvance="19" page="0" chnl="15" />
    <char id="432" x="0" y="132" width="17" height="32" xoffset="1" yoffset="0" xadvance="16" page="0" chnl="15" />
    <char id="433" x="581" y="0" width="18" height="32" xoffset="0" yoffset="0" xadvance="18" page="0" chnl="15" />
    <char id="434" x="454" y="165" width="15" height="32" xoffset="1" yoffset="0" xadvance="17" page="0" chnl="15" />
    <char id="435" x="406" y="33" width="20" height="32" xoffset="-1" yoffset="0" xadvance="18" page="0" chnl="15" />
    <char id="436" x="528" y="33" width="19" height="32" xoffset="0" yoffset="0" xadvance="13" page="0" chnl="15" />
    <char id="437" x="438" y="165" width="15" height="32" xoffset="0" yoffset="0" xadvance="15" page="0" chnl="15" />
    <char id="438" x="0" y="396" width="12" height="32" xoffset="0" yoffset="0" xadvance="12" page="0" chnl="15" />
    <char id="439" x="15" y="231" width="14" height="32" xoffset="0" yoffset="0" xadvance="14" page="0" chnl="15" />
    <char id="440" x="0" y="231" width="14" height="32" xoffset="0" yoffset="0" xadvance="14" page="0" chnl="15" />
    <char id="441" x="574" y="363" width="12" height="32" xoffset="0" yoffset="0" xadvance="12" page="0" chnl="15" />
    <char id="442" x="548" y="363" width="12" height="32" xoffset="0" yoffset="0" xadvance="12" page="0" chnl="15" />
    <char id="443" x="406" y="330" width="13" height="32" xoffset="1" yoffset="0" xadvance="14" page="0" chnl="15" />
    <char id="444" x="420" y="330" width="13" height="32" xoffset="0" yoffset="0" xadvance="14" page="0" chnl="15" />
    <char id="445" x="457" y="363" width="12" height="32" xoffset="0" yoffset="0" xadvance="12" page="0" chnl="15" />
    <char id="446" x="434" y="330" width="13" height="32" xoffset="0" yoffset="0" xadvance="13" page="0" chnl="15" />
    <char id="447" x="448" y="330" width="13" height="32" xoffset="1" yoffset="0" xadvance="14" page="0" chnl="15" />
    <char id="448" x="229" y="429" width="4" height="32" xoffset="3" yoffset="0" xadvance="10" page="0" chnl="15" />
    <char id="449" x="108" y="429" width="8" height="32" xoffset="1" yoffset="0" xadvance="10" page="0" chnl="15" />
    <char id="450" x="374" y="165" width="15" height="32" xoffset="2" yoffset="0" xadvance="19" page="0" chnl="15" />
    <char id="451" x="193" y="429" width="5" height="32" xoffset="2" yoffset="0" xadvance="9" page="0" chnl="15" />
    <char id="452" x="0" y="0" width="31" height="32" xoffset="1" yoffset="0" xadvance="32" page="0" chnl="15" />
    <char id="453" x="94" y="0" width="29" height="32" xoffset="1" yoffset="0" xadvance="29" page="0" chnl="15" />
    <char id="454" x="178" y="0" width="26" height="32" xoffset="0" yoffset="0" xadvance="26" page="0" chnl="15" />
    <char id="455" x="24" y="33" width="23" height="32" xoffset="1" yoffset="0" xadvance="25" page="0" chnl="15" />
    <char id="456" x="508" y="33" width="19" height="32" xoffset="1" yoffset="0" xadvance="21" page="0" chnl="15" />
    <char id="457" x="138" y="396" width="11" height="32" xoffset="1" yoffset="0" xadvance="13" page="0" chnl="15" />
    <char id="458" x="151" y="0" width="26" height="32" xoffset="1" yoffset="0" xadvance="28" page="0" chnl="15" />
    <char id="459" x="144" y="33" width="22" height="32" xoffset="1" yoffset="0" xadvance="24" page="0" chnl="15" />
    <char id="460" x="448" y="33" width="19" height="32" xoffset="1" yoffset="0" xadvance="21" page="0" chnl="15" />
    <char id="461" x="399" y="99" width="18" height="32" xoffset="-1" yoffset="0" xadvance="16" page="0" chnl="15" />
    <char id="462" x="28" y="363" width="13" height="32" xoffset="0" yoffset="0" xadvance="14" page="0" chnl="15" />
    <char id="463" x="387" y="396" width="10" height="32" xoffset="0" yoffset="0" xadvance="10" page="0" chnl="15" />
    <char id="464" x="222" y="396" width="10" height="32" xoffset="-2" yoffset="0" xadvance="6" page="0" chnl="15" />
    <char id="465" x="361" y="99" width="18" height="32" xoffset="0" yoffset="0" xadvance="18" page="0" chnl="15" />
    <char id="466" x="0" y="297" width="14" height="32" xoffset="0" yoffset="0" xadvance="14" page="0" chnl="15" />
    <char id="467" x="422" y="165" width="15" height="32" xoffset="1" yoffset="0" xadvance="17" page="0" chnl="15" />
    <char id="468" x="84" y="363" width="13" height="32" xoffset="1" yoffset="0" xadvance="15" page="0" chnl="15" />
    <char id="469" x="80" y="198" width="15" height="32" xoffset="1" yoffset="0" xadvance="17" page="0" chnl="15" />
    <char id="470" x="112" y="363" width="13" height="32" xoffset="1" yoffset="0" xadvance="15" page="0" chnl="15" />
    <char id="471" x="486" y="165" width="15" height="32" xoffset="1" yoffset="0" xadvance="17" page="0" chnl="15" />
    <char id="472" x="140" y="363" width="13" height="32" xoffset="1" yoffset="0" xadvance="15" page="0" chnl="15" />
    <char id="473" x="502" y="165" width="15" height="32" xoffset="1" yoffset="0" xadvance="17" page="0" chnl="15" />
    <char id="474" x="168" y="363" width="13" height="32" xoffset="1" yoffset="0" xadvance="15" page="0" chnl="15" />
    <char id="475" x="518" y="165" width="15" height="32" xoffset="1" yoffset="0" xadvance="17" page="0" chnl="15" />
    <char id="476" x="30" y="297" width="13" height="32" xoffset="1" yoffset="0" xadvance="15" page="0" chnl="15" />
    <char id="477" x="240" y="264" width="14" height="32" xoffset="0" yoffset="0" xadvance="14" page="0" chnl="15" />
    <char id="478" x="342" y="99" width="18" height="32" xoffset="-1" yoffset="0" xadvance="16" page="0" chnl="15" />
    <char id="479" x="72" y="297" width="13" height="32" xoffset="0" yoffset="0" xadvance="14" page="0" chnl="15" />
    <char id="480" x="323" y="99" width="18" height="32" xoffset="-1" yoffset="0" xadvance="16" page="0" chnl="15" />
    <char id="481" x="100" y="297" width="13" height="32" xoffset="0" yoffset="0" xadvance="14" page="0" chnl="15" />
    <char id="482" x="309" y="0" width="25" height="32" xoffset="-1" yoffset="0" xadvance="24" page="0" chnl="15" />
    <char id="483" x="48" y="33" width="23" height="32" xoffset="0" yoffset="0" xadvance="23" page="0" chnl="15" />
    <char id="484" x="266" y="99" width="18" height="32" xoffset="0" yoffset="0" xadvance="17" page="0" chnl="15" />
    <char id="485" x="45" y="264" width="14" height="32" xoffset="0" yoffset="0" xadvance="14" page="0" chnl="15" />
    <char id="486" x="216" y="132" width="17" height="32" xoffset="0" yoffset="0" xadvance="17" page="0" chnl="15" />
    <char id="487" x="184" y="297" width="13" height="32" xoffset="0" yoffset="0" xadvance="14" page="0" chnl="15" />
    <char id="488" x="534" y="165" width="15" height="32" xoffset="1" yoffset="0" xadvance="15" page="0" chnl="15" />
    <char id="489" x="212" y="297" width="13" height="32" xoffset="1" yoffset="0" xadvance="13" page="0" chnl="15" />
    <char id="490" x="209" y="99" width="18" height="32" xoffset="0" yoffset="0" xadvance="18" page="0" chnl="15" />
    <char id="491" x="300" y="264" width="14" height="32" xoffset="0" yoffset="0" xadvance="14" page="0" chnl="15" />
    <char id="492" x="171" y="99" width="18" height="32" xoffset="0" yoffset="0" xadvance="18" page="0" chnl="15" />
    <char id="493" x="495" y="264" width="14" height="32" xoffset="0" yoffset="0" xadvance="14" page="0" chnl="15" />
    <char id="494" x="525" y="264" width="14" height="32" xoffset="0" yoffset="0" xadvance="14" page="0" chnl="15" />
    <char id="495" x="210" y="363" width="12" height="32" xoffset="0" yoffset="0" xadvance="12" page="0" chnl="15" />
    <char id="496" x="321" y="396" width="10" height="32" xoffset="-2" yoffset="0" xadvance="7" page="0" chnl="15" />
    <char id="497" x="32" y="0" width="31" height="32" xoffset="1" yoffset="0" xadvance="32" page="0" chnl="15" />
    <char id="498" x="64" y="0" width="29" height="32" xoffset="1" yoffset="0" xadvance="29" page="0" chnl="15" />
    <char id="499" x="124" y="0" width="26" height="32" xoffset="0" yoffset="0" xadvance="26" page="0" chnl="15" />
    <char id="500" x="234" y="132" width="17" height="32" xoffset="0" yoffset="0" xadvance="17" page="0" chnl="15" />
    <char id="501" x="352" y="297" width="13" height="32" xoffset="0" yoffset="0" xadvance="14" page="0" chnl="15" />
    <char id="502" x="385" y="0" width="24" height="32" xoffset="1" yoffset="0" xadvance="26" page="0" chnl="15" />
    <char id="503" x="375" y="231" width="14" height="32" xoffset="1" yoffset="0" xadvance="15" page="0" chnl="15" />
    <char id="504" x="582" y="165" width="15" height="32" xoffset="1" yoffset="0" xadvance="17" page="0" chnl="15" />
    <char id="505" x="408" y="297" width="13" height="32" xoffset="1" yoffset="0" xadvance="15" page="0" chnl="15" />
    <char id="506" x="497" y="66" width="18" height="32" xoffset="-1" yoffset="0" xadvance="16" page="0" chnl="15" />
    <char id="507" x="436" y="297" width="13" height="32" xoffset="0" yoffset="0" xadvance="14" page="0" chnl="15" />
    <char id="508" x="257" y="0" width="25" height="32" xoffset="-1" yoffset="0" xadvance="24" page="0" chnl="15" />
    <char id="509" x="120" y="33" width="23" height="32" xoffset="0" yoffset="0" xadvance="23" page="0" chnl="15" />
    <char id="510" x="421" y="66" width="18" height="32" xoffset="0" yoffset="0" xadvance="18" page="0" chnl="15" />
    <char id="511" x="465" y="231" width="14" height="32" xoffset="0" yoffset="0" xadvance="14" page="0" chnl="15" />
    <char id="512" x="383" y="66" width="18" height="32" xoffset="-1" yoffset="0" xadvance="16" page="0" chnl="15" />
    <char id="513" x="520" y="297" width="13" height="32" xoffset="0" yoffset="0" xadvance="14" page="0" chnl="15" />
    <char id="514" x="364" y="66" width="18" height="32" xoffset="-1" yoffset="0" xadvance="16" page="0" chnl="15" />
    <char id="515" x="548" y="297" width="13" height="32" xoffset="0" yoffset="0" xadvance="14" page="0" chnl="15" />
    <char id="516" x="510" y="231" width="14" height="32" xoffset="1" yoffset="0" xadvance="15" page="0" chnl="15" />
    <char id="517" x="525" y="231" width="14" height="32" xoffset="0" yoffset="0" xadvance="14" page="0" chnl="15" />
    <char id="518" x="540" y="231" width="14" height="32" xoffset="1" yoffset="0" xadvance="15" page="0" chnl="15" />
    <char id="519" x="555" y="231" width="14" height="32" xoffset="0" yoffset="0" xadvance="14" page="0" chnl="15" />
    <char id="520" x="198" y="396" width="11" height="32" xoffset="-1" yoffset="0" xadvance="10" page="0" chnl="15" />
    <char id="521" x="210" y="396" width="11" height="32" xoffset="-3" yoffset="0" xadvance="6" page="0" chnl="15" />
    <char id="522" x="343" y="396" width="10" height="32" xoffset="0" yoffset="0" xadvance="10" page="0" chnl="15" />
    <char id="523" x="464" y="396" width="10" height="32" xoffset="-2" yoffset="0" xadvance="6" page="0" chnl="15" />
    <char id="524" x="440" y="66" width="18" height="32" xoffset="0" yoffset="0" xadvance="18" page="0" chnl="15" />
    <char id="525" x="585" y="231" width="14" height="32" xoffset="0" yoffset="0" xadvance="14" page="0" chnl="15" />
    <char id="526" x="326" y="66" width="18" height="32" xoffset="0" yoffset="0" xadvance="18" page="0" chnl="15" />
    <char id="527" x="0" y="264" width="14" height="32" xoffset="0" yoffset="0" xadvance="14" page="0" chnl="15" />
    <char id="528" x="340" y="165" width="16" height="32" xoffset="1" yoffset="0" xadvance="16" page="0" chnl="15" />
    <char id="529" x="588" y="330" width="11" height="32" xoffset="-1" yoffset="0" xadvance="9" page="0" chnl="15" />
    <char id="530" x="34" y="165" width="16" height="32" xoffset="1" yoffset="0" xadvance="16" page="0" chnl="15" />
    <char id="531" x="545" y="396" width="9" height="32" xoffset="1" yoffset="0" xadvance="9" page="0" chnl="15" />
    <char id="532" x="112" y="198" width="15" height="32" xoffset="1" yoffset="0" xadvance="17" page="0" chnl="15" />
    <char id="533" x="126" y="330" width="13" height="32" xoffset="1" yoffset="0" xadvance="15" page="0" chnl="15" />
    <char id="534" x="470" y="165" width="15" height="32" xoffset="1" yoffset="0" xadvance="17" page="0" chnl="15" />
    <char id="535" x="154" y="330" width="13" height="32" xoffset="1" yoffset="0" xadvance="15" page="0" chnl="15" />
    <char id="536" x="75" y="264" width="14" height="32" xoffset="0" yoffset="0" xadvance="14" page="0" chnl="15" />
    <char id="537" x="13" y="396" width="12" height="32" xoffset="0" yoffset="0" xadvance="12" page="0" chnl="15" />
    <char id="538" x="252" y="132" width="17" height="32" xoffset="-1" yoffset="0" xadvance="15" page="0" chnl="15" />
    <char id="539" x="442" y="396" width="10" height="32" xoffset="0" yoffset="0" xadvance="9" page="0" chnl="15" />
    <char id="540" x="196" y="330" width="13" height="32" xoffset="0" yoffset="0" xadvance="13" page="0" chnl="15" />
    <char id="541" x="90" y="396" width="11" height="32" xoffset="0" yoffset="0" xadvance="11" page="0" chnl="15" />
    <char id="542" x="0" y="165" width="16" height="32" xoffset="1" yoffset="0" xadvance="18" page="0" chnl="15" />
    <char id="543" x="224" y="330" width="13" height="32" xoffset="1" yoffset="0" xadvance="15" page="0" chnl="15" />
    <char id="544" x="556" y="132" width="16" height="32" xoffset="1" yoffset="0" xadvance="17" page="0" chnl="15" />
    <char id="545" x="235" y="33" width="21" height="32" xoffset="0" yoffset="0" xadvance="20" page="0" chnl="15" />
    <char id="546" x="144" y="198" width="15" height="32" xoffset="0" yoffset="0" xadvance="15" page="0" chnl="15" />
    <char id="547" x="165" y="264" width="14" height="32" xoffset="0" yoffset="0" xadvance="14" page="0" chnl="15" />
    <char id="548" x="255" y="165" width="16" height="32" xoffset="0" yoffset="0" xadvance="15" page="0" chnl="15" />
    <char id="549" x="308" y="330" width="13" height="32" xoffset="0" yoffset="0" xadvance="12" page="0" chnl="15" />
    <char id="550" x="288" y="66" width="18" height="32" xoffset="-1" yoffset="0" xadvance="16" page="0" chnl="15" />
    <char id="551" x="336" y="330" width="13" height="32" xoffset="0" yoffset="0" xadvance="14" page="0" chnl="15" />
    <char id="552" x="210" y="264" width="14" height="32" xoffset="1" yoffset="0" xadvance="15" page="0" chnl="15" />
    <char id="553" x="225" y="264" width="14" height="32" xoffset="0" yoffset="0" xadvance="14" page="0" chnl="15" />
    <char id="554" x="193" y="66" width="18" height="32" xoffset="0" yoffset="0" xadvance="18" page="0" chnl="15" />
    <char id="555" x="255" y="264" width="14" height="32" xoffset="0" yoffset="0" xadvance="14" page="0" chnl="15" />
    <char id="556" x="155" y="66" width="18" height="32" xoffset="0" yoffset="0" xadvance="18" page="0" chnl="15" />
    <char id="557" x="285" y="264" width="14" height="32" xoffset="0" yoffset="0" xadvance="14" page="0" chnl="15" />
    <char id="558" x="516" y="66" width="18" height="32" xoffset="0" yoffset="0" xadvance="18" page="0" chnl="15" />
    <char id="559" x="315" y="264" width="14" height="32" xoffset="0" yoffset="0" xadvance="14" page="0" chnl="15" />
    <char id="560" x="418" y="99" width="18" height="32" xoffset="0" yoffset="0" xadvance="18" page="0" chnl="15" />
    <char id="561" x="345" y="264" width="14" height="32" xoffset="0" yoffset="0" xadvance="14" page="0" chnl="15" />
    <char id="562" x="270" y="132" width="17" height="32" xoffset="-1" yoffset="0" xadvance="15" page="0" chnl="15" />
    <char id="563" x="504" y="330" width="13" height="32" xoffset="0" yoffset="0" xadvance="13" page="0" chnl="15" />
    <char id="564" x="496" y="363" width="12" height="32" xoffset="0" yoffset="0" xadvance="11" page="0" chnl="15" />
    <char id="565" x="385" y="33" width="20" height="32" xoffset="1" yoffset="0" xadvance="20" page="0" chnl="15" />
    <char id="566" x="532" y="330" width="13" height="32" xoffset="-1" yoffset="0" xadvance="11" page="0" chnl="15" />
    <char id="567" x="54" y="429" width="8" height="32" xoffset="-2" yoffset="0" xadvance="7" page="0" chnl="15" />
    <char id="568" x="509" y="0" width="23" height="32" xoffset="0" yoffset="0" xadvance="23" page="0" chnl="15" />
    <char id="569" x="485" y="0" width="23" height="32" xoffset="0" yoffset="0" xadvance="23" page="0" chnl="15" />
    <char id="570" x="345" y="66" width="18" height="32" xoffset="-1" yoffset="0" xadvance="16" page="0" chnl="15" />
    <char id="571" x="288" y="132" width="17" height="32" xoffset="0" yoffset="0" xadvance="16" page="0" chnl="15" />
    <char id="572" x="14" y="363" width="13" height="32" xoffset="0" yoffset="0" xadvance="12" page="0" chnl="15" />
    <char id="573" x="187" y="165" width="16" height="32" xoffset="-2" yoffset="0" xadvance="13" page="0" chnl="15" />
    <char id="574" x="306" y="132" width="17" height="32" xoffset="-1" yoffset="0" xadvance="15" page="0" chnl="15" />
    <char id="575" x="418" y="363" width="12" height="32" xoffset="0" yoffset="0" xadvance="12" page="0" chnl="15" />
    <char id="576" x="431" y="363" width="12" height="32" xoffset="0" yoffset="0" xadvance="12" page="0" chnl="15" />
    <char id="577" x="480" y="264" width="14" height="32" xoffset="0" yoffset="0" xadvance="14" page="0" chnl="15" />
    <char id="578" x="392" y="363" width="12" height="32" xoffset="0" yoffset="0" xadvance="12" page="0" chnl="15" />
    <char id="579" x="288" y="198" width="15" height="32" xoffset="0" yoffset="0" xadvance="15" page="0" chnl="15" />
    <char id="580" x="342" y="132" width="17" height="32" xoffset="0" yoffset="0" xadvance="17" page="0" chnl="15" />
    <char id="581" x="459" y="66" width="18" height="32" xoffset="-1" yoffset="0" xadvance="16" page="0" chnl="15" />
    <char id="582" x="540" y="264" width="14" height="32" xoffset="1" yoffset="0" xadvance="15" page="0" chnl="15" />
    <char id="583" x="555" y="264" width="14" height="32" xoffset="0" yoffset="0" xadvance="14" page="0" chnl="15" />
    <char id="584" x="288" y="363" width="12" height="32" xoffset="-1" yoffset="0" xadvance="11" page="0" chnl="15" />
    <char id="585" x="431" y="396" width="10" height="32" xoffset="-2" yoffset="0" xadvance="7" page="0" chnl="15" />
    <char id="586" x="167" y="33" width="22" height="32" xoffset="0" yoffset="0" xadvance="19" page="0" chnl="15" />
    <char id="587" x="478" y="66" width="18" height="32" xoffset="0" yoffset="0" xadvance="14" page="0" chnl="15" />
    <char id="588" x="378" y="132" width="17" height="32" xoffset="0" yoffset="0" xadvance="16" page="0" chnl="15" />
    <char id="589" x="150" y="396" width="11" height="32" xoffset="-1" yoffset="0" xadvance="9" page="0" chnl="15" />
    <char id="590" x="54" y="132" width="17" height="32" xoffset="-1" yoffset="0" xadvance="15" page="0" chnl="15" />
    <char id="591" x="196" y="363" width="13" height="32" xoffset="0" yoffset="0" xadvance="13" page="0" chnl="15" />
  </chars>
  <kernings count="222">
    <kerning first="216" second="84" amount="-1" />
    <kerning first="199" second="45" amount="-1" />
    <kerning first="39" second="65" amount="-1" />
    <kerning first="39" second="198" amount="-1" />
    <kerning first="123" second="106" amount="1" />
    <kerning first="40" second="106" amount="1" />
    <kerning first="44" second="41" amount="-1" />
    <kerning first="44" second="55" amount="-1" />
    <kerning first="44" second="93" amount="-1" />
    <kerning first="44" second="125" amount="-1" />
    <kerning first="121" second="230" amount="-1" />
    <kerning first="121" second="97" amount="-1" />
    <kerning first="45" second="65" amount="-1" />
    <kerning first="121" second="46" amount="-2" />
    <kerning first="45" second="74" amount="-1" />
    <kerning first="121" second="45" amount="-1" />
    <kerning first="45" second="84" amount="-2" />
    <kerning first="45" second="86" amount="-1" />
    <kerning first="45" second="87" amount="-1" />
    <kerning first="45" second="88" amount="-1" />
    <kerning first="45" second="89" amount="-2" />
    <kerning first="121" second="44" amount="-2" />
    <kerning first="120" second="45" amount="-1" />
    <kerning first="45" second="118" amount="-1" />
    <kerning first="119" second="46" amount="-1" />
    <kerning first="45" second="120" amount="-1" />
    <kerning first="45" second="121" amount="-1" />
    <kerning first="45" second="122" amount="-1" />
    <kerning first="45" second="198" amount="-1" />
    <kerning first="119" second="44" amount="-1" />
    <kerning first="46" second="41" amount="-1" />
    <kerning first="46" second="44" amount="-2" />
    <kerning first="46" second="45" amount="-2" />
    <kerning first="46" second="55" amount="-1" />
    <kerning first="46" second="93" amount="-1" />
    <kerning first="46" second="125" amount="-1" />
    <kerning first="118" second="230" amount="-1" />
    <kerning first="118" second="97" amount="-1" />
    <kerning first="118" second="46" amount="-2" />
    <kerning first="118" second="45" amount="-1" />
    <kerning first="118" second="44" amount="-2" />
    <kerning first="116" second="45" amount="-1" />
    <kerning first="55" second="44" amount="-2" />
    <kerning first="55" second="46" amount="-2" />
    <kerning first="114" second="230" amount="-1" />
    <kerning first="65" second="45" amount="-1" />
    <kerning first="114" second="46" amount="-4" />
    <kerning first="65" second="84" amount="-1" />
    <kerning first="114" second="44" amount="-4" />
    <kerning first="65" second="86" amount="-1" />
    <kerning first="65" second="87" amount="-1" />
    <kerning first="65" second="89" amount="-1" />
    <kerning first="107" second="45" amount="-1" />
    <kerning first="102" second="238" amount="2" />
    <kerning first="102" second="125" amount="1" />
    <kerning first="102" second="93" amount="1" />
    <kerning first="102" second="92" amount="1" />
    <kerning first="102" second="63" amount="1" />
    <kerning first="102" second="46" amount="-2" />
    <kerning first="102" second="45" amount="-1" />
    <kerning first="102" second="44" amount="-2" />
    <kerning first="102" second="42" amount="1" />
    <kerning first="102" second="41" amount="1" />
    <kerning first="102" second="39" amount="1" />
    <kerning first="102" second="34" amount="1" />
    <kerning first="101" second="84" amount="-2" />
    <kerning first="99" second="84" amount="-1" />
    <kerning first="91" second="106" amount="1" />
    <kerning first="90" second="339" amount="-1" />
    <kerning first="90" second="248" amount="-1" />
    <kerning first="66" second="84" amount="-1" />
    <kerning first="90" second="230" amount="-1" />
    <kerning first="90" second="121" amount="-1" />
    <kerning first="90" second="119" amount="-1" />
    <kerning first="90" second="111" amount="-1" />
    <kerning first="90" second="101" amount="-1" />
    <kerning first="90" second="97" amount="-1" />
    <kerning first="90" second="45" amount="-1" />
    <kerning first="89" second="339" amount="-2" />
    <kerning first="89" second="248" amount="-2" />
    <kerning first="89" second="230" amount="-2" />
    <kerning first="89" second="198" amount="-1" />
    <kerning first="89" second="118" amount="-1" />
    <kerning first="89" second="117" amount="-1" />
    <kerning first="89" second="115" amount="-1" />
    <kerning first="67" second="45" amount="-1" />
    <kerning first="89" second="114" amount="-1" />
    <kerning first="89" second="113" amount="-2" />
    <kerning first="89" second="112" amount="-1" />
    <kerning first="68" second="44" amount="-1" />
    <kerning first="68" second="46" amount="-1" />
    <kerning first="89" second="111" amount="-2" />
    <kerning first="68" second="84" amount="-1" />
    <kerning first="89" second="110" amount="-1" />
    <kerning first="89" second="109" amount="-1" />
    <kerning first="89" second="103" amount="-2" />
    <kerning first="89" second="101" amount="-2" />
    <kerning first="89" second="100" amount="-1" />
    <kerning first="70" second="44" amount="-4" />
    <kerning first="70" second="46" amount="-4" />
    <kerning first="70" second="58" amount="-1" />
    <kerning first="89" second="97" amount="-2" />
    <kerning first="70" second="63" amount="1" />
    <kerning first="70" second="65" amount="-1" />
    <kerning first="70" second="74" amount="-1" />
    <kerning first="89" second="74" amount="-1" />
    <kerning first="70" second="97" amount="-1" />
    <kerning first="70" second="101" amount="-1" />
    <kerning first="70" second="111" amount="-1" />
    <kerning first="70" second="198" amount="-1" />
    <kerning first="70" second="230" amount="-1" />
    <kerning first="70" second="248" amount="-1" />
    <kerning first="89" second="65" amount="-1" />
    <kerning first="70" second="339" amount="-1" />
    <kerning first="89" second="58" amount="-2" />
    <kerning first="89" second="46" amount="-4" />
    <kerning first="89" second="45" amount="-2" />
    <kerning first="89" second="44" amount="-4" />
    <kerning first="88" second="339" amount="-1" />
    <kerning first="88" second="248" amount="-1" />
    <kerning first="88" second="230" amount="-1" />
    <kerning first="88" second="121" amount="-1" />
    <kerning first="88" second="111" amount="-1" />
    <kerning first="88" second="101" amount="-1" />
    <kerning first="88" second="45" amount="-1" />
    <kerning first="87" second="339" amount="-1" />
    <kerning first="87" second="248" amount="-1" />
    <kerning first="87" second="230" amount="-1" />
    <kerning first="87" second="121" amount="-1" />
    <kerning first="87" second="111" amount="-1" />
    <kerning first="87" second="101" amount="-1" />
    <kerning first="87" second="97" amount="-1" />
    <kerning first="87" second="65" amount="-1" />
    <kerning first="87" second="58" amount="-1" />
    <kerning first="75" second="45" amount="-1" />
    <kerning first="87" second="46" amount="-3" />
    <kerning first="75" second="97" amount="-1" />
    <kerning first="75" second="101" amount="-1" />
    <kerning first="75" second="111" amount="-1" />
    <kerning first="75" second="117" amount="-1" />
    <kerning first="75" second="118" amount="-1" />
    <kerning first="75" second="119" amount="-1" />
    <kerning first="75" second="121" amount="-1" />
    <kerning first="87" second="45" amount="-1" />
    <kerning first="75" second="230" amount="-1" />
    <kerning first="75" second="248" amount="-1" />
    <kerning first="87" second="44" amount="-4" />
    <kerning first="75" second="339" amount="-1" />
    <kerning first="86" second="339" amount="-1" />
    <kerning first="86" second="248" amount="-1" />
    <kerning first="76" second="39" amount="-1" />
    <kerning first="76" second="45" amount="-2" />
    <kerning first="76" second="65" amount="-1" />
    <kerning first="86" second="230" amount="-1" />
    <kerning first="86" second="198" amount="-1" />
    <kerning first="76" second="74" amount="1" />
    <kerning first="86" second="121" amount="-1" />
    <kerning first="86" second="117" amount="-1" />
    <kerning first="76" second="84" amount="-2" />
    <kerning first="76" second="86" amount="-1" />
    <kerning first="76" second="87" amount="-1" />
    <kerning first="76" second="89" amount="-2" />
    <kerning first="76" second="118" amount="-1" />
    <kerning first="76" second="121" amount="-1" />
    <kerning first="86" second="111" amount="-1" />
    <kerning first="76" second="198" amount="-1" />
    <kerning first="86" second="101" amount="-1" />
    <kerning first="86" second="97" amount="-1" />
    <kerning first="86" second="65" amount="-1" />
    <kerning first="86" second="58" amount="-1" />
    <kerning first="86" second="46" amount="-4" />
    <kerning first="86" second="45" amount="-1" />
    <kerning first="86" second="44" amount="-4" />
    <kerning first="84" second="339" amount="-3" />
    <kerning first="84" second="338" amount="-1" />
    <kerning first="79" second="84" amount="-1" />
    <kerning first="84" second="248" amount="-3" />
    <kerning first="84" second="230" amount="-3" />
    <kerning first="84" second="216" amount="-1" />
    <kerning first="84" second="198" amount="-2" />
    <kerning first="80" second="44" amount="-4" />
    <kerning first="80" second="46" amount="-4" />
    <kerning first="80" second="65" amount="-1" />
    <kerning first="80" second="74" amount="-1" />
    <kerning first="84" second="199" amount="-1" />
    <kerning first="80" second="97" amount="-1" />
    <kerning first="80" second="101" amount="-1" />
    <kerning first="80" second="111" amount="-1" />
    <kerning first="80" second="198" amount="-1" />
    <kerning first="80" second="230" amount="-1" />
    <kerning first="80" second="248" amount="-1" />
    <kerning first="84" second="122" amount="-2" />
    <kerning first="80" second="339" amount="-1" />
    <kerning first="84" second="121" amount="-2" />
    <kerning first="84" second="119" amount="-2" />
    <kerning first="84" second="118" amount="-2" />
    <kerning first="82" second="45" amount="-1" />
    <kerning first="82" second="84" amount="-1" />
    <kerning first="84" second="117" amount="-2" />
    <kerning first="84" second="115" amount="-2" />
    <kerning first="84" second="114" amount="-2" />
    <kerning first="84" second="111" amount="-3" />
    <kerning first="84" second="103" amount="-3" />
    <kerning first="82" second="121" amount="-1" />
    <kerning first="82" second="230" amount="-1" />
    <kerning first="82" second="248" amount="-1" />
    <kerning first="82" second="339" amount="-1" />
    <kerning first="84" second="101" amount="-3" />
    <kerning first="84" second="99" amount="-3" />
    <kerning first="84" second="97" amount="-3" />
    <kerning first="84" second="89" amount="-1" />
    <kerning first="84" second="84" amount="-1" />
    <kerning first="84" second="79" amount="-1" />
    <kerning first="84" second="74" amount="-1" />
    <kerning first="84" second="71" amount="-1" />
    <kerning first="84" second="67" amount="-1" />
    <kerning first="84" second="65" amount="-1" />
    <kerning first="84" second="63" amount="1" />
    <kerning first="84" second="58" amount="-2" />
    <kerning first="84" second="46" amount="-4" />
    <kerning first="84" second="45" amount="-2" />
    <kerning first="84" second="44" amount="-4" />
  </kernings>
</font>
