[
	{
		"ClassName":"MonoPanda.Systems.DrawSystem",
		"Parameters": {
			"BlendState":"NonPremultiplied",
			"SortMode":"BackToFront"
		}
	},
	{
		"ClassName":"Example.ECS.ControlSystem",
		"Parameters": {
			"AccelerationMultiplier": 1.0
		}
	},
	{
		"ClassName":"MonoPanda.Systems.SpriteAnimationSystem"
	},
	{
		"ClassName":"MonoPanda.Systems.BehaviourSystem",
		"UpdateInterval": 0
	},
	{
		"ClassName":"MonoPanda.Systems.GravitySystem",
		"UpdateInterval": 0,
		"Parameters": {
			"GlobalGravityActive": false,
			"GlobalGravityPower": 900,
			"GlobalGravityDirection": "Down",
			"AffectSourcePowerByDistance": true,
			"MaxPowerDistanceMultiplier": 0.2
		}
	},
	{
		"ClassName":"MonoPanda.Systems.MoveSystem",
		"Parameters": {
			"MaxAccelerationToVelocity": 500,
			"VelocityLoss": 300
		}
	},
	{
		"ClassName":"MonoPanda.Systems.LightSystem",
		"Parameters": {
			"Active": false,
			"DefaultShadowType": "Illuminated",
			"AmbientColor": "100,100,100"
		}
	},
	{
		"ClassName":"MonoPanda.Systems.CameraMovementSystem",
		"Parameters": {
		}
	},
	{
		"ClassName": "MonoPanda.Systems.CameraZoomSystem",
		"Parameters": {
			"ZoomSteps": [
				0.75, 1, 1.5, 2, 2.5, 3, 4, 5
			],
			"Step": 1
		}
	},
	{
		"ClassName":"MonoPanda.Systems.SoundSystem",
		"Parameters": {
			"MaxVolumeDistance": 250,
			"MinVolumeDistance": 1500
		}
	},
	{
		"ClassName": "MonoPanda.Systems.CollisionSystem",
		"Parameters": {
			"WorldBounds": "-2500, -2500, 5000, 5000"
		}
	}
]