{
	"Models": [
		{
			"Id": "controlled-entity",
			"Components": {
				"MonoPanda.Components.DrawComponent": {
					"ContentId": "example-square",
					"Size": 50,
					"Color": "Cyan",
					"Depth": 0.5,
					"Scale": 0.5
				},
				"MonoPanda.Components.MoveComponent": {
				},
				"Example.ECS.ControlComponent": {
					"Acceleration": 300,
					"RotateLightToCursor": true
				},
				"MonoPanda.Components.CollisionComponent": {
					"BoundingRectangle": "-12, -12, 25, 25"
				}
			}
		},
		{
			"Id": "tile",
			"Components": {
				"MonoPanda.Components.DrawComponent": {
					"ContentId": "tiled-tileset",
					"Size": 16,
					"Depth": 0.6
				}
			}
		},
		{
			"Id": "house",
			"Components": {
				"MonoPanda.Components.DrawComponent": {
					"ContentId": "tiled-house",
					"Size": "90,94",
					"Depth": 0.6
				}
			}
		},
		{
			"Id": "text-object",
			"Components": {
				"MonoPanda.Components.TextComponent" : {
					"PositionOffset": "0, 0",
					"Font": "example-font",
					"FontSize": 5,
					"FontColor": "Black",
					"Text": "0",
					"Depth": 0.6
				}
			}
		},
		{
			"Id": "trigger",
			"Components": {
				"MonoPanda.Components.CollisionComponent": {
					
				},
				"Example.TiledExample.TriggerComponent": {
					
				}
			}
		}
	]
}
