{
"skeleton": {
	"hash": "4e6SPYkOq9LWbMw3Ah5PZYc3D7w",
	"spine": "3.8.84",
	"x": -120.27,
	"y": -173.03,
	"width": 237,
	"height": 308.11,
	"images": "",
	"audio": ""
},
"bones": [
	{ "name": "root" },
	{ "name": "leg1_bone", "parent": "root", "length": 64.9, "rotation": -89.55, "x": -35.81, "y": -71.46 },
	{ "name": "leg2_bone", "parent": "root", "length": 62.35, "rotation": -89.06, "x": 40.84, "y": -66.86 },
	{ "name": "bone_hat", "parent": "root", "length": 52.31, "rotation": 98.26, "x": -10.58, "y": 70.92 },
	{ "name": "bone_hat_2", "parent": "bone_hat", "length": 121.35, "rotation": -7.91, "x": 32.1, "y": -15.03, "skin": true },
	{ "name": "bone_hat_2_2_left", "parent": "bone_hat_2", "length": 40.96, "rotation": 1.7, "x": 75.33, "y": 6.13, "skin": true },
	{ "name": "bone_hat_2_2_right", "parent": "bone_hat_2", "length": 36.58, "rotation": 1.95, "x": 76.71, "y": -7.04, "skin": true },
	{ "name": "body", "parent": "root", "length": 100.21, "rotation": 0.95, "x": -8.07, "y": 7.46 }
],
"slots": [
	{ "name": "leg1", "bone": "leg1_bone", "attachment": "leg" },
	{ "name": "leg2", "bone": "leg2_bone", "attachment": "leg" },
	{ "name": "body_fur", "bone": "body", "attachment": "body_fur" },
	{ "name": "body_outline", "bone": "body", "attachment": "body_outline" },
	{ "name": "eyes", "bone": "body", "attachment": "eyes" },
	{ "name": "mouth", "bone": "body", "attachment": "mouth" },
	{ "name": "hat", "bone": "bone_hat", "attachment": "hat" },
	{ "name": "hat_2_2_1", "bone": "bone_hat_2", "attachment": "hat_2_2_1" },
	{ "name": "hat_2_3_1", "bone": "bone_hat_2_2_left", "attachment": "hat_2_3_1" },
	{ "name": "hat_2_3_2", "bone": "bone_hat_2_2_right", "attachment": "hat_2_3_2" }
],
"skins": [
	{
		"name": "default",
		"attachments": {
			"body_fur": {
				"body_fur": { "x": 10.05, "y": -1.63, "rotation": -0.95, "width": 217, "height": 219 }
			},
			"body_outline": {
				"body_outline": { "x": 6.26, "y": -2.49, "rotation": -0.95, "width": 237, "height": 260 }
			},
			"leg1": {
				"leg": { "x": 47.51, "y": -2.13, "rotation": 89.55, "width": 104, "height": 104 }
			},
			"leg2": {
				"leg": { "x": 54.18, "y": 0.64, "rotation": 89.06, "width": 104, "height": 104 }
			}
		}
	},
	{
		"name": "skin_eyes_1",
		"attachments": {
			"eyes": {
				"eyes": { "name": "eyes_1", "x": 5.26, "y": 18.08, "rotation": -0.95, "width": 128, "height": 88 }
			}
		}
	},
	{
		"name": "skin_eyes_2",
		"attachments": {
			"eyes": {
				"eyes": { "name": "eyes_2", "x": 5.31, "y": 9.76, "rotation": -0.95, "width": 140, "height": 57 }
			}
		}
	},
	{
		"name": "skin_eyes_3",
		"attachments": {
			"eyes": {
				"eyes": { "name": "eyes_3", "x": 6.06, "y": 10.71, "rotation": -0.95, "width": 150, "height": 70 }
			}
		}
	},
	{
		"name": "skin_hat_1",
		"attachments": {
			"hat": {
				"hat": { "name": "hat_1", "x": 23.39, "y": -6.02, "rotation": -98.26, "width": 212, "height": 118 }
			}
		}
	},
	{
		"name": "skin_hat_2",
		"attachments": {
			"hat": {
				"hat": { "name": "hat_2_1", "x": 25.6, "y": -8.92, "rotation": -98.26, "width": 145, "height": 123 }
			},
			"hat_2_2_1": {
				"hat_2_2_1": { "name": "hat_2_2", "x": 65.07, "y": 0.94, "rotation": -90.35, "width": 38, "height": 95 }
			},
			"hat_2_3_1": {
				"hat_2_3_1": { "name": "hat_2_3", "x": 12.84, "y": 0.94, "rotation": -92.05, "width": 31, "height": 54 }
			},
			"hat_2_3_2": {
				"hat_2_3_2": { "name": "hat_2_3", "x": 13.48, "y": -1.36, "rotation": 87.71, "width": 31, "height": 54 }
			}
		},
		"bones": [ "bone_hat_2", "bone_hat_2_2_left", "bone_hat_2_2_right" ]
	},
	{
		"name": "skin_mouth_1",
		"attachments": {
			"mouth": {
				"mouth": { "name": "mouth_1", "x": 7.36, "y": -42.68, "rotation": -0.95, "width": 106, "height": 54 }
			}
		}
	},
	{
		"name": "skin_mouth_2",
		"attachments": {
			"mouth": {
				"mouth": { "name": "mouth_2", "x": 7.34, "y": -44.14, "rotation": -0.95, "width": 34, "height": 34 }
			}
		}
	},
	{
		"name": "skin_mouth_3",
		"attachments": {
			"mouth": {
				"mouth": { "name": "mouth_3", "x": 13.15, "y": -46.43, "rotation": -0.95, "width": 94, "height": 64 }
			}
		}
	}
],
"animations": {
	"breath": {
		"bones": {
			"body": {
				"scale": [
					{},
					{ "time": 1, "x": 1.1, "y": 1.1 },
					{ "time": 2 }
				]
			},
			"bone_hat": {
				"translate": [
					{},
					{ "time": 1, "y": 10 },
					{ "time": 2 }
				]
			},
			"bone_hat_2_2_right": {
				"rotate": [
					{},
					{ "time": 0.1667, "angle": -124.43, "curve": "stepped" },
					{ "time": 0.8333, "angle": -124.43 },
					{ "time": 1 }
				]
			},
			"bone_hat_2_2_left": {
				"rotate": [
					{},
					{ "time": 0.1667, "angle": 138.37, "curve": "stepped" },
					{ "time": 0.8333, "angle": 138.37 },
					{ "time": 1 }
				]
			}
		}
	},
	"dance": {
		"bones": {
			"leg1_bone": {
				"rotate": [
					{},
					{ "time": 0.3333, "angle": -47.5 },
					{ "time": 0.6667 }
				]
			},
			"leg2_bone": {
				"rotate": [
					{ "time": 0.6667 },
					{ "time": 1, "angle": 50.37 },
					{ "time": 1.3333 }
				]
			}
		}
	},
	"stand": {
		"bones": {
			"leg2_bone": {
				"rotate": [
					{ "time": 3 },
					{ "time": 3.3333, "angle": 51.87 },
					{ "time": 3.6667 }
				]
			}
		}
	},
	"walk": {
		"bones": {
			"leg1_bone": {
				"translate": [
					{},
					{ "time": 0.3333, "y": 32.44 },
					{ "time": 0.6667 }
				]
			},
			"leg2_bone": {
				"translate": [
					{ "time": 0.6667 },
					{ "time": 1, "y": 38.12 },
					{ "time": 1.3333 }
				]
			}
		}
	}
}
}