﻿[
	{
		"ClassName":"MonoPanda.Systems.DrawSystem",
		"Parameters": {
			"BlendState":"NonPremultiplied",
			"SortMode":"BackToFront"
		}
	},
	{
		"ClassName":"Example.ECS.ControlSystem",
		"Parameters": {
			"AccelerationMultiplier": 1.0
		}
	},
	{
		"ClassName":"MonoPanda.Systems.MoveSystem",
		"Parameters": {
			"MaxAccelerationToVelocity": 200,
			"VelocityLoss": 300
		}
	},
	{
		"ClassName":"MonoPanda.Systems.CollisionSystem",
		"Parameters": {
			"WorldBounds": "-1000,-1000,2000,2000"
		}
	}
]