﻿{
    "Models": [
        {
            "Id": "controlled-entity",
            "Components": {
                "MonoPanda.Components.DrawComponent": {
                    "ContentId": "example-square",
                    "Size": 50,
                    "Color": "LimeGreen",
                    "Depth": 0.5
                },
                "MonoPanda.Components.MoveComponent": {
                    "MaxAccelerationToVelocityMultiplier": 3
                },
                "Example.ECS.ControlComponent": {
                    "Acceleration": 1200,
                    "RotateLightToCursor": true
                },
                "MonoPanda.Components.CollisionComponent": {
                    "BoundingRectangle": "-25, -25, 50, 50"
                }
            }
        },
        {
            "Id": "tree",
            "Components": {
                "draw_tree-bottom": {
                    "ClassName": "MonoPanda.Components.DrawComponent",
                    "ContentId": "tree-bottom",
                    "Scale": 0.25,
                    "Depth": 0.51
                },
                "draw_tree-top": {
                    "ClassName": "MonoPanda.Components.DrawComponent",
                    "ContentId": "tree-top",
                    "Scale": 0.25,
                    "Depth": 0.49
                },
                "MonoPanda.Components.CollisionComponent": {
                    "BoundingRectangle": "-75, 15, 150, 58"
                },
                "MonoPanda.Components.SolidComponent": {
                }
            }
        }
    ]
}
