[
	{
		"Id":"test-package",
		"LoadOnStart":false,
		"Items":[
			"monopanda-logo",
		]
	},
	{
		"Id":"example-package",
		"LoadOnStart":false,
		"Items":[
			"monopanda-logo",
			"example-sfx",
			"example-song",
			"example-font",
			"example-square",
			"example-big-file"
		]
	},
	{
		"Id":"example-loading",
		"LoadOnStart":false,
		"Items": [
			"monopanda-logo",
			"example-sfx",
			"example-song",
			"example-font",
			"example-square",
			"example-big-file",
			"example-cursor",
			"example-spine-creature",
			"spritesheet-test",
			"spine-test"
		]
	}
]