chips,class
R0C0,grain
R0C1,grain
R0C10,grain
R0C11,grain
R0C12,grain
R0C13,grain
R0C14,grain
R0C15,grain
R0C16,grain
R0C17,grain
R0C18,grain
R0C19,grain
R0C2,grain
R0C20,grain
R0C21,grain
R0C22,grain
R0C23,grain
R0C24,grain
R0C25,grain
R0C26,grain
R0C27,grain
R0C28,grain
R0C29,grain
R0C3,grain
R0C30,grain
R0C31,grain
R0C32,grain
R0C33,grain
R0C34,grain
R0C35,grain
R0C36,grain
R0C37,void
R0C38,grain
R0C39,grain
R0C4,grain
R0C40,grain
R0C41,grain
R0C42,grain
R0C43,grain
R0C44,grain
R0C45,grain
R0C46,grain
R0C47,grain
R0C48,grain
R0C49,grain
R0C5,grain
R0C50,grain
R0C51,grain
R0C52,grain
R0C53,grain
R0C54,grain
R0C55,grain
R0C56,grain
R0C57,grain
R0C58,grain
R0C59,grain
R0C6,grain
R0C60,grain
R0C61,grain
R0C62,grain
R0C63,grain
R0C7,grain
R0C8,grain
R0C9,grain
R10C0,void
R10C1,void
R10C10,grain
R10C11,grain
R10C12,grain
R10C13,grain
R10C14,grain
R10C15,grain
R10C16,grain
R10C17,grain
R10C18,grain
R10C19,grain
R10C2,void
R10C20,grain
R10C21,grain
R10C22,grain
R10C23,grain
R10C24,grain
R10C25,grain
R10C26,grain
R10C27,grain
R10C28,grain
R10C29,grain
R10C3,grain
R10C30,grain
R10C31,grain
R10C32,grain
R10C33,grain
R10C34,grain
R10C35,grain
R10C36,grain
R10C37,grain
R10C38,grain
R10C39,grain
R10C4,grain
R10C40,grain
R10C41,grain
R10C42,grain
R10C43,grain
R10C44,grain
R10C45,grain
R10C46,grain
R10C47,grain
R10C48,grain
R10C49,grain
R10C5,grain
R10C50,grain
R10C51,grain
R10C52,grain
R10C53,grain
R10C54,grain
R10C55,grain
R10C56,grain
R10C57,grain
R10C58,grain
R10C59,grain
R10C6,grain
R10C60,grain
R10C61,grain
R10C62,grain
R10C63,grain
R10C7,grain
R10C8,grain
R10C9,grain
R11C0,void
R11C1,void
R11C10,grain
R11C11,grain
R11C12,grain
R11C13,grain
R11C14,grain
R11C15,grain
R11C16,grain
R11C17,grain
R11C18,grain
R11C19,grain
R11C2,void
R11C20,grain
R11C21,grain
R11C22,grain
R11C23,grain
R11C24,grain
R11C25,grain
R11C26,grain
R11C27,grain
R11C28,grain
R11C29,grain
R11C3,grain
R11C30,grain
R11C31,grain
R11C32,grain
R11C33,grain
R11C34,grain
R11C35,grain
R11C36,grain
R11C37,grain
R11C38,grain
R11C39,grain
R11C4,grain
R11C40,void
R11C41,grain
R11C42,void
R11C43,grain
R11C44,grain
R11C45,grain
R11C46,grain
R11C47,grain
R11C48,grain
R11C49,grain
R11C5,grain
R11C50,grain
R11C51,grain
R11C52,grain
R11C53,grain
R11C54,grain
R11C55,grain
R11C56,grain
R11C57,grain
R11C58,grain
R11C59,grain
R11C6,grain
R11C60,grain
R11C61,grain
R11C62,grain
R11C63,grain
R11C7,grain
R11C8,grain
R11C9,grain
R12C0,grain
R12C1,grain
R12C10,grain
R12C11,grain
R12C12,grain
R12C13,grain
R12C14,grain
R12C15,grain
R12C16,grain
R12C17,grain
R12C18,grain
R12C19,grain
R12C2,grain
R12C20,grain
R12C21,grain
R12C22,grain
R12C23,grain
R12C24,grain
R12C25,grain
R12C26,grain
R12C27,grain
R12C28,grain
R12C29,grain
R12C3,grain
R12C30,grain
R12C31,grain
R12C32,grain
R12C33,grain
R12C34,grain
R12C35,grain
R12C36,grain
R12C37,grain
R12C38,grain
R12C39,void
R12C4,grain
R12C40,grain
R12C41,grain
R12C42,grain
R12C43,grain
R12C44,grain
R12C45,grain
R12C46,grain
R12C47,grain
R12C48,grain
R12C49,grain
R12C5,grain
R12C50,grain
R12C51,grain
R12C52,grain
R12C53,grain
R12C54,grain
R12C55,grain
R12C56,grain
R12C57,grain
R12C58,grain
R12C59,grain
R12C6,grain
R12C60,grain
R12C61,grain
R12C62,grain
R12C63,grain
R12C7,grain
R12C8,grain
R12C9,grain
R13C0,grain
R13C1,grain
R13C10,grain
R13C11,grain
R13C12,grain
R13C13,grain
R13C14,grain
R13C15,grain
R13C16,grain
R13C17,grain
R13C18,grain
R13C19,grain
R13C2,grain
R13C20,grain
R13C21,grain
R13C22,grain
R13C23,grain
R13C24,grain
R13C25,void
R13C26,grain
R13C27,grain
R13C28,grain
R13C29,grain
R13C3,grain
R13C30,grain
R13C31,grain
R13C32,grain
R13C33,grain
R13C34,grain
R13C35,grain
R13C36,grain
R13C37,grain
R13C38,grain
R13C39,grain
R13C4,grain
R13C40,grain
R13C41,grain
R13C42,grain
R13C43,grain
R13C44,grain
R13C45,grain
R13C46,grain
R13C47,grain
R13C48,grain
R13C49,grain
R13C5,grain
R13C50,grain
R13C51,grain
R13C52,grain
R13C53,grain
R13C54,grain
R13C55,grain
R13C56,grain
R13C57,grain
R13C58,grain
R13C59,grain
R13C6,grain
R13C60,grain
R13C61,grain
R13C62,grain
R13C63,grain
R13C7,grain
R13C8,grain
R13C9,grain
R14C0,grain
R14C1,grain
R14C10,grain
R14C11,grain
R14C12,grain
R14C13,grain
R14C14,grain
R14C15,grain
R14C16,grain
R14C17,grain
R14C18,grain
R14C19,grain
R14C2,grain
R14C20,grain
R14C21,grain
R14C22,grain
R14C23,grain
R14C24,grain
R14C25,void
R14C26,grain
R14C27,grain
R14C28,grain
R14C29,grain
R14C3,grain
R14C30,grain
R14C31,grain
R14C32,grain
R14C33,grain
R14C34,grain
R14C35,grain
R14C36,grain
R14C37,grain
R14C38,grain
R14C39,grain
R14C4,grain
R14C40,grain
R14C41,grain
R14C42,grain
R14C43,grain
R14C44,grain
R14C45,grain
R14C46,grain
R14C47,grain
R14C48,grain
R14C49,grain
R14C5,grain
R14C50,grain
R14C51,grain
R14C52,grain
R14C53,grain
R14C54,grain
R14C55,grain
R14C56,grain
R14C57,grain
R14C58,grain
R14C59,grain
R14C6,grain
R14C60,grain
R14C61,grain
R14C62,grain
R14C63,grain
R14C7,grain
R14C8,grain
R14C9,grain
R15C0,grain
R15C1,grain
R15C10,grain
R15C11,grain
R15C12,grain
R15C13,grain
R15C14,grain
R15C15,grain
R15C16,grain
R15C17,grain
R15C18,grain
R15C19,grain
R15C2,grain
R15C20,grain
R15C21,grain
R15C22,grain
R15C23,grain
R15C24,grain
R15C25,void
R15C26,grain
R15C27,grain
R15C28,grain
R15C29,grain
R15C3,grain
R15C30,grain
R15C31,grain
R15C32,grain
R15C33,grain
R15C34,grain
R15C35,grain
R15C36,grain
R15C37,grain
R15C38,grain
R15C39,grain
R15C4,grain
R15C40,grain
R15C41,grain
R15C42,grain
R15C43,grain
R15C44,grain
R15C45,grain
R15C46,grain
R15C47,grain
R15C48,grain
R15C49,grain
R15C5,grain
R15C50,grain
R15C51,grain
R15C52,grain
R15C53,grain
R15C54,grain
R15C55,grain
R15C56,grain
R15C57,grain
R15C58,grain
R15C59,grain
R15C6,grain
R15C60,grain
R15C61,grain
R15C62,grain
R15C63,grain
R15C7,grain
R15C8,grain
R15C9,grain
R16C0,grain
R16C1,grain
R16C10,grain
R16C11,grain
R16C12,grain
R16C13,grain
R16C14,grain
R16C15,grain
R16C16,grain
R16C17,grain
R16C18,grain
R16C19,grain
R16C2,grain
R16C20,grain
R16C21,grain
R16C22,grain
R16C23,grain
R16C24,void
R16C25,void
R16C26,grain
R16C27,grain
R16C28,grain
R16C29,grain
R16C3,grain
R16C30,void
R16C31,grain
R16C32,grain
R16C33,grain
R16C34,grain
R16C35,grain
R16C36,grain
R16C37,grain
R16C38,grain
R16C39,grain
R16C4,grain
R16C40,grain
R16C41,grain
R16C42,grain
R16C43,grain
R16C44,grain
R16C45,grain
R16C46,grain
R16C47,grain
R16C48,grain
R16C49,grain
R16C5,grain
R16C50,grain
R16C51,grain
R16C52,grain
R16C53,grain
R16C54,grain
R16C55,grain
R16C56,grain
R16C57,grain
R16C58,grain
R16C59,grain
R16C6,grain
R16C60,grain
R16C61,grain
R16C62,grain
R16C63,grain
R16C7,grain
R16C8,grain
R16C9,grain
R17C0,grain
R17C1,grain
R17C10,grain
R17C11,grain
R17C12,grain
R17C13,grain
R17C14,grain
R17C15,grain
R17C16,grain
R17C17,grain
R17C18,grain
R17C19,grain
R17C2,grain
R17C20,grain
R17C21,grain
R17C22,grain
R17C23,grain
R17C24,void
R17C25,void
R17C26,void
R17C27,grain
R17C28,grain
R17C29,grain
R17C3,grain
R17C30,grain
R17C31,grain
R17C32,grain
R17C33,grain
R17C34,grain
R17C35,grain
R17C36,grain
R17C37,grain
R17C38,grain
R17C39,grain
R17C4,grain
R17C40,grain
R17C41,grain
R17C42,grain
R17C43,grain
R17C44,grain
R17C45,grain
R17C46,grain
R17C47,grain
R17C48,grain
R17C49,grain
R17C5,grain
R17C50,grain
R17C51,grain
R17C52,grain
R17C53,grain
R17C54,grain
R17C55,grain
R17C56,grain
R17C57,grain
R17C58,grain
R17C59,grain
R17C6,grain
R17C60,grain
R17C61,grain
R17C62,grain
R17C63,grain
R17C7,grain
R17C8,grain
R17C9,grain
R18C0,grain
R18C1,grain
R18C10,grain
R18C11,grain
R18C12,grain
R18C13,grain
R18C14,grain
R18C15,grain
R18C16,grain
R18C17,grain
R18C18,grain
R18C19,grain
R18C2,grain
R18C20,grain
R18C21,grain
R18C22,grain
R18C23,grain
R18C24,void
R18C25,void
R18C26,grain
R18C27,grain
R18C28,grain
R18C29,grain
R18C3,grain
R18C30,grain
R18C31,grain
R18C32,grain
R18C33,grain
R18C34,grain
R18C35,grain
R18C36,grain
R18C37,grain
R18C38,grain
R18C39,grain
R18C4,grain
R18C40,grain
R18C41,grain
R18C42,grain
R18C43,grain
R18C44,grain
R18C45,grain
R18C46,grain
R18C47,grain
R18C48,grain
R18C49,grain
R18C5,grain
R18C50,grain
R18C51,grain
R18C52,grain
R18C53,grain
R18C54,grain
R18C55,grain
R18C56,grain
R18C57,grain
R18C58,grain
R18C59,grain
R18C6,grain
R18C60,grain
R18C61,grain
R18C62,grain
R18C63,grain
R18C7,grain
R18C8,grain
R18C9,grain
R19C0,grain
R19C1,grain
R19C10,grain
R19C11,grain
R19C12,grain
R19C13,grain
R19C14,grain
R19C15,grain
R19C16,grain
R19C17,grain
R19C18,grain
R19C19,grain
R19C2,grain
R19C20,grain
R19C21,grain
R19C22,grain
R19C23,grain
R19C24,grain
R19C25,grain
R19C26,grain
R19C27,grain
R19C28,grain
R19C29,grain
R19C3,grain
R19C30,grain
R19C31,grain
R19C32,grain
R19C33,grain
R19C34,grain
R19C35,grain
R19C36,grain
R19C37,grain
R19C38,grain
R19C39,grain
R19C4,grain
R19C40,grain
R19C41,grain
R19C42,grain
R19C43,grain
R19C44,grain
R19C45,grain
R19C46,grain
R19C47,grain
R19C48,grain
R19C49,grain
R19C5,grain
R19C50,grain
R19C51,grain
R19C52,grain
R19C53,grain
R19C54,grain
R19C55,grain
R19C56,grain
R19C57,grain
R19C58,grain
R19C59,grain
R19C6,grain
R19C60,grain
R19C61,grain
R19C62,grain
R19C63,grain
R19C7,grain
R19C8,grain
R19C9,grain
R1C0,grain
R1C1,grain
R1C10,grain
R1C11,grain
R1C12,grain
R1C13,grain
R1C14,grain
R1C15,grain
R1C16,grain
R1C17,grain
R1C18,grain
R1C19,grain
R1C2,grain
R1C20,grain
R1C21,grain
R1C22,grain
R1C23,void
R1C24,grain
R1C25,grain
R1C26,grain
R1C27,grain
R1C28,grain
R1C29,grain
R1C3,grain
R1C30,grain
R1C31,grain
R1C32,grain
R1C33,grain
R1C34,grain
R1C35,grain
R1C36,grain
R1C37,void
R1C38,grain
R1C39,grain
R1C4,grain
R1C40,grain
R1C41,grain
R1C42,grain
R1C43,grain
R1C44,grain
R1C45,grain
R1C46,grain
R1C47,grain
R1C48,grain
R1C49,grain
R1C5,grain
R1C50,grain
R1C51,grain
R1C52,grain
R1C53,grain
R1C54,grain
R1C55,grain
R1C56,grain
R1C57,grain
R1C58,grain
R1C59,grain
R1C6,grain
R1C60,grain
R1C61,grain
R1C62,grain
R1C63,grain
R1C7,grain
R1C8,grain
R1C9,grain
R20C0,grain
R20C1,grain
R20C10,grain
R20C11,grain
R20C12,grain
R20C13,grain
R20C14,grain
R20C15,grain
R20C16,grain
R20C17,grain
R20C18,grain
R20C19,grain
R20C2,grain
R20C20,grain
R20C21,grain
R20C22,grain
R20C23,grain
R20C24,grain
R20C25,grain
R20C26,grain
R20C27,grain
R20C28,grain
R20C29,grain
R20C3,grain
R20C30,grain
R20C31,grain
R20C32,grain
R20C33,grain
R20C34,grain
R20C35,grain
R20C36,grain
R20C37,grain
R20C38,grain
R20C39,grain
R20C4,grain
R20C40,grain
R20C41,grain
R20C42,grain
R20C43,grain
R20C44,grain
R20C45,grain
R20C46,grain
R20C47,grain
R20C48,grain
R20C49,grain
R20C5,grain
R20C50,grain
R20C51,grain
R20C52,grain
R20C53,grain
R20C54,grain
R20C55,grain
R20C56,grain
R20C57,grain
R20C58,grain
R20C59,grain
R20C6,grain
R20C60,grain
R20C61,grain
R20C62,grain
R20C63,grain
R20C7,grain
R20C8,grain
R20C9,grain
R21C0,grain
R21C1,grain
R21C10,grain
R21C11,grain
R21C12,grain
R21C13,grain
R21C14,grain
R21C15,grain
R21C16,grain
R21C17,grain
R21C18,void
R21C19,grain
R21C2,grain
R21C20,grain
R21C21,void
R21C22,void
R21C23,grain
R21C24,grain
R21C25,grain
R21C26,grain
R21C27,grain
R21C28,grain
R21C29,grain
R21C3,grain
R21C30,grain
R21C31,grain
R21C32,grain
R21C33,grain
R21C34,grain
R21C35,grain
R21C36,grain
R21C37,grain
R21C38,grain
R21C39,grain
R21C4,grain
R21C40,grain
R21C41,grain
R21C42,grain
R21C43,grain
R21C44,grain
R21C45,grain
R21C46,grain
R21C47,grain
R21C48,grain
R21C49,grain
R21C5,grain
R21C50,grain
R21C51,grain
R21C52,grain
R21C53,grain
R21C54,grain
R21C55,grain
R21C56,grain
R21C57,grain
R21C58,grain
R21C59,grain
R21C6,grain
R21C60,grain
R21C61,grain
R21C62,grain
R21C63,grain
R21C7,grain
R21C8,grain
R21C9,grain
R22C0,grain
R22C1,grain
R22C10,grain
R22C11,grain
R22C12,grain
R22C13,grain
R22C14,grain
R22C15,grain
R22C16,grain
R22C17,grain
R22C18,grain
R22C19,grain
R22C2,grain
R22C20,void
R22C21,void
R22C22,void
R22C23,void
R22C24,grain
R22C25,grain
R22C26,grain
R22C27,grain
R22C28,grain
R22C29,grain
R22C3,grain
R22C30,grain
R22C31,grain
R22C32,grain
R22C33,grain
R22C34,grain
R22C35,grain
R22C36,grain
R22C37,grain
R22C38,grain
R22C39,grain
R22C4,grain
R22C40,grain
R22C41,grain
R22C42,grain
R22C43,grain
R22C44,grain
R22C45,grain
R22C46,grain
R22C47,grain
R22C48,grain
R22C49,grain
R22C5,grain
R22C50,grain
R22C51,grain
R22C52,void
R22C53,void
R22C54,grain
R22C55,grain
R22C56,grain
R22C57,grain
R22C58,grain
R22C59,grain
R22C6,grain
R22C60,grain
R22C61,void
R22C62,grain
R22C63,grain
R22C7,grain
R22C8,grain
R22C9,grain
R23C0,grain
R23C1,grain
R23C10,grain
R23C11,grain
R23C12,grain
R23C13,grain
R23C14,grain
R23C15,grain
R23C16,grain
R23C17,grain
R23C18,grain
R23C19,grain
R23C2,grain
R23C20,void
R23C21,void
R23C22,void
R23C23,void
R23C24,grain
R23C25,grain
R23C26,grain
R23C27,grain
R23C28,grain
R23C29,grain
R23C3,grain
R23C30,grain
R23C31,grain
R23C32,grain
R23C33,grain
R23C34,grain
R23C35,grain
R23C36,grain
R23C37,grain
R23C38,grain
R23C39,grain
R23C4,grain
R23C40,grain
R23C41,grain
R23C42,grain
R23C43,grain
R23C44,grain
R23C45,grain
R23C46,grain
R23C47,grain
R23C48,grain
R23C49,grain
R23C5,grain
R23C50,grain
R23C51,grain
R23C52,void
R23C53,void
R23C54,grain
R23C55,grain
R23C56,grain
R23C57,grain
R23C58,grain
R23C59,grain
R23C6,grain
R23C60,grain
R23C61,grain
R23C62,grain
R23C63,grain
R23C7,grain
R23C8,grain
R23C9,grain
R24C0,grain
R24C1,grain
R24C10,grain
R24C11,grain
R24C12,grain
R24C13,grain
R24C14,grain
R24C15,grain
R24C16,grain
R24C17,grain
R24C18,grain
R24C19,grain
R24C2,grain
R24C20,grain
R24C21,void
R24C22,void
R24C23,grain
R24C24,grain
R24C25,grain
R24C26,grain
R24C27,grain
R24C28,grain
R24C29,grain
R24C3,grain
R24C30,grain
R24C31,grain
R24C32,grain
R24C33,grain
R24C34,grain
R24C35,grain
R24C36,grain
R24C37,grain
R24C38,grain
R24C39,grain
R24C4,grain
R24C40,grain
R24C41,grain
R24C42,grain
R24C43,grain
R24C44,grain
R24C45,grain
R24C46,grain
R24C47,grain
R24C48,grain
R24C49,grain
R24C5,grain
R24C50,grain
R24C51,grain
R24C52,void
R24C53,void
R24C54,grain
R24C55,grain
R24C56,grain
R24C57,grain
R24C58,grain
R24C59,grain
R24C6,grain
R24C60,void
R24C61,grain
R24C62,grain
R24C63,grain
R24C7,grain
R24C8,void
R24C9,grain
R25C0,grain
R25C1,grain
R25C10,grain
R25C11,grain
R25C12,grain
R25C13,grain
R25C14,grain
R25C15,grain
R25C16,grain
R25C17,grain
R25C18,grain
R25C19,grain
R25C2,grain
R25C20,grain
R25C21,grain
R25C22,grain
R25C23,grain
R25C24,grain
R25C25,grain
R25C26,grain
R25C27,grain
R25C28,grain
R25C29,grain
R25C3,grain
R25C30,grain
R25C31,grain
R25C32,grain
R25C33,grain
R25C34,grain
R25C35,grain
R25C36,grain
R25C37,grain
R25C38,grain
R25C39,grain
R25C4,grain
R25C40,grain
R25C41,grain
R25C42,grain
R25C43,grain
R25C44,grain
R25C45,grain
R25C46,grain
R25C47,grain
R25C48,void
R25C49,void
R25C5,grain
R25C50,void
R25C51,grain
R25C52,grain
R25C53,grain
R25C54,grain
R25C55,grain
R25C56,grain
R25C57,grain
R25C58,grain
R25C59,grain
R25C6,grain
R25C60,grain
R25C61,grain
R25C62,grain
R25C63,grain
R25C7,grain
R25C8,grain
R25C9,grain
R26C0,grain
R26C1,grain
R26C10,grain
R26C11,grain
R26C12,grain
R26C13,grain
R26C14,grain
R26C15,grain
R26C16,grain
R26C17,grain
R26C18,grain
R26C19,grain
R26C2,grain
R26C20,grain
R26C21,grain
R26C22,grain
R26C23,grain
R26C24,grain
R26C25,grain
R26C26,grain
R26C27,grain
R26C28,grain
R26C29,grain
R26C3,grain
R26C30,grain
R26C31,grain
R26C32,grain
R26C33,grain
R26C34,grain
R26C35,grain
R26C36,grain
R26C37,grain
R26C38,grain
R26C39,grain
R26C4,grain
R26C40,grain
R26C41,grain
R26C42,grain
R26C43,grain
R26C44,grain
R26C45,grain
R26C46,grain
R26C47,grain
R26C48,void
R26C49,void
R26C5,void
R26C50,void
R26C51,grain
R26C52,grain
R26C53,grain
R26C54,grain
R26C55,grain
R26C56,grain
R26C57,grain
R26C58,grain
R26C59,grain
R26C6,void
R26C60,grain
R26C61,grain
R26C62,grain
R26C63,grain
R26C7,grain
R26C8,grain
R26C9,grain
R27C0,grain
R27C1,grain
R27C10,grain
R27C11,grain
R27C12,grain
R27C13,grain
R27C14,grain
R27C15,grain
R27C16,grain
R27C17,grain
R27C18,void
R27C19,void
R27C2,grain
R27C20,void
R27C21,grain
R27C22,grain
R27C23,grain
R27C24,grain
R27C25,grain
R27C26,grain
R27C27,grain
R27C28,grain
R27C29,grain
R27C3,grain
R27C30,grain
R27C31,grain
R27C32,grain
R27C33,grain
R27C34,grain
R27C35,grain
R27C36,grain
R27C37,grain
R27C38,grain
R27C39,grain
R27C4,grain
R27C40,grain
R27C41,grain
R27C42,grain
R27C43,grain
R27C44,grain
R27C45,grain
R27C46,grain
R27C47,grain
R27C48,void
R27C49,void
R27C5,void
R27C50,void
R27C51,grain
R27C52,grain
R27C53,grain
R27C54,grain
R27C55,grain
R27C56,grain
R27C57,grain
R27C58,grain
R27C59,grain
R27C6,void
R27C60,grain
R27C61,grain
R27C62,grain
R27C63,grain
R27C7,grain
R27C8,grain
R27C9,grain
R28C0,grain
R28C1,grain
R28C10,grain
R28C11,grain
R28C12,grain
R28C13,grain
R28C14,grain
R28C15,grain
R28C16,grain
R28C17,grain
R28C18,void
R28C19,void
R28C2,grain
R28C20,void
R28C21,void
R28C22,grain
R28C23,grain
R28C24,grain
R28C25,grain
R28C26,void
R28C27,grain
R28C28,grain
R28C29,grain
R28C3,grain
R28C30,grain
R28C31,grain
R28C32,grain
R28C33,grain
R28C34,grain
R28C35,grain
R28C36,grain
R28C37,grain
R28C38,grain
R28C39,grain
R28C4,grain
R28C40,grain
R28C41,grain
R28C42,grain
R28C43,grain
R28C44,grain
R28C45,grain
R28C46,grain
R28C47,grain
R28C48,grain
R28C49,grain
R28C5,grain
R28C50,grain
R28C51,grain
R28C52,grain
R28C53,grain
R28C54,grain
R28C55,grain
R28C56,grain
R28C57,grain
R28C58,grain
R28C59,grain
R28C6,grain
R28C60,grain
R28C61,grain
R28C62,grain
R28C63,grain
R28C7,grain
R28C8,grain
R28C9,grain
R29C0,grain
R29C1,grain
R29C10,grain
R29C11,grain
R29C12,grain
R29C13,grain
R29C14,grain
R29C15,grain
R29C16,grain
R29C17,void
R29C18,void
R29C19,void
R29C2,grain
R29C20,void
R29C21,void
R29C22,grain
R29C23,grain
R29C24,grain
R29C25,grain
R29C26,grain
R29C27,grain
R29C28,grain
R29C29,grain
R29C3,grain
R29C30,grain
R29C31,grain
R29C32,grain
R29C33,grain
R29C34,grain
R29C35,grain
R29C36,grain
R29C37,grain
R29C38,grain
R29C39,grain
R29C4,grain
R29C40,grain
R29C41,grain
R29C42,grain
R29C43,grain
R29C44,grain
R29C45,grain
R29C46,grain
R29C47,grain
R29C48,grain
R29C49,grain
R29C5,grain
R29C50,grain
R29C51,grain
R29C52,grain
R29C53,grain
R29C54,grain
R29C55,grain
R29C56,grain
R29C57,grain
R29C58,grain
R29C59,grain
R29C6,grain
R29C60,grain
R29C61,grain
R29C62,grain
R29C63,grain
R29C7,grain
R29C8,grain
R29C9,grain
R2C0,grain
R2C1,grain
R2C10,grain
R2C11,grain
R2C12,grain
R2C13,grain
R2C14,grain
R2C15,grain
R2C16,grain
R2C17,grain
R2C18,grain
R2C19,grain
R2C2,grain
R2C20,grain
R2C21,grain
R2C22,grain
R2C23,grain
R2C24,grain
R2C25,grain
R2C26,grain
R2C27,grain
R2C28,grain
R2C29,grain
R2C3,grain
R2C30,grain
R2C31,grain
R2C32,grain
R2C33,grain
R2C34,grain
R2C35,grain
R2C36,grain
R2C37,grain
R2C38,grain
R2C39,grain
R2C4,grain
R2C40,grain
R2C41,grain
R2C42,grain
R2C43,grain
R2C44,grain
R2C45,grain
R2C46,grain
R2C47,grain
R2C48,grain
R2C49,grain
R2C5,grain
R2C50,grain
R2C51,grain
R2C52,grain
R2C53,grain
R2C54,grain
R2C55,grain
R2C56,grain
R2C57,grain
R2C58,grain
R2C59,grain
R2C6,grain
R2C60,grain
R2C61,grain
R2C62,grain
R2C63,grain
R2C7,grain
R2C8,grain
R2C9,grain
R30C0,grain
R30C1,grain
R30C10,grain
R30C11,grain
R30C12,grain
R30C13,grain
R30C14,grain
R30C15,grain
R30C16,grain
R30C17,void
R30C18,void
R30C19,void
R30C2,grain
R30C20,void
R30C21,void
R30C22,grain
R30C23,grain
R30C24,grain
R30C25,grain
R30C26,grain
R30C27,grain
R30C28,grain
R30C29,grain
R30C3,grain
R30C30,grain
R30C31,grain
R30C32,grain
R30C33,grain
R30C34,grain
R30C35,grain
R30C36,grain
R30C37,grain
R30C38,grain
R30C39,grain
R30C4,grain
R30C40,grain
R30C41,grain
R30C42,grain
R30C43,grain
R30C44,grain
R30C45,grain
R30C46,grain
R30C47,grain
R30C48,grain
R30C49,grain
R30C5,grain
R30C50,grain
R30C51,grain
R30C52,grain
R30C53,grain
R30C54,grain
R30C55,grain
R30C56,grain
R30C57,grain
R30C58,grain
R30C59,grain
R30C6,grain
R30C60,grain
R30C61,grain
R30C62,grain
R30C63,grain
R30C7,grain
R30C8,grain
R30C9,grain
R31C0,grain
R31C1,grain
R31C10,grain
R31C11,grain
R31C12,grain
R31C13,grain
R31C14,grain
R31C15,grain
R31C16,grain
R31C17,grain
R31C18,void
R31C19,void
R31C2,grain
R31C20,void
R31C21,grain
R31C22,grain
R31C23,grain
R31C24,grain
R31C25,grain
R31C26,grain
R31C27,grain
R31C28,grain
R31C29,grain
R31C3,grain
R31C30,grain
R31C31,grain
R31C32,grain
R31C33,grain
R31C34,grain
R31C35,grain
R31C36,grain
R31C37,grain
R31C38,grain
R31C39,grain
R31C4,grain
R31C40,grain
R31C41,grain
R31C42,grain
R31C43,grain
R31C44,grain
R31C45,grain
R31C46,grain
R31C47,grain
R31C48,grain
R31C49,grain
R31C5,grain
R31C50,grain
R31C51,grain
R31C52,grain
R31C53,grain
R31C54,grain
R31C55,grain
R31C56,grain
R31C57,grain
R31C58,grain
R31C59,grain
R31C6,grain
R31C60,grain
R31C61,grain
R31C62,grain
R31C63,grain
R31C7,grain
R31C8,grain
R31C9,grain
R32C0,grain
R32C1,grain
R32C10,grain
R32C11,grain
R32C12,grain
R32C13,grain
R32C14,grain
R32C15,grain
R32C16,grain
R32C17,grain
R32C18,grain
R32C19,grain
R32C2,grain
R32C20,grain
R32C21,grain
R32C22,grain
R32C23,grain
R32C24,grain
R32C25,grain
R32C26,grain
R32C27,grain
R32C28,grain
R32C29,grain
R32C3,grain
R32C30,grain
R32C31,grain
R32C32,grain
R32C33,grain
R32C34,grain
R32C35,grain
R32C36,grain
R32C37,grain
R32C38,grain
R32C39,grain
R32C4,grain
R32C40,grain
R32C41,grain
R32C42,grain
R32C43,grain
R32C44,grain
R32C45,grain
R32C46,grain
R32C47,grain
R32C48,grain
R32C49,grain
R32C5,grain
R32C50,grain
R32C51,grain
R32C52,grain
R32C53,grain
R32C54,grain
R32C55,grain
R32C56,grain
R32C57,grain
R32C58,grain
R32C59,grain
R32C6,grain
R32C60,grain
R32C61,grain
R32C62,grain
R32C63,grain
R32C7,grain
R32C8,grain
R32C9,grain
R33C0,grain
R33C1,grain
R33C10,grain
R33C11,grain
R33C12,grain
R33C13,grain
R33C14,grain
R33C15,grain
R33C16,grain
R33C17,grain
R33C18,grain
R33C19,grain
R33C2,grain
R33C20,grain
R33C21,grain
R33C22,grain
R33C23,grain
R33C24,grain
R33C25,grain
R33C26,grain
R33C27,grain
R33C28,grain
R33C29,grain
R33C3,grain
R33C30,grain
R33C31,grain
R33C32,grain
R33C33,grain
R33C34,grain
R33C35,grain
R33C36,grain
R33C37,grain
R33C38,grain
R33C39,grain
R33C4,grain
R33C40,grain
R33C41,grain
R33C42,grain
R33C43,grain
R33C44,grain
R33C45,grain
R33C46,grain
R33C47,grain
R33C48,grain
R33C49,grain
R33C5,grain
R33C50,grain
R33C51,grain
R33C52,grain
R33C53,grain
R33C54,grain
R33C55,grain
R33C56,grain
R33C57,grain
R33C58,grain
R33C59,grain
R33C6,grain
R33C60,grain
R33C61,grain
R33C62,grain
R33C63,grain
R33C7,grain
R33C8,grain
R33C9,grain
R34C0,grain
R34C1,grain
R34C10,grain
R34C11,grain
R34C12,grain
R34C13,grain
R34C14,grain
R34C15,grain
R34C16,grain
R34C17,grain
R34C18,grain
R34C19,grain
R34C2,grain
R34C20,grain
R34C21,grain
R34C22,grain
R34C23,grain
R34C24,grain
R34C25,grain
R34C26,grain
R34C27,grain
R34C28,grain
R34C29,grain
R34C3,grain
R34C30,grain
R34C31,grain
R34C32,grain
R34C33,grain
R34C34,grain
R34C35,grain
R34C36,grain
R34C37,grain
R34C38,grain
R34C39,grain
R34C4,grain
R34C40,grain
R34C41,grain
R34C42,grain
R34C43,grain
R34C44,grain
R34C45,grain
R34C46,void
R34C47,void
R34C48,grain
R34C49,grain
R34C5,grain
R34C50,grain
R34C51,grain
R34C52,grain
R34C53,grain
R34C54,void
R34C55,grain
R34C56,grain
R34C57,grain
R34C58,grain
R34C59,grain
R34C6,grain
R34C60,grain
R34C61,grain
R34C62,grain
R34C63,grain
R34C7,grain
R34C8,grain
R34C9,grain
R35C0,grain
R35C1,grain
R35C10,grain
R35C11,grain
R35C12,grain
R35C13,grain
R35C14,grain
R35C15,grain
R35C16,grain
R35C17,grain
R35C18,grain
R35C19,grain
R35C2,grain
R35C20,grain
R35C21,grain
R35C22,grain
R35C23,grain
R35C24,grain
R35C25,grain
R35C26,grain
R35C27,grain
R35C28,grain
R35C29,grain
R35C3,grain
R35C30,grain
R35C31,grain
R35C32,grain
R35C33,grain
R35C34,grain
R35C35,grain
R35C36,grain
R35C37,grain
R35C38,grain
R35C39,grain
R35C4,grain
R35C40,grain
R35C41,grain
R35C42,grain
R35C43,grain
R35C44,grain
R35C45,grain
R35C46,void
R35C47,void
R35C48,grain
R35C49,grain
R35C5,grain
R35C50,grain
R35C51,grain
R35C52,grain
R35C53,grain
R35C54,grain
R35C55,grain
R35C56,grain
R35C57,grain
R35C58,grain
R35C59,grain
R35C6,grain
R35C60,grain
R35C61,grain
R35C62,grain
R35C63,grain
R35C7,grain
R35C8,grain
R35C9,grain
R36C0,grain
R36C1,grain
R36C10,grain
R36C11,grain
R36C12,grain
R36C13,grain
R36C14,grain
R36C15,grain
R36C16,grain
R36C17,grain
R36C18,grain
R36C19,grain
R36C2,grain
R36C20,grain
R36C21,grain
R36C22,grain
R36C23,grain
R36C24,grain
R36C25,grain
R36C26,grain
R36C27,grain
R36C28,grain
R36C29,grain
R36C3,grain
R36C30,grain
R36C31,grain
R36C32,grain
R36C33,grain
R36C34,grain
R36C35,grain
R36C36,grain
R36C37,grain
R36C38,grain
R36C39,grain
R36C4,grain
R36C40,grain
R36C41,grain
R36C42,grain
R36C43,grain
R36C44,grain
R36C45,void
R36C46,void
R36C47,void
R36C48,grain
R36C49,grain
R36C5,grain
R36C50,grain
R36C51,grain
R36C52,grain
R36C53,grain
R36C54,grain
R36C55,grain
R36C56,grain
R36C57,grain
R36C58,grain
R36C59,grain
R36C6,grain
R36C60,grain
R36C61,grain
R36C62,grain
R36C63,grain
R36C7,grain
R36C8,grain
R36C9,grain
R37C0,grain
R37C1,grain
R37C10,grain
R37C11,grain
R37C12,grain
R37C13,grain
R37C14,grain
R37C15,grain
R37C16,grain
R37C17,grain
R37C18,grain
R37C19,grain
R37C2,grain
R37C20,grain
R37C21,grain
R37C22,grain
R37C23,grain
R37C24,grain
R37C25,grain
R37C26,grain
R37C27,grain
R37C28,grain
R37C29,grain
R37C3,grain
R37C30,grain
R37C31,grain
R37C32,grain
R37C33,grain
R37C34,grain
R37C35,grain
R37C36,grain
R37C37,grain
R37C38,grain
R37C39,grain
R37C4,grain
R37C40,grain
R37C41,grain
R37C42,grain
R37C43,grain
R37C44,grain
R37C45,grain
R37C46,void
R37C47,void
R37C48,grain
R37C49,grain
R37C5,grain
R37C50,grain
R37C51,grain
R37C52,grain
R37C53,grain
R37C54,grain
R37C55,grain
R37C56,grain
R37C57,grain
R37C58,grain
R37C59,grain
R37C6,grain
R37C60,grain
R37C61,grain
R37C62,grain
R37C63,grain
R37C7,grain
R37C8,grain
R37C9,grain
R38C0,grain
R38C1,grain
R38C10,grain
R38C11,grain
R38C12,grain
R38C13,grain
R38C14,grain
R38C15,grain
R38C16,grain
R38C17,grain
R38C18,grain
R38C19,grain
R38C2,grain
R38C20,grain
R38C21,grain
R38C22,grain
R38C23,grain
R38C24,grain
R38C25,grain
R38C26,grain
R38C27,grain
R38C28,grain
R38C29,grain
R38C3,grain
R38C30,grain
R38C31,grain
R38C32,grain
R38C33,grain
R38C34,grain
R38C35,grain
R38C36,grain
R38C37,grain
R38C38,grain
R38C39,grain
R38C4,grain
R38C40,grain
R38C41,grain
R38C42,grain
R38C43,grain
R38C44,grain
R38C45,grain
R38C46,grain
R38C47,grain
R38C48,grain
R38C49,grain
R38C5,grain
R38C50,grain
R38C51,grain
R38C52,grain
R38C53,grain
R38C54,grain
R38C55,grain
R38C56,grain
R38C57,grain
R38C58,grain
R38C59,grain
R38C6,grain
R38C60,grain
R38C61,grain
R38C62,grain
R38C63,grain
R38C7,grain
R38C8,grain
R38C9,grain
R39C0,grain
R39C1,grain
R39C10,grain
R39C11,grain
R39C12,grain
R39C13,grain
R39C14,grain
R39C15,grain
R39C16,grain
R39C17,grain
R39C18,grain
R39C19,grain
R39C2,grain
R39C20,grain
R39C21,grain
R39C22,grain
R39C23,grain
R39C24,grain
R39C25,grain
R39C26,grain
R39C27,grain
R39C28,grain
R39C29,grain
R39C3,grain
R39C30,grain
R39C31,grain
R39C32,grain
R39C33,grain
R39C34,grain
R39C35,grain
R39C36,grain
R39C37,grain
R39C38,grain
R39C39,grain
R39C4,grain
R39C40,grain
R39C41,grain
R39C42,grain
R39C43,grain
R39C44,grain
R39C45,grain
R39C46,grain
R39C47,grain
R39C48,grain
R39C49,grain
R39C5,grain
R39C50,grain
R39C51,grain
R39C52,grain
R39C53,grain
R39C54,grain
R39C55,grain
R39C56,grain
R39C57,grain
R39C58,grain
R39C59,grain
R39C6,grain
R39C60,grain
R39C61,grain
R39C62,grain
R39C63,grain
R39C7,grain
R39C8,grain
R39C9,grain
R3C0,grain
R3C1,grain
R3C10,grain
R3C11,grain
R3C12,grain
R3C13,void
R3C14,grain
R3C15,grain
R3C16,grain
R3C17,grain
R3C18,grain
R3C19,grain
R3C2,grain
R3C20,grain
R3C21,grain
R3C22,grain
R3C23,grain
R3C24,grain
R3C25,grain
R3C26,grain
R3C27,grain
R3C28,grain
R3C29,grain
R3C3,grain
R3C30,grain
R3C31,grain
R3C32,grain
R3C33,grain
R3C34,grain
R3C35,grain
R3C36,grain
R3C37,grain
R3C38,grain
R3C39,grain
R3C4,grain
R3C40,grain
R3C41,void
R3C42,grain
R3C43,grain
R3C44,grain
R3C45,grain
R3C46,grain
R3C47,grain
R3C48,grain
R3C49,grain
R3C5,grain
R3C50,grain
R3C51,grain
R3C52,grain
R3C53,grain
R3C54,grain
R3C55,grain
R3C56,grain
R3C57,grain
R3C58,grain
R3C59,grain
R3C6,grain
R3C60,grain
R3C61,grain
R3C62,grain
R3C63,grain
R3C7,grain
R3C8,grain
R3C9,grain
R40C0,grain
R40C1,grain
R40C10,grain
R40C11,grain
R40C12,grain
R40C13,grain
R40C14,grain
R40C15,grain
R40C16,void
R40C17,grain
R40C18,grain
R40C19,grain
R40C2,grain
R40C20,grain
R40C21,grain
R40C22,grain
R40C23,grain
R40C24,grain
R40C25,grain
R40C26,grain
R40C27,grain
R40C28,grain
R40C29,grain
R40C3,void
R40C30,grain
R40C31,grain
R40C32,grain
R40C33,grain
R40C34,grain
R40C35,grain
R40C36,grain
R40C37,grain
R40C38,grain
R40C39,grain
R40C4,void
R40C40,grain
R40C41,grain
R40C42,grain
R40C43,grain
R40C44,grain
R40C45,grain
R40C46,grain
R40C47,grain
R40C48,grain
R40C49,grain
R40C5,grain
R40C50,grain
R40C51,grain
R40C52,grain
R40C53,grain
R40C54,grain
R40C55,grain
R40C56,grain
R40C57,grain
R40C58,grain
R40C59,grain
R40C6,grain
R40C60,grain
R40C61,grain
R40C62,grain
R40C63,grain
R40C7,grain
R40C8,grain
R40C9,grain
R41C0,grain
R41C1,grain
R41C10,grain
R41C11,grain
R41C12,grain
R41C13,grain
R41C14,grain
R41C15,grain
R41C16,grain
R41C17,grain
R41C18,grain
R41C19,grain
R41C2,grain
R41C20,grain
R41C21,grain
R41C22,grain
R41C23,grain
R41C24,grain
R41C25,grain
R41C26,grain
R41C27,grain
R41C28,grain
R41C29,grain
R41C3,grain
R41C30,grain
R41C31,grain
R41C32,grain
R41C33,grain
R41C34,grain
R41C35,grain
R41C36,grain
R41C37,grain
R41C38,grain
R41C39,grain
R41C4,grain
R41C40,grain
R41C41,grain
R41C42,grain
R41C43,grain
R41C44,grain
R41C45,grain
R41C46,grain
R41C47,grain
R41C48,grain
R41C49,grain
R41C5,grain
R41C50,grain
R41C51,grain
R41C52,grain
R41C53,grain
R41C54,grain
R41C55,grain
R41C56,grain
R41C57,grain
R41C58,grain
R41C59,grain
R41C6,grain
R41C60,grain
R41C61,grain
R41C62,grain
R41C63,grain
R41C7,grain
R41C8,grain
R41C9,grain
R42C0,grain
R42C1,grain
R42C10,grain
R42C11,grain
R42C12,grain
R42C13,grain
R42C14,grain
R42C15,grain
R42C16,grain
R42C17,grain
R42C18,grain
R42C19,grain
R42C2,grain
R42C20,grain
R42C21,grain
R42C22,grain
R42C23,grain
R42C24,grain
R42C25,grain
R42C26,grain
R42C27,grain
R42C28,grain
R42C29,grain
R42C3,grain
R42C30,grain
R42C31,grain
R42C32,grain
R42C33,grain
R42C34,grain
R42C35,grain
R42C36,grain
R42C37,grain
R42C38,grain
R42C39,grain
R42C4,grain
R42C40,grain
R42C41,grain
R42C42,grain
R42C43,grain
R42C44,grain
R42C45,grain
R42C46,grain
R42C47,grain
R42C48,grain
R42C49,grain
R42C5,grain
R42C50,grain
R42C51,grain
R42C52,grain
R42C53,grain
R42C54,grain
R42C55,grain
R42C56,grain
R42C57,grain
R42C58,grain
R42C59,grain
R42C6,grain
R42C60,grain
R42C61,grain
R42C62,grain
R42C63,grain
R42C7,grain
R42C8,grain
R42C9,grain
R43C0,grain
R43C1,grain
R43C10,grain
R43C11,grain
R43C12,grain
R43C13,grain
R43C14,grain
R43C15,grain
R43C16,grain
R43C17,grain
R43C18,grain
R43C19,grain
R43C2,grain
R43C20,grain
R43C21,grain
R43C22,grain
R43C23,grain
R43C24,grain
R43C25,grain
R43C26,grain
R43C27,grain
R43C28,grain
R43C29,grain
R43C3,grain
R43C30,grain
R43C31,grain
R43C32,grain
R43C33,grain
R43C34,grain
R43C35,grain
R43C36,grain
R43C37,grain
R43C38,grain
R43C39,grain
R43C4,grain
R43C40,grain
R43C41,grain
R43C42,grain
R43C43,grain
R43C44,grain
R43C45,grain
R43C46,grain
R43C47,grain
R43C48,grain
R43C49,grain
R43C5,grain
R43C50,grain
R43C51,grain
R43C52,grain
R43C53,grain
R43C54,grain
R43C55,grain
R43C56,grain
R43C57,grain
R43C58,grain
R43C59,grain
R43C6,grain
R43C60,grain
R43C61,grain
R43C62,grain
R43C63,grain
R43C7,grain
R43C8,grain
R43C9,grain
R44C0,grain
R44C1,grain
R44C10,grain
R44C11,grain
R44C12,grain
R44C13,grain
R44C14,grain
R44C15,grain
R44C16,void
R44C17,void
R44C18,grain
R44C19,grain
R44C2,grain
R44C20,grain
R44C21,grain
R44C22,grain
R44C23,grain
R44C24,grain
R44C25,grain
R44C26,grain
R44C27,grain
R44C28,grain
R44C29,grain
R44C3,grain
R44C30,grain
R44C31,grain
R44C32,grain
R44C33,grain
R44C34,grain
R44C35,grain
R44C36,grain
R44C37,grain
R44C38,grain
R44C39,grain
R44C4,grain
R44C40,grain
R44C41,grain
R44C42,grain
R44C43,grain
R44C44,grain
R44C45,grain
R44C46,grain
R44C47,grain
R44C48,grain
R44C49,grain
R44C5,grain
R44C50,grain
R44C51,grain
R44C52,grain
R44C53,grain
R44C54,grain
R44C55,grain
R44C56,grain
R44C57,grain
R44C58,grain
R44C59,grain
R44C6,grain
R44C60,grain
R44C61,grain
R44C62,grain
R44C63,grain
R44C7,grain
R44C8,void
R44C9,grain
R45C0,grain
R45C1,grain
R45C10,grain
R45C11,grain
R45C12,grain
R45C13,grain
R45C14,grain
R45C15,grain
R45C16,void
R45C17,void
R45C18,grain
R45C19,grain
R45C2,grain
R45C20,grain
R45C21,grain
R45C22,grain
R45C23,grain
R45C24,grain
R45C25,grain
R45C26,grain
R45C27,grain
R45C28,grain
R45C29,grain
R45C3,grain
R45C30,grain
R45C31,grain
R45C32,grain
R45C33,grain
R45C34,grain
R45C35,grain
R45C36,grain
R45C37,grain
R45C38,grain
R45C39,grain
R45C4,grain
R45C40,grain
R45C41,grain
R45C42,grain
R45C43,grain
R45C44,grain
R45C45,grain
R45C46,grain
R45C47,grain
R45C48,grain
R45C49,grain
R45C5,grain
R45C50,grain
R45C51,grain
R45C52,grain
R45C53,grain
R45C54,grain
R45C55,grain
R45C56,grain
R45C57,grain
R45C58,grain
R45C59,grain
R45C6,grain
R45C60,grain
R45C61,grain
R45C62,grain
R45C63,grain
R45C7,grain
R45C8,grain
R45C9,grain
R46C0,grain
R46C1,grain
R46C10,grain
R46C11,grain
R46C12,grain
R46C13,grain
R46C14,grain
R46C15,grain
R46C16,grain
R46C17,grain
R46C18,grain
R46C19,grain
R46C2,grain
R46C20,grain
R46C21,grain
R46C22,grain
R46C23,grain
R46C24,grain
R46C25,grain
R46C26,grain
R46C27,grain
R46C28,grain
R46C29,grain
R46C3,grain
R46C30,grain
R46C31,grain
R46C32,grain
R46C33,grain
R46C34,grain
R46C35,grain
R46C36,grain
R46C37,grain
R46C38,grain
R46C39,grain
R46C4,grain
R46C40,grain
R46C41,grain
R46C42,grain
R46C43,grain
R46C44,grain
R46C45,grain
R46C46,grain
R46C47,grain
R46C48,grain
R46C49,grain
R46C5,grain
R46C50,grain
R46C51,grain
R46C52,grain
R46C53,grain
R46C54,grain
R46C55,grain
R46C56,grain
R46C57,grain
R46C58,grain
R46C59,grain
R46C6,grain
R46C60,grain
R46C61,grain
R46C62,grain
R46C63,grain
R46C7,grain
R46C8,grain
R46C9,grain
R47C0,grain
R47C1,grain
R47C10,grain
R47C11,grain
R47C12,grain
R47C13,grain
R47C14,grain
R47C15,grain
R47C16,grain
R47C17,grain
R47C18,grain
R47C19,grain
R47C2,grain
R47C20,grain
R47C21,grain
R47C22,grain
R47C23,grain
R47C24,grain
R47C25,grain
R47C26,grain
R47C27,grain
R47C28,grain
R47C29,grain
R47C3,grain
R47C30,grain
R47C31,grain
R47C32,grain
R47C33,grain
R47C34,grain
R47C35,grain
R47C36,grain
R47C37,grain
R47C38,grain
R47C39,grain
R47C4,grain
R47C40,grain
R47C41,grain
R47C42,grain
R47C43,grain
R47C44,grain
R47C45,grain
R47C46,grain
R47C47,grain
R47C48,grain
R47C49,grain
R47C5,grain
R47C50,grain
R47C51,grain
R47C52,grain
R47C53,grain
R47C54,grain
R47C55,grain
R47C56,grain
R47C57,grain
R47C58,grain
R47C59,grain
R47C6,grain
R47C60,grain
R47C61,grain
R47C62,grain
R47C63,grain
R47C7,grain
R47C8,grain
R47C9,grain
R4C0,grain
R4C1,grain
R4C10,grain
R4C11,grain
R4C12,grain
R4C13,grain
R4C14,grain
R4C15,grain
R4C16,grain
R4C17,grain
R4C18,grain
R4C19,grain
R4C2,grain
R4C20,grain
R4C21,grain
R4C22,grain
R4C23,grain
R4C24,grain
R4C25,grain
R4C26,grain
R4C27,grain
R4C28,grain
R4C29,grain
R4C3,grain
R4C30,void
R4C31,grain
R4C32,grain
R4C33,grain
R4C34,grain
R4C35,grain
R4C36,grain
R4C37,grain
R4C38,grain
R4C39,grain
R4C4,grain
R4C40,grain
R4C41,grain
R4C42,grain
R4C43,grain
R4C44,grain
R4C45,grain
R4C46,grain
R4C47,grain
R4C48,grain
R4C49,grain
R4C5,grain
R4C50,grain
R4C51,grain
R4C52,grain
R4C53,grain
R4C54,grain
R4C55,grain
R4C56,grain
R4C57,grain
R4C58,grain
R4C59,grain
R4C6,grain
R4C60,grain
R4C61,grain
R4C62,grain
R4C63,grain
R4C7,grain
R4C8,grain
R4C9,grain
R5C0,grain
R5C1,grain
R5C10,grain
R5C11,grain
R5C12,grain
R5C13,grain
R5C14,grain
R5C15,grain
R5C16,grain
R5C17,grain
R5C18,grain
R5C19,grain
R5C2,grain
R5C20,grain
R5C21,grain
R5C22,grain
R5C23,grain
R5C24,grain
R5C25,grain
R5C26,grain
R5C27,grain
R5C28,grain
R5C29,grain
R5C3,grain
R5C30,grain
R5C31,grain
R5C32,grain
R5C33,grain
R5C34,grain
R5C35,grain
R5C36,grain
R5C37,grain
R5C38,grain
R5C39,grain
R5C4,grain
R5C40,grain
R5C41,grain
R5C42,grain
R5C43,grain
R5C44,grain
R5C45,void
R5C46,void
R5C47,grain
R5C48,grain
R5C49,grain
R5C5,grain
R5C50,grain
R5C51,grain
R5C52,grain
R5C53,grain
R5C54,grain
R5C55,grain
R5C56,grain
R5C57,grain
R5C58,grain
R5C59,grain
R5C6,grain
R5C60,grain
R5C61,grain
R5C62,grain
R5C63,grain
R5C7,grain
R5C8,grain
R5C9,void
R6C0,grain
R6C1,grain
R6C10,grain
R6C11,grain
R6C12,grain
R6C13,grain
R6C14,grain
R6C15,grain
R6C16,grain
R6C17,grain
R6C18,grain
R6C19,grain
R6C2,grain
R6C20,grain
R6C21,grain
R6C22,grain
R6C23,grain
R6C24,grain
R6C25,grain
R6C26,grain
R6C27,grain
R6C28,grain
R6C29,grain
R6C3,grain
R6C30,grain
R6C31,grain
R6C32,grain
R6C33,grain
R6C34,grain
R6C35,grain
R6C36,grain
R6C37,grain
R6C38,grain
R6C39,grain
R6C4,grain
R6C40,grain
R6C41,grain
R6C42,grain
R6C43,grain
R6C44,grain
R6C45,void
R6C46,void
R6C47,grain
R6C48,grain
R6C49,grain
R6C5,grain
R6C50,grain
R6C51,grain
R6C52,grain
R6C53,grain
R6C54,grain
R6C55,grain
R6C56,grain
R6C57,grain
R6C58,grain
R6C59,grain
R6C6,grain
R6C60,void
R6C61,grain
R6C62,grain
R6C63,grain
R6C7,grain
R6C8,void
R6C9,void
R7C0,grain
R7C1,grain
R7C10,grain
R7C11,grain
R7C12,grain
R7C13,grain
R7C14,grain
R7C15,grain
R7C16,grain
R7C17,grain
R7C18,grain
R7C19,grain
R7C2,grain
R7C20,grain
R7C21,grain
R7C22,grain
R7C23,grain
R7C24,grain
R7C25,grain
R7C26,grain
R7C27,grain
R7C28,grain
R7C29,grain
R7C3,grain
R7C30,grain
R7C31,grain
R7C32,grain
R7C33,grain
R7C34,grain
R7C35,grain
R7C36,grain
R7C37,grain
R7C38,grain
R7C39,grain
R7C4,grain
R7C40,grain
R7C41,grain
R7C42,grain
R7C43,grain
R7C44,grain
R7C45,grain
R7C46,grain
R7C47,grain
R7C48,grain
R7C49,grain
R7C5,grain
R7C50,grain
R7C51,grain
R7C52,grain
R7C53,grain
R7C54,grain
R7C55,grain
R7C56,grain
R7C57,grain
R7C58,grain
R7C59,grain
R7C6,grain
R7C60,grain
R7C61,grain
R7C62,grain
R7C63,grain
R7C7,grain
R7C8,grain
R7C9,void
R8C0,grain
R8C1,grain
R8C10,grain
R8C11,grain
R8C12,grain
R8C13,grain
R8C14,grain
R8C15,grain
R8C16,grain
R8C17,grain
R8C18,grain
R8C19,grain
R8C2,grain
R8C20,grain
R8C21,grain
R8C22,grain
R8C23,grain
R8C24,grain
R8C25,grain
R8C26,grain
R8C27,grain
R8C28,grain
R8C29,grain
R8C3,grain
R8C30,grain
R8C31,grain
R8C32,grain
R8C33,grain
R8C34,grain
R8C35,grain
R8C36,grain
R8C37,grain
R8C38,grain
R8C39,grain
R8C4,grain
R8C40,grain
R8C41,grain
R8C42,grain
R8C43,grain
R8C44,grain
R8C45,grain
R8C46,grain
R8C47,grain
R8C48,grain
R8C49,grain
R8C5,grain
R8C50,grain
R8C51,grain
R8C52,grain
R8C53,grain
R8C54,grain
R8C55,grain
R8C56,grain
R8C57,grain
R8C58,grain
R8C59,grain
R8C6,grain
R8C60,grain
R8C61,grain
R8C62,grain
R8C63,grain
R8C7,grain
R8C8,grain
R8C9,grain
R9C0,grain
R9C1,void
R9C10,grain
R9C11,grain
R9C12,grain
R9C13,grain
R9C14,grain
R9C15,grain
R9C16,grain
R9C17,grain
R9C18,grain
R9C19,grain
R9C2,grain
R9C20,grain
R9C21,grain
R9C22,grain
R9C23,grain
R9C24,grain
R9C25,grain
R9C26,grain
R9C27,grain
R9C28,grain
R9C29,grain
R9C3,grain
R9C30,grain
R9C31,grain
R9C32,grain
R9C33,grain
R9C34,grain
R9C35,grain
R9C36,grain
R9C37,grain
R9C38,grain
R9C39,grain
R9C4,grain
R9C40,grain
R9C41,grain
R9C42,grain
R9C43,grain
R9C44,grain
R9C45,grain
R9C46,grain
R9C47,grain
R9C48,grain
R9C49,grain
R9C5,grain
R9C50,grain
R9C51,grain
R9C52,grain
R9C53,grain
R9C54,grain
R9C55,grain
R9C56,grain
R9C57,grain
R9C58,grain
R9C59,grain
R9C6,grain
R9C60,grain
R9C61,grain
R9C62,grain
R9C63,grain
R9C7,grain
R9C8,grain
R9C9,grain
