chips,class
R32C22,GE
R10C32,GE
R11C26,GE
R11C32,GE
R10C26,GE
R25C24,GE
R24C30,GE
R24C24,GE
R25C30,GE
R4C24,GE
R5C30,GE
R5C24,GE
R4C30,GE
R5C25,GE
R4C31,GE
R4C25,GE
R5C31,GE
R24C25,GE
R25C31,GE
R25C25,GE
R24C31,GE
R10C27,GE
R11C27,GE
R32C23,GE
R32C21,GE
R10C25,GE
R11C31,GE
R11C25,GE
R10C31,GE
R24C27,GE
R25C27,GE
R5C27,GE
R4C27,GE
R5C32,GE
R4C26,GE
R4C32,GE
R5C26,GE
R24C32,GE
R25C26,GE
R25C32,GE
R24C26,GE
R11C24,GE
R10C30,GE
R10C24,GE
R11C30,GE
R32C24,GE
R32C30,GE
R1C28,GE
R0C28,GE
R24C22,GE
R25C22,GE
R20C28,GE
R21C28,GE
R5C22,GE
R4C22,GE
R4C23,GE
R5C23,GE
R21C29,GE
R20C29,GE
R25C23,GE
R24C23,GE
R11C21,GE
R0C29,GE
R1C29,GE
R10C21,GE
R32C31,GE
R32C25,GE
R32C27,GE
R11C23,GE
R10C23,GE
R25C21,GE
R24C21,GE
R4C21,GE
R15C29,GE
R14C29,GE
R5C21,GE
R14C28,GE
R15C28,GE
R10C22,GE
R11C22,GE
R32C26,GE
R32C32,GE
R28C21,GE
R29C21,GE
R18C29,GE
R9C21,GE
R8C21,GE
R19C29,GE
R27C28,GE
R26C28,GE
R2C22,GE
R3C22,GE
R6C28,GE
R7C28,GE
R23C22,GE
R22C22,GE
R22C23,GE
R23C23,GE
R7C29,GE
R16C21,GE
R17C21,GE
R6C29,GE
R3C23,GE
R2C23,GE
R26C29,GE
R27C29,GE
R19C28,GE
R18C28,GE
R29C22,GE
R28C22,GE
R8C22,GE
R9C22,GE
R12C29,GE
R3C21,GE
R2C21,GE
R13C29,GE
R16C23,GE
R17C23,GE
R22C21,GE
R23C21,GE
R17C22,GE
R16C22,GE
R13C28,GE
R12C28,GE
R9C23,GE
R8C23,GE
R28C23,GE
R29C23,GE
R29C27,GE
R28C27,GE
R30C28,GE
R8C27,GE
R9C27,GE
R31C28,GE
R3C24,GE
R2C30,GE
R2C24,GE
R3C30,GE
R17C32,GE
R16C26,GE
R16C32,GE
R17C26,GE
R22C24,GE
R23C30,GE
R23C24,GE
R22C30,GE
R23C25,GE
R22C31,GE
R22C25,GE
R23C31,GE
R17C27,GE
R16C27,GE
R2C25,GE
R3C31,GE
R3C25,GE
R2C31,GE
R8C32,GE
R31C29,GE
R9C26,GE
R9C32,GE
R8C26,GE
R30C29,GE
R29C32,GE
R28C26,GE
R28C32,GE
R29C26,GE
R28C24,GE
R29C30,GE
R29C24,GE
R28C30,GE
R9C24,GE
R8C30,GE
R8C24,GE
R9C30,GE
R2C27,GE
R3C27,GE
R17C25,GE
R16C31,GE
R16C25,GE
R17C31,GE
R23C27,GE
R22C27,GE
R23C32,GE
R22C26,GE
R22C32,GE
R23C26,GE
R16C24,GE
R17C30,GE
R17C24,GE
R16C30,GE
R2C32,GE
R3C26,GE
R3C32,GE
R2C26,GE
R8C25,GE
R9C31,GE
R9C25,GE
R8C31,GE
R29C25,GE
R28C31,GE
R28C25,GE
R29C31,GE
R29C28,GE
R28C28,GE
R8C28,GE
R30C27,GE
R31C27,GE
R9C28,GE
R26C21,GE
R27C21,GE
R12C23,GE
R13C23,GE
R7C21,GE
R16C29,GE
R17C29,GE
R6C21,GE
R17C28,GE
R16C28,GE
R13C22,GE
R12C22,GE
R18C21,GE
R9C29,GE
R31C26,GE
R30C32,GE
R30C26,GE
R8C29,GE
R19C21,GE
R31C32,GE
R28C29,GE
R29C29,GE
R30C30,GE
R31C24,GE
R18C23,GE
R31C30,GE
R19C23,GE
R30C24,GE
R27C22,GE
R26C22,GE
R2C28,GE
R3C28,GE
R6C22,GE
R7C22,GE
R23C28,GE
R22C28,GE
R22C29,GE
R23C29,GE
R7C23,GE
R6C23,GE
R12C21,GE
R3C29,GE
R2C29,GE
R13C21,GE
R26C23,GE
R27C23,GE
R31C31,GE
R30C25,GE
R19C22,GE
R30C31,GE
R18C22,GE
R31C25,GE
R31C21,GE
R18C26,GE
R19C32,GE
R19C26,GE
R30C21,GE
R18C32,GE
R27C27,GE
R26C27,GE
R12C31,GE
R13C25,GE
R13C31,GE
R12C25,GE
R6C27,GE
R7C27,GE
R7C26,GE
R6C32,GE
R6C26,GE
R7C32,GE
R13C30,GE
R12C24,GE
R12C30,GE
R13C24,GE
R26C26,GE
R27C32,GE
R27C26,GE
R26C32,GE
R19C27,GE
R18C27,GE
R18C31,GE
R19C25,GE
R30C22,GE
R19C31,GE
R31C22,GE
R18C25,GE
R27C30,GE
R26C24,GE
R26C30,GE
R27C24,GE
R12C26,GE
R13C32,GE
R13C26,GE
R12C32,GE
R6C30,GE
R7C24,GE
R7C30,GE
R6C24,GE
R7C31,GE
R6C25,GE
R6C31,GE
R7C25,GE
R13C27,GE
R12C27,GE
R26C31,GE
R27C25,GE
R27C31,GE
R26C25,GE
R19C30,GE
R18C24,GE
R31C23,GE
R18C30,GE
R30C23,GE
R19C24,GE
R1C27,GE
R0C27,GE
R20C27,GE
R21C27,GE
R15C31,GE
R14C25,GE
R14C31,GE
R15C25,GE
R14C30,GE
R15C24,GE
R15C30,GE
R14C24,GE
R21C26,GE
R20C32,GE
R20C26,GE
R21C32,GE
R0C26,GE
R1C32,GE
R1C26,GE
R0C32,GE
R32C28,GE
R1C30,GE
R0C24,GE
R0C30,GE
R1C24,GE
R20C30,GE
R21C24,GE
R21C30,GE
R20C24,GE
R15C26,GE
R14C32,GE
R14C26,GE
R15C32,GE
R14C27,GE
R15C27,GE
R21C31,GE
R20C25,GE
R20C31,GE
R21C25,GE
R0C31,GE
R1C25,GE
R1C31,GE
R0C25,GE
R32C29,GE
R11C29,GE
R0C21,GE
R1C21,GE
R10C29,GE
R21C21,GE
R20C21,GE
R15C23,GE
R14C23,GE
R14C22,GE
R15C22,GE
R10C28,GE
R11C28,GE
R1C22,GE
R0C22,GE
R24C28,GE
R25C28,GE
R20C22,GE
R21C22,GE
R5C28,GE
R4C28,GE
R4C29,GE
R15C21,GE
R14C21,GE
R5C29,GE
R21C23,GE
R20C23,GE
R25C29,GE
R24C29,GE
R0C23,GE
R1C23,GE
R0C12,STO
R1C12,STO
R25C18,STO
R24C18,STO
R21C12,STO
R20C12,STO
R28C9,STO
R15C10,STO
R4C18,STO
R5C18,STO
R14C10,STO
R3C9,STO
R14C11,STO
R5C19,STO
R3C8,STO
R4C19,STO
R15C11,STO
R28C8,STO
R20C13,STO
R21C13,STO
R24C19,STO
R25C19,STO
R1C13,STO
R0C13,STO
R6C7,STO
R31C9,STO
R1C11,STO
R10C19,STO
R11C19,STO
R0C11,STO
R20C11,STO
R21C11,STO
R14C13,STO
R15C13,STO
R15C12,STO
R14C12,STO
R21C10,STO
R20C10,STO
R0C10,STO
R11C18,STO
R12C7,STO
R10C18,STO
R1C10,STO
R32C20,STO
R31C8,STO
R6C6,STO
R30C9,STO
R32C18,STO
R7C7,STO
R1C14,STO
R0C14,STO
R10C20,STO
R11C20,STO
R20C14,STO
R21C14,STO
R14C16,STO
R15C16,STO
R15C17,STO
R14C17,STO
R21C15,STO
R20C15,STO
R13C7,STO
R0C15,STO
R1C15,STO
R32C19,STO
R7C6,STO
R30C8,STO
R0C17,STO
R1C17,STO
R29C9,STO
R2C9,STO
R25C7,STO
R21C17,STO
R20C17,STO
R15C15,STO
R14C15,STO
R14C14,STO
R15C14,STO
R5C20,STO
R4C20,STO
R20C16,STO
R21C16,STO
R24C20,STO
R2C8,STO
R25C20,STO
R1C16,STO
R29C8,STO
R0C16,STO
R31C12,STO
R18C15,STO
R19C15,STO
R30C12,STO
R11C6,STO
R9C9,STO
R27C14,STO
R26C14,STO
R13C16,STO
R32C9,STO
R12C16,STO
R22C9,STO
R6C14,STO
R7C14,STO
R5C7,STO
R5C6,STO
R7C15,STO
R6C15,STO
R12C17,STO
R13C17,STO
R32C8,STO
R26C15,STO
R27C15,STO
R9C8,STO
R11C7,STO
R30C13,STO
R19C14,STO
R18C14,STO
R31C13,STO
R8C20,STO
R9C20,STO
R29C20,STO
R28C20,STO
R0C9,STO
R19C16,STO
R30C11,STO
R31C11,STO
R18C16,STO
R27C7,STO
R26C17,STO
R27C17,STO
R14C8,STO
R12C15,STO
R13C15,STO
R7C17,STO
R6C17,STO
R23C20,STO
R22C20,STO
R6C16,STO
R7C16,STO
R13C14,STO
R12C14,STO
R14C9,STO
R2C20,STO
R3C20,STO
R27C16,STO
R26C16,STO
R18C17,STO
R31C10,STO
R30C10,STO
R19C17,STO
R0C8,STO
R26C7,STO
R19C13,STO
R30C14,STO
R31C14,STO
R18C13,STO
R1C9,STO
R26C12,STO
R27C12,STO
R3C18,STO
R12C10,STO
R13C10,STO
R2C18,STO
R7C12,STO
R6C12,STO
R22C18,STO
R23C18,STO
R23C19,STO
R15C9,STO
R22C19,STO
R6C13,STO
R7C13,STO
R2C19,STO
R13C11,STO
R12C11,STO
R3C19,STO
R27C13,STO
R26C13,STO
R1C8,STO
R18C12,STO
R31C15,STO
R30C15,STO
R19C12,STO
R28C18,STO
R29C18,STO
R9C18,STO
R31C17,STO
R19C10,STO
R30C17,STO
R8C18,STO
R4C7,STO
R27C11,STO
R26C11,STO
R13C13,STO
R12C13,STO
R6C11,STO
R7C11,STO
R16C19,STO
R8C9,STO
R23C9,STO
R23C8,STO
R16C18,STO
R7C10,STO
R8C8,STO
R6C10,STO
R12C12,STO
R13C12,STO
R26C10,STO
R27C10,STO
R4C6,STO
R8C19,STO
R30C16,STO
R19C11,STO
R18C11,STO
R31C16,STO
R9C19,STO
R10C7,STO
R29C19,STO
R28C19,STO
R29C14,STO
R28C14,STO
R26C8,STO
R8C14,STO
R9C14,STO
R1C6,STO
R3C17,STO
R2C17,STO
R16C15,STO
R17C15,STO
R22C17,STO
R23C17,STO
R23C16,STO
R22C16,STO
R6C20,STO
R7C20,STO
R2C16,STO
R3C16,STO
R27C20,STO
R26C20,STO
R1C7,STO
R9C15,STO
R8C15,STO
R26C9,STO
R28C15,STO
R29C15,STO
R28C17,STO
R29C17,STO
R10C9,STO
R31C18,STO
R9C17,STO
R8C17,STO
R30C18,STO
R1C5,STO
R4C8,STO
R2C14,STO
R3C14,STO
R13C20,STO
R12C20,STO
R17C16,STO
R16C16,STO
R23C14,STO
R22C14,STO
R22C15,STO
R23C15,STO
R8C7,STO
R16C17,STO
R17C17,STO
R3C15,STO
R2C15,STO
R4C9,STO
R30C19,STO
R8C16,STO
R9C16,STO
R31C19,STO
R10C8,STO
R29C16,STO
R28C16,STO
R0C5,STO
R28C12,STO
R29C12,STO
R9C12,STO
R8C12,STO
R11C9,STO
R2C11,STO
R13C19,STO
R12C19,STO
R3C11,STO
R17C13,STO
R5C8,STO
R23C11,STO
R22C11,STO
R22C10,STO
R23C10,STO
R5C9,STO
R17C12,STO
R3C10,STO
R12C18,STO
R32C7,STO
R13C18,STO
R2C10,STO
R9C7,STO
R11C8,STO
R8C13,STO
R9C13,STO
R30C20,STO
R31C20,STO
R29C13,STO
R28C13,STO
R0C4,STO
R29C11,STO
R0C6,STO
R28C11,STO
R8C11,STO
R19C19,STO
R18C19,STO
R9C11,STO
R27C8,STO
R26C18,STO
R27C18,STO
R3C12,STO
R2C12,STO
R7C18,STO
R6C18,STO
R17C10,STO
R22C12,STO
R23C12,STO
R23C13,STO
R22C13,STO
R17C11,STO
R6C19,STO
R7C19,STO
R2C13,STO
R3C13,STO
R27C19,STO
R26C19,STO
R27C9,STO
R9C10,STO
R18C18,STO
R19C18,STO
R8C10,STO
R28C10,STO
R0C7,STO
R29C10,STO
R7C8,STO
R32C17,STO
R10C13,STO
R11C13,STO
R24C11,STO
R25C11,STO
R2C5,STO
R13C9,STO
R14C19,STO
R5C11,STO
R4C11,STO
R15C19,STO
R15C18,STO
R4C10,STO
R5C10,STO
R14C18,STO
R13C8,STO
R25C10,STO
R24C10,STO
R11C12,STO
R10C12,STO
R7C9,STO
R32C16,STO
R30C7,STO
R32C14,STO
R0C18,STO
R11C10,STO
R10C10,STO
R1C18,STO
R25C12,STO
R24C12,STO
R2C6,STO
R21C18,STO
R25C8,STO
R20C18,STO
R4C12,STO
R5C12,STO
R5C13,STO
R4C13,STO
R20C19,STO
R25C9,STO
R21C19,STO
R2C7,STO
R24C13,STO
R25C13,STO
R29C7,STO
R1C19,STO
R10C11,STO
R11C11,STO
R0C19,STO
R32C15,STO
R32C11,STO
R24C8,STO
R11C15,STO
R10C15,STO
R25C17,STO
R24C17,STO
R4C17,STO
R3C6,STO
R5C17,STO
R3C7,STO
R5C16,STO
R4C16,STO
R21C20,STO
R28C7,STO
R24C16,STO
R25C16,STO
R10C14,STO
R11C14,STO
R24C9,STO
R1C20,STO
R0C20,STO
R32C10,STO
R6C8,STO
R32C12,STO
R10C16,STO
R12C9,STO
R11C16,STO
R24C14,STO
R25C14,STO
R5C14,STO
R4C14,STO
R14C20,STO
R15C20,STO
R4C15,STO
R5C15,STO
R25C15,STO
R24C15,STO
R12C8,STO
R11C17,STO
R10C17,STO
R32C13,STO
R31C7,STO
R6C9,STO
R6C4,PtC
R17C8,PtC
R7C1,PtC
R24C7,PtC
R12C5,PtC
R25C2,PtC
R13C0,PtC
R13C1,PtC
R25C3,PtC
R12C4,PtC
R24C6,PtC
R7C0,PtC
R17C9,PtC
R6C5,PtC
R21C9,PtC
R7C2,PtC
R24C4,PtC
R12C6,PtC
R25C1,PtC
R13C3,PtC
R13C2,PtC
R25C0,PtC
R24C5,PtC
R7C3,PtC
R21C8,PtC
R20C9,PtC
R6C2,PtC
R12C3,PtC
R24C1,PtC
R13C6,PtC
R25C4,PtC
R25C5,PtC
R24C0,PtC
R12C2,PtC
R6C3,PtC
R20C8,PtC
R16C8,PtC
R6C1,PtC
R7C4,PtC
R12C0,PtC
R24C2,PtC
R13C5,PtC
R25C6,PtC
R13C4,PtC
R24C3,PtC
R12C1,PtC
R7C5,PtC
R6C0,PtC
R16C9,PtC
R26C1,PtC
R10C3,PtC
R27C4,PtC
R4C2,PtC
R19C0,PtC
R17C20,PtC
R16C20,PtC
R18C5,PtC
R18C4,PtC
R22C8,PtC
R19C1,PtC
R4C3,PtC
R27C5,PtC
R10C2,PtC
R26C0,PtC
R26C2,PtC
R10C0,PtC
R11C5,PtC
R4C1,PtC
R19C3,PtC
R5C4,PtC
R18C6,PtC
R18C7,PtC
R5C5,PtC
R19C2,PtC
R4C0,PtC
R11C4,PtC
R27C6,PtC
R10C1,PtC
R26C3,PtC
R10C5,PtC
R11C0,PtC
R27C2,PtC
R4C4,PtC
R19C6,PtC
R5C1,PtC
R18C3,PtC
R15C8,PtC
R18C2,PtC
R5C0,PtC
R19C7,PtC
R4C5,PtC
R27C3,PtC
R11C1,PtC
R26C6,PtC
R10C4,PtC
R10C6,PtC
R26C4,PtC
R18C10,PtC
R11C3,PtC
R27C1,PtC
R19C5,PtC
R5C2,PtC
R17C19,PtC
R18C0,PtC
R18C1,PtC
R17C18,PtC
R5C3,PtC
R19C4,PtC
R27C0,PtC
R11C2,PtC
R26C5,PtC
R0C3,PtC
R19C20,PtC
R18C20,PtC
R9C0,PtC
R22C0,PtC
R32C0,PtC
R19C9,PtC
R14C2,PtC
R8C5,PtC
R23C5,PtC
R15C7,PtC
R15C6,PtC
R23C4,PtC
R17C14,PtC
R16C14,PtC
R8C4,PtC
R14C3,PtC
R19C8,PtC
R32C1,PtC
R22C1,PtC
R9C1,PtC
R0C2,PtC
R0C0,PtC
R9C3,PtC
R32C3,PtC
R22C3,PtC
R14C1,PtC
R8C6,PtC
R23C6,PtC
R15C4,PtC
R15C5,PtC
R23C7,PtC
R14C0,PtC
R22C2,PtC
R32C2,PtC
R9C2,PtC
R1C4,PtC
R0C1,PtC
R1C0,PtC
R9C6,PtC
R14C4,PtC
R32C6,PtC
R22C6,PtC
R16C13,PtC
R8C3,PtC
R15C1,PtC
R23C3,PtC
R23C2,PtC
R15C0,PtC
R16C12,PtC
R8C2,PtC
R22C7,PtC
R14C5,PtC
R1C1,PtC
R1C3,PtC
R9C5,PtC
R14C7,PtC
R22C5,PtC
R32C5,PtC
R8C0,PtC
R16C10,PtC
R15C2,PtC
R18C9,PtC
R23C0,PtC
R23C1,PtC
R18C8,PtC
R15C3,PtC
R8C1,PtC
R16C11,PtC
R32C4,PtC
R22C4,PtC
R14C6,PtC
R9C4,PtC
R1C2,PtC
R20C6,PtC
R30C6,PtC
R16C4,PtC
R31C3,PtC
R21C3,PtC
R17C1,PtC
R29C5,PtC
R28C0,PtC
R3C0,PtC
R3C1,PtC
R28C1,PtC
R2C4,PtC
R29C4,PtC
R17C0,PtC
R21C2,PtC
R31C2,PtC
R16C5,PtC
R20C7,PtC
R30C5,PtC
R20C5,PtC
R16C7,PtC
R21C0,PtC
R31C0,PtC
R17C2,PtC
R29C6,PtC
R28C3,PtC
R3C3,PtC
R3C2,PtC
R28C2,PtC
R17C3,PtC
R31C1,PtC
R21C1,PtC
R16C6,PtC
R20C4,PtC
R30C4,PtC
R16C2,PtC
R30C0,PtC
R20C0,PtC
R17C7,PtC
R21C5,PtC
R31C5,PtC
R29C3,PtC
R2C3,PtC
R28C6,PtC
R20C20,PtC
R2C2,PtC
R29C2,PtC
R31C4,PtC
R21C4,PtC
R17C6,PtC
R20C1,PtC
R30C1,PtC
R16C3,PtC
R16C1,PtC
R20C3,PtC
R30C3,PtC
R17C4,PtC
R31C6,PtC
R21C6,PtC
R29C0,PtC
R2C0,PtC
R28C5,PtC
R3C5,PtC
R3C4,PtC
R28C4,PtC
R2C1,PtC
R29C1,PtC
R21C7,PtC
R17C5,PtC
R30C2,PtC
R20C2,PtC
R16C0,PtC
