
                                                                              
                                                                              
PPPPPPPPPPPPPPPPP      SSSSSSSSSSSSSSS    SSSSSSSSSSSSSSS PPPPPPPPPPPPPPPPP   
P::::::::::::::::P   SS:::::::::::::::S SS:::::::::::::::SP::::::::::::::::P  
P::::::PPPPPP:::::P S:::::SSSSSS::::::SS:::::SSSSSS::::::SP::::::PPPPPP:::::P 
PP:::::P     P:::::PS:::::S     SSSSSSSS:::::S     SSSSSSSPP:::::P     P:::::P
  P::::P     P:::::PS:::::S            S:::::S              P::::P     P:::::P
  P::::P     P:::::PS:::::S            S:::::S              P::::P     P:::::P
  P::::PPPPPP:::::P  S::::SSSS          S::::SSSS           P::::PPPPPP:::::P 
  P:::::::::::::PP    SS::::::SSSSS      SS::::::SSSSS      P:::::::::::::PP  
  P::::PPPPPPPPP        SSS::::::::SS      SSS::::::::SS    P::::PPPPPPPPP    
  P::::P                   SSSSSS::::S        SSSSSS::::S   P::::P            
  P::::P                        S:::::S            S:::::S  P::::P            
  P::::P                        S:::::S            S:::::S  P::::P            
PP::::::PP          SSSSSSS     S:::::SSSSSSSS     S:::::SPP::::::PP          
P::::::::P          S::::::SSSSSS:::::SS::::::SSSSSS:::::SP::::::::P          
P::::::::P          S:::::::::::::::SS S:::::::::::::::SS P::::::::P          
PPPPPPPPPP           SSSSSSSSSSSSSSS    SSSSSSSSSSSSSSS   PPPPPPPPPP          
                                                                              


====================================================================
 >Cross Validation Results
--------------------------------------------------------------------
fold0
Accuracy: 79.4157547020541%

		CONFUSION MATRIX

          H         E         C         
H    130270      2953     20891
E      5200     58506     20197
C     17648     12468    117390

    SOV_ALL    SOV_H      SOV_E      SOV_C
    76.1198    79.2853    76.4764    71.8957

    Q3_ALL     Q3_H       Q3_E       Q3_C      
    79.4158    84.5283    69.7305    79.5832

--------------------------------------------------------------------
fold1
Accuracy: 79.25625824169836%

		CONFUSION MATRIX

          H         E         C         
H    120504      2602     19401
E      4984     58068     19905
C     17366     11879    112327

    SOV_ALL    SOV_H      SOV_E      SOV_C
    75.8556    78.7883    76.9053    71.4983

    Q3_ALL     Q3_H       Q3_E       Q3_C      
    79.2563    84.5601    69.9977    79.3427

--------------------------------------------------------------------
fold2
Accuracy: 79.37592138888083%

		CONFUSION MATRIX

          H         E         C         
H    124018      2887     19658
E      5152     60547     20532
C     17487     12487    116415

    SOV_ALL    SOV_H      SOV_E      SOV_C
    76.1378    78.9431    77.0430    72.0150

    Q3_ALL     Q3_H       Q3_E       Q3_C      
    79.3759    84.6175    70.2149    79.5244

--------------------------------------------------------------------
fold3
Accuracy: 79.25728359904413%

		CONFUSION MATRIX

          H         E         C         
H    124582      2975     20564
E      4962     60181     21094
C     17104     12550    118045

    SOV_ALL    SOV_H      SOV_E      SOV_C
    75.5004    78.3860    76.4486    71.7034

    Q3_ALL     Q3_H       Q3_E       Q3_C      
    79.2573    84.1083    69.7856    79.9227

--------------------------------------------------------------------
fold4
Accuracy: 79.50597883072896%

		CONFUSION MATRIX

          H         E         C         
H    124720      3047     20030
E      4575     58588     19647
C     17021     12102    113169

    SOV_ALL    SOV_H      SOV_E      SOV_C
    76.6195    78.2817    77.1056    72.1126

    Q3_ALL     Q3_H       Q3_E       Q3_C      
    79.5060    84.3860    70.7499    79.5329

--------------------------------------------------------------------
====================================================================

              ___     ___      _        ___                __   
    o O O    | __|   / _ \    | |      |   \              /  \  
   o         | _|   | (_) |   | |__    | |) |    ___     | () | 
  TS__[O]   _|_|_    \___/    |____|   |___/    |___|    _\__/  
 {======| _| """ | _|"""""| _|"""""| _|"""""| _|"""""| _|"""""| 
./o--000' "`-0-0-' "`-0-0-' "`-0-0-' "`-0-0-' "`-0-0-' "`-0-0-' 
====================================================================
 >Ensembles Results
--------------------------------------------------------------------

    SOV_ALL    SOV_H      SOV_E      SOV_C
    77.0552    79.7888    77.0956    72.9127

    Q3_ALL     Q3_H       Q3_E       Q3_C      
    79.9387    84.4381    70.2120    80.7703

====================================================================
 >Ensembles + External Rules Results
--------------------------------------------------------------------

    SOV_ALL    SOV_H      SOV_E      SOV_C
    78.0368    80.2838    76.7137    73.1275

    Q3_ALL     Q3_H       Q3_E       Q3_C      
    79.9680    83.6050    69.1680    82.3112

====================================================================
 >Ensembles + External Rules + Decision Tree Results
--------------------------------------------------------------------

    SOV_ALL    SOV_H      SOV_E      SOV_C
    78.3855    79.9111    77.1874    73.7833

    Q3_ALL     Q3_H       Q3_E       Q3_C      
    81.3656    84.0949    71.2096    84.2908

====================================================================
 >Ensembles + Decision Tree Results
--------------------------------------------------------------------

    SOV_ALL    SOV_H      SOV_E      SOV_C
    80.0108    81.5103    79.7310    76.1326

    Q3_ALL     Q3_H       Q3_E       Q3_C      
    83.2978    86.3069    75.1153    84.8081

====================================================================
 >Ensembles + Decision Tree + External Rules Results
--------------------------------------------------------------------

    SOV_ALL    SOV_H      SOV_E      SOV_C
    80.5903    81.9255    79.2612    75.4882

    Q3_ALL     Q3_H       Q3_E       Q3_C      
    82.8602    85.3407    73.5301    85.5755

====================================================================
 >Ensembles + External Rules + Random Forest Results
--------------------------------------------------------------------

    SOV_ALL    SOV_H      SOV_E      SOV_C
    78.2880    80.2908    77.4759    73.1255

    Q3_ALL     Q3_H       Q3_E       Q3_C      
    81.4102    84.6393    71.8329    83.4841

====================================================================
 >Ensembles + Random Forest Results
--------------------------------------------------------------------

    SOV_ALL    SOV_H      SOV_E      SOV_C
    80.8173    82.7765    81.1077    76.1612

    Q3_ALL     Q3_H       Q3_E       Q3_C      
    83.9470    87.3924    76.8733    84.3708

====================================================================
 >Ensembles + Random Forest + External Rules Results
--------------------------------------------------------------------

    SOV_ALL    SOV_H      SOV_E      SOV_C
    81.4798    83.0903    80.3036    76.1650

    Q3_ALL     Q3_H       Q3_E       Q3_C      
    83.6215    86.5548    75.2583    85.3138

====================================================================

              ___     ___      _        ___                _    
    o O O    | __|   / _ \    | |      |   \              / |   
   o         | _|   | (_) |   | |__    | |) |    ___      | |   
  TS__[O]   _|_|_    \___/    |____|   |___/    |___|    _|_|_  
 {======| _| """ | _|"""""| _|"""""| _|"""""| _|"""""| _|"""""| 
./o--000' "`-0-0-' "`-0-0-' "`-0-0-' "`-0-0-' "`-0-0-' "`-0-0-' 
====================================================================
 >Ensembles Results
--------------------------------------------------------------------

    SOV_ALL    SOV_H      SOV_E      SOV_C
    76.7976    79.2163    77.4045    72.6267

    Q3_ALL     Q3_H       Q3_E       Q3_C      
    79.7453    84.3159    70.4666    80.5816

====================================================================
 >Ensembles + External Rules Results
--------------------------------------------------------------------

    SOV_ALL    SOV_H      SOV_E      SOV_C
    77.8596    79.2497    77.2882    73.0719

    Q3_ALL     Q3_H       Q3_E       Q3_C      
    79.8221    83.4717    69.5589    82.1624

====================================================================
 >Ensembles + External Rules + Decision Tree Results
--------------------------------------------------------------------

    SOV_ALL    SOV_H      SOV_E      SOV_C
    78.2372    78.3317    78.0911    73.9226

    Q3_ALL     Q3_H       Q3_E       Q3_C      
    81.2302    83.8155    71.9204    84.0830

====================================================================
 >Ensembles + Decision Tree Results
--------------------------------------------------------------------

    SOV_ALL    SOV_H      SOV_E      SOV_C
    79.5943    80.3291    80.0884    76.0046

    Q3_ALL     Q3_H       Q3_E       Q3_C      
    83.1518    85.9986    75.4813    84.7809

====================================================================
 >Ensembles + Decision Tree + External Rules Results
--------------------------------------------------------------------

    SOV_ALL    SOV_H      SOV_E      SOV_C
    80.4450    80.6247    79.9350    75.6729

    Q3_ALL     Q3_H       Q3_E       Q3_C      
    82.7739    84.9986    74.1143    85.6087

====================================================================
 >Ensembles + External Rules + Random Forest Results
--------------------------------------------------------------------

    SOV_ALL    SOV_H      SOV_E      SOV_C
    78.3325    78.9738    78.4426    73.4074

    Q3_ALL     Q3_H       Q3_E       Q3_C      
    81.2855    84.3334    72.6895    83.2545

====================================================================
 >Ensembles + Random Forest Results
--------------------------------------------------------------------

    SOV_ALL    SOV_H      SOV_E      SOV_C
    80.8010    82.0904    81.6237    76.1957

    Q3_ALL     Q3_H       Q3_E       Q3_C      
    83.8768    87.1957    77.3774    84.3444

====================================================================
 >Ensembles + Random Forest + External Rules Results
--------------------------------------------------------------------

    SOV_ALL    SOV_H      SOV_E      SOV_C
    81.5587    82.1671    81.1408    76.3740

    Q3_ALL     Q3_H       Q3_E       Q3_C      
    83.6095    86.4014    76.0514    85.2280

====================================================================

              ___     ___      _        ___               ___   
    o O O    | __|   / _ \    | |      |   \             |_  )  
   o         | _|   | (_) |   | |__    | |) |    ___      / /   
  TS__[O]   _|_|_    \___/    |____|   |___/    |___|    /___|  
 {======| _| """ | _|"""""| _|"""""| _|"""""| _|"""""| _|"""""| 
./o--000' "`-0-0-' "`-0-0-' "`-0-0-' "`-0-0-' "`-0-0-' "`-0-0-' 
====================================================================
 >Ensembles Results
--------------------------------------------------------------------

    SOV_ALL    SOV_H      SOV_E      SOV_C
    77.1218    79.0891    77.5758    73.0444

    Q3_ALL     Q3_H       Q3_E       Q3_C      
    79.8454    84.5111    70.4341    80.7178

====================================================================
 >Ensembles + External Rules Results
--------------------------------------------------------------------

    SOV_ALL    SOV_H      SOV_E      SOV_C
    78.1791    79.4484    77.5042    73.5319

    Q3_ALL     Q3_H       Q3_E       Q3_C      
    79.9007    83.6944    69.5110    82.2227

====================================================================
 >Ensembles + External Rules + Decision Tree Results
--------------------------------------------------------------------

    SOV_ALL    SOV_H      SOV_E      SOV_C
    78.4759    78.7944    77.8616    74.3578

    Q3_ALL     Q3_H       Q3_E       Q3_C      
    81.2383    84.0778    71.2864    84.2577

====================================================================
 >Ensembles + Decision Tree Results
--------------------------------------------------------------------

    SOV_ALL    SOV_H      SOV_E      SOV_C
    80.0477    80.5411    80.1725    76.5107

    Q3_ALL     Q3_H       Q3_E       Q3_C      
    83.1625    86.1684    75.1377    84.8800

====================================================================
 >Ensembles + Decision Tree + External Rules Results
--------------------------------------------------------------------

    SOV_ALL    SOV_H      SOV_E      SOV_C
    80.6356    80.5222    80.0012    76.1113

    Q3_ALL     Q3_H       Q3_E       Q3_C      
    82.7508    85.2548    73.6962    85.5775

====================================================================
 >Ensembles + External Rules + Random Forest Results
--------------------------------------------------------------------

    SOV_ALL    SOV_H      SOV_E      SOV_C
    78.4332    79.1613    78.2424    73.8578

    Q3_ALL     Q3_H       Q3_E       Q3_C      
    81.2858    84.5746    71.9764    83.4769

====================================================================
 >Ensembles + Random Forest Results
--------------------------------------------------------------------

    SOV_ALL    SOV_H      SOV_E      SOV_C
    80.6995    81.9491    81.3396    76.4293

    Q3_ALL     Q3_H       Q3_E       Q3_C      
    83.7743    87.2471    76.8842    84.3561

====================================================================
 >Ensembles + Random Forest + External Rules Results
--------------------------------------------------------------------

    SOV_ALL    SOV_H      SOV_E      SOV_C
    81.4937    81.8535    80.9608    76.5969

    Q3_ALL     Q3_H       Q3_E       Q3_C      
    83.4468    86.4209    75.4126    85.2018

====================================================================

              ___     ___      _        ___               ____  
    o O O    | __|   / _ \    | |      |   \             |__ /  
   o         | _|   | (_) |   | |__    | |) |    ___      |_ \  
  TS__[O]   _|_|_    \___/    |____|   |___/    |___|    |___/  
 {======| _| """ | _|"""""| _|"""""| _|"""""| _|"""""| _|"""""| 
./o--000' "`-0-0-' "`-0-0-' "`-0-0-' "`-0-0-' "`-0-0-' "`-0-0-' 
====================================================================
 >Ensembles Results
--------------------------------------------------------------------

    SOV_ALL    SOV_H      SOV_E      SOV_C
    76.4116    78.5796    77.0526    72.4699

    Q3_ALL     Q3_H       Q3_E       Q3_C      
    79.6865    84.0002    70.1648    80.9200

====================================================================
 >Ensembles + External Rules Results
--------------------------------------------------------------------

    SOV_ALL    SOV_H      SOV_E      SOV_C
    77.5137    78.8420    76.6486    72.8013

    Q3_ALL     Q3_H       Q3_E       Q3_C      
    79.6991    83.0794    69.1698    82.4569

====================================================================
 >Ensembles + External Rules + Decision Tree Results
--------------------------------------------------------------------

    SOV_ALL    SOV_H      SOV_E      SOV_C
    77.9269    78.4988    76.7990    73.3322

    Q3_ALL     Q3_H       Q3_E       Q3_C      
    81.0840    83.4885    71.0217    84.5476

====================================================================
 >Ensembles + Decision Tree Results
--------------------------------------------------------------------

    SOV_ALL    SOV_H      SOV_E      SOV_C
    79.4379    79.9471    79.7580    75.7921

    Q3_ALL     Q3_H       Q3_E       Q3_C      
    83.0088    85.7124    74.8577    85.0568

====================================================================
 >Ensembles + Decision Tree + External Rules Results
--------------------------------------------------------------------

    SOV_ALL    SOV_H      SOV_E      SOV_C
    79.9722    80.1228    78.9837    75.1913

    Q3_ALL     Q3_H       Q3_E       Q3_C      
    82.5979    84.7807    73.3142    85.8293

====================================================================
 >Ensembles + External Rules + Random Forest Results
--------------------------------------------------------------------

    SOV_ALL    SOV_H      SOV_E      SOV_C
    77.9452    78.8797    77.1816    72.8749

    Q3_ALL     Q3_H       Q3_E       Q3_C      
    81.1416    83.9962    71.7221    83.7785

====================================================================
 >Ensembles + Random Forest Results
--------------------------------------------------------------------

    SOV_ALL    SOV_H      SOV_E      SOV_C
    80.4177    81.8856    81.0484    75.8514

    Q3_ALL     Q3_H       Q3_E       Q3_C      
    83.6909    86.8634    76.7756    84.5470

====================================================================
 >Ensembles + Random Forest + External Rules Results
--------------------------------------------------------------------

    SOV_ALL    SOV_H      SOV_E      SOV_C
    81.0257    81.8025    80.1940    75.8248

    Q3_ALL     Q3_H       Q3_E       Q3_C      
    83.3768    86.0884    75.3006    85.3730

====================================================================

              ___     ___      _        ___              _ _    
    o O O    | __|   / _ \    | |      |   \            | | |   
   o         | _|   | (_) |   | |__    | |) |    ___    |_  _|  
  TS__[O]   _|_|_    \___/    |____|   |___/    |___|    _|_|_  
 {======| _| """ | _|"""""| _|"""""| _|"""""| _|"""""| _|"""""| 
./o--000' "`-0-0-' "`-0-0-' "`-0-0-' "`-0-0-' "`-0-0-' "`-0-0-' 
====================================================================
 >Ensembles Results
--------------------------------------------------------------------

    SOV_ALL    SOV_H      SOV_E      SOV_C
    77.2239    78.0298    77.6826    72.9472

    Q3_ALL     Q3_H       Q3_E       Q3_C      
    79.8868    84.0727    70.8308    80.8092

====================================================================
 >Ensembles + External Rules Results
--------------------------------------------------------------------

    SOV_ALL    SOV_H      SOV_E      SOV_C
    78.2491    78.3543    77.3740    73.2324

    Q3_ALL     Q3_H       Q3_E       Q3_C      
    79.8870    83.2263    69.9215    82.2183

====================================================================
 >Ensembles + External Rules + Decision Tree Results
--------------------------------------------------------------------

    SOV_ALL    SOV_H      SOV_E      SOV_C
    78.8083    78.1078    77.9038    73.9377

    Q3_ALL     Q3_H       Q3_E       Q3_C      
    81.2628    83.8271    71.6689    84.1825

====================================================================
 >Ensembles + Decision Tree Results
--------------------------------------------------------------------

    SOV_ALL    SOV_H      SOV_E      SOV_C
    80.3869    80.2473    80.3265    76.0852

    Q3_ALL     Q3_H       Q3_E       Q3_C      
    83.1104    85.8935    75.3037    84.7630

====================================================================
 >Ensembles + Decision Tree + External Rules Results
--------------------------------------------------------------------

    SOV_ALL    SOV_H      SOV_E      SOV_C
    80.9103    80.6130    79.7884    75.7062

    Q3_ALL     Q3_H       Q3_E       Q3_C      
    82.7363    85.0085    73.9198    85.5073

====================================================================
 >Ensembles + External Rules + Random Forest Results
--------------------------------------------------------------------

    SOV_ALL    SOV_H      SOV_E      SOV_C
    78.6762    78.4265    78.1792    73.3003

    Q3_ALL     Q3_H       Q3_E       Q3_C      
    81.3148    84.3820    72.2582    83.3996

====================================================================
 >Ensembles + Random Forest Results
--------------------------------------------------------------------

    SOV_ALL    SOV_H      SOV_E      SOV_C
    81.1487    81.6746    81.3491    76.1860

    Q3_ALL     Q3_H       Q3_E       Q3_C      
    83.7755    87.0877    76.9774    84.2915

====================================================================
 >Ensembles + Random Forest + External Rules Results
--------------------------------------------------------------------

    SOV_ALL    SOV_H      SOV_E      SOV_C
    81.8012    82.0919    80.6554    76.2761

    Q3_ALL     Q3_H       Q3_E       Q3_C      
    83.4977    86.3610    75.5537    85.1467

====================================================================

