[?1h=
                                              < M A T L A B (R) >
                                    Copyright 1984-2019 The MathWorks, Inc.
                                    R2019a (9.6.0.1072779) 64-bit (maci64)
                                                 March 8, 2019

 
To get started, type doc.
For product information, visit www.mathworks.com.
 
[?1l>