// Jest Snapshot v1, https://goo.gl/fbAQLP

exports[`Display nav buttons 1`] = `
<DocumentFragment>
  <div
    class="flex justify-between text-sm text-gray-500"
  >
    <div
      class="flex"
    >
      <a
        href="/"
        title="First page"
      >
        <svg
          class="w-4 h-4"
          fill="none"
          stroke="currentColor"
          viewBox="0 0 24 24"
          xmlns="http://www.w3.org/2000/svg"
        >
          <path
            d="M11 19l-7-7 7-7m8 14l-7-7 7-7"
            stroke-linecap="round"
            stroke-linejoin="round"
            stroke-width="2"
          />
        </svg>
      </a>
      <a
        href="/1"
        title="Previous page"
      >
        <svg
          class="w-4 h-4"
          fill="none"
          stroke="currentColor"
          viewBox="0 0 24 24"
          xmlns="http://www.w3.org/2000/svg"
        >
          <path
            d="M15 19l-7-7 7-7"
            stroke-linecap="round"
            stroke-linejoin="round"
            stroke-width="2"
          />
        </svg>
      </a>
    </div>
    <div>
      2/10
    </div>
    <div
      class="flex"
    >
      <a
        href="/3"
        title="Next page"
      >
        <svg
          class="w-4 h-4"
          fill="none"
          stroke="currentColor"
          viewBox="0 0 24 24"
          xmlns="http://www.w3.org/2000/svg"
        >
          <path
            d="M9 5l7 7-7 7"
            stroke-linecap="round"
            stroke-linejoin="round"
            stroke-width="2"
          />
        </svg>
      </a>
      <a
        href="/10"
        title="Last page"
      >
        <svg
          class="w-4 h-4"
          fill="none"
          stroke="currentColor"
          viewBox="0 0 24 24"
          xmlns="http://www.w3.org/2000/svg"
        >
          <path
            d="M13 5l7 7-7 7M5 5l7 7-7 7"
            stroke-linecap="round"
            stroke-linejoin="round"
            stroke-width="2"
          />
        </svg>
      </a>
    </div>
  </div>
</DocumentFragment>
`;

exports[`Do not display nav buttons 1`] = `
<DocumentFragment>
  <div
    class="flex justify-between text-sm text-gray-500"
  >
    <div />
    <div>
      1/10
    </div>
    <div />
  </div>
</DocumentFragment>
`;
