<?xml version="1.0"?>
<robot name="vehicle"
  xmlns:xacro="http://ros.org/wiki/xacro">
  <xacro:include filename="$(find rosa_description)/urdf/VLP-16.urdf.xacro"/>

  <xacro:arg name="config_dir" default="$(find rosa_description)"/>
  <xacro:property name="calibration" value="${load_yaml('$(arg config_dir)/sensors_calibration.yaml')}"/>
  <xacro:arg name="gpu" default="false"/>

  <!-- sensor kit -->
  <xacro:include filename="sensor_kit.xacro"/>
  <xacro:sensor_kit_macro parent="base_link" x="${calibration['base_link2pandar']['x']}" y="${calibration['base_link2pandar']['y']}" z="${calibration['base_link2pandar']['z']}" roll="${calibration['base_link2pandar']['roll']}" pitch="${calibration['base_link2pandar']['pitch']}" yaw="${calibration['base_link2pandar']['yaw']}" />
  <!-- embedded sensors -->
  <VLP-16 parent="base_link" name="esr_front" topic="/radar_markers" hz="10" samples="220" gpu="$(arg gpu)">
    <origin xyz="${calibration['base_link2esr_front']['x']} ${calibration['base_link2esr_front']['y']} ${calibration['base_link2esr_front']['z']}" rpy="${calibration['base_link2esr_front']['roll']} ${calibration['base_link2esr_front']['pitch']} ${calibration['base_link2esr_front']['yaw']}" />
  </VLP-16>
  <VLP-16 parent="base_link" name="esr_rear" topic="/radar_markers" hz="10" samples="220" gpu="$(arg gpu)">
    <origin xyz="${calibration['base_link2esr_rear']['x']} ${calibration['base_link2esr_rear']['y']} ${calibration['base_link2esr_rear']['z']}" rpy="${calibration['base_link2esr_rear']['roll']} ${calibration['base_link2esr_rear']['pitch']} ${calibration['base_link2esr_rear']['yaw']}" />
  </VLP-16>
  <VLP-16 parent="base_link" name="esr_right" topic="/radar_markers" hz="10" samples="220" gpu="$(arg gpu)">
    <origin xyz="${calibration['base_link2esr_right']['x']} ${calibration['base_link2esr_right']['y']} ${calibration['base_link2esr_right']['z']}" rpy="${calibration['base_link2esr_right']['roll']} ${calibration['base_link2esr_right']['pitch']} ${calibration['base_link2esr_right']['yaw']}" />
  </VLP-16>
  <VLP-16 parent="base_link" name="esr_left" topic="/radar_markers" hz="10" samples="220" gpu="$(arg gpu)">
    <origin xyz="${calibration['base_link2esr_left']['x']} ${calibration['base_link2esr_left']['y']} ${calibration['base_link2esr_left']['z']}" rpy="${calibration['base_link2esr_left']['roll']} ${calibration['base_link2esr_left']['pitch']} ${calibration['base_link2esr_left']['yaw']}" />
  </VLP-16>
  <!-- ars408 -->
  <VLP-16 parent="base_link" name="ars408_front" topic="/visualization" hz="10" samples="220" gpu="$(arg gpu)">
    <origin xyz="${calibration['base_link2ars408_front']['x']} ${calibration['base_link2ars408_front']['y']} ${calibration['base_link2ars408_front']['z']}" rpy="${calibration['base_link2ars408_front']['roll']} ${calibration['base_link2ars408_front']['pitch']} ${calibration['base_link2ars408_front']['yaw']}" />
  </VLP-16>
  <VLP-16 parent="base_link" name="ars408_left" topic="/visualization" hz="10" samples="220" gpu="$(arg gpu)">
    <origin xyz="${calibration['base_link2ars408_left']['x']} ${calibration['base_link2ars408_left']['y']} ${calibration['base_link2ars408_left']['z']}" rpy="${calibration['base_link2ars408_left']['roll']} ${calibration['base_link2ars408_left']['pitch']} ${calibration['base_link2ars408_left']['yaw']}" />
  </VLP-16>
  <VLP-16 parent="base_link" name="ars408_rear" topic="/visualization" hz="10" samples="220" gpu="$(arg gpu)">
    <origin xyz="${calibration['base_link2ars408_rear']['x']} ${calibration['base_link2ars408_rear']['y']} ${calibration['base_link2ars408_rear']['z']}" rpy="${calibration['base_link2ars408_rear']['roll']} ${calibration['base_link2ars408_rear']['pitch']} ${calibration['base_link2ars408_rear']['yaw']}" />
  </VLP-16>
  <VLP-16 parent="base_link" name="ars408_right" topic="/visualization" hz="10" samples="220" gpu="$(arg gpu)">
    <origin xyz="${calibration['base_link2ars408_right']['x']} ${calibration['base_link2ars408_right']['y']} ${calibration['base_link2ars408_right']['z']}" rpy="${calibration['base_link2ars408_right']['roll']} ${calibration['base_link2ars408_right']['pitch']} ${calibration['base_link2ars408_right']['yaw']}" />
  </VLP-16>

</robot>
