{
	"name": "ffmpeg-d",
	"description": "FFmpeg Bindings",
	"copyright": "Copyright © 2013",
	"license": "LGPL-2.1",
	"authors": [
		"Sumit Raja"
	],
	"targetType": "sourceLibrary",
	"platforms": ["Windows", "Posix"],
	"lflags": ["-L$LD_LIBRARY_PATH"],
    "libs": [
        "avcodec",
        "avformat",
        "avutil",
        "avfilter",
    ],
    
	"configurations": [
		{
			"name": "posix-test-executable",
            "mainSourceFile": "source/app.d",
			"targetType": "executable",
			"platforms": ["Posix"],
			"lflags": ["-L$LD_LIBRARY_PATH"],
            "libs": [
                "avcodec",
                "avformat",
                "avutil",
                "avfilter",
            ]
		},
		{
			"name": "windows-test-executable",
            "mainSourceFile": "source/app.d",
			"targetType": "executable",
            "platforms": ["Windows"],
            "libs": [
                "avcodec",
                "avformat",
                "avutil",
                "avfilter",
            ]
		},
	]
}
