{
"MovingActor": // This is the definition name for the actor and is what must be used when referring to it (the filename doesn't matter).
{
	"name": "Moving Actor", // This can be omitted.
	"components":
	{
		"Transform": // The default values are fine, so we don't specify them.
		{
		},
		"Physics":
		{
			"shape":
			{
				"type": "circle",
				"radius": 1.0
			},
			"density": 100.0,
			"linearDamping": 0.7,
			"angularDamping": 0.04
			// The default values for the rest are fine.
		}
	}
}
}
