{
    "name": "Unity.PepUpUI.Editor",
    "rootNamespace": "",
    "references": [
        "GUID:52a416f1784e9f04aa31f2f04b973e4b"
    ],
    "includePlatforms": [],
    "excludePlatforms": [],
    "allowUnsafeCode": false,
    "overrideReferences": false,
    "precompiledReferences": [],
    "autoReferenced": true,
    "defineConstraints": [],
    "versionDefines": [],
    "noEngineReferences": false
}