<svg width="20" height="24" viewBox="0 0 20 24" fill="none" xmlns="http://www.w3.org/2000/svg">
  <path
    d="M9 13.0153V16.4554C9 16.7803 9.096 17.0528 9.288 17.273C9.48 17.4931 9.71733 17.6028 10 17.6021C10.2833 17.6021 10.521 17.492 10.713 17.2718C10.905 17.0516 11.0007 16.7795 11 16.4554V13.0153H14C14.2833 13.0153 14.521 12.9052 14.713 12.6851C14.905 12.4649 15.0007 12.1928 15 11.8686C15 11.5437 14.904 11.2712 14.712 11.051C14.52 10.8309 14.2827 10.7212 14 10.7219H11V7.2819C11 6.957 10.904 6.68448 10.712 6.46431C10.52 6.24415 10.2827 6.13445 10 6.13521C9.71667 6.13521 9.479 6.2453 9.287 6.46546C9.095 6.68562 8.99933 6.95777 9 7.2819V10.7219H6C5.71667 10.7219 5.479 10.832 5.287 11.0522C5.095 11.2724 4.99933 11.5445 5 11.8686C5 12.1935 5.096 12.4661 5.288 12.6862C5.48 12.9064 5.71733 13.0161 6 13.0153H9ZM10 23.3355C8.61667 23.3355 7.31667 23.0343 6.1 22.4319C4.88333 21.8295 3.825 21.0127 2.925 19.9814C2.025 18.9494 1.31267 17.7358 0.788 16.3407C0.263333 14.9456 0.000666667 13.4549 0 11.8686C0 10.2824 0.262667 8.7917 0.788 7.39657C1.31333 6.00143 2.02567 4.78786 2.925 3.75584C3.825 2.72383 4.88333 1.90701 6.1 1.30538C7.31667 0.703755 8.61667 0.402559 10 0.401794C11.3833 0.401794 12.6833 0.70299 13.9 1.30538C15.1167 1.90777 16.175 2.72459 17.075 3.75584C17.975 4.78786 18.6877 6.00143 19.213 7.39657C19.7383 8.7917 20.0007 10.2824 20 11.8686C20 13.4549 19.7373 14.9456 19.212 16.3407C18.6867 17.7358 17.9743 18.9494 17.075 19.9814C16.175 21.0134 15.1167 21.8306 13.9 22.433C12.6833 23.0354 11.3833 23.3362 10 23.3355Z"
    fill="#43D0C1" />
</svg>