<?xml version="1.0" encoding="UTF-8" standalone="no"?>
<!DOCTYPE svg PUBLIC "-//W3C//DTD SVG 1.1//EN" "http://www.w3.org/Graphics/SVG/1.1/DTD/svg11.dtd">
<svg width="100%" height="100%" viewBox="0 0 100 100" version="1.1" xmlns="http://www.w3.org/2000/svg" xmlns:xlink="http://www.w3.org/1999/xlink" xml:space="preserve" xmlns:serif="http://www.serif.com/" style="fill-rule:evenodd;clip-rule:evenodd;stroke-linejoin:round;stroke-miterlimit:2;">
    <g transform="matrix(0.0141368,0,0,0.0141368,0.430416,2.46138)">
        <circle cx="3506.41" cy="3362.75" r="3536.86" style="fill:rgb(228,228,228);"/>
    </g>
    <g transform="matrix(59.7438,0,0,59.7438,33.3429,70.7266)">
        <path d="M0.072,-0.643C0.135,-0.662 0.202,-0.671 0.274,-0.671C0.345,-0.671 0.397,-0.657 0.429,-0.63C0.461,-0.603 0.477,-0.559 0.477,-0.499C0.477,-0.468 0.473,-0.446 0.465,-0.433C0.456,-0.419 0.45,-0.408 0.445,-0.401C0.44,-0.394 0.433,-0.387 0.425,-0.38C0.41,-0.369 0.399,-0.361 0.39,-0.356L0.379,-0.349C0.418,-0.335 0.446,-0.317 0.465,-0.296C0.484,-0.274 0.493,-0.238 0.493,-0.189C0.493,-0.122 0.476,-0.072 0.442,-0.039C0.407,-0.006 0.353,0.01 0.279,0.01C0.22,0.01 0.158,0.003 0.093,-0.01L0.062,-0.017L0.069,-0.08C0.141,-0.065 0.208,-0.058 0.271,-0.058C0.366,-0.059 0.414,-0.101 0.414,-0.186C0.414,-0.265 0.369,-0.307 0.278,-0.31L0.145,-0.31L0.145,-0.376L0.278,-0.376C0.306,-0.376 0.333,-0.387 0.359,-0.41C0.385,-0.432 0.398,-0.461 0.398,-0.498C0.398,-0.535 0.388,-0.561 0.367,-0.578C0.346,-0.594 0.312,-0.602 0.263,-0.602C0.21,-0.602 0.157,-0.597 0.105,-0.587L0.079,-0.582L0.072,-0.643Z" style="fill-rule:nonzero;"/>
    </g>
</svg>
