<?xml version="1.0" encoding="UTF-8" standalone="no"?>
<!DOCTYPE svg PUBLIC "-//W3C//DTD SVG 1.1//EN" "http://www.w3.org/Graphics/SVG/1.1/DTD/svg11.dtd">
<svg width="100%" height="100%" viewBox="0 0 100 100" version="1.1" xmlns="http://www.w3.org/2000/svg" xmlns:xlink="http://www.w3.org/1999/xlink" xml:space="preserve" xmlns:serif="http://www.serif.com/" style="fill-rule:evenodd;clip-rule:evenodd;stroke-linejoin:round;stroke-miterlimit:2;">
    <g transform="matrix(0.0141368,0,0,0.0141368,0.430416,2.46138)">
        <circle cx="3506.41" cy="3362.75" r="3536.86" style="fill:rgb(54,165,137);"/>
    </g>
    <g transform="matrix(59.7438,0,0,59.7438,33.3429,70.7266)">
        <path d="M0.477,-0.66L0.477,-0.59L0.156,-0.59L0.138,-0.375C0.189,-0.402 0.241,-0.416 0.293,-0.416C0.433,-0.416 0.503,-0.351 0.503,-0.221C0.503,-0.146 0.484,-0.089 0.445,-0.05C0.406,-0.011 0.352,0.009 0.282,0.009C0.226,0.009 0.164,0.002 0.096,-0.013L0.063,-0.02L0.072,-0.081C0.149,-0.066 0.213,-0.059 0.266,-0.059C0.318,-0.059 0.357,-0.073 0.384,-0.1C0.411,-0.127 0.424,-0.164 0.424,-0.213C0.424,-0.262 0.412,-0.296 0.388,-0.317C0.363,-0.337 0.329,-0.347 0.284,-0.347C0.26,-0.347 0.235,-0.344 0.209,-0.337C0.182,-0.33 0.162,-0.324 0.148,-0.317L0.127,-0.307L0.074,-0.317L0.092,-0.66L0.477,-0.66Z" style="fill:white;fill-rule:nonzero;"/>
    </g>
</svg>
