{
	"info": {
		"_postman_id": "ef6f1b14-50d0-4b89-a3fb-8d3b3f81f9c8",
		"name": "S32",
		"schema": "https://schema.getpostman.com/json/collection/v2.1.0/collection.json"
	},
	"item": [
		{
			"name": "S32 ACTIVITY",
			"item": [
				{
					"name": "GET METHOD",
					"request": {
						"method": "GET",
						"header": []
					},
					"response": []
				},
				{
					"name": "POST METHOD",
					"request": {
						"method": "POST",
						"header": []
					},
					"response": []
				},
				{
					"name": "PUT METHOD",
					"request": {
						"method": "PUT",
						"header": []
					},
					"response": []
				},
				{
					"name": "DELETE METHOD",
					"request": {
						"method": "DELETE",
						"header": []
					},
					"response": []
				}
			]
		},
		{
			"name": "GET METHOD",
			"request": {
				"method": "GET",
				"header": [],
				"url": {
					"raw": "localhost:4000/items",
					"host": [
						"localhost"
					],
					"port": "4000",
					"path": [
						"items"
					]
				}
			},
			"response": []
		},
		{
			"name": "POST METHOD",
			"request": {
				"method": "POST",
				"header": [],
				"url": {
					"raw": "http://localhost:4000/items",
					"protocol": "http",
					"host": [
						"localhost"
					],
					"port": "4000",
					"path": [
						"items"
					]
				}
			},
			"response": []
		},
		{
			"name": "CRUD GET METHOD",
			"request": {
				"method": "GET",
				"header": []
			},
			"response": []
		},
		{
			"name": "CRUD POST METHOD",
			"request": {
				"method": "POST",
				"header": []
			},
			"response": []
		}
	]
}