{
	"info": {
		"_postman_id": "29fe9f4a-c070-4ca3-ad17-51627c45b4ac",
		"name": "Capstone 2",
		"schema": "https://schema.getpostman.com/json/collection/v2.1.0/collection.json"
	},
	"item": [
		{
			"name": "User Registration",
			"request": {
				"method": "POST",
				"header": [],
				"body": {
					"mode": "raw",
					"raw": "{\r\n    \"firstName\": \"John\",\r\n    \"lastName\": \"Smith\",\r\n    \"email\": \"John123@mail.com\",\r\n    \"mobileNo\": \"09874513656\",\r\n    \"password\": \"John123\"\r\n}",
					"options": {
						"raw": {
							"language": "json"
						}
					}
				},
				"url": {
					"raw": "localhost:4000/users/register",
					"host": [
						"localhost"
					],
					"port": "4000",
					"path": [
						"users",
						"register"
					]
				}
			},
			"response": []
		},
		{
			"name": "User Auth",
			"request": {
				"auth": {
					"type": "bearer",
					"bearer": [
						{
							"key": "token",
							"value": "eyJhbGciOiJIUzI1NiIsInR5cCI6IkpXVCJ9.eyJpZCI6IjYzY2E1ZWM3MmMzMDU5YzU4NDVlZWY5OCIsImVtYWlsIjoiZm9sZGVkc0BtYWlsLmNvbSIsImlzQWRtaW4iOnRydWUsImlhdCI6MTY3NDQzMzgyMX0.2OqBZ7LpkXQYLjeT5dfdoPGyrHkKz8y3Cu6e9epM8Mo",
							"type": "string"
						}
					]
				},
				"method": "POST",
				"header": [],
				"body": {
					"mode": "raw",
					"raw": "{\r\n    \"email\":  \"John123@mail.com\",\r\n    \"password\": \"John123\"\r\n\r\n}",
					"options": {
						"raw": {
							"language": "json"
						}
					}
				},
				"url": {
					"raw": "localhost:4000/users/login",
					"host": [
						"localhost"
					],
					"port": "4000",
					"path": [
						"users",
						"login"
					]
				}
			},
			"response": []
		},
		{
			"name": "Create Product(Admin)",
			"request": {
				"auth": {
					"type": "bearer",
					"bearer": [
						{
							"key": "token",
							"value": "eyJhbGciOiJIUzI1NiIsInR5cCI6IkpXVCJ9.eyJpZCI6IjYzY2E1ZWM3MmMzMDU5YzU4NDVlZWY5OCIsImVtYWlsIjoiZm9sZGVkc0BtYWlsLmNvbSIsImlzQWRtaW4iOnRydWUsImlhdCI6MTY3NDQ2MDM0MX0.EKM0qou5C-Xd3WEkP5MzCMOPMMpBR9-GvfLpUFxItyU",
							"type": "string"
						}
					]
				},
				"method": "POST",
				"header": [],
				"body": {
					"mode": "raw",
					"raw": "{\r\n    \"productName\": \"yow\",\r\n    \"productBrand\": \"me\",\r\n\t\"description\": \"Maalat\",\r\n\t\"price\": 1000\r\n}",
					"options": {
						"raw": {
							"language": "json"
						}
					}
				},
				"url": {
					"raw": "localhost:4000/products/add",
					"host": [
						"localhost"
					],
					"port": "4000",
					"path": [
						"products",
						"add"
					]
				}
			},
			"response": []
		},
		{
			"name": "Retrieve All Active Product",
			"request": {
				"method": "GET",
				"header": [],
				"url": {
					"raw": "localhost:4000/products/all",
					"host": [
						"localhost"
					],
					"port": "4000",
					"path": [
						"products",
						"all"
					]
				}
			},
			"response": []
		},
		{
			"name": "Retrieve Single Product",
			"request": {
				"method": "GET",
				"header": [],
				"url": {
					"raw": "localhost:4000/products/",
					"host": [
						"localhost"
					],
					"port": "4000",
					"path": [
						"products",
						""
					]
				}
			},
			"response": []
		},
		{
			"name": "Retrieve User Details",
			"request": {
				"auth": {
					"type": "bearer",
					"bearer": [
						{
							"key": "token",
							"value": "eyJhbGciOiJIUzI1NiIsInR5cCI6IkpXVCJ9.eyJpZCI6IjYzY2E0MTdhZjY5M2ZjN2QwNjUyMTUyNCIsImVtYWlsIjoiZG9uZ3BldGVAbWFpbC5jb20iLCJpc0FkbWluIjpmYWxzZSwiaWF0IjoxNjc0MjAwMTg5fQ.xMEsuPBKXGRHpFBbEFx55u5yGH_CRzjTspZX-dLCAAg",
							"type": "string"
						}
					]
				},
				"method": "POST",
				"header": [],
				"body": {
					"mode": "raw",
					"raw": "{\r\n    \"id\": \"63ca417af693fc7d06521524\"\r\n}",
					"options": {
						"raw": {
							"language": "json"
						}
					}
				},
				"url": {
					"raw": "localhost:4000/users/details",
					"host": [
						"localhost"
					],
					"port": "4000",
					"path": [
						"users",
						"details"
					]
				}
			},
			"response": []
		},
		{
			"name": "Update Product Info(Admin)",
			"request": {
				"auth": {
					"type": "bearer",
					"bearer": [
						{
							"key": "token",
							"value": "eyJhbGciOiJIUzI1NiIsInR5cCI6IkpXVCJ9.eyJpZCI6IjYzY2E1ZWM3MmMzMDU5YzU4NDVlZWY5OCIsImVtYWlsIjoiZm9sZGVkc0BtYWlsLmNvbSIsImlzQWRtaW4iOnRydWUsImlhdCI6MTY3NDQzMzgyMX0.2OqBZ7LpkXQYLjeT5dfdoPGyrHkKz8y3Cu6e9epM8Mo",
							"type": "string"
						}
					]
				},
				"method": "PUT",
				"header": [],
				"body": {
					"mode": "raw",
					"raw": "{\r\n    \"productName\" : \"crocky\",\r\n\t\"description\": \"nadaya\",\r\n\t\"price\": 5000\r\n}",
					"options": {
						"raw": {
							"language": "json"
						}
					}
				},
				"url": {
					"raw": "localhost:4000/products/63ca54b0c3821e30036f3381",
					"host": [
						"localhost"
					],
					"port": "4000",
					"path": [
						"products",
						"63ca54b0c3821e30036f3381"
					]
				}
			},
			"response": []
		},
		{
			"name": "Archive Product(Admin)",
			"request": {
				"auth": {
					"type": "bearer",
					"bearer": [
						{
							"key": "token",
							"value": "eyJhbGciOiJIUzI1NiIsInR5cCI6IkpXVCJ9.eyJpZCI6IjYzY2E1ZWM3MmMzMDU5YzU4NDVlZWY5OCIsImVtYWlsIjoiZm9sZGVkc0BtYWlsLmNvbSIsImlzQWRtaW4iOnRydWUsImlhdCI6MTY3NDQzMzgyMX0.2OqBZ7LpkXQYLjeT5dfdoPGyrHkKz8y3Cu6e9epM8Mo",
							"type": "string"
						}
					]
				},
				"method": "PUT",
				"header": [],
				"body": {
					"mode": "raw",
					"raw": "{\r\n    \"isActive\": false\r\n}",
					"options": {
						"raw": {
							"language": "json"
						}
					}
				},
				"url": {
					"raw": "localhost:4000/products/63cdce7464b7a29a07744f62/archive",
					"host": [
						"localhost"
					],
					"port": "4000",
					"path": [
						"products",
						"63cdce7464b7a29a07744f62",
						"archive"
					]
				}
			},
			"response": []
		},
		{
			"name": "User Checkout",
			"request": {
				"auth": {
					"type": "bearer",
					"bearer": [
						{
							"key": "token",
							"value": "eyJhbGciOiJIUzI1NiIsInR5cCI6IkpXVCJ9.eyJpZCI6IjYzY2Y2ZDliNGQ2YjdhOTljODhkYzI3YSIsImVtYWlsIjoiamFjb2JwMTIzQG1haWwuY29tIiwiaXNBZG1pbiI6ZmFsc2UsImlhdCI6MTY3NDUzOTgyNn0.0ft7CCe_w9_7Dc0r4g3QAmSEvPmCpwizgENbN8YA-C4",
							"type": "string"
						}
					]
				},
				"method": "POST",
				"header": [],
				"body": {
					"mode": "raw",
					"raw": "{\r\n    \"userId\": \"63cf6d9b4d6b7a99c88dc27a\",\r\n    \"productId\": \"63ce3d1f4d37c087a6a8e9da\",\r\n    \"quantity\": 4\r\n}",
					"options": {
						"raw": {
							"language": "json"
						}
					}
				},
				"url": {
					"raw": "localhost:4000/users/myOrder",
					"host": [
						"localhost"
					],
					"port": "4000",
					"path": [
						"users",
						"myOrder"
					]
				}
			},
			"response": []
		},
		{
			"name": "Add Admin User",
			"request": {
				"auth": {
					"type": "bearer",
					"bearer": [
						{
							"key": "token",
							"value": "eyJhbGciOiJIUzI1NiIsInR5cCI6IkpXVCJ9.eyJpZCI6IjYzY2E1ZWM3MmMzMDU5YzU4NDVlZWY5OCIsImVtYWlsIjoiZm9sZGVkc0BtYWlsLmNvbSIsImlzQWRtaW4iOnRydWUsImlhdCI6MTY3NDQzMzgyMX0.2OqBZ7LpkXQYLjeT5dfdoPGyrHkKz8y3Cu6e9epM8Mo",
							"type": "string"
						}
					]
				},
				"method": "PUT",
				"header": [],
				"url": {
					"raw": "localhost:4000/users/63cf80aecc7eab1841ddcf1b/setAsAdmin",
					"host": [
						"localhost"
					],
					"port": "4000",
					"path": [
						"users",
						"63cf80aecc7eab1841ddcf1b",
						"setAsAdmin"
					]
				}
			},
			"response": []
		},
		{
			"name": "Get All Orders(Admin)",
			"request": {
				"auth": {
					"type": "bearer",
					"bearer": [
						{
							"key": "token",
							"value": "eyJhbGciOiJIUzI1NiIsInR5cCI6IkpXVCJ9.eyJpZCI6IjYzY2Y4MGFlY2M3ZWFiMTg0MWRkY2YxYiIsImVtYWlsIjoiZGF2ZTEyM0BtYWlsLmNvbSIsImlzQWRtaW4iOnRydWUsImlhdCI6MTY3NDU0MzUwMH0.MqdDewBTVhKPcKcRly54X9e7qHQeLGIqc1NepUZ3Xx8",
							"type": "string"
						}
					]
				},
				"method": "GET",
				"header": [],
				"url": {
					"raw": "localhost:4000/users/getAllOrder",
					"host": [
						"localhost"
					],
					"port": "4000",
					"path": [
						"users",
						"getAllOrder"
					]
				}
			},
			"response": []
		},
		{
			"name": "Get User Orders",
			"protocolProfileBehavior": {
				"disableBodyPruning": true
			},
			"request": {
				"auth": {
					"type": "bearer",
					"bearer": [
						{
							"key": "token",
							"value": "eyJhbGciOiJIUzI1NiIsInR5cCI6IkpXVCJ9.eyJpZCI6IjYzZDA3MTM3ZWEzY2IyMjk4ZDI4YWVkOSIsImVtYWlsIjoiZGF3eW4xMjNAbWFpbC5jb20iLCJpc0FkbWluIjpmYWxzZSwiaWF0IjoxNjc0NjA0ODU3fQ.ZM8oXQCAY5xMmaZdpvc7Pu_SlY7R2Kajn9wKfcjjArE",
							"type": "string"
						}
					]
				},
				"method": "GET",
				"header": [],
				"body": {
					"mode": "raw",
					"raw": ""
				},
				"url": {
					"raw": "localhost:4000/users/63d0660ca598ca072eb6b3df/allMyOrder",
					"host": [
						"localhost"
					],
					"port": "4000",
					"path": [
						"users",
						"63d0660ca598ca072eb6b3df",
						"allMyOrder"
					]
				}
			},
			"response": []
		}
	]
}