Starting Single Run, Sweeps and Corners...

Current time: Fri Dec  4 03:39:40 2020 
Best design point: 1
Design specs: 
	LAB1:XOR_test:1	corner	Nominal - 
Design parameters: 

Interactive.18
Number of points completed: 1
Number of simulation errors: 0
Interactive.18 completed. 
Current time: Fri Dec  4 03:39:43 2020 
