Starting Single Run, Sweeps and Corners...

Current time: Sun Nov 29 17:55:51 2020 
Best design point: 1
Design specs: 
	LAB1:OR_test:1	corner	Nominal - 
Design parameters: 

Interactive.9
Number of points completed: 1
Number of simulation errors: 0
Interactive.9 completed. 
Current time: Sun Nov 29 17:55:54 2020 
