Starting Single Run, Sweeps and Corners...

Current time: Thu Dec  3 03:33:31 2020 
Best design point: 1
Design specs: 
	LAB1:full_custom_adder_test:1	corner	Nominal - 
Design parameters: 

Interactive.46
Number of points completed: 1
Number of simulation errors: 0
Interactive.46 completed. 
Current time: Thu Dec  3 03:33:41 2020 
