<svg xmlns="http://www.w3.org/2000/svg" width="89.548" height="84.623" viewBox="0 0 89.548 84.623">
  <g id="_24-hours" data-name="24-hours" transform="translate(0 -14.097)">
    <path id="Path_348" data-name="Path 348" d="M94.359,182.183a11.8,11.8,0,1,0-11.8-11.8A11.815,11.815,0,0,0,94.359,182.183Zm0-18.361a6.559,6.559,0,1,1-6.559,6.559A6.567,6.567,0,0,1,94.359,163.823Z" transform="translate(-68.133 -119.239)" fill="#ffd46d"/>
    <path id="Path_349" data-name="Path 349" d="M45.569,308.145A14.5,14.5,0,0,0,31.09,293.667H21.361A14.5,14.5,0,0,0,6.883,308.145V324.2H0v5.242H89.458V324.2H45.569Zm-33.444,0a9.247,9.247,0,0,1,9.237-9.237h2.244v18.223h5.242V298.909H31.09a9.247,9.247,0,0,1,9.237,9.237V324.2h-28.2Z" transform="translate(0 -230.723)" fill="#ffd46d"/>
    <path id="Path_350" data-name="Path 350" d="M185.45,21.058a29.032,29.032,0,0,1,25.438,51.786l2.77-6.9-4.864-1.953-6.373,15.87,16.224,4.911,1.519-5.017-7.037-2.13A34.275,34.275,0,1,0,169.6,25.638l3.924,3.476a29.057,29.057,0,0,1,11.925-8.056Z" transform="translate(-139.968)" fill="#ffd46d"/>
    <path id="Path_351" data-name="Path 351" d="M240.566,163.458V165.6h12.253v-3.734H246.6l4.332-5.6a6.992,6.992,0,0,0,1.567-4.3,5.687,5.687,0,0,0-1.31-3.88,5.612,5.612,0,0,0-4.432-1.812,5.759,5.759,0,0,0-4.028,1.555,5.568,5.568,0,0,0-1.787,3.838l-.044.765,3.779.72.093-.953c.133-1.372.876-2.191,1.986-2.191a1.638,1.638,0,0,1,1.407.521,2.164,2.164,0,0,1,.451,1.437c0,.812-.184,1.433-1.231,2.766Z" transform="translate(-198.534 -109.079)" fill="#ffd46d"/>
    <path id="Path_352" data-name="Path 352" d="M322.9,147.408l-7.719,13.456v1.976h7.55v3.7h3.883v-3.7h2.161v-3.734h-2.161v-11.7Zm-.169,11.7h-2.354l2.354-4.2Z" transform="translate(-260.115 -110.019)" fill="#ffd46d"/>
  </g>
</svg>
