C:\Users\e.francisco.000\Source\Repos\Common\Common.UI\dist\out-tsc\e2e\app.po.js
C:\Users\e.francisco.000\Source\Repos\Common\Common.UI\dist\out-tsc\e2e\app.po.js.map
C:\Users\e.francisco.000\Source\Repos\Common\Common.UI\dist\out-tsc\e2e\app.e2e-spec.js
C:\Users\e.francisco.000\Source\Repos\Common\Common.UI\dist\out-tsc\e2e\app.e2e-spec.js.map
C:\Users\e.francisco.000\Source\Repos\Common\Common.UI\dist\out-tsc\src\app\core\models\auth-request.js
C:\Users\e.francisco.000\Source\Repos\Common\Common.UI\dist\out-tsc\src\app\core\models\auth-request.js.map
C:\Users\e.francisco.000\Source\Repos\Common\Common.UI\dist\out-tsc\src\app\core\models\user-profile.js
C:\Users\e.francisco.000\Source\Repos\Common\Common.UI\dist\out-tsc\src\app\core\models\user-profile.js.map
C:\Users\e.francisco.000\Source\Repos\Common\Common.UI\dist\out-tsc\src\app\core\models\index.js
C:\Users\e.francisco.000\Source\Repos\Common\Common.UI\dist\out-tsc\src\app\core\models\index.js.map
C:\Users\e.francisco.000\Source\Repos\Common\Common.UI\dist\out-tsc\src\app\core\models\menu-item.js
C:\Users\e.francisco.000\Source\Repos\Common\Common.UI\dist\out-tsc\src\app\core\models\menu-item.js.map
C:\Users\e.francisco.000\Source\Repos\Common\Common.UI\dist\out-tsc\src\app\core\auth\auth.service.js
C:\Users\e.francisco.000\Source\Repos\Common\Common.UI\dist\out-tsc\src\app\core\auth\auth.service.js.map
C:\Users\e.francisco.000\Source\Repos\Common\Common.UI\dist\out-tsc\src\app\core\auth\auth.guard.js
C:\Users\e.francisco.000\Source\Repos\Common\Common.UI\dist\out-tsc\src\app\core\auth\auth.guard.js.map
C:\Users\e.francisco.000\Source\Repos\Common\Common.UI\dist\out-tsc\src\app\app.component.js
C:\Users\e.francisco.000\Source\Repos\Common\Common.UI\dist\out-tsc\src\app\app.component.js.map
C:\Users\e.francisco.000\Source\Repos\Common\Common.UI\dist\out-tsc\src\app\shared\nav-dropdown.directive.js
C:\Users\e.francisco.000\Source\Repos\Common\Common.UI\dist\out-tsc\src\app\shared\nav-dropdown.directive.js.map
C:\Users\e.francisco.000\Source\Repos\Common\Common.UI\dist\out-tsc\src\app\shared\sidebar.directive.js
C:\Users\e.francisco.000\Source\Repos\Common\Common.UI\dist\out-tsc\src\app\shared\sidebar.directive.js.map
C:\Users\e.francisco.000\Source\Repos\Common\Common.UI\dist\out-tsc\src\app\shared\aside.directive.js
C:\Users\e.francisco.000\Source\Repos\Common\Common.UI\dist\out-tsc\src\app\shared\aside.directive.js.map
C:\Users\e.francisco.000\Source\Repos\Common\Common.UI\dist\out-tsc\src\app\shared\breadcrumb.component.js
C:\Users\e.francisco.000\Source\Repos\Common\Common.UI\dist\out-tsc\src\app\shared\breadcrumb.component.js.map
C:\Users\e.francisco.000\Source\Repos\Common\Common.UI\dist\out-tsc\src\app\core\http\http-status-codes.js
C:\Users\e.francisco.000\Source\Repos\Common\Common.UI\dist\out-tsc\src\app\core\http\http-status-codes.js.map
C:\Users\e.francisco.000\Source\Repos\Common\Common.UI\dist\out-tsc\src\app\core\http\model.service.js
C:\Users\e.francisco.000\Source\Repos\Common\Common.UI\dist\out-tsc\src\app\core\http\model.service.js.map
C:\Users\e.francisco.000\Source\Repos\Common\Common.UI\dist\out-tsc\src\app\core\http\base-http.service.js
C:\Users\e.francisco.000\Source\Repos\Common\Common.UI\dist\out-tsc\src\app\core\http\base-http.service.js.map
C:\Users\e.francisco.000\Source\Repos\Common\Common.UI\dist\out-tsc\src\app\core\http\index.js
C:\Users\e.francisco.000\Source\Repos\Common\Common.UI\dist\out-tsc\src\app\core\http\index.js.map
C:\Users\e.francisco.000\Source\Repos\Common\Common.UI\dist\out-tsc\src\app\models\models\user-type.js
C:\Users\e.francisco.000\Source\Repos\Common\Common.UI\dist\out-tsc\src\app\models\models\user-type.js.map
C:\Users\e.francisco.000\Source\Repos\Common\Common.UI\dist\out-tsc\src\app\models\models\user.js
C:\Users\e.francisco.000\Source\Repos\Common\Common.UI\dist\out-tsc\src\app\models\models\user.js.map
C:\Users\e.francisco.000\Source\Repos\Common\Common.UI\dist\out-tsc\src\app\models\models\role.js
C:\Users\e.francisco.000\Source\Repos\Common\Common.UI\dist\out-tsc\src\app\models\models\role.js.map
C:\Users\e.francisco.000\Source\Repos\Common\Common.UI\dist\out-tsc\src\app\models\models\district.js
C:\Users\e.francisco.000\Source\Repos\Common\Common.UI\dist\out-tsc\src\app\models\models\district.js.map
C:\Users\e.francisco.000\Source\Repos\Common\Common.UI\dist\out-tsc\src\app\models\models\province.js
C:\Users\e.francisco.000\Source\Repos\Common\Common.UI\dist\out-tsc\src\app\models\models\province.js.map
C:\Users\e.francisco.000\Source\Repos\Common\Common.UI\dist\out-tsc\src\app\models\models\municipality.js
C:\Users\e.francisco.000\Source\Repos\Common\Common.UI\dist\out-tsc\src\app\models\models\municipality.js.map
C:\Users\e.francisco.000\Source\Repos\Common\Common.UI\dist\out-tsc\src\app\models\models\address.js
C:\Users\e.francisco.000\Source\Repos\Common\Common.UI\dist\out-tsc\src\app\models\models\address.js.map
C:\Users\e.francisco.000\Source\Repos\Common\Common.UI\dist\out-tsc\src\app\models\models\person.js
C:\Users\e.francisco.000\Source\Repos\Common\Common.UI\dist\out-tsc\src\app\models\models\person.js.map
C:\Users\e.francisco.000\Source\Repos\Common\Common.UI\dist\out-tsc\src\app\models\models\marital-status.js
C:\Users\e.francisco.000\Source\Repos\Common\Common.UI\dist\out-tsc\src\app\models\models\marital-status.js.map
C:\Users\e.francisco.000\Source\Repos\Common\Common.UI\dist\out-tsc\src\app\models\models\identification-type.js
C:\Users\e.francisco.000\Source\Repos\Common\Common.UI\dist\out-tsc\src\app\models\models\identification-type.js.map
C:\Users\e.francisco.000\Source\Repos\Common\Common.UI\dist\out-tsc\src\app\models\models\contact-information.js
C:\Users\e.francisco.000\Source\Repos\Common\Common.UI\dist\out-tsc\src\app\models\models\contact-information.js.map
C:\Users\e.francisco.000\Source\Repos\Common\Common.UI\dist\out-tsc\src\app\models\models\gender.js
C:\Users\e.francisco.000\Source\Repos\Common\Common.UI\dist\out-tsc\src\app\models\models\gender.js.map
C:\Users\e.francisco.000\Source\Repos\Common\Common.UI\dist\out-tsc\src\app\models\models\contact-type.js
C:\Users\e.francisco.000\Source\Repos\Common\Common.UI\dist\out-tsc\src\app\models\models\contact-type.js.map
C:\Users\e.francisco.000\Source\Repos\Common\Common.UI\dist\out-tsc\src\app\models\models\access-list.js
C:\Users\e.francisco.000\Source\Repos\Common\Common.UI\dist\out-tsc\src\app\models\models\access-list.js.map
C:\Users\e.francisco.000\Source\Repos\Common\Common.UI\dist\out-tsc\src\app\models\index.js
C:\Users\e.francisco.000\Source\Repos\Common\Common.UI\dist\out-tsc\src\app\models\index.js.map
C:\Users\e.francisco.000\Source\Repos\Common\Common.UI\dist\out-tsc\src\app\shared\services\services\role.service.js
C:\Users\e.francisco.000\Source\Repos\Common\Common.UI\dist\out-tsc\src\app\shared\services\services\role.service.js.map
C:\Users\e.francisco.000\Source\Repos\Common\Common.UI\dist\out-tsc\src\app\shared\services\services\user.service.js
C:\Users\e.francisco.000\Source\Repos\Common\Common.UI\dist\out-tsc\src\app\shared\services\services\user.service.js.map
C:\Users\e.francisco.000\Source\Repos\Common\Common.UI\dist\out-tsc\src\app\core\utils.js
C:\Users\e.francisco.000\Source\Repos\Common\Common.UI\dist\out-tsc\src\app\core\utils.js.map
C:\Users\e.francisco.000\Source\Repos\Common\Common.UI\dist\out-tsc\src\app\shared\services\services\common.service.js
C:\Users\e.francisco.000\Source\Repos\Common\Common.UI\dist\out-tsc\src\app\shared\services\services\common.service.js.map
C:\Users\e.francisco.000\Source\Repos\Common\Common.UI\dist\out-tsc\src\app\shared\services\services\political-division.service.js
C:\Users\e.francisco.000\Source\Repos\Common\Common.UI\dist\out-tsc\src\app\shared\services\services\political-division.service.js.map
C:\Users\e.francisco.000\Source\Repos\Common\Common.UI\dist\out-tsc\src\app\shared\services\index.js
C:\Users\e.francisco.000\Source\Repos\Common\Common.UI\dist\out-tsc\src\app\shared\services\index.js.map
C:\Users\e.francisco.000\Source\Repos\Common\Common.UI\dist\out-tsc\src\app\core\animations\router.animations.js
C:\Users\e.francisco.000\Source\Repos\Common\Common.UI\dist\out-tsc\src\app\core\animations\router.animations.js.map
C:\Users\e.francisco.000\Source\Repos\Common\Common.UI\dist\out-tsc\src\app\layouts\full-layout.component.js
C:\Users\e.francisco.000\Source\Repos\Common\Common.UI\dist\out-tsc\src\app\layouts\full-layout.component.js.map
C:\Users\e.francisco.000\Source\Repos\Common\Common.UI\dist\out-tsc\src\app\pages\not-found\not-found.component.js
C:\Users\e.francisco.000\Source\Repos\Common\Common.UI\dist\out-tsc\src\app\pages\not-found\not-found.component.js.map
C:\Users\e.francisco.000\Source\Repos\Common\Common.UI\dist\out-tsc\src\app\core\auth\index.js
C:\Users\e.francisco.000\Source\Repos\Common\Common.UI\dist\out-tsc\src\app\core\auth\index.js.map
C:\Users\e.francisco.000\Source\Repos\Common\Common.UI\dist\out-tsc\src\app\core\components\base-component.js
C:\Users\e.francisco.000\Source\Repos\Common\Common.UI\dist\out-tsc\src\app\core\components\base-component.js.map
C:\Users\e.francisco.000\Source\Repos\Common\Common.UI\dist\out-tsc\src\app\account\change-password\change-password.component.js
C:\Users\e.francisco.000\Source\Repos\Common\Common.UI\dist\out-tsc\src\app\account\change-password\change-password.component.js.map
C:\Users\e.francisco.000\Source\Repos\Common\Common.UI\dist\out-tsc\src\app\app.routing.js
C:\Users\e.francisco.000\Source\Repos\Common\Common.UI\dist\out-tsc\src\app\app.routing.js.map
C:\Users\e.francisco.000\Source\Repos\Common\Common.UI\dist\out-tsc\src\app\core\auth\token.interceptor.js
C:\Users\e.francisco.000\Source\Repos\Common\Common.UI\dist\out-tsc\src\app\core\auth\token.interceptor.js.map
C:\Users\e.francisco.000\Source\Repos\Common\Common.UI\dist\out-tsc\src\app\app.module.js
C:\Users\e.francisco.000\Source\Repos\Common\Common.UI\dist\out-tsc\src\app\app.module.js.map
C:\Users\e.francisco.000\Source\Repos\Common\Common.UI\dist\out-tsc\src\environments\environment.js
C:\Users\e.francisco.000\Source\Repos\Common\Common.UI\dist\out-tsc\src\environments\environment.js.map
C:\Users\e.francisco.000\Source\Repos\Common\Common.UI\dist\out-tsc\src\main.js
C:\Users\e.francisco.000\Source\Repos\Common\Common.UI\dist\out-tsc\src\main.js.map
C:\Users\e.francisco.000\Source\Repos\Common\Common.UI\dist\out-tsc\src\polyfills.js
C:\Users\e.francisco.000\Source\Repos\Common\Common.UI\dist\out-tsc\src\polyfills.js.map
C:\Users\e.francisco.000\Source\Repos\Common\Common.UI\dist\out-tsc\src\test.js
C:\Users\e.francisco.000\Source\Repos\Common\Common.UI\dist\out-tsc\src\test.js.map
C:\Users\e.francisco.000\Source\Repos\Common\Common.UI\dist\out-tsc\src\app\app.component.spec.js
C:\Users\e.francisco.000\Source\Repos\Common\Common.UI\dist\out-tsc\src\app\app.component.spec.js.map
C:\Users\e.francisco.000\Source\Repos\Common\Common.UI\dist\out-tsc\src\environments\environment.prod.js
C:\Users\e.francisco.000\Source\Repos\Common\Common.UI\dist\out-tsc\src\environments\environment.prod.js.map
C:\Users\e.francisco.000\Source\Repos\Common\Common.UI\dist\out-tsc\src\app\account\login\login.component.js
C:\Users\e.francisco.000\Source\Repos\Common\Common.UI\dist\out-tsc\src\app\account\login\login.component.js.map
C:\Users\e.francisco.000\Source\Repos\Common\Common.UI\dist\out-tsc\src\app\account\account.routing.js
C:\Users\e.francisco.000\Source\Repos\Common\Common.UI\dist\out-tsc\src\app\account\account.routing.js.map
C:\Users\e.francisco.000\Source\Repos\Common\Common.UI\dist\out-tsc\src\app\account\account.module.js
C:\Users\e.francisco.000\Source\Repos\Common\Common.UI\dist\out-tsc\src\app\account\account.module.js.map
C:\Users\e.francisco.000\Source\Repos\Common\Common.UI\dist\out-tsc\src\app\dashboard\dashboard.component.js
C:\Users\e.francisco.000\Source\Repos\Common\Common.UI\dist\out-tsc\src\app\dashboard\dashboard.component.js.map
C:\Users\e.francisco.000\Source\Repos\Common\Common.UI\dist\out-tsc\src\app\dashboard\dashboard-routing.module.js
C:\Users\e.francisco.000\Source\Repos\Common\Common.UI\dist\out-tsc\src\app\dashboard\dashboard-routing.module.js.map
C:\Users\e.francisco.000\Source\Repos\Common\Common.UI\dist\out-tsc\src\app\dashboard\dashboard.module.js
C:\Users\e.francisco.000\Source\Repos\Common\Common.UI\dist\out-tsc\src\app\dashboard\dashboard.module.js.map
C:\Users\e.francisco.000\Source\Repos\Common\Common.UI\dist\out-tsc\src\app\core\transfer-panel\transfe-panel\transfer-panel.component.js
C:\Users\e.francisco.000\Source\Repos\Common\Common.UI\dist\out-tsc\src\app\core\transfer-panel\transfe-panel\transfer-panel.component.js.map
C:\Users\e.francisco.000\Source\Repos\Common\Common.UI\dist\out-tsc\src\app\core\transfer-panel\transfer-panel.module.js
C:\Users\e.francisco.000\Source\Repos\Common\Common.UI\dist\out-tsc\src\app\core\transfer-panel\transfer-panel.module.js.map
C:\Users\e.francisco.000\Source\Repos\Common\Common.UI\dist\out-tsc\src\app\core\data\generic-database.js
C:\Users\e.francisco.000\Source\Repos\Common\Common.UI\dist\out-tsc\src\app\core\data\generic-database.js.map
C:\Users\e.francisco.000\Source\Repos\Common\Common.UI\dist\out-tsc\src\app\core\data\collumn-definition.js
C:\Users\e.francisco.000\Source\Repos\Common\Common.UI\dist\out-tsc\src\app\core\data\collumn-definition.js.map
C:\Users\e.francisco.000\Source\Repos\Common\Common.UI\dist\out-tsc\src\app\core\data\index.js
C:\Users\e.francisco.000\Source\Repos\Common\Common.UI\dist\out-tsc\src\app\core\data\index.js.map
C:\Users\e.francisco.000\Source\Repos\Common\Common.UI\dist\out-tsc\src\app\settings\users\user-list\user-list.component.js
C:\Users\e.francisco.000\Source\Repos\Common\Common.UI\dist\out-tsc\src\app\settings\users\user-list\user-list.component.js.map
C:\Users\e.francisco.000\Source\Repos\Common\Common.UI\dist\out-tsc\src\app\settings\users\user-edit\user-edit.component.js
C:\Users\e.francisco.000\Source\Repos\Common\Common.UI\dist\out-tsc\src\app\settings\users\user-edit\user-edit.component.js.map
C:\Users\e.francisco.000\Source\Repos\Common\Common.UI\dist\out-tsc\src\app\settings\roles\role-edit\role-edit.component.js
C:\Users\e.francisco.000\Source\Repos\Common\Common.UI\dist\out-tsc\src\app\settings\roles\role-edit\role-edit.component.js.map
C:\Users\e.francisco.000\Source\Repos\Common\Common.UI\dist\out-tsc\src\app\settings\roles\role-list\role-list.component.js
C:\Users\e.francisco.000\Source\Repos\Common\Common.UI\dist\out-tsc\src\app\settings\roles\role-list\role-list.component.js.map
C:\Users\e.francisco.000\Source\Repos\Common\Common.UI\dist\out-tsc\src\app\settings\settings.routing.js
C:\Users\e.francisco.000\Source\Repos\Common\Common.UI\dist\out-tsc\src\app\settings\settings.routing.js.map
C:\Users\e.francisco.000\Source\Repos\Common\Common.UI\dist\out-tsc\src\app\settings\settings.module.js
C:\Users\e.francisco.000\Source\Repos\Common\Common.UI\dist\out-tsc\src\app\settings\settings.module.js.map
C:\Users\e.francisco.000\Source\Repos\Common\Common.UI\dist\out-tsc\src\app\account\change-password\change-password.component.spec.js
C:\Users\e.francisco.000\Source\Repos\Common\Common.UI\dist\out-tsc\src\app\account\change-password\change-password.component.spec.js.map
C:\Users\e.francisco.000\Source\Repos\Common\Common.UI\dist\out-tsc\src\app\account\login\login.component.spec.js
C:\Users\e.francisco.000\Source\Repos\Common\Common.UI\dist\out-tsc\src\app\account\login\login.component.spec.js.map
C:\Users\e.francisco.000\Source\Repos\Common\Common.UI\dist\out-tsc\src\app\core\data\generic-datasoruce.js
C:\Users\e.francisco.000\Source\Repos\Common\Common.UI\dist\out-tsc\src\app\core\data\generic-datasoruce.js.map
C:\Users\e.francisco.000\Source\Repos\Common\Common.UI\dist\out-tsc\src\app\core\transfer-panel\index.js
C:\Users\e.francisco.000\Source\Repos\Common\Common.UI\dist\out-tsc\src\app\core\transfer-panel\index.js.map
C:\Users\e.francisco.000\Source\Repos\Common\Common.UI\dist\out-tsc\src\app\models\models\access-levels.js
C:\Users\e.francisco.000\Source\Repos\Common\Common.UI\dist\out-tsc\src\app\models\models\access-levels.js.map
C:\Users\e.francisco.000\Source\Repos\Common\Common.UI\dist\out-tsc\src\app\pages\not-found\not-found.component.spec.js
C:\Users\e.francisco.000\Source\Repos\Common\Common.UI\dist\out-tsc\src\app\pages\not-found\not-found.component.spec.js.map
C:\Users\e.francisco.000\Source\Repos\Common\Common.UI\dist\out-tsc\src\app\core\transfer-panel\transfe-panel\transfer-panel.component.spec.js
C:\Users\e.francisco.000\Source\Repos\Common\Common.UI\dist\out-tsc\src\app\core\transfer-panel\transfe-panel\transfer-panel.component.spec.js.map
C:\Users\e.francisco.000\Source\Repos\Common\Common.UI\dist\out-tsc\src\app\settings\roles\role-edit\role-edit.component.spec.js
C:\Users\e.francisco.000\Source\Repos\Common\Common.UI\dist\out-tsc\src\app\settings\roles\role-edit\role-edit.component.spec.js.map
C:\Users\e.francisco.000\Source\Repos\Common\Common.UI\dist\out-tsc\src\app\settings\roles\role-list\role-list.component.spec.js
C:\Users\e.francisco.000\Source\Repos\Common\Common.UI\dist\out-tsc\src\app\settings\roles\role-list\role-list.component.spec.js.map
C:\Users\e.francisco.000\Source\Repos\Common\Common.UI\dist\out-tsc\src\app\settings\users\user-edit\user-edit.component.spec.js
C:\Users\e.francisco.000\Source\Repos\Common\Common.UI\dist\out-tsc\src\app\settings\users\user-edit\user-edit.component.spec.js.map
C:\Users\e.francisco.000\Source\Repos\Common\Common.UI\dist\out-tsc\src\app\settings\users\user-list\user-list.component.spec.js
C:\Users\e.francisco.000\Source\Repos\Common\Common.UI\dist\out-tsc\src\app\settings\users\user-list\user-list.component.spec.js.map
C:\Users\e.francisco.000\Source\Repos\Common\Common.UI\dist\out-tsc\src\app\shared\services\services\political-division.service.spec.js
C:\Users\e.francisco.000\Source\Repos\Common\Common.UI\dist\out-tsc\src\app\shared\services\services\political-division.service.spec.js.map
C:\Users\e.francisco.000\Source\Repos\Common\Common.UI\dist\out-tsc\src\app\shared\services\services\role.service.spec.js
C:\Users\e.francisco.000\Source\Repos\Common\Common.UI\dist\out-tsc\src\app\shared\services\services\role.service.spec.js.map
