<?xml version="1.0" encoding="UTF-8" standalone="no"?>
<!-- Created with Inkscape (http://www.inkscape.org/) -->

<svg
   xmlns:dc="http://purl.org/dc/elements/1.1/"
   xmlns:cc="http://creativecommons.org/ns#"
   xmlns:rdf="http://www.w3.org/1999/02/22-rdf-syntax-ns#"
   xmlns:svg="http://www.w3.org/2000/svg"
   xmlns="http://www.w3.org/2000/svg"
   xmlns:sodipodi="http://sodipodi.sourceforge.net/DTD/sodipodi-0.dtd"
   xmlns:inkscape="http://www.inkscape.org/namespaces/inkscape"
   width="210mm"
   height="297mm"
   viewBox="0 0 210 297"
   version="1.1"
   id="svg8"
   inkscape:version="0.92.3 (2405546, 2018-03-11)"
   sodipodi:docname="LabOrgA6_01.svg"
   inkscape:export-filename="/home/simoes/Documents/LabOrgA6_01.png"
   inkscape:export-xdpi="96"
   inkscape:export-ydpi="96">
  <defs
     id="defs2" />
  <sodipodi:namedview
     id="base"
     pagecolor="#ffffff"
     bordercolor="#666666"
     borderopacity="1.0"
     inkscape:pageopacity="0.0"
     inkscape:pageshadow="2"
     inkscape:zoom="0.98994949"
     inkscape:cx="-28.892456"
     inkscape:cy="852.857"
     inkscape:document-units="mm"
     inkscape:current-layer="layer1"
     showgrid="false"
     inkscape:window-width="1366"
     inkscape:window-height="741"
     inkscape:window-x="0"
     inkscape:window-y="27"
     inkscape:window-maximized="1" />
  <metadata
     id="metadata5">
    <rdf:RDF>
      <cc:Work
         rdf:about="">
        <dc:format>image/svg+xml</dc:format>
        <dc:type
           rdf:resource="http://purl.org/dc/dcmitype/StillImage" />
        <dc:title></dc:title>
      </cc:Work>
    </rdf:RDF>
  </metadata>
  <g
     inkscape:label="Layer 1"
     inkscape:groupmode="layer"
     id="layer1">
    <rect
       style="fill:#0000ff;stroke-width:0.26458332"
       id="rect10"
       width="51.31575"
       height="74.300934"
       x="61.739262"
       y="11.021605" />
    <rect
       style="fill:#0000ff;stroke-width:0.26458332"
       id="rect12"
       width="52.384827"
       height="72.697311"
       x="63.610146"
       y="101.89325" />
    <rect
       style="fill:#0000ff;stroke-width:0.26458332"
       id="rect14"
       width="51.583019"
       height="77.508163"
       x="64.411957"
       y="192.23035" />
    <text
       xml:space="preserve"
       style="font-style:normal;font-weight:normal;font-size:4.23333311px;line-height:1.25;font-family:sans-serif;letter-spacing:0px;word-spacing:0px;fill:#000000;fill-opacity:1;stroke:none;stroke-width:0.26458332"
       x="72.697311"
       y="25.72143"
       id="text18"><tspan
         sodipodi:role="line"
         id="tspan16"
         x="72.697311"
         y="25.72143"
         style="stroke-width:0.26458332">Operação dos</tspan><tspan
         sodipodi:role="line"
         x="72.697311"
         y="31.013096"
         style="stroke-width:0.26458332"
         id="tspan20">Registradores</tspan><tspan
         sodipodi:role="line"
         x="72.697311"
         y="36.304764"
         style="stroke-width:0.26458332"
         id="tspan92">Escrita Memória</tspan></text>
    <path
       style="fill:none;stroke:#000000;stroke-width:0.26458332px;stroke-linecap:butt;stroke-linejoin:miter;stroke-opacity:1"
       d="m 88.446426,275.45535 c 0,4.66172 0,9.32341 0,13.98513 0,0.62995 -0.06957,1.26376 0,1.88987 0.114734,1.03262 0.609024,1.9953 0.755955,3.02382 0.288081,2.01657 -0.423191,0.26492 0.377975,2.26785 0.02655,0.0664 0.648917,1.61893 1.133928,1.13392 0.08909,-0.0891 0,-0.25199 0,-0.37796 0,-0.62997 0,-1.25992 0,-1.88989 0,-1.06037 0.119528,-1.27286 -0.377976,-2.26785 -0.203155,-0.40632 -0.552797,-0.72763 -0.755952,-1.13392 -0.178181,-0.35637 -0.199797,-0.77759 -0.377975,-1.13395 -0.924971,-1.84994 -0.457214,-0.48361 -1.511906,-1.88987 -0.169035,-0.2254 -0.221703,-0.52155 -0.377976,-0.75597 -0.170857,-0.25627 -1.358871,-0.88868 -0.377976,-1.13392 0.366691,-0.0917 0.755952,0 1.133928,0 0.251983,0 0.511492,-0.0611 0.755954,0 0.273314,0.0683 0.521541,0.22172 0.755951,0.37798 0.148254,0.0989 0.218607,0.29829 0.377976,0.37799 0.136689,0.0683 1.626984,0 1.889882,0 0.170225,0 1.018897,0.0575 1.133927,0 0.159369,-0.0797 0.218607,-0.2983 0.377976,-0.37799 0.225383,-0.11268 0.530572,0.11269 0.755954,0 0.159367,-0.0797 0.208939,-0.32163 0.377976,-0.37798 0.239054,-0.0797 0.503968,0 0.755952,0 0.251984,0 0.503968,0 0.755951,0 0.755955,0 1.511906,0 2.267858,0 0.62996,0 1.268492,-0.10356 1.889882,0 0.90476,0.15081 1.74108,0.60515 2.64583,0.75597 0.62139,0.10355 1.27216,-0.12356 1.88988,0 0.66532,0.13305 1.22457,0.62288 1.88988,0.75594 0.61773,0.12356 1.26251,-0.057 1.88989,0 0.76323,0.0694 1.50528,0.30173 2.26785,0.37798 0.50147,0.0501 1.00794,0 1.51191,0 0.88194,0 1.76389,0 2.64583,0 0.26791,0 2.17013,0.0489 2.26786,0 0.15937,-0.0797 0.21861,-0.29829 0.37797,-0.37798 0.22539,-0.11269 0.53057,0.11268 0.75596,0 0.15937,-0.0797 0.2186,-0.29829 0.37797,-0.37799 0.17174,-0.0858 2.57694,0 2.64584,0 0.26458,0 5.40506,0 5.66964,0 2.39385,0 4.7877,0 7.18155,0 0.62996,0 1.25992,0 1.88988,0 0.25198,0 0.50397,0 0.75595,0 0.12599,0 0.25845,0.0399 0.37798,0 0.26726,-0.0891 0.48868,-0.28887 0.75595,-0.37795 0.23905,-0.0797 0.5169,0.0797 0.75595,0 0.26727,-0.0891 0.48868,-0.2889 0.75595,-0.37799 0.23906,-0.0797 0.50397,0 0.75595,0 1.25993,0 2.51985,0 3.77977,0 0.37797,0 0.75975,-0.0534 1.13393,0 0.51425,0.0735 0.99764,0.30451 1.5119,0.37799 0.37418,0.0534 0.76329,-0.0741 1.13393,0 0.39068,0.0781 0.8522,0.65968 1.13393,0.37795 0.0891,-0.0891 -0.0891,-0.28887 0,-0.37795 0.0652,-0.0652 1.08893,0.0562 1.13393,0 0.45893,-0.57367 0.83555,-1.21857 1.13392,-1.8899 0.76274,-1.71614 0.22099,-1.01192 0.37798,-2.26785 0.0951,-0.76046 0.25198,-1.5119 0.37798,-2.26785 0,-0.88196 -0.0798,-1.76752 0,-2.64583 0.047,-0.51737 0.32061,-0.99563 0.37797,-1.51191 0.0696,-0.62611 -0.057,-1.26251 0,-1.88989 0.0694,-0.76322 0.30172,-1.50527 0.37798,-2.26785 0.0502,-0.50146 0,-1.00793 0,-1.51191 0,-1.7639 0,-3.52777 0,-5.29166 0,-1.7639 0,-3.52778 0,-5.29167 0,-0.88194 0.0974,-1.76928 0,-2.64583 -0.044,-0.39599 -0.34191,-0.73715 -0.37798,-1.13393 -0.0913,-1.0038 0,-2.01588 0,-3.02381 0,-1.88988 0,-3.77976 0,-5.66965 0,-0.62996 0.0627,-1.26304 0,-1.88988 -0.0639,-0.63924 -0.25198,-1.25992 -0.37797,-1.88988 0,-0.75595 0.0684,-1.51501 0,-2.26785 -0.0582,-0.6398 -0.26306,-1.25781 -0.37798,-1.88989 -0.13709,-0.75401 -0.30172,-1.50528 -0.37798,-2.26785 -0.0501,-0.50147 0,-1.00794 0,-1.51191 0,-0.62996 0,-1.25992 0,-1.88988 0,-0.50397 0.0713,-1.013 0,-1.5119 -0.0563,-0.39442 -0.32855,-0.73859 -0.37797,-1.13393 -0.0781,-0.6251 0,-1.25992 0,-1.88988 0,-0.88195 0,-1.76389 0,-2.64584 0,-0.37797 0,-0.75595 0,-1.13392 0,-0.25199 0.0494,-0.50887 0,-0.75596 -0.0781,-0.39068 -0.29984,-0.74324 -0.37798,-1.13393 -0.0494,-0.24708 0.0611,-0.51149 0,-0.75595 -0.0683,-0.27331 -0.30964,-0.48263 -0.37797,-0.75595 -0.0611,-0.24446 0,-0.50397 0,-0.75595 0,-0.75595 0,-1.51191 0,-2.26786 0,-10.83532 0,-21.67063 0,-32.50595 0,-3.52778 0,-7.05556 0,-10.58334 0,-1.00793 0,-2.01587 0,-3.0238 0,-0.62996 -0.10357,-1.2685 0,-1.88989 0.0293,-0.17575 0.3118,-0.21254 0.37797,-0.37797 0.19293,-0.48232 0.2761,-1.00252 0.37798,-1.51191 0.0247,-0.12354 0,-0.25198 0,-0.37797 0,-0.62996 -0.0891,-1.26625 0,-1.88988 0.0398,-0.2789 0.28888,-0.48869 0.37797,-0.75596 0.0399,-0.11952 0,-0.25198 0,-0.37797 0,-0.62996 -0.0781,-1.26479 0,-1.88988 0.0494,-0.39535 0.28135,-0.7474 0.37798,-1.13393 0.15582,-0.62326 0.28712,-1.2539 0.37798,-1.88988 0.0534,-0.37418 0,-0.75595 0,-1.13393 0,-1.51191 0,-3.02381 0,-4.53572 0,-0.50396 -0.0829,-1.01479 0,-1.5119 0.0854,-0.51241 0.27609,-1.00251 0.37797,-1.5119 0.0247,-0.12355 0,-0.25199 0,-0.37798 0,-0.88194 0,-1.76389 0,-2.64583 0,-0.37798 -0.0741,-0.7633 0,-1.13393 0.0553,-0.27626 0.25199,-0.50397 0.37798,-0.75596 0,-0.75595 -0.0835,-1.51652 0,-2.26785 0.088,-0.79197 0.67666,-1.47497 0.75595,-2.26786 0.0878,-0.87757 -0.10939,-1.7707 0,-2.64583 0.0221,-0.17681 0.29829,-0.21861 0.37798,-0.37798 0.0563,-0.11269 -0.0178,-0.25325 0,-0.37798 0.10838,-0.75867 0.29334,-1.50616 0.37797,-2.26785 0.0696,-0.62611 -0.0781,-1.26479 0,-1.88988 0.0951,-0.76046 0.3192,-1.50374 0.37798,-2.26786 0.0676,-0.87935 0,-1.76389 0,-2.64583 0,-1.13393 0,-2.26786 0,-3.40179 0,-0.50397 -0.0625,-1.01183 0,-1.5119 0.0951,-0.76047 0.26959,-1.50918 0.37798,-2.26786 0.0178,-0.12473 0,-0.25199 0,-0.37798 0,-0.62996 0,-1.25992 0,-1.88988 0,-0.50397 0,-1.00793 0,-1.5119 0,-0.62996 0,-1.25992 0,-1.88988 0,-0.50397 -0.0988,-1.01773 0,-1.51191 0.0349,-0.17472 0.34303,-0.20326 0.37797,-0.37798 0.0988,-0.49418 0,-1.00793 0,-1.5119 0,-1.00794 0,-2.01587 0,-3.02381 1.9388,-11.6327 -0.67263,2.3334 2.26786,-8.69345 0.12986,-0.48695 0,-1.00794 0,-1.5119 0,-1.13393 -0.0666,-2.269818 0,-3.40179 0.0597,-1.014028 0.25199,-2.015873 0.37798,-3.02381 0.12599,-1.007936 0.16514,-2.030577 0.37797,-3.023809 0.99753,-4.655112 0.75865,0.337575 1.13393,-5.291667 0.19782,-2.967257 -0.33723,-2.570425 0.37798,-5.669643 0.15256,-0.661112 0.59139,-1.231651 0.75595,-1.889881 0.76077,-3.043074 0.1225,-2.225992 0.37798,-5.291666 0.0533,-0.640217 0.31405,-1.250634 0.37797,-1.889881 0.0627,-0.626834 -0.13665,-1.274922 0,-1.889881 0.12223,-0.550036 0.6193,-0.965275 0.75596,-1.511905 0.12223,-0.488921 -0.0829,-1.014794 0,-1.511905 0.22815,-1.368919 0.32391,-0.26986 0.75595,-1.133928 0.55615,-1.112312 -0.87561,0.497637 0.37797,-0.755953 0.126,-0.125992 0.25199,-0.251984 0.37798,-0.377976 0.12599,-0.125992 0.34303,-0.203257 0.37798,-0.377976 0.0988,-0.494182 0,-1.007937 0,-1.511905 0,-0.881944 0,-1.763889 0,-2.645833 0,-2.393849 0,-4.787699 0,-7.181548 0,-2.141865 0,-4.28373 0,-6.425595 0,-0.62996 0.18101,-1.286488 0,-1.889881 -2.57801,-8.593362 0.22003,5.336889 -1.88988,-4.157738 -0.082,-0.368976 0.0417,-0.758264 0,-1.133929 -0.0846,-0.761692 -0.3086,-1.504624 -0.37798,-2.267857 -0.057,-0.627373 0.0696,-1.263773 0,-1.889881 0.49064,-1.237591 -0.94575,-1.704939 -1.13393,-2.645833 -0.17296,-0.864818 0.0878,-1.768266 0,-2.645833 -0.32398,-3.23983 -0.14559,0.01399 -0.75595,-1.511905 -0.19293,-0.482324 -0.14566,-1.047269 -0.37798,-1.511905 -0.28172,-0.563454 -0.76777,-0.999285 -1.13393,-1.511905 -0.26404,-0.369655 -0.52223,-0.744394 -0.75595,-1.133928 -0.14495,-0.241579 -0.23303,-0.514374 -0.37797,-0.755953 -0.46745,-0.779068 -1.1056,-1.455232 -1.51191,-2.267857 -0.17818,-0.356359 -0.1998,-0.777569 -0.37798,-1.133928 -0.15936,-0.318738 -0.64326,-0.417881 -0.75595,-0.755953 -0.0797,-0.239053 0,-0.503968 0,-0.755952 0,-0.377976 0.0917,-0.767238 0,-1.133929 -0.0432,-0.172859 -0.27914,-0.229721 -0.37797,-0.377976 -0.15628,-0.234411 -0.25199,-0.503968 -0.37798,-0.755952 -0.25198,-0.503969 -0.54669,-0.988751 -0.75595,-1.511905 -0.0468,-0.116981 0,-0.251984 0,-0.377976 0,-0.06889 0.0859,-2.474094 0,-2.645834 -0.20316,-0.406312 -0.52223,-0.744394 -0.75596,-1.133928 -0.14494,-0.241579 -0.2217,-0.521542 -0.37797,-0.755953 -0.0988,-0.148254 -0.25199,-0.251984 -0.37798,-0.377976 -0.37797,-0.3779759 -0.72328,-0.7917247 -1.13393,-1.1339283 -0.34898,-0.2908171 -0.75595,-0.5039682 -1.13392,-0.7559524 -1.1388,-0.759197 -1.30309,-0.9364397 -2.64584,-1.5119047 -1.63674,-0.7014625 -0.82243,0.0057 -2.64583,-1.1339286 -3.65587,-2.7419012 0.2401,-0.068937 -2.64583,-1.5119048 -0.37798,-0.2519841 -0.75596,-0.5039682 -1.13393,-0.7559524 -0.126,0 -0.25845,0.039842 -0.37798,0 -0.26727,-0.08909 -0.4752,-0.35458 -0.75595,-0.3779761 -1.25557,-0.1046308 -2.51984,0 -3.77976,0 -2.39385,0 -4.7877,0 -7.18155,0 -8.31548,0 -16.63095,0 -24.94643,0 -3.779762,0 -7.559524,0 -11.339286,0 -0.755952,0 -1.511904,0 -2.267857,0 -0.125992,0 -0.377976,0.125992 -0.377976,0 0,-0.1259921 0.265285,-0.056345 0.377976,0 0.159369,0.079684 0.251984,0.2519841 0.377976,0.3779761 0.251985,0.2519842 0.572607,0.4503768 0.755953,0.7559524 0.204986,0.341644 0.22103,0.7677211 0.377976,1.1339286 0.221955,0.5178956 0.577773,0.9773657 0.755952,1.5119048 0.159369,0.4781062 -0.12223,1.0229837 0,1.5119047 0.456307,1.8252257 0.179622,-0.018733 0.755953,1.1339286 0.05634,0.1126907 0,0.2519841 0,0.3779762"
       id="path22"
       inkscape:connector-curvature="0" />
    <path
       style="fill:none;stroke:#000000;stroke-width:0.26458332px;stroke-linecap:butt;stroke-linejoin:miter;stroke-opacity:1"
       d="m 89.000752,8.0816404 c 0.178179,0.1336347 0.343554,0.2863133 0.534538,0.4009043 0.06677,0.040064 0.326326,-0.037289 0.400905,0 0.05635,0.028173 0.07729,0.1054622 0.133635,0.1336347 0.07968,0.039842 0.187585,-0.039842 0.267269,0 0.05635,0.028173 0.07387,0.1137137 0.133636,0.1336347 0.08452,0.028173 0.18084,-0.021608 0.267269,0 0.09663,0.024159 0.172775,0.1021369 0.267269,0.133635 0.04226,0.014086 0.09379,-0.01992 0.133635,0 0.160362,0.080181 0.240544,0.3207234 0.400905,0.400904 0.07968,0.039842 0.187584,-0.039842 0.267269,0 0.05635,0.028173 0.08909,0.08909 0.133636,0.133635 0.152122,0.1521232 0.440626,0.534539 0.668173,0.534539 0.319238,0 0.528759,-0.5008763 0.668173,-0.668174 0.120986,-0.1451845 0.287513,-0.2497137 0.400905,-0.400904 0.02673,-0.035636 -0.01408,-0.091376 0,-0.133635 0.0315,-0.094494 0.07838,-0.1843926 0.133633,-0.2672694 0.03495,-0.052416 0.08909,-0.08909 0.133636,-0.1336349 0.133636,-0.1336347 0.267269,-0.2672694 0.400904,-0.4009041 0.04455,-0.044545 0.113713,-0.073872 0.133634,-0.1336349 0.04226,-0.126777 0,-0.2672694 0,-0.4009041"
       id="path24"
       inkscape:connector-curvature="0" />
    <text
       xml:space="preserve"
       style="font-style:normal;font-weight:normal;font-size:4.23333311px;line-height:1.25;font-family:sans-serif;letter-spacing:0px;word-spacing:0px;fill:#000000;fill-opacity:1;stroke:none;stroke-width:0.26458332"
       x="93.54911"
       y="281.88095"
       id="text28"><tspan
         sodipodi:role="line"
         id="tspan26"
         x="93.54911"
         y="281.88095"
         style="stroke-width:0.26458332">Borda de clock</tspan></text>
    <text
       xml:space="preserve"
       style="font-style:normal;font-weight:normal;font-size:4.23333311px;line-height:1.25;font-family:sans-serif;letter-spacing:0px;word-spacing:0px;fill:#000000;fill-opacity:1;stroke:none;stroke-width:0.26458332"
       x="74.272324"
       y="116.89434"
       id="text32"><tspan
         sodipodi:role="line"
         id="tspan30"
         x="74.272324"
         y="116.89434"
         style="stroke-width:0.26458332">Máquina de </tspan><tspan
         sodipodi:role="line"
         x="74.272324"
         y="122.186"
         style="stroke-width:0.26458332"
         id="tspan34">Controle</tspan><tspan
         sodipodi:role="line"
         x="74.272324"
         y="127.47768"
         style="stroke-width:0.26458332"
         id="tspan56" /><tspan
         sodipodi:role="line"
         x="74.272324"
         y="132.76933"
         style="stroke-width:0.26458332"
         id="tspan70">Reset</tspan><tspan
         sodipodi:role="line"
         x="74.272324"
         y="138.061"
         style="stroke-width:0.26458332"
         id="tspan58">Busca</tspan><tspan
         sodipodi:role="line"
         x="74.272324"
         y="143.35268"
         style="stroke-width:0.26458332"
         id="tspan60">Decodificação</tspan><tspan
         sodipodi:role="line"
         x="74.272324"
         y="148.64433"
         style="stroke-width:0.26458332"
         id="tspan64">Execução</tspan><tspan
         sodipodi:role="line"
         x="74.272324"
         y="153.936"
         style="stroke-width:0.26458332"
         id="tspan66">Execução2</tspan><tspan
         sodipodi:role="line"
         x="74.272324"
         y="159.22768"
         style="stroke-width:0.26458332"
         id="tspan68">Haçted</tspan><tspan
         sodipodi:role="line"
         x="74.272324"
         y="164.51933"
         style="stroke-width:0.26458332"
         id="tspan62" /></text>
    <path
       style="fill:none;stroke:#000000;stroke-width:0.26458332px;stroke-linecap:butt;stroke-linejoin:miter;stroke-opacity:1"
       d="m 87.501488,86.089285 c 0,2.645833 0,5.291667 0,7.9375 0,0.62996 0,1.259919 0,1.889879 0,0.188989 0.04584,0.383619 0,0.566965 -0.04322,0.17286 -0.334761,0.205116 -0.377978,0.377976 -0.04584,0.183346 0,0.377976 0,0.566965 0,0.377976 0,0.755952 0,1.133927 0,0.377979 0,0.755955 0,1.13393 0,0.09883 -0.02484,0.706263 0,0.755953 0.03984,0.0797 0.125994,0.12599 0.188989,0.18899"
       id="path36"
       inkscape:connector-curvature="0" />
    <path
       style="fill:none;stroke:#000000;stroke-width:0.26458332px;stroke-linecap:butt;stroke-linejoin:miter;stroke-opacity:1"
       d="m 87.312499,100.64137 c -0.818949,-0.37798 -1.586661,-0.896608 -2.456844,-1.133932 -0.219133,-0.05976 0.241694,0.385257 0.377976,0.566962 -0.01887,0.3744 0.27837,0.0894 0.377975,0.18899 0.09961,0.0996 0.11085,0.26077 0.188987,0.37798 0.09884,0.14825 0.271071,0.23543 0.377978,0.37797 0.136279,0.18171 0.241695,0.38526 0.377976,0.56697 0.05345,0.0713 0.0999,0.18899 0.188987,0.18899 0.08909,0 0.109305,-0.14915 0.188989,-0.18899 0.130307,-0.0652 0.566965,0.14259 0.566965,-0.18899 -3e-6,-0.25974 -0.421306,-0.63979 -0.188989,-0.75595 0.303429,-0.15172 0.623104,0.2707 0.944941,0.37797 0.05976,0.0199 0.125992,0 0.188986,0 0.063,0 0.136573,0.0349 0.18899,0 0.148254,-0.0988 0.229721,-0.27914 0.377975,-0.37797 0.05242,-0.0349 0.144444,0.0445 0.18899,0 0.04454,-0.0446 -0.04455,-0.14445 0,-0.18899 0.04454,-0.0446 0.130497,0.0234 0.188986,0 0.261578,-0.10463 0.497007,-0.267 0.755954,-0.37798 0.183103,-0.07847 0.373701,-0.14067 0.566963,-0.188986 0.06112,-0.01527 0.125992,0 0.188989,0 0.50378,0 1.133927,-0.02785 1.133927,-0.755952"
       id="path38"
       inkscape:connector-curvature="0" />
    <path
       style="fill:none;stroke:#000000;stroke-width:0.26458332px;stroke-linecap:butt;stroke-linejoin:miter;stroke-opacity:1"
       d="m 90.147321,176.2366 c 0,0.75596 0,1.51191 0,2.26786 0,0.18899 -0.03107,0.38055 0,0.56697 0.261938,1.57163 0.05179,0.15538 0.377976,1.13392 0.01992,0.0598 -0.01992,0.12923 0,0.18899 0.107278,0.32184 0.284779,0.61875 0.377976,0.94494 0.03461,0.12115 -0.03056,0.25575 0,0.37798 0.03416,0.13666 0.154824,0.24132 0.188987,0.37798 0.03056,0.12223 -0.02471,0.25443 0,0.37797 0.03907,0.19534 0.14992,0.37162 0.188989,0.56697 0.02471,0.12354 0,0.25198 0,0.37797 0,0.31498 0,0.62996 0,0.94494 0,0.126 -0.03984,0.25845 0,0.37798 0.0667,0.2001 0.479457,0.27649 0.377976,0.37797 -0.063,0.063 -0.125992,-0.12599 -0.188987,-0.18898 0.063,0.18898 0.149918,0.37162 0.188987,0.56696 0.02471,0.12355 0.03056,0.25575 0,0.37798 -0.03416,0.13666 -0.161362,0.23985 -0.188987,0.37797 -0.03706,0.18532 0,0.37798 0,0.56697 0,0.18899 0,0.37797 0,0.56696 0,0.50397 0,1.00794 0,1.51191 0,0.26207 -0.04149,1.23993 0,1.32291 0.03984,0.0797 0.125992,0.126 0.188987,0.18899"
       id="path40"
       inkscape:connector-curvature="0" />
    <path
       style="fill:none;stroke:#000000;stroke-width:0.26458332px;stroke-linecap:butt;stroke-linejoin:miter;stroke-opacity:1"
       d="m 91.659225,190.41071 c -0.692957,-0.37798 -1.313098,-0.94249 -2.078869,-1.13393 -0.305575,-0.0764 0.410689,0.48248 0.566965,0.75596 0.09884,0.17296 0.115002,0.382 0.188987,0.56696 0.104632,0.26158 0.251984,0.50397 0.377976,0.75595 0.125992,0.25199 0.221702,0.52154 0.377976,0.75595 0.04942,0.0741 0.0999,0.18899 0.188989,0.18899 0.08909,0 0.109305,-0.14914 0.188989,-0.18899 0.112689,-0.0563 0.265285,0.0563 0.377976,0 0.07968,-0.0398 0.109302,-0.14914 0.188986,-0.18898 0.112692,-0.0564 0.288888,0.0891 0.377976,0 0.04455,-0.0445 -0.04454,-0.14445 0,-0.18899 0.04143,-0.0414 0.501973,0.0433 0.566965,0 0.148254,-0.0988 0.235434,-0.27107 0.377976,-0.37798 0.09517,-0.41637 0.388787,-0.0999 0.566965,-0.18899 0.07968,-0.0398 0.117716,-0.13553 0.188989,-0.18898 0.181708,-0.13629 0.389602,-0.23609 0.566963,-0.37798 0.139136,-0.11131 0.229722,-0.27914 0.377976,-0.37798 0.05242,-0.0349 0.138591,0.0378 0.188989,0 0.528349,0.057 0.520287,-0.70927 0.755951,-0.94494 0.04455,-0.0445 0.132644,0.0282 0.18899,0 0.07968,-0.0398 0.125992,-0.12599 0.188986,-0.18899 0.063,-0.063 0.125995,-0.12599 0.188989,-0.18898 0.063,-0.063 0.109305,-0.14915 0.18899,-0.18899 0.05634,-0.0282 0.125992,0 0.188986,0"
       id="path42"
       inkscape:connector-curvature="0" />
    <text
       xml:space="preserve"
       style="font-style:normal;font-weight:normal;font-size:4.23333311px;line-height:1.25;font-family:sans-serif;letter-spacing:0px;word-spacing:0px;fill:#000000;fill-opacity:1;stroke:none;stroke-width:0.26458332"
       x="76.729164"
       y="209.68748"
       id="text46"><tspan
         sodipodi:role="line"
         id="tspan44"
         x="76.729164"
         y="209.68748"
         style="stroke-width:0.26458332">Multiplexadores</tspan><tspan
         sodipodi:role="line"
         x="76.729164"
         y="214.97916"
         style="stroke-width:0.26458332"
         id="tspan72" /><tspan
         sodipodi:role="line"
         x="76.729164"
         y="220.27081"
         style="stroke-width:0.26458332"
         id="tspan74">M1</tspan><tspan
         sodipodi:role="line"
         x="76.729164"
         y="225.56248"
         style="stroke-width:0.26458332"
         id="tspan76">M2</tspan><tspan
         sodipodi:role="line"
         x="76.729164"
         y="230.85416"
         style="stroke-width:0.26458332"
         id="tspan78">M3</tspan><tspan
         sodipodi:role="line"
         x="76.729164"
         y="236.14581"
         style="stroke-width:0.26458332"
         id="tspan80">M4</tspan><tspan
         sodipodi:role="line"
         x="76.729164"
         y="241.43748"
         style="stroke-width:0.26458332"
         id="tspan82">M5</tspan><tspan
         sodipodi:role="line"
         x="76.729164"
         y="246.72916"
         style="stroke-width:0.26458332"
         id="tspan84">M6</tspan><tspan
         sodipodi:role="line"
         x="76.729164"
         y="252.02081"
         style="stroke-width:0.26458332"
         id="tspan86" /><tspan
         sodipodi:role="line"
         x="76.729164"
         y="257.31247"
         style="stroke-width:0.26458332"
         id="tspan88">lLeitura Memória</tspan><tspan
         sodipodi:role="line"
         x="76.729164"
         y="262.60416"
         style="stroke-width:0.26458332"
         id="tspan90">ULA</tspan></text>
    <text
       xml:space="preserve"
       style="font-style:normal;font-weight:normal;font-size:4.23333311px;line-height:1.25;font-family:sans-serif;letter-spacing:0px;word-spacing:0px;fill:#000000;fill-opacity:1;stroke:none;stroke-width:0.26458332"
       x="74.033661"
       y="45.766644"
       id="text50"><tspan
         sodipodi:role="line"
         id="tspan48"
         x="74.033661"
         y="45.766644"
         style="stroke-width:0.26458332">Inicializa </tspan><tspan
         sodipodi:role="line"
         x="74.033661"
         y="51.058311"
         style="stroke-width:0.26458332"
         id="tspan52">os Loads</tspan><tspan
         sodipodi:role="line"
         x="74.033661"
         y="56.349976"
         style="stroke-width:0.26458332"
         id="tspan54">com Zero </tspan></text>
  </g>
</svg>
