;RUMO ON NM;25.37;25.67;25.32;-0.04;-0.16%;20.19M;15:54:48;
;AMBEV S/A ON;19.08;19.27;19.01;0.07;+0.37%;17.12M;15:54:43;
;BRASIL ON;47.87;49.25;47.87;-0.66;-1.36%;12.01M;15:54:37;
;BRADESCO PN EJ N1Â;34.19;35.17;34.19;-0.61;-1.75%;26.85M;15:54:38;
;BRADESPAR PN;37.75;38.2;37.73;-0.07;-0.19%;1.15M;15:54:35;
;BRF SA ON;34.74;34.86;34.16;0.79;+2.33%;6.32M;15:54:49;
;BRASKEM PNA;28.64;29.65;28.51;-0.49;-1.68%;2.85M;15:54:48;
;BR MALLS PAR ON;17.36;17.64;17.34;-0.03;-0.17%;6.78M;15:54:37;
;B2W DIGITAL ON;66.54;67.49;65.66;0.34;+0.51%;1.81M;15:54:36;
;B3 SA Brasil Bolsa Balcao;46.22;46.95;46.18;-0.18;-0.39%;10.14M;15:54:51;
;CCR SA ON;17.77;18.0;17.45;0.23;+1.31%;9.73M;15:54:56;
;CIELO ON;8.36;8.93;8.24;-0.42;-4.78%;24.67M;15:54:54;
;CEMIG PN;13.41;13.47;13.02;0.38;+2.92%;12.77M;15:54:54;
;COSAN ON;69.33;70.0;68.91;0.03;+0.04%;953.70K;15:54:39;
;SID NACIONAL ON;14.01;14.63;13.92;-0.17;-1.20%;14.54M;15:54:45;
;CYRELA REALT ON;30.11;30.11;29.15;0.68;+2.31%;3.39M;15:54:37;
;ECORODOVIAS ON;15.21;15.38;14.76;0.42;+2.84%;3.67M;15:54:50;
;ELETROBRAS ON;36.25;36.5;35.77;0.29;+0.81%;13.26M;15:54:35;
;ELETROBRAS PNB;37.85;38.11;37.14;0.56;+1.50%;4.04M;15:54:49;
;EMBRAER ON;18.96;19.15;18.9;-0.07;-0.37%;1.89M;15:54:46;
;ENERGIAS BR ON;20.61;20.85;20.55;-0.07;-0.34%;3.61M;15:54:37;
;EQUATORIAL ON;22.06;22.79;22.06;-0.61;-2.69%;6.66M;15:54:49;
;YDUQS Part ON;47.35;47.68;46.29;0.15;+0.32%;2.52M;15:54:43;
;FLEURY ON;28.95;28.96;28.45;0.17;+0.59%;1.41M;15:54:34;
;GERDAU PN N1;18.11;18.68;18.05;-0.38;-2.06%;10.24M;15:54:41;
;GERDAU MET PN;8.48;8.63;8.38;-0.09;-1.05%;11.80M;15:54:31;
;GOL PN N2;36.33;36.84;36.25;0.15;+0.41%;4.71M;15:54:48;
;HYPERMARCAS ON;33.5;33.7;33.22;0.38;+1.15%;1.99M;15:54:37;
;IGUATEMI ON;50.67;50.67;49.8;0.65;+1.30%;1.89M;15:54:52;
;ITAUSA PN;13.57;13.89;13.57;-0.13;-0.95%;21.21M;15:54:46;
;ITAUUNIBANCOPN EB N1;35.48;36.64;35.48;-0.83;-2.29%;21.66M;15:54:54;
;JBS ON;25.5;25.95;25.26;-0.14;-0.55%;8.52M;15:54:42;
;LOJAS AMERIC PN;26.5;27.09;26.32;-0.24;-0.90%;4.46M;15:54:35;
;LOJAS RENNER ON;54.45;54.59;53.58;0.2;+0.37%;4.36M;15:54:48;
;MAGAZ LUIZA ON;49.3;49.88;48.66;0.23;+0.47%;10.69M;15:54:48;
;MARFRIG ON;10.87;11.05;10.81;-0.04;-0.37%;3.98M;15:54:47;
;MRV ON;22.35;22.74;21.79;0.19;+0.86%;5.38M;15:54:43;
;MULTIPLAN ON;31.08;31.08;30.68;0.23;+0.75%;3.96M;15:53:49;
;NATURA ON;38.0;38.42;36.7;1.29;+3.51%;3.43M;15:54:46;
;P.ACUCAR-CBD PN;83.82;84.9;83.6;-0.17;-0.20%;820.60K;15:54:39;
;PETROBRAS ON;31.09;31.75;30.93;-0.24;-0.77%;17.09M;15:54:50;
;PETROBRAS PN;29.41;30.17;29.41;-0.57;-1.90%;68.87M;15:54:54;
;QUALICORP ON;33.95;34.55;33.95;-0.27;-0.79%;3.49M;15:54:45;
;LOCALIZA ON;47.5;47.9;46.71;0.67;+1.43%;4.33M;15:54:52;
;SANTANDER BR UNT;44.54;45.69;44.54;-0.17;-0.38%;1.49M;15:54:44;
;SABESP ON;58.54;58.9;57.96;0.14;+0.24%;2.63M;15:54:56;
;ENGIE BRASILON NM;47.51;47.99;47.48;-0.48;-1.00%;1.26M;15:54:47;
;TIM PART S/A ON;14.52;14.78;14.48;-0.16;-1.09%;4.94M;15:54:49;
;TAESA UNT;30.42;30.66;30.23;0.06;+0.20%;1.77M;15:54:41;
;ULTRAPAR ON NM;22.43;22.85;22.15;0.17;+0.76%;5.71M;15:54:44;
;USIMINAS PNA;9.12;9.31;9.09;-0.13;-1.41%;14.14M;15:54:46;
;VALE ON;53.34;54.67;53.34;-0.42;-0.78%;21.81M;15:54:56;
;TELEF BRASIL PN;56.63;57.77;56.47;0.3;+0.53%;1.17M;15:54:46;
;WEG ON;33.49;34.38;33.49;-0.56;-1.64%;3.56M;15:54:51;
;Cogna Educacao;12.1;12.36;12.05;-0.1;-0.82%;14.67M;15:54:46;
;RAIADROGASIL ON;105.33;107.47;104.71;-1.68;-1.57%;1.18M;15:54:42;
;BBSEGURIDADE ON NM;36.82;37.6;36.82;-0.53;-1.42%;2.94M;15:54:36;
;CVC BRASIL ON NM;43.38;43.69;42.92;-0.25;-0.57%;2.19M;15:54:49;
;Smiles Fidelidade;38.5;38.86;38.02;0.01;+0.03%;2.36M;15:54:28;
;KLABIN S/A UNT N2;18.52;19.05;18.51;-0.31;-1.65%;4.58M;15:54:53;
;Via Varejo;11.25;11.6;11.23;0.38;+3.50%;72.52M;15:54:56;
;Banco BTG;74.18;75.55;74.02;-0.52;-0.70%;1.85M;16:13:00;
;Azul SA Pref;57.27;57.82;56.63;0.41;+0.72%;3.22M;16:12:00;
;IRB Brasil Resseguros;36.74;36.97;36.66;0.06;+0.16%;2.63M;16:06:00;
;Suzano Papel Celulose;39.2;39.79;38.93;0.32;+0.82%;3.80M;15:54:49;
;Petrobras Distribuidora;28.5;28.54;27.51;0.98;+3.56%;6.28M;15:54:47;
;Notre Dame;61.59;63.7;59.75;1.59;+2.65%;8.47M;16:10:00;
;BRADESCO ON;32.03;32.73;32.03;-0.49;-1.51%;1.66M;16:08:00;
