freguesia,acronym,validVotesPercentage,votes,dicofre
Conceição,PS,50.93,165,420509
Conceição,PPD/PSD.CDS-PP,22.84,74,420509
Conceição,B.E.,8.33,27,420509
Conceição,MPT,7.72,25,420509
Conceição,PCP-PEV,3.4,11,420509
Conceição,PAN,2.16,7,420509
Conceição,L,1.54,5,420509
Conceição,PDA,0.93,3,420509
Conceição,PPM,0.93,3,420509
Conceição,PND,0.31,1,420509
Conceição,PNR,0.31,1,420509
Conceição,PPV,0.31,1,420509
Conceição,PTP,0.31,1,420509
Conceição,MAS,0,0,420509
Conceição,PCTP/MRPP,0,0,420509
Conceição,POUS,0,0,420509
