Objeto do Contrato,Tipo de Procedimento,Tipo(s) de Contrato,CPVs,Entidade(s) Adjudicante(s),Entidade(s) Adjudicatária(s),Preço Contratual,Data de Publicação,Data de Celebração do Contrato,Prazo de Execução,Local de Execução,Fundamentação,Data de Fecho do Contrato,Preço Total Efetivo,Causas das Alterações ao Prazo,Causas das Alterações ao Preço,Estado,N.º registo do Acordo Quadro,Descrição do Acordo Quadro,Procedimento Centralizado
49001018-Serviços Medicos Fisiatria,Ajuste Direto Regime Geral,Aquisição de serviços,"79600000-0, Serviços de recrutamento",Hospital Dr. Francisco Zagalo (501510150),DRA OLGA FONSECA-SERV.MEDICOS UNIPESSOAL LDA. (507788486),"3.190,00 €",21-02-2018,30-01-2018,30 dias,"Portugal, Aveiro, Ovar","Artigo 20.º, n.º 1, alínea d) do Código dos Contratos Públicos",21-02-2018,"3.190,00 €",,"",,Não aplicável.,Não aplicável.,FALSE
49005816-Serviços medicos de Med. Fisica Reabilitação,Ajuste Direto Regime Geral,Aquisição de serviços,"85100000-0, Serviços de saúde",Hospital Dr. Francisco Zagalo (501510150),DRA OLGA FONSECA-SERV.MEDICOS UNIPESSOAL LDA. (507788486),"36.308,00 €",01-03-2017,03-02-2017,365 dias,"Portugal, Aveiro, Ovar","Artigo 20.º, n.º 1, alínea a) do Código dos Contratos Públicos",30-11-2017,"30.102,00 €",,Serviços abaixo do previsto,,Não aplicável.,Não aplicável.,FALSE
AD49005816-Serviços Medicos de M.F.Reabilitação,Ajuste Direto Regime Geral,Aquisição de serviços,"85000000-9, Serviços de saúde e acção social",Hospital Dr. Francisco Zagalo (501510150),DRA OLGA FONSECA-SERV.MEDICOS UNIPESSOAL LDA. (507788486),"36.776,11 €",04-01-2017,01-03-2016,365 dias,"Portugal, Aveiro, Ovar","Artigo 20.º, n.º 1, alínea a) do Código dos Contratos Públicos",31-12-2016,"36.776,11 €",,"",,Não aplicável.,Não aplicável.,FALSE
Serviços medicos,Ajuste Direto Regime Geral,Aquisição de serviços,"79600000-0, Serviços de recrutamento",Hospital Dr. Francisco Zagalo (501510150),DRA OLGA FONSECA-SERV.MEDICOS UNIPESSOAL LDA. (507788486),"2.956,39 €",16-02-2016,20-01-2016,30 dias,"Portugal, Aveiro, Ovar","Artigo 20.º, n.º 1, alínea a) do Código dos Contratos Públicos",31-01-2016,"2.956,39 €",,"",,Não aplicável.,Não aplicável.,FALSE
Serviços medicos de Med. Fisica Reabilitação,Ajuste Direto Regime Geral,Aquisição de serviços,"85100000-0, Serviços de saúde",Hospital Dr. Francisco Zagalo (501510150),"Dr.Olga Fonseca-Serviços Medicos Unipessoal, Lda. (507788486)","27.840,00 €",28-05-2015,04-03-2015,365 dias,"Portugal, Aveiro, Ovar","Artigo 20.º, n.º 1, alínea a) do Código dos Contratos Públicos",31-12-2015,"31.689,63 €",,Serviço acima do previsto,,Não aplicável.,Não aplicável.,FALSE
Serviços medicos de clinico geral para os meses Junho/Julho/Agosto/2013,Ajuste Direto Regime Geral,Aquisição de serviços,"85000000-9, Serviços de saúde e acção social",HOSPITAL DR FRANCISCO ZAGALO (501510150),"Morecare-Serviços de Saude, Lda, (507788486)","11.250,00 €",20-05-2013,08-05-2013,92 dias,"Portugal, Aveiro, Ovar","Artigo 20.º, n.º 1, alínea a) do Código dos Contratos Públicos",31-08-2013,"10.025,00 €",,serviços efectuados abaixo do previsto,,Não aplicável.,Não aplicável.,
Serviços médicos de Med. Fisica Reabilitação para os meses de Junho/Julho e Agosto/2013,Ajuste Direto Regime Geral,Aquisição de serviços,"85000000-9, Serviços de saúde e acção social",HOSPITAL DR FRANCISCO ZAGALO (501510150),Dr. Olga Maria Ferreira O.Fonseca-Serv.Med.Unip.Lda. (507788486),"13.050,00 €",20-05-2013,08-05-2013,92 dias,"Portugal, Aveiro, Ovar","Artigo 20.º, n.º 1, alínea a) do Código dos Contratos Públicos",31-08-2013,"7.714,00 €",,Serviços efectuados abaixo do previsto,,Não aplicável.,Não aplicável.,
Serviços médicos na area de Medicina Fisica e Reabilitação,Ajuste Direto Regime Geral,Aquisição de serviços,"85140000-2, Serviços de saúde diversos",HOSPITAL DR FRANCISCO ZAGALO (501510150),"Dr.Olga Maria Ferreira O. Fonseca-Serv.Med.Unipessoal,Lda. (507788486)","19.720,00 €",23-10-2012,21-08-2012,122 dias,"Portugal, Aveiro, Ovar","Artigo 20.º, n.º 1, alínea a) do Código dos Contratos Públicos",31-12-2012,"10.411,00 €",,Serviços efectuados abaixo do previsto,,Não aplicável.,Não aplicável.,
Serviços Médicos de Medicina Fisica e Reabilitação relativo a Março/2011,Ajuste Direto Regime Geral,Aquisição de serviços,"85140000-2, Serviços de saúde diversos",HOSPITAL DR FRANCISCO ZAGALO (501510150),"DR OLGA MARIA FERREIRA O. FONSECA-SERV. MEDICINA UNIPESSOAL, LDA. (507788486)","5.610,99 €",17-05-2011,20-04-2011,30 dias,"Portugal, Aveiro, Ovar","Artigo 20.º, n.º 1, alínea a) do Código dos Contratos Públicos",20-04-2011,"5.610,99 €",,"",,Não aplicável.,Não aplicável.,
PRESTAÇÃO DE SERVIÇOS MÉDICOS NA AREA DE FISIATRIA RELATIVO A JAN. E FEV DE 2011,Ajuste Direto Regime Geral,Aquisição de serviços,"85312500-4, Serviços de reabilitação",HOSPITAL DR FRANCISCO ZAGALO (501510150),DR.OLGA MARIA FERREIRA O. FONSECA-SERV.MÉDICOS UNIP.LDA. (507788486),"9.965,84 €",31-03-2011,23-03-2011,60 dias,"Portugal, Aveiro, Ovar","Artigo 20.º, n.º 1, alínea a) do Código dos Contratos Públicos",23-03-2011,"9.965,84 €",,"",,Não aplicável.,Não aplicável.,
