Objeto do Contrato,Tipo de Procedimento,Tipo(s) de Contrato,CPVs,Entidade(s) Adjudicante(s),Entidade(s) Adjudicatária(s),Preço Contratual,Data de Publicação,Data de Celebração do Contrato,Prazo de Execução,Local de Execução,Fundamentação,Data de Fecho do Contrato,Preço Total Efetivo,Causas das Alterações ao Prazo,Causas das Alterações ao Preço,Estado,N.º registo do Acordo Quadro,Descrição do Acordo Quadro,Procedimento Centralizado
"AJ/58/2017 Aquisição de serviços de gestão de resíduos dos grupos III, IV e líquidos ",Ajuste Direto Regime Geral,Aquisição de serviços,"90500000-2, Serviços relativos a resíduos e lixos","Hospital de Magalhães Lemos, E. P. E. (502828790)",AMBIMED (503593427),"20,90 €",20-10-2017,13-07-2017,1 dias,"Portugal, Porto, Porto","Artigo 20.º, n.º 1, alínea a) do Código dos Contratos Públicos",,,,,,Não aplicável.,Não aplicável.,FALSE
"AS/38/2017 Serviços de Jardinagem no Hospital de Magalhães Lemos, E.P.E., para o ano de 2017",Ajuste Direto Regime Geral,Aquisição de serviços,"50000000-5, Serviços de reparação e manutenção","Hospital de Magalhães Lemos, E. P. E. (502828790)","Consjardim Unipessoal, Lda. (509456111)","4.000,00 €",20-10-2017,02-01-2017,30 dias,"Portugal, Porto, Porto","Artigo 20.º, n.º 1, alínea a) do Código dos Contratos Públicos",,,,,,Não aplicável.,Não aplicável.,FALSE
AJ/61/2017 Fornecimento de produtos hortícolas da 4ª gama para o ano de 2017,Ajuste Direto Regime Geral,Aquisição de bens móveis,"15300000-1, Fruta, produtos hortícolas e produtos afins","Hospital de Magalhães Lemos, E. P. E. (502828790)",FreshSabor (508879760),"518,30 €",19-10-2017,14-03-2017,8 dias,"Portugal, Porto, Porto","Artigo 20.º, n.º 1, alínea a) do Código dos Contratos Públicos",,,,,,Não aplicável.,Não aplicável.,FALSE
AJ/33/2017 Aquisição de Material de Consumo Clínico – Outros Produtos - para o ano de 2017,Ajuste Direto Regime Geral,Aquisição de bens móveis,"33000000-0, Equipamento médico, medicamentos e produtos para cuidados pessoais","Hospital de Magalhães Lemos, E. P. E. (502828790)","BASTOS VIEGAS,S.A. (500042772)","191,80 €",19-10-2017,03-07-2017,30 dias,"Portugal, Porto, Porto","Artigo 20.º, n.º 1, alínea a) do Código dos Contratos Públicos",,,,,,Não aplicável.,Não aplicável.,FALSE
Aquisição de medicamentos urgentes a armazenistas grossistas,Ajuste Direto Regime Geral,Aquisição de bens móveis,"33000000-0, Equipamento médico, medicamentos e produtos para cuidados pessoais","Hospital de Magalhães Lemos, E. P. E. (502828790)",Alliance Healthcare (502693150),"735,28 €",19-10-2017,03-10-2017,66 dias,"Portugal, Porto, Porto","Artigo 20.º, n.º 1, alínea a) do Código dos Contratos Públicos",,,,,,Não aplicável.,Não aplicável.,FALSE
AJ/37/2017 Aquisição de Material de Consumo Hoteleiro para o ano de 2017,Ajuste Direto Regime Geral,Aquisição de bens móveis,"39000000-2, Mobiliário (incl. de escritório), acessórios, aparelhos domésticos (excl. iluminação) e produtos de limpeza","Hospital de Magalhães Lemos, E. P. E. (502828790)",A.J.OLIVEIRA (502293748),"286,93 €",17-10-2017,06-07-2017,30 dias,"Portugal, Porto, Porto","Artigo 20.º, n.º 1, alínea a) do Código dos Contratos Públicos",,,,,,Não aplicável.,Não aplicável.,FALSE
AJ/33/2017 Aquisição de Material de Consumo Clínico – Outros Produtos - para o ano de 2017,Ajuste Direto Regime Geral,Aquisição de bens móveis,"33000000-0, Equipamento médico, medicamentos e produtos para cuidados pessoais","Hospital de Magalhães Lemos, E. P. E. (502828790)",PAUL HARTMANN (502271728),"240,00 €",17-10-2017,03-07-2017,30 dias,"Portugal, Porto, Porto","Artigo 20.º, n.º 1, alínea a) do Código dos Contratos Públicos",,,,,,Não aplicável.,Não aplicável.,FALSE
IG/8/2017 Combustíveis rodoviários para o ano de 2017_ 2016UMC373,Ajuste Direto Regime Geral,Aquisição de bens móveis,"09100000-0, Combustíveis","Hospital de Magalhães Lemos, E. P. E. (502828790)",Petróleos de Portugal - Petrogal SA (500697370),"886,15 €",17-10-2017,07-03-2017,30 dias,"Portugal, Porto, Porto","Artigo 20.º, n.º 1, alínea a) do Código dos Contratos Públicos",,,,,,Não aplicável.,Não aplicável.,FALSE
AJ/59/2017 Fornecimento de produtos de mercearia geral para o ano de 2017,Ajuste Direto Regime Geral,Aquisição de bens móveis,"15600000-4, Produtos da transformação de cereais e leguminosas, amidos e féculas","Hospital de Magalhães Lemos, E. P. E. (502828790)","RECHEIO - Cah & Carry, S (500145415)","126,66 €",17-10-2017,30-06-2017,8 dias,"Portugal, Porto, Porto","Artigo 20.º, n.º 1, alínea a) do Código dos Contratos Públicos",,,,,,Não aplicável.,Não aplicável.,FALSE
IG/07/2017 - Aquisição de gás natural na SPMS para o ano de 2017,Ajuste Direto Regime Geral,Aquisição de serviços,"76000000-3, Serviços relacionados com as indústrias do gás e do petróleo","Hospital de Magalhães Lemos, E. P. E. (502828790)","Galp Power, SA (504723456)","192,02 €",17-10-2017,02-01-2017,30 dias,"Portugal, Porto, Porto","Artigo 20.º, n.º 1, alínea a) do Código dos Contratos Públicos",,,,,,Não aplicável.,Não aplicável.,FALSE
AM/1014/2017 - Contrato de Assistência Técnica aos Elevadores do HML para 2017,Ajuste Direto Regime Geral,Aquisição de serviços,"50000000-5, Serviços de reparação e manutenção","Hospital de Magalhães Lemos, E. P. E. (502828790)",SCHMITT+SOHN ELEVADORES (500230757),"150,00 €",17-10-2017,02-01-2017,90 dias,"Portugal, Porto, Porto","Artigo 20.º, n.º 1, alínea a) do Código dos Contratos Públicos",,,,,,Não aplicável.,Não aplicável.,FALSE
AM/1016/2017 - Contrato de assistência técnica aos multifunções e fotocopia,Ajuste Direto Regime Geral,Aquisição de serviços,"79000000-4, Serviços a empresas: direito, comercialização, consultoria, recrutamento, impressão e segurança","Hospital de Magalhães Lemos, E. P. E. (502828790)",SCHMITT+SOHN ELEVADORES (500230757),"330,00 €",17-10-2017,02-01-2017,30 dias,"Portugal, Porto, Porto","Artigo 20.º, n.º 1, alínea a) do Código dos Contratos Públicos",,,,,,Não aplicável.,Não aplicável.,FALSE
IG/06/2017 - Fornecimento de Electricidade ao abrigo da SPMS para o ano de 2017,Ajuste Direto Regime Geral,Aquisição de serviços,"65000000-3, Serviços públicos","Hospital de Magalhães Lemos, E. P. E. (502828790)","Iberdrola Clientes Portugal, Unipessoal, Lda (502124083)","16.842,40 €",17-10-2017,02-01-2017,30 dias,"Portugal, Porto, Porto","Artigo 20.º, n.º 1, alínea a) do Código dos Contratos Públicos",,,,,,Não aplicável.,Não aplicável.,FALSE
"AJ/17/2017 Fornecimento de carnes frescas, congeladas, derivados de carne, enchidos e fumados durante 2017",Ajuste Direto Regime Geral,Aquisição de bens móveis,"15110000-2, Carne","Hospital de Magalhães Lemos, E. P. E. (502828790)","Carnes São José - Comércio e Industria de Carnes, Lda (501235574)","690,66 €",17-10-2017,02-01-2017,8 dias,"Portugal, Porto, Porto","Artigo 20.º, n.º 1, alínea a) do Código dos Contratos Públicos",,,,,,Não aplicável.,Não aplicável.,FALSE
AJ/60/2017 Fornecimento de leite e queijo fundido durante o ano de 2017,Ajuste Direto Regime Geral,Aquisição de bens móveis,"15500000-3, Lacticínios","Hospital de Magalhães Lemos, E. P. E. (502828790)",LACTOGAL (503183997),"531,35 €",17-10-2017,01-03-2017,8 dias,"Portugal, Porto, Porto","Artigo 20.º, n.º 1, alínea a) do Código dos Contratos Públicos",,,,,,Não aplicável.,Não aplicável.,FALSE
AJ/18/2017 Fornecimento de frutas e produtos hortícolas e da 4ª gama para o ano de 2017,Ajuste Direto Regime Geral,Aquisição de bens móveis,"15300000-1, Fruta, produtos hortícolas e produtos afins","Hospital de Magalhães Lemos, E. P. E. (502828790)","HORTIDOURO-PRODUTOS HORTICOLAS,LDA (507144007)","77,69 €",17-10-2017,02-01-2017,8 dias,"Portugal, Porto, Porto","Artigo 20.º, n.º 1, alínea a) do Código dos Contratos Públicos",,,,,,Não aplicável.,Não aplicável.,FALSE
AJ/18/2017 Fornecimento de frutas e produtos hortícolas e da 4ª gama para o ano de 2017,Ajuste Direto Regime Geral,Aquisição de bens móveis,"15300000-1, Fruta, produtos hortícolas e produtos afins","Hospital de Magalhães Lemos, E. P. E. (502828790)","HORTIDOURO-PRODUTOS HORTICOLAS,LDA (507144007)","594,40 €",17-10-2017,02-01-2017,8 dias,"Portugal, Porto, Porto","Artigo 20.º, n.º 1, alínea a) do Código dos Contratos Públicos",,,,,,Não aplicável.,Não aplicável.,FALSE
"IG/24/2017 - Material de Consumo Clínico - Fraldas, cuecas, chinelos, pensos, resguardos",Ajuste Direto Regime Geral,Aquisição de bens móveis,"33000000-0, Equipamento médico, medicamentos e produtos para cuidados pessoais","Hospital de Magalhães Lemos, E. P. E. (502828790)",PAUL HARTMANN (502271728),"833,28 €",17-10-2017,19-01-2017,15 dias,"Portugal, Porto, Porto","Artigo 20.º, n.º 1, alínea a) do Código dos Contratos Públicos",,,,,,Não aplicável.,Não aplicável.,FALSE
AJ/37/2017 Aquisição de Material de Consumo Hoteleiro para o ano de 2017,Ajuste Direto Regime Geral,Aquisição de bens móveis,"33000000-0, Equipamento médico, medicamentos e produtos para cuidados pessoais","Hospital de Magalhães Lemos, E. P. E. (502828790)","MEILEX, LDA. (501759441)","126,00 €",17-10-2017,06-07-2017,30 dias,"Portugal, Porto, Porto","Artigo 20.º, n.º 1, alínea a) do Código dos Contratos Públicos",,,,,,Não aplicável.,Não aplicável.,FALSE
"AJ/19/2017 - Fornecimento de congelados – peixes, derivados de peixe e legumes para o ano de 2017",Ajuste Direto Regime Geral,Aquisição de bens móveis,"15000000-8, Produtos alimentares, bebidas, tabaco e produtos afins","Hospital de Magalhães Lemos, E. P. E. (502828790)",A.MENDES TORRADO (501544984),"19,90 €",17-10-2017,02-01-2017,8 dias,"Portugal, Porto, Porto","Artigo 20.º, n.º 1, alínea a) do Código dos Contratos Públicos",,,,,,Não aplicável.,Não aplicável.,FALSE
AJ/33/2017 Aquisição de Material de Consumo Clínico – Outros Produtos - para o ano de 2017,Ajuste Direto Regime Geral,Aquisição de bens móveis,"33000000-0, Equipamento médico, medicamentos e produtos para cuidados pessoais","Hospital de Magalhães Lemos, E. P. E. (502828790)",ANASTÁCIO SALDANHA UNIPESSOAL LDA (505804441),"109,00 €",17-10-2017,03-07-2017,60 dias,"Portugal, Porto, Porto","Artigo 20.º, n.º 1, alínea a) do Código dos Contratos Públicos",,,,,,Não aplicável.,Não aplicável.,FALSE
AJ/37/2017 - Aquisição de Material de Consumo Hoteleiro para o ano de 2017,Ajuste Direto Regime Geral,Aquisição de bens móveis,"39000000-2, Mobiliário (incl. de escritório), acessórios, aparelhos domésticos (excl. iluminação) e produtos de limpeza","Hospital de Magalhães Lemos, E. P. E. (502828790)",HIGITOTAL (504297040),"171,65 €",17-10-2017,06-07-2017,15 dias,"Portugal, Porto, Porto","Artigo 20.º, n.º 1, alínea a) do Código dos Contratos Públicos",,,,,,Não aplicável.,Não aplicável.,FALSE
AJ/37/2017 - Aquisição de Material de Consumo Hoteleiro para o ano de 2017,Ajuste Direto Regime Geral,Aquisição de bens móveis,"39000000-2, Mobiliário (incl. de escritório), acessórios, aparelhos domésticos (excl. iluminação) e produtos de limpeza","Hospital de Magalhães Lemos, E. P. E. (502828790)",HIGITOTAL (504297040),"26,80 €",17-10-2017,06-07-2017,15 dias,"Portugal, Porto, Porto","Artigo 20.º, n.º 1, alínea a) do Código dos Contratos Públicos",,,,,,Não aplicável.,Não aplicável.,FALSE
AM/1016/2017 Contrato de assistência técnica aos multifunções e fotocopiadores para 2017,Ajuste Direto Regime Geral,Aquisição de serviços,"50000000-5, Serviços de reparação e manutenção","Hospital de Magalhães Lemos, E. P. E. (502828790)",XEROX (501656677),"100,96 €",17-10-2017,02-01-2017,90 dias,"Portugal, Porto, Porto","Artigo 20.º, n.º 1, alínea a) do Código dos Contratos Públicos",,,,,,Não aplicável.,Não aplicável.,FALSE
IG/09/2017 - Sabão Líquido na SPMS – AQ CP 8/2015 para 2017,Ajuste Direto Regime Geral,Aquisição de bens móveis,"39000000-2, Mobiliário (incl. de escritório), acessórios, aparelhos domésticos (excl. iluminação) e produtos de limpeza","Hospital de Magalhães Lemos, E. P. E. (502828790)","VYGON, LDA. (503232785)","339,00 €",17-10-2017,01-01-2017,15 dias,"Portugal, Porto, Porto","Artigo 20.º, n.º 1, alínea a) do Código dos Contratos Públicos",,,,,,Não aplicável.,Não aplicável.,FALSE
AJ/37/2017 - Aquisição de Material de Consumo Hoteleiro para o ano de 2017,Ajuste Direto Regime Geral,Aquisição de bens móveis,"39000000-2, Mobiliário (incl. de escritório), acessórios, aparelhos domésticos (excl. iluminação) e produtos de limpeza","Hospital de Magalhães Lemos, E. P. E. (502828790)",Air Liquide Medicinal SA (501576436),"364,08 €",17-10-2017,06-07-2017,15 dias,"Portugal, Porto, Porto","Artigo 20.º, n.º 1, alínea a) do Código dos Contratos Públicos",,,,,,Não aplicável.,Não aplicável.,FALSE
"AJ/58/2017Aquisição de serviços de gestão de resíduos dos grupos III, IV e líquidos ",Ajuste Direto Regime Geral,Aquisição de serviços,"90710000-7, Gestão ambiental","Hospital de Magalhães Lemos, E. P. E. (502828790)",AMBIMED (503593427),"460,82 €",17-10-2017,13-07-2017,30 dias,"Portugal, Porto, Porto","Artigo 20.º, n.º 1, alínea a) do Código dos Contratos Públicos",,,,,,Não aplicável.,Não aplicável.,FALSE
AJ/23/2017 - Fornecimento de produtos de mercearia para o ano de 2017,Ajuste Direto Regime Geral,Aquisição de bens móveis,"15000000-8, Produtos alimentares, bebidas, tabaco e produtos afins","Hospital de Magalhães Lemos, E. P. E. (502828790)",VILANDORINHO-ARMAZEM MERCEARIA (501140450),"178,80 €",16-10-2017,02-01-2017,15 dias,"Portugal, Porto, Porto","Artigo 20.º, n.º 1, alínea a) do Código dos Contratos Públicos",,,,,,Não aplicável.,Não aplicável.,FALSE
AJ/61/2017- Fornecimento de produtos hortícolas da 4ª gama para o ano de 2017,Ajuste Direto Regime Geral,Aquisição de bens móveis,"15000000-8, Produtos alimentares, bebidas, tabaco e produtos afins","Hospital de Magalhães Lemos, E. P. E. (502828790)",FreshSabor (508879760),"504,30 €",16-10-2017,14-03-2017,8 dias,"Portugal, Porto, Porto","Artigo 20.º, n.º 1, alínea a) do Código dos Contratos Públicos",,,,,,Não aplicável.,Não aplicável.,FALSE
AS/110/2017 - Serviços de manutenção preventiva e correctiva - Rede Telefónica,Ajuste Direto Regime Geral,Aquisição de serviços,"50000000-5, Serviços de reparação e manutenção","Hospital de Magalhães Lemos, E. P. E. (502828790)",VERA LÚCIA BOTELHO DIAS SILVA (214778673),"409,50 €",13-10-2017,02-01-2017,30 dias,"Portugal, Porto, Porto","Artigo 20.º, n.º 1, alínea a) do Código dos Contratos Públicos",,,,,,Não aplicável.,Não aplicável.,FALSE
IG/199/2017 - Consumo de energia até inicio do novo contrato,Ajuste Direto Regime Geral,Aquisição de serviços,"65000000-3, Serviços públicos","Hospital de Magalhães Lemos, E. P. E. (502828790)",EDP COMERCIAL (503504564),"865,22 €",13-10-2017,13-02-2017,30 dias,"Portugal, Porto, Porto","Artigo 20.º, n.º 1, alínea a) do Código dos Contratos Públicos",,,,,,Não aplicável.,Não aplicável.,FALSE
