freguesia,acronym,validVotesPercentage,votes,dicofre
Santiago da Guarda,PPD/PSD.CDS-PP,64.43,558,100307
Santiago da Guarda,PS,19.05,165,100307
Santiago da Guarda,MPT,6.12,53,100307
Santiago da Guarda,PCP-PEV,2.54,22,100307
Santiago da Guarda,L,1.62,14,100307
Santiago da Guarda,PND,1.5,13,100307
Santiago da Guarda,B.E.,0.69,6,100307
Santiago da Guarda,MAS,0.69,6,100307
Santiago da Guarda,PNR,0.69,6,100307
Santiago da Guarda,PCTP/MRPP,0.58,5,100307
Santiago da Guarda,PTP,0.58,5,100307
Santiago da Guarda,PPM,0.46,4,100307
Santiago da Guarda,PAN,0.35,3,100307
Santiago da Guarda,PDA,0.35,3,100307
Santiago da Guarda,PPV,0.35,3,100307
Santiago da Guarda,POUS,0,0,100307
