Objeto do Contrato,Tipo de Procedimento,Tipo(s) de Contrato,CPVs,Entidade(s) Adjudicante(s),Entidade(s) Adjudicatária(s),Preço Contratual,Data de Publicação,Data de Celebração do Contrato,Prazo de Execução,Local de Execução,Fundamentação,Data de Fecho do Contrato,Preço Total Efetivo,Causas das Alterações ao Prazo,Causas das Alterações ao Preço,Estado,N.º registo do Acordo Quadro,Descrição do Acordo Quadro,Procedimento Centralizado
Aquisição de reagentes para Bioquímica,Ajuste Direto Regime Geral,Aquisição de bens móveis,"33696500-0, Reagentes de laboratório","Hospital Garcia de Orta, E. P. E. (506361470)","ROCHE SISTEMAS DIAGNOSTICO, SOC. UNIPESSOAL, LDA (504282921)","5.190,00 €",29-03-2018,10-01-2018,90 dias,"Portugal, Setúbal, Almada","Artigo 26.º, n.º 1, alínea a) do Código dos Contratos Públicos",,,,,,Não aplicável.,Não aplicável.,FALSE
Aquisição de reagentes MIOGLOBINA para laboratório de urgência,Ajuste Direto Regime Geral,Aquisição de bens móveis,"33696500-0, Reagentes de laboratório","Hospital Garcia de Orta, E. P. E. (506361470)","ROCHE SISTEMAS DIAGNOSTICO, SOC. UNIPESSOAL, LDA (504282921)","10.000,00 €",29-03-2018,14-12-2017,17 dias,"Portugal, Setúbal, Almada","Artigo 20.º, n.º 1, alínea a) do Código dos Contratos Públicos",,,,,,Não aplicável.,Não aplicável.,FALSE
AQUISIÇÃO DE D-DIMEROS + CALIBRADOR,Ajuste Direto Regime Geral,Aquisição de bens móveis,"33696000-5, Reagentes e meios de contraste","Hospital Garcia de Orta, E. P. E. (506361470)","WERFEN PORTUGAL, LDA (EX IZASA) (501086110)","6.500,00 €",29-03-2018,19-01-2018,90 dias,"Portugal, Setúbal, Almada","Artigo 26.º, n.º 1, alínea a) do Código dos Contratos Públicos",,,,,,Não aplicável.,Não aplicável.,FALSE
AQUISIÇÃO DE OXIGÉNIO 100% GAS INAL RECIP. CRIOGÉNICO INALATÓRIA,Ajuste Direto Regime Geral,Aquisição de bens móveis,"33000000-0, Equipamento médico, medicamentos e produtos para cuidados pessoais","Hospital Garcia de Orta, E. P. E. (506361470)",Praxair Portugal Gases (501738916),"73.000,00 €",29-03-2018,14-12-2017,90 dias,"Portugal, Setúbal, Almada","Artigo 20.º, n.º 1, alínea a) do Código dos Contratos Públicos",,,,,,Não aplicável.,Não aplicável.,FALSE
Aquisição de PCR (MODULAR),Ajuste Direto Regime Geral,Aquisição de bens móveis,"33696500-0, Reagentes de laboratório","Hospital Garcia de Orta, E. P. E. (506361470)","ROCHE SISTEMAS DIAGNOSTICO, SOC. UNIPESSOAL, LDA (504282921)","5.240,00 €",28-03-2018,29-12-2017,2 dias,"Portugal, Setúbal, Almada","Artigo 26.º, n.º 1, alínea a) do Código dos Contratos Públicos",,,,,,Não aplicável.,Não aplicável.,FALSE
Aquisição de reagentes para laboratório de urgência,Ajuste Direto Regime Geral,Aquisição de bens móveis,"33696500-0, Reagentes de laboratório","Hospital Garcia de Orta, E. P. E. (506361470)","ROCHE SISTEMAS DIAGNOSTICO, SOC. UNIPESSOAL, LDA (504282921)","6.390,00 €",28-03-2018,16-11-2017,45 dias,"Portugal, Setúbal, Almada","Artigo 20.º, n.º 1, alínea a) do Código dos Contratos Públicos",,,,,,Não aplicável.,Não aplicável.,FALSE
Aquisição de reagentes para laboratório de urgência,Ajuste Direto Regime Geral,Aquisição de bens móveis,"33696500-0, Reagentes de laboratório","Hospital Garcia de Orta, E. P. E. (506361470)","ROCHE SISTEMAS DIAGNOSTICO, SOC. UNIPESSOAL, LDA (504282921)","5.170,00 €",28-03-2018,15-11-2017,46 dias,"Portugal, Setúbal, Almada","Artigo 20.º, n.º 1, alínea a) do Código dos Contratos Públicos",,,,,,Não aplicável.,Não aplicável.,FALSE
Aquisição de Ferritina,Ajuste Direto Regime Geral,Aquisição de bens móveis,"33696500-0, Reagentes de laboratório","Hospital Garcia de Orta, E. P. E. (506361470)","ROCHE SISTEMAS DIAGNOSTICO, SOC. UNIPESSOAL, LDA (504282921)","9.000,00 €",28-03-2018,31-10-2017,61 dias,"Portugal, Setúbal, Almada","Artigo 20.º, n.º 1, alínea a) do Código dos Contratos Públicos",,,,,,Não aplicável.,Não aplicável.,FALSE
Aquisição de reagentes PCR COBAS,Ajuste Direto Regime Geral,Aquisição de bens móveis,"33696500-0, Reagentes de laboratório","Hospital Garcia de Orta, E. P. E. (506361470)","ROCHE SISTEMAS DIAGNOSTICO, SOC. UNIPESSOAL, LDA (504282921)","9.920,00 €",28-03-2018,14-12-2017,17 dias,"Portugal, Setúbal, Almada","Artigo 20.º, n.º 1, alínea a) do Código dos Contratos Públicos",,,,,,Não aplicável.,Não aplicável.,FALSE
Aquisição de reagentes,Ajuste Direto Regime Geral,Aquisição de bens móveis,"33696500-0, Reagentes de laboratório","Hospital Garcia de Orta, E. P. E. (506361470)","ROCHE SIST.DIAG., SOC. UNIP. LDA (504282921)","30.600,00 €",27-03-2018,31-10-2017,61 dias,"Portugal, Setúbal, Almada","Artigo 20.º, n.º 1, alínea a) do Código dos Contratos Públicos",,,,,,Não aplicável.,Não aplicável.,FALSE
Aquisição de reagentes para HOSPOC,Ajuste Direto Regime Geral,Aquisição de bens móveis,"33696500-0, Reagentes de laboratório","Hospital Garcia de Orta, E. P. E. (506361470)","ROCHE SIST.DIAG., SOC. UNIP. LDA (504282921)","6.608,00 €",27-03-2018,08-11-2017,53 dias,"Portugal, Setúbal, Almada","Artigo 26.º, n.º 1, alínea a) do Código dos Contratos Públicos",,,,,,Não aplicável.,Não aplicável.,FALSE
Aquisição de reagentes,Ajuste Direto Regime Geral,Aquisição de bens móveis,"33000000-0, Equipamento médico, medicamentos e produtos para cuidados pessoais","Hospital Garcia de Orta, E. P. E. (506361470)",SYSMEX ESPANA S.L. (B64928948),"7.001,70 €",27-03-2018,16-06-2017,183 dias,"Portugal, Setúbal, Almada","Artigo 26.º, n.º 1, alínea a) do Código dos Contratos Públicos",,,,,,Não aplicável.,Não aplicável.,FALSE
Contrato de assistência técnica a equipamentos de marca PENTAX para o ano de 2017,Ajuste Direto Regime Geral,Aquisição de serviços,"50000000-5, Serviços de reparação e manutenção","Hospital Garcia de Orta, E. P. E. (506361470)","SIMMÉDICA -SISTEMAS INTEGRALES DE LA MEDICINA, S.A SUCURSAL EM PORTUGAL (980488842)","32.500,00 €",23-03-2018,29-05-2017,365 dias,"Portugal, Setúbal, Almada","Artigo 24.º, n.º 1, alínea e) do Código dos Contratos Públicos",,,,,,Não aplicável.,Não aplicável.,FALSE
Renovação do contrato de assistência técnica a equipamentos de marca BECKMAN COULTER para o ano de 2018,Ajuste Direto Regime Geral,Aquisição de serviços,"50000000-5, Serviços de reparação e manutenção","Hospital Garcia de Orta, E. P. E. (506361470)","BECKMAN COULTER PORTUGAL UNIPESSOAL, LDA (509035167)","1.501,07 €",23-03-2018,05-01-2018,365 dias,"Portugal, Setúbal, Almada","Artigo 24.º, n.º 1, alínea e) do Código dos Contratos Públicos",,,,,,Não aplicável.,Não aplicável.,FALSE
Aquisição de 2 Centrifugas de Bancada - AD nº. 7401617,Ajuste Direto Regime Geral,Aquisição de bens móveis,"33000000-0, Equipamento médico, medicamentos e produtos para cuidados pessoais","Hospital Garcia de Orta, E. P. E. (506361470)"," SUPPLYLAB, LDA (508453534)","11.517,00 €",23-03-2018,02-03-2018,30 dias,"Portugal, Setúbal, Almada","Artigo 20.º, n.º 1, alínea a) do Código dos Contratos Públicos",,,,,,Não aplicável.,Não aplicável.,FALSE
Renovação do contrato de assistência técnica a equipamentos de marca CONNECTIS para o ano de 2018,Ajuste Direto Regime Geral,Aquisição de serviços,"50000000-5, Serviços de reparação e manutenção","Hospital Garcia de Orta, E. P. E. (506361470)",CONNECTIS PORTUGAL (510686559),"12.295,00 €",22-03-2018,31-01-2018,365 dias,"Portugal, Setúbal, Almada","Artigo 24.º, n.º 1, alínea e) do Código dos Contratos Públicos",,,,,,Não aplicável.,Não aplicável.,FALSE
Renovação do contrato de assistência técnica a equipamentos de marca ENKROTT para o ano de 2018,Ajuste Direto Regime Geral,Aquisição de serviços,"50000000-5, Serviços de reparação e manutenção","Hospital Garcia de Orta, E. P. E. (506361470)","ENKROTT - GESTÃO E TRATAMENTO DE ÁGUAS, S.A. (500103461)","1.434,00 €",22-03-2018,05-01-2018,365 dias,"Portugal, Setúbal, Almada","Artigo 24.º, n.º 1, alínea e) do Código dos Contratos Públicos",,,,,,Não aplicável.,Não aplicável.,FALSE
"Aquisição e Implementação de Solução de Gestão de UCI do HGO, EPE - AD nº. 7403497",Ajuste Direto Regime Geral,Aquisição de bens móveis,"48000000-8, Pacotes de software e sistemas de informação","Hospital Garcia de Orta, E. P. E. (506361470)",B-Simple (506188841),"50.000,00 €",22-03-2018,02-03-2018,365 dias,"Portugal, Setúbal, Almada","Artigo 20.º, n.º 1, alínea a) do Código dos Contratos Públicos",,,,,,Não aplicável.,Não aplicável.,FALSE
Renovação do contrato de assistência técnica a equipamentos de marca EMSOR durante o ano de 2018,Ajuste Direto Regime Geral,Aquisição de serviços,"50000000-5, Serviços de reparação e manutenção","Hospital Garcia de Orta, E. P. E. (506361470)",BENNASAR DIAGNÓSTICA (509366066),"2.805,00 €",22-03-2018,05-01-2018,365 dias,"Portugal, Setúbal, Almada","Artigo 24.º, n.º 1, alínea e) do Código dos Contratos Públicos",,,,,,Não aplicável.,Não aplicável.,FALSE
Renovação do contrato de assistência técnica a equipamentos de marca INFOCONTROL para o ano de 2018,Ajuste Direto Regime Geral,Aquisição de serviços,"50000000-5, Serviços de reparação e manutenção","Hospital Garcia de Orta, E. P. E. (506361470)",Infocontrol (501395784),"2.786,46 €",22-03-2018,02-01-2018,365 dias,"Portugal, Setúbal, Almada","Artigo 24.º, n.º 1, alínea e) do Código dos Contratos Públicos",,,,,,Não aplicável.,Não aplicável.,FALSE
Renovação do contrato de manutenção de equipamento de esterilização STERRAD para o ano de 2018,Ajuste Direto Regime Geral,Aquisição de serviços,"50000000-5, Serviços de reparação e manutenção","Hospital Garcia de Orta, E. P. E. (506361470)","JOHNSON & JOHNSON, LDA (500153370)","6.120,00 €",22-03-2018,12-01-2018,365 dias,"Portugal, Setúbal, Almada","Artigo 24.º, n.º 1, alínea e) do Código dos Contratos Públicos",,,,,,Não aplicável.,Não aplicável.,FALSE
Renovação do contrato de assistência técnica a equipamento de Neuroestimulação Intra-operatória para o ano de 2018,Ajuste Direto Regime Geral,Aquisição de serviços,"50000000-5, Serviços de reparação e manutenção","Hospital Garcia de Orta, E. P. E. (506361470)",Hasse (500132976),"9.600,00 €",22-03-2018,12-01-2018,365 dias,"Portugal, Setúbal, Almada","Artigo 24.º, n.º 1, alínea e) do Código dos Contratos Públicos",,,,,,Não aplicável.,Não aplicável.,FALSE
Contrato de assistência técnica a equipamentos de marca VIGIE para o ano de 2018,Ajuste Direto Regime Geral,Aquisição de serviços,"50000000-5, Serviços de reparação e manutenção","Hospital Garcia de Orta, E. P. E. (506361470)","ViGIE Solutions, Lda. (509041108)","6.962,84 €",22-03-2018,12-01-2018,365 dias,"Portugal, Setúbal, Almada","Artigo 24.º, n.º 1, alínea e) do Código dos Contratos Públicos",,,,,,Não aplicável.,Não aplicável.,FALSE
Aquisição de 32 mesas de cabeceira com tabuleiro de refeições,Ajuste Direto Regime Geral,Aquisição de bens móveis,"39100000-3, Mobiliário","Hospital Garcia de Orta, E. P. E. (506361470)","Sano Técnica, Lda. (500239819)","11.779,20 €",22-03-2018,01-03-2018,30 dias,"Portugal, Setúbal, Almada","Artigo 20.º, n.º 1, alínea a) do Código dos Contratos Públicos",,,,,,Não aplicável.,Não aplicável.,FALSE
AQUISIÇÃO DE BRONCOFIBROSCÓPIO,Ajuste Direto Regime Geral,Aquisição de bens móveis,"33000000-0, Equipamento médico, medicamentos e produtos para cuidados pessoais","Hospital Garcia de Orta, E. P. E. (506361470)","TEPREL - EQUIPAMENTO MÉDICOS, S.A. (502262184)","8.030,00 €",21-03-2018,09-03-2018,30 dias,"Portugal, Setúbal, Almada","Artigo 20.º, n.º 1, alínea a) do Código dos Contratos Públicos",,,,,,Não aplicável.,Não aplicável.,FALSE
PRESTAÇÃO DE SERVIÇOS DE DESENHADOR CAD PARA ANO DE 2017,Ajuste Direto Regime Geral,Aquisição de serviços,"71000000-8, Serviços de arquitectura, construção, engenharia e inspecção","Hospital Garcia de Orta, E. P. E. (506361470)","Efago - Manutenção Hospitalar, ACE (510930573)","30.982,56 €",21-03-2018,17-01-2018,365 dias,"Portugal, Setúbal, Almada","Artigo 20.º, n.º 1, alínea a) do Código dos Contratos Públicos",,,,,,Não aplicável.,Não aplicável.,FALSE
