freguesia,acronym,validVotesPercentage,votes,dicofre
Gaula,PPD/PSD.CDS-PP,28.78,333,310804
Gaula,PS,23.25,269,310804
Gaula,PTP,12.1,140,310804
Gaula,MPT,11.41,132,310804
Gaula,B.E.,4.93,57,310804
Gaula,PCP-PEV,4.93,57,310804
Gaula,PAN,4.75,55,310804
Gaula,L,2.25,26,310804
Gaula,PND,1.82,21,310804
Gaula,PCTP/MRPP,1.64,19,310804
Gaula,MAS,0.86,10,310804
Gaula,PPM,0.78,9,310804
Gaula,PPV,0.78,9,310804
Gaula,PDA,0.69,8,310804
Gaula,PNR,0.61,7,310804
Gaula,POUS,0.43,5,310804
