freguesia,acronym,validVotesPercentage,votes,dicofre
Planalto de Monforte (União das freguesias de Oucidres e Bobadela),PPD/PSD.CDS-PP,62.04,67,170353
Planalto de Monforte (União das freguesias de Oucidres e Bobadela),PS,22.22,24,170353
Planalto de Monforte (União das freguesias de Oucidres e Bobadela),PCP-PEV,6.48,7,170353
Planalto de Monforte (União das freguesias de Oucidres e Bobadela),MPT,1.85,2,170353
Planalto de Monforte (União das freguesias de Oucidres e Bobadela),PCTP/MRPP,1.85,2,170353
Planalto de Monforte (União das freguesias de Oucidres e Bobadela),PND,1.85,2,170353
Planalto de Monforte (União das freguesias de Oucidres e Bobadela),B.E.,0.93,1,170353
Planalto de Monforte (União das freguesias de Oucidres e Bobadela),L,0.93,1,170353
Planalto de Monforte (União das freguesias de Oucidres e Bobadela),PAN,0.93,1,170353
Planalto de Monforte (União das freguesias de Oucidres e Bobadela),PTP,0.93,1,170353
Planalto de Monforte (União das freguesias de Oucidres e Bobadela),MAS,0,0,170353
Planalto de Monforte (União das freguesias de Oucidres e Bobadela),PDA,0,0,170353
Planalto de Monforte (União das freguesias de Oucidres e Bobadela),PNR,0,0,170353
Planalto de Monforte (União das freguesias de Oucidres e Bobadela),POUS,0,0,170353
Planalto de Monforte (União das freguesias de Oucidres e Bobadela),PPM,0,0,170353
Planalto de Monforte (União das freguesias de Oucidres e Bobadela),PPV,0,0,170353
