freguesia,acronym,validVotesPercentage,votes,dicofre
Fermentões,PS,43.6,759,030815
Fermentões,PPD/PSD.CDS-PP,24.35,424,030815
Fermentões,MPT,10.17,177,030815
Fermentões,PCP-PEV,9.13,159,030815
Fermentões,B.E.,4.65,81,030815
Fermentões,PCTP/MRPP,2.47,43,030815
Fermentões,L,1.78,31,030815
Fermentões,PAN,1.03,18,030815
Fermentões,PND,0.63,11,030815
Fermentões,PPM,0.63,11,030815
Fermentões,MAS,0.52,9,030815
Fermentões,PTP,0.46,8,030815
Fermentões,PPV,0.29,5,030815
Fermentões,PNR,0.17,3,030815
Fermentões,PDA,0.11,2,030815
Fermentões,POUS,0,0,030815
