Objeto do Contrato,Tipo de Procedimento,Tipo(s) de Contrato,CPVs,Entidade(s) Adjudicante(s),Entidade(s) Adjudicatária(s),Preço Contratual,Data de Publicação,Data de Celebração do Contrato,Prazo de Execução,Local de Execução,Fundamentação,Data de Fecho do Contrato,Preço Total Efetivo,Causas das Alterações ao Prazo,Causas das Alterações ao Preço,Estado,N.º registo do Acordo Quadro,Descrição do Acordo Quadro,Procedimento Centralizado
Assinatura anual para acesso web à Ovid,Ajuste Direto Regime Geral,Aquisição de serviços,"72320000-4, Serviços relacionados com bases de dados","Centro Hospitalar e Universitário de Coimbra, E.P.E. (510103448)","Lusodoc, Documentação Técnico-Científica, Lda. (502609982)","7.936,00 €",11-12-2012,10-12-2012,365 dias,"Portugal, Coimbra, Coimbra","Artigo 20.º, n.º 1, alínea a) do Código dos Contratos Públicos","","",,,,Não aplicável.,Não aplicável.,
Sistema de avaliação retrospetiva da glicose,Ajuste Direto Regime Geral,Aquisição de bens móveis,"33195000-3, Sistema de monitorização dos doentes","Centro Hospitalar e Universitário de Coimbra, E.P.E. (510103448)","Medtronic Portugal, Lda. (504223933)","1.800,00 €",11-12-2012,31-10-2012,2 dias,"Portugal, Coimbra, Coimbra","Artigo 20.º, n.º 1, alínea a) do Código dos Contratos Públicos","","",,,,Não aplicável.,Não aplicável.,
Equipamento informático diverso,Ajuste Direto Regime Geral,Aquisição de bens móveis,"30230000-0, Equipamento informático","Centro Hospitalar e Universitário de Coimbra, E.P.E. (510103448)","ATM Informática 2, SA. (504062859), Normática, SA. (501782230), CPCis, SA. (501267255)","2.292,94 €",11-12-2012,16-11-2012,30 dias,"Portugal, Coimbra, Coimbra","Artigo 20.º, n.º 1, alínea a) do Código dos Contratos Públicos","","",,,,Não aplicável.,Não aplicável.,
"Cardiodesfibrilhador CDI camara unica com electrodo, 1 unidade;<br/>Cardiodesfibrilhador CDI - Biventricular com electrodo, 1 unidade",Ajuste Direto Regime Geral,Aquisição de bens móveis,"33182210-4, Estimulador cardíaco (pacemaker)","Centro Hospitalar e Universitário de Coimbra, E.P.E. (510103448)","Sorincardio - Comercio e Distribuição de Equipamentos Medicos, ldª (505514010)","36.250,00 €",11-12-2012,04-12-2012,20 dias,"Portugal, Coimbra, Coimbra","Artigo 20.º, n.º 1, alínea a) do Código dos Contratos Públicos","","",,,,Não aplicável.,Não aplicável.,
CABEÇAS FEMORAIS PARA PROTESES TOTAIS DA ANCA,Ajuste Direto Regime Geral,Aquisição de bens móveis,"33184100-4, Implantes cirúrgicos","Centro Hospitalar e Universitário de Coimbra, E.P.E. (510103448)","MBA PORTUGAL, S.A. (504445960)","1.890,00 €",11-12-2012,01-12-2012,20 dias,"Portugal, Coimbra, Coimbra","Artigo 20.º, n.º 1, alínea a) do Código dos Contratos Públicos","","",,,,Não aplicável.,Não aplicável.,
"AGULHA PERCUTANEA, FIO GUIA, ESPAÇADORES, MATERIAL DE COLUNA LEGACY",Ajuste Direto Regime Geral,Aquisição de bens móveis,"33184100-4, Implantes cirúrgicos","Centro Hospitalar e Universitário de Coimbra, E.P.E. (510103448)",MEDTRONIC PORTUGAL COMERCIO E DISTRIBUIÇÃO DE APARELHOS MEDICOS LDA (504223933),"5.026,25 €",11-12-2012,01-12-2012,20 dias,"Portugal, Coimbra, Coimbra","Artigo 20.º, n.º 1, alínea a) do Código dos Contratos Públicos","","",,,,Não aplicável.,Não aplicável.,
"MATERIAL DE COLUNA LEGACY, AGULHA PERCUTANEA, FIO GUIA",Ajuste Direto Regime Geral,Aquisição de bens móveis,"33184100-4, Implantes cirúrgicos","Centro Hospitalar e Universitário de Coimbra, E.P.E. (510103448)",MEDTRONIC PORTUGAL - COMERCIO E DISTRIBUIÇÃO DE APARELHOS MEDICOS LDA (504223933),"2.665,25 €",11-12-2012,01-12-2012,20 dias,"Portugal, Coimbra, Coimbra","Artigo 20.º, n.º 1, alínea a) do Código dos Contratos Públicos","","",,,,Não aplicável.,Não aplicável.,
"AGULHAS PERCUTANEA, FIO GUIA, MATERIAL DE FIXAÇÃO - LEGACY",Ajuste Direto Regime Geral,Aquisição de bens móveis,"33184100-4, Implantes cirúrgicos","Centro Hospitalar e Universitário de Coimbra, E.P.E. (510103448)",MEDTRONIC PORTUGAL COMERCIO E DISTRIBUIÇÃO DE APARELHOS MEDICOS LDA (504223933),"2.869,00 €",11-12-2012,01-12-2012,20 dias,"Portugal, Coimbra, Coimbra","Artigo 20.º, n.º 1, alínea a) do Código dos Contratos Públicos","","",,,,Não aplicável.,Não aplicável.,
SISTEMA DE FIXAÇÃO DA COLUNA DORSO-LOMBAR VIA POSTERIOR,Ajuste Direto Regime Geral,Aquisição de bens móveis,"33184100-4, Implantes cirúrgicos","Centro Hospitalar e Universitário de Coimbra, E.P.E. (510103448)",MEDTRONIC PORTUGAL COMERCIO E DISTRIBUIÇÃO DE APARELHOS MEDICOS LDA (504223933),"4.075,00 €",11-12-2012,01-12-2012,20 dias,"Portugal, Coimbra, Coimbra","Artigo 20.º, n.º 1, alínea a) do Código dos Contratos Públicos","","",,,,Não aplicável.,Não aplicável.,
"AGULHA PERCUTANEA, FIO GUIA, LEGACY, ESPAÇADORES",Ajuste Direto Regime Geral,Aquisição de bens móveis,"33184100-4, Implantes cirúrgicos","Centro Hospitalar e Universitário de Coimbra, E.P.E. (510103448)",MEDTRONIC PORTUGAL COMERCIO E DISTRIBUIÇÃO DE APARELHOS MEDICOS LDA (504223933),"4.631,25 €",10-12-2012,01-12-2012,20 dias,"Portugal, Coimbra, Coimbra<BR/>Portugal, Coimbra, Coimbra","Artigo 20.º, n.º 1, alínea a) do Código dos Contratos Públicos","","",,,,Não aplicável.,Não aplicável.,
PROTESES DO OMBRO PARA FRACTURAS DA EXTREMIDADE SUPERIOR DO UMERO,Ajuste Direto Regime Geral,Aquisição de bens móveis,"33183100-7, Implantes ortopédicos","Centro Hospitalar e Universitário de Coimbra, E.P.E. (510103448)",JOHNSON & JOHNSON LDA (500153370),"1.480,00 €",10-12-2012,01-12-2012,20 dias,"Portugal, Coimbra, Coimbra","Artigo 20.º, n.º 1, alínea a) do Código dos Contratos Públicos","","",,,,Não aplicável.,Não aplicável.,
Adesão à BioMed Central como Advance Payment Membership,Ajuste Direto Regime Geral,Aquisição de serviços,"79970000-4, Serviços de publicação","Centro Hospitalar e Universitário de Coimbra, E.P.E. (510103448)",BioMed Central Limited (GB823826326),"6.000,00 €",10-12-2012,29-10-2012,365 dias,"Portugal, Coimbra, Coimbra","Artigo 20.º, n.º 1, alínea a) do Código dos Contratos Públicos","","",,,,Não aplicável.,Não aplicável.,
ESPAÇADORES INTERVERTEBRAIS CAGES DA COLUNA CERVICAL,Ajuste Direto Regime Geral,Aquisição de bens móveis,"33183100-7, Implantes ortopédicos","Centro Hospitalar e Universitário de Coimbra, E.P.E. (510103448)",EUROSINTESE MATERIAL MEDICO HOSPITALAR LD (503491403),"6.490,00 €",10-12-2012,19-11-2012,20 dias,"Portugal, Coimbra, Coimbra","Artigo 20.º, n.º 1, alínea a) do Código dos Contratos Públicos","","",,,,Não aplicável.,Não aplicável.,
Aquisição de Imunoglobulina Humana Normal 50mg/ml sol inj fr 200ml IV,Ajuste Direto Regime Geral,Aquisição de bens móveis,"33698000-9, Produtos para fins clínicos","Centro Hospitalar e Universitário de Coimbra, E.P.E. (510103448)",Octapharma - Produtos Farmaceuticos Lda (502820780),"73.944,00 €",10-12-2012,27-11-2012,365 dias,"Portugal, Coimbra, Coimbra","Artigo 24.º, n.º 1, alínea c) do Código dos Contratos Públicos","","",,,,Não aplicável.,Não aplicável.,
Aquisição de Imunoglobulina Humana Normal 165mg/ml sol inj fr 10ml SC,Ajuste Direto Regime Geral,Aquisição de bens móveis,"33698000-9, Produtos para fins clínicos","Centro Hospitalar e Universitário de Coimbra, E.P.E. (510103448)",Octapharma - Produtos Farmaceuticos Lda (502820780),"67.320,00 €",10-12-2012,27-11-2012,365 dias,"Portugal, Coimbra, Coimbra","Artigo 24.º, n.º 1, alínea e) do Código dos Contratos Públicos","","",,,,Não aplicável.,Não aplicável.,
IMPLANTES PARA A ESTABILIZAÇÃO DA COLUNA CERVICALE TORACICA SUPERIOR,Ajuste Direto Regime Geral,Aquisição de bens móveis,"33183100-7, Implantes ortopédicos","Centro Hospitalar e Universitário de Coimbra, E.P.E. (510103448)",SYNTHES COMERCIALIZAÇÃO DE DISPOSITIVOS MEDICOS LDA (501212191),"4.304,27 €",07-12-2012,01-12-2012,20 dias,"Portugal, Coimbra, Coimbra","Artigo 20.º, n.º 1, alínea a) do Código dos Contratos Públicos","","",,,,Não aplicável.,Não aplicável.,
"CAVILHAS NÃO RIMADAS DA TIBIA, PARAFUSOS DE BLOQUEIO,PLACAS EM L",Ajuste Direto Regime Geral,Aquisição de bens móveis,"33183100-7, Implantes ortopédicos","Centro Hospitalar e Universitário de Coimbra, E.P.E. (510103448)",SYNTHES COMERCIALIZAÇÃO DE DISPOSITIVOS MEDICOS LD (501212191),"1.273,96 €",06-12-2012,01-12-2012,20 dias,"Portugal, Coimbra, Coimbra","Artigo 20.º, n.º 1, alínea a) do Código dos Contratos Públicos","","",,,,Não aplicável.,Não aplicável.,
"espaçadores intervertebrais cages da coluna lombar, 1 Unid",Ajuste Direto Regime Geral,Aquisição de bens móveis,"33183100-7, Implantes ortopédicos","Centro Hospitalar e Universitário de Coimbra, E.P.E. (510103448)",synthes comercialização dispositivos medicos LD (501212191),"1.400,00 €",06-12-2012,01-12-2012,20 dias,"Portugal, Coimbra, Coimbra","Artigo 20.º, n.º 1, alínea a) do Código dos Contratos Públicos","","",,,,Não aplicável.,Não aplicável.,
Aquisição de Fibrinogénio Humano 5.5mg/cm2+Trombina 2UI/cm2 Esp. Medic.,Ajuste Direto Regime Geral,Aquisição de bens móveis,"33698000-9, Produtos para fins clínicos","Centro Hospitalar e Universitário de Coimbra, E.P.E. (510103448)",Takeda Farmaceuticos Portugal Lda (502801204),"28.000,00 €",06-12-2012,06-11-2012,365 dias,"Portugal, Coimbra, Coimbra","Artigo 20.º, n.º 1, alínea a) do Código dos Contratos Públicos","","",,,,Não aplicável.,Não aplicável.,
Upgrade da Storage Eva4000,Ajuste Direto Regime Geral,Aquisição de bens móveis,"30233141-1, Matriz redundante de discos independentes (RAID)","Centro Hospitalar e Universitário de Coimbra, E.P.E. (510103448)","CPCis - Companhia Portuguesa de Computadores, Informática e Sistemas, S.A. (501267255)","9.637,93 €",04-12-2012,29-11-2012,15 dias,"Portugal, Coimbra, Coimbra","Artigo 20.º, n.º 1, alínea a) do Código dos Contratos Públicos","","",,,,Não aplicável.,Não aplicável.,
"Aquisição de Peginterferão Alfa 2A 0,18mg/0,5ml sol inj caneta 0,5ml SC",Ajuste Direto Regime Geral,Aquisição de bens móveis,"33698000-9, Produtos para fins clínicos","Centro Hospitalar e Universitário de Coimbra, E.P.E. (510103448)","Roche Farmacêutica Quimica, Lda (500233810)","161.616,00 €",04-12-2012,26-10-2012,365 dias,"Portugal, Coimbra, Coimbra","Artigo 24.º, n.º 1, alínea e) do Código dos Contratos Públicos","","",,,,Não aplicável.,Não aplicável.,
"Aquisição de Sol DPCA Glucose 22,7mg/ml CA 1,25 mmol/l saco duplo com tampa iodopov 2000ml",Ajuste Direto Regime Geral,Aquisição de bens móveis,"33698000-9, Produtos para fins clínicos","Centro Hospitalar e Universitário de Coimbra, E.P.E. (510103448)",Fresénius Medical Care Portugal S.A. (503070220),"22.823,20 €",04-12-2012,14-11-2012,365 dias,"Portugal, Coimbra, Coimbra","Artigo 20.º, n.º 1, alínea a) do Código dos Contratos Públicos","","",,,,Não aplicável.,Não aplicável.,
Aquisição de Mesna 400mg/4ml sol inj fr 4ml IV,Ajuste Direto Regime Geral,Aquisição de bens móveis,"33698000-9, Produtos para fins clínicos","Centro Hospitalar e Universitário de Coimbra, E.P.E. (510103448)","Baxter Médico Farmacêutica, Lda (503347345)","33.048,00 €",04-12-2012,18-10-2012,365 dias,"Portugal, Coimbra, Coimbra","Artigo 24.º, n.º 1, alínea e) do Código dos Contratos Públicos","","",,,,Não aplicável.,Não aplicável.,
"Aquisição de Eribulina 0,44mg/ml sol inj fr 2ml IV",Ajuste Direto Regime Geral,Aquisição de bens móveis,"33698000-9, Produtos para fins clínicos","Centro Hospitalar e Universitário de Coimbra, E.P.E. (510103448)","Eisai Farmacêutica Unipessoal, Lda (507847660)","12.000,00 €",04-12-2012,29-10-2012,365 dias,"Portugal, Coimbra, Coimbra","Artigo 20.º, n.º 1, alínea a) do Código dos Contratos Públicos","","",,,,Não aplicável.,Não aplicável.,
"Aquisição de Darbepoetina alfa 150ug/0,3ml sol inj ser 0,3ml",Ajuste Direto Regime Geral,Aquisição de bens móveis,"33698000-9, Produtos para fins clínicos","Centro Hospitalar e Universitário de Coimbra, E.P.E. (510103448)","Amgen Biofarmacêutica, Lda (502942959)","217.382,40 €",04-12-2012,29-10-2012,365 dias,"Portugal, Coimbra, Coimbra","Artigo 24.º, n.º 1, alínea e) do Código dos Contratos Públicos","","",,,,Não aplicável.,Não aplicável.,
Aquisição de Reagentes para o Serviço de Sangue e Medicina Transfusional,Ajuste Direto Regime Geral,Aquisição de bens móveis,"33696500-0, Reagentes de laboratório","Centro Hospitalar e Universitário de Coimbra, E.P.E. (510103448)",Diamed Portuguesa S.A. (501675809),"25.399,00 €",04-12-2012,08-11-2012,365 dias,"Portugal, Coimbra, Coimbra","Artigo 20.º, n.º 1, alínea a) do Código dos Contratos Públicos",31-12-2014,"25.399,00 €",,,,Não aplicável.,Não aplicável.,
"Aquisição de Sol DPCA Glucose 22,7mg/ml CA 1,25mmol/l Saco duplo com tampa iodopov 5000ml",Ajuste Direto Regime Geral,Aquisição de bens móveis,"33698000-9, Produtos para fins clínicos","Centro Hospitalar e Universitário de Coimbra, E.P.E. (510103448)","Fresénius Medical Care, Lda (503070220)","21.840,00 €",04-12-2012,07-11-2012,365 dias,"Portugal, Coimbra, Coimbra","Artigo 20.º, n.º 1, alínea a) do Código dos Contratos Públicos","","",,,,Não aplicável.,Não aplicável.,
Aquisição de Imunoglobulina Humana Contra a Hepatite B 2500 UI pó sol inj fr IV,Ajuste Direto Regime Geral,Aquisição de bens móveis,"33698000-9, Produtos para fins clínicos","Centro Hospitalar e Universitário de Coimbra, E.P.E. (510103448)","Kedrion Portugal - Distribuição de Produtos Farmacêuticos, Lda (508472830)","47.850,00 €",04-12-2012,07-11-2012,365 dias,"Portugal, Coimbra, Coimbra","Artigo 24.º, n.º 1, alínea e) do Código dos Contratos Públicos","","",,,,Não aplicável.,Não aplicável.,
Aquisição de Tobramicina 28mg pó inal caps blist,Ajuste Direto Regime Geral,Aquisição de bens móveis,"33698000-9, Produtos para fins clínicos","Centro Hospitalar e Universitário de Coimbra, E.P.E. (510103448)",Novartis Farma Produtos Farmacêuticos (500063524),"54.180,90 €",04-12-2012,05-11-2012,365 dias,"Portugal, Coimbra, Coimbra","Artigo 20.º, n.º 1, alínea a) do Código dos Contratos Públicos","","",,,,Não aplicável.,Não aplicável.,
Aquisição de Noradrenalina 1mg/mlsol inj fr 50ml IV,Ajuste Direto Regime Geral,Aquisição de bens móveis,"33698000-9, Produtos para fins clínicos","Centro Hospitalar e Universitário de Coimbra, E.P.E. (510103448)","B. Braun Medical, Lda (501506543)","105.000,00 €",04-12-2012,25-10-2012,365 dias,"Portugal, Coimbra, Coimbra","Artigo 24.º, n.º 2, alínea c) do Código dos Contratos Públicos","","",,,,Não aplicável.,Não aplicável.,
"Aquisição de Peginterferão Alfa 2A 0,135mg/0,5ml sol inj. caneta 0,5mlSC",Ajuste Direto Regime Geral,Aquisição de bens móveis,"33698000-9, Produtos para fins clínicos","Centro Hospitalar e Universitário de Coimbra, E.P.E. (510103448)",Roche Farmacêutica Quimica (500233810),"51.936,00 €",04-12-2012,25-10-2012,365 dias,"Portugal, Coimbra, Coimbra","Artigo 24.º, n.º 1, alínea e) do Código dos Contratos Públicos","","",,,,Não aplicável.,Não aplicável.,
Aquisição de medicamentos,Ajuste Direto Regime Geral,Aquisição de bens móveis,"33698000-9, Produtos para fins clínicos","Centro Hospitalar e Universitário de Coimbra, E.P.E. (510103448)",UCB - Produtos Farmacêuticos Lda (500291322),"60.000,00 €",04-12-2012,08-11-2012,365 dias,"Portugal, Coimbra<BR/>Portugal, Coimbra, Coimbra","Artigo 24.º, n.º 1, alínea e) do Código dos Contratos Públicos","","",,,,Não aplicável.,Não aplicável.,
aquisição de medicamentos,Ajuste Direto Regime Geral,Aquisição de bens móveis,"33698000-9, Produtos para fins clínicos","Centro Hospitalar e Universitário de Coimbra, E.P.E. (510103448)","Gilead Sciences, Lda (503604704)","1.201.995,00 €",04-12-2012,05-11-2012,365 dias,"Portugal, Coimbra","Artigo 24.º, n.º 1, alínea e) do Código dos Contratos Públicos","","",,,,Não aplicável.,Não aplicável.,
Aquisição de Fibrinogénio humano 1.000mg pó sol. inj. fr IV,Ajuste Direto Regime Geral,Aquisição de bens móveis,"33698000-9, Produtos para fins clínicos","Centro Hospitalar e Universitário de Coimbra, E.P.E. (510103448)","CSL Behring, Lda (503047201)","221.250,00 €",03-12-2012,07-11-2012,365 dias,"Portugal, Coimbra, Coimbra","Artigo 24.º, n.º 1, alínea e) do Código dos Contratos Públicos","","",,,,Não aplicável.,Não aplicável.,
"Ajuste Direto n.º 410018/2011R1 - Treprostinilo 2,5mg/ml sol. inj. frs. 20ml SC",Ajuste Direto Regime Geral,Aquisição de bens móveis,"33600000-6, Produtos farmacêuticos","Centro Hospitalar e Universitário de Coimbra, E.P.E. (510103448)",D.L.A. Farmacêutica S.A. (503894427),"359.078,18 €",03-12-2012,22-10-2012,365 dias,"Portugal, Coimbra","Artigo 24.º, n.º 1, alínea e) do Código dos Contratos Públicos","","",,,,Não aplicável.,Não aplicável.,
