freguesia,acronym,validVotesPercentage,votes,dicofre
Muge,PS,55.63,163,141503
Muge,PPD/PSD,10.24,30,141503
Muge,B.E.,8.53,25,141503
Muge,PCP-PEV,7.51,22,141503
Muge,CDS-PP,6.14,18,141503
Muge,PAN,6.14,18,141503
Muge,PCTP/MRPP,1.02,3,141503
Muge,PDR,1.02,3,141503
Muge,PPM.PPV/CDC,1.02,3,141503
Muge,A,0.68,2,141503
Muge,IL,0.68,2,141503
Muge,PNR,0.68,2,141503
Muge,NC,0.34,1,141503
Muge,PURP,0.34,1,141503
Muge,L,0,0,141503
Muge,MAS,0,0,141503
Muge,PTP,0,0,141503
