freguesia,acronym,validVotesPercentage,votes,dicofre
Serra d' El-Rei,PS,40.62,145,101405
Serra d' El-Rei,PPD/PSD.CDS-PP,22.13,79,101405
Serra d' El-Rei,PCP-PEV,17.37,62,101405
Serra d' El-Rei,MPT,5.32,19,101405
Serra d' El-Rei,B.E.,3.64,13,101405
Serra d' El-Rei,PAN,3.08,11,101405
Serra d' El-Rei,PCTP/MRPP,2.52,9,101405
Serra d' El-Rei,L,1.68,6,101405
Serra d' El-Rei,PND,1.4,5,101405
Serra d' El-Rei,PNR,0.56,2,101405
Serra d' El-Rei,PPV,0.56,2,101405
Serra d' El-Rei,PTP,0.56,2,101405
Serra d' El-Rei,MAS,0.28,1,101405
Serra d' El-Rei,PPM,0.28,1,101405
Serra d' El-Rei,PDA,0,0,101405
Serra d' El-Rei,POUS,0,0,101405
