Objeto do Contrato,Tipo de Procedimento,Tipo(s) de Contrato,CPVs,Entidade(s) Adjudicante(s),Entidade(s) Adjudicatária(s),Preço Contratual,Data de Publicação,Data de Celebração do Contrato,Prazo de Execução,Local de Execução,Fundamentação,Data de Fecho do Contrato,Preço Total Efetivo,Causas das Alterações ao Prazo,Causas das Alterações ao Preço,Estado,N.º registo do Acordo Quadro,Descrição do Acordo Quadro,Procedimento Centralizado
COBERTURA ABSORVENTE P/ MESA OPERATORIA C/ LENCOL-  Ajuste Directo nº 2323526,Ajuste Direto Regime Geral,Aquisição de bens móveis,"33000000-0, Equipamento médico, medicamentos e produtos para cuidados pessoais","Hospital Garcia de Orta, E. P. E. (506361470)",LINEAMÉDICA (505148676),"5.312,50 €",09-01-2017,16-06-2016,365 dias,"Portugal, Setúbal, Almada","Artigo 20.º, n.º 1, alínea a) do Código dos Contratos Públicos",,,,,,Não aplicável.,Não aplicável.,FALSE
FRALDA DE ADULTO L- Ajuste Directo Nº 2424106,Ajuste Direto Regime Geral,Aquisição de bens móveis,"33000000-0, Equipamento médico, medicamentos e produtos para cuidados pessoais","Hospital Garcia de Orta, E. P. E. (506361470)","Albino Dias de Andrade, Lda (500013810)","7.175,00 €",09-01-2017,20-06-2016,365 dias,"Portugal, Setúbal, Almada","Artigo 20.º, n.º 1, alínea a) do Código dos Contratos Públicos",,,,,,Não aplicável.,Não aplicável.,FALSE
MICROCATETER P/ ANGIOPLASTIA - AJuste Directo Nº 2422166,Ajuste Direto Regime Geral,Aquisição de bens móveis,"33000000-0, Equipamento médico, medicamentos e produtos para cuidados pessoais","Hospital Garcia de Orta, E. P. E. (506361470)","TERUMO EUROPE ESPANA, SL (980472024)","7.400,00 €",06-01-2017,15-06-2016,365 dias,"Portugal, Setúbal, Almada","Artigo 20.º, n.º 1, alínea a) do Código dos Contratos Públicos",,,,,,Não aplicável.,Não aplicável.,FALSE
MASCARA CIRURGICA C/ VISEIRA - Ajuste Directo Nº 2322216,Ajuste Direto Regime Geral,Aquisição de bens móveis,"33000000-0, Equipamento médico, medicamentos e produtos para cuidados pessoais","Hospital Garcia de Orta, E. P. E. (506361470)",MOLNLYCKE HEALTH CARE LDA.-Com.Prod.Hospit. (511101066),"5.280,00 €",06-01-2017,09-06-2016,365 dias,"Portugal, Setúbal, Almada","Artigo 20.º, n.º 1, alínea a) do Código dos Contratos Públicos",,,,,,Não aplicável.,Não aplicável.,FALSE
CATETERES - Aj. Directo nº. 2421956,Ajuste Direto Regime Geral,Aquisição de bens móveis,"33000000-0, Equipamento médico, medicamentos e produtos para cuidados pessoais","Hospital Garcia de Orta, E. P. E. (506361470)",BIOTRONIK Portugal (Unipessoal Lda. (510726941),"7.500,00 €",06-01-2017,09-06-2016,30 dias,"Portugal, Setúbal, Almada","Artigo 20.º, n.º 1, alínea a) do Código dos Contratos Públicos",,,,,,Não aplicável.,Não aplicável.,FALSE
CATETERES - Aj. Directo nº. 2421956,Ajuste Direto Regime Geral,Aquisição de bens móveis,"33000000-0, Equipamento médico, medicamentos e produtos para cuidados pessoais","Hospital Garcia de Orta, E. P. E. (506361470)",TERUMO EUROPE ESPANHA SL (980472024),"8.500,00 €",06-01-2017,09-06-2016,30 dias,"Portugal, Setúbal, Almada","Artigo 20.º, n.º 1, alínea a) do Código dos Contratos Públicos",,,,,,Não aplicável.,Não aplicável.,FALSE
CATETERES  Aj. Directo nº.2421956,Ajuste Direto Regime Geral,Aquisição de bens móveis,"33000000-0, Equipamento médico, medicamentos e produtos para cuidados pessoais","Hospital Garcia de Orta, E. P. E. (506361470)","MEDTRONIC PORTUGAL, LDA. (504223933)","4.750,00 €",06-01-2017,09-06-2016,30 dias,"Portugal, Setúbal, Almada","Artigo 20.º, n.º 1, alínea a) do Código dos Contratos Públicos",,,,,,Não aplicável.,Não aplicável.,FALSE
CATETERES - Aj. Directo nº. 2421956,Ajuste Direto Regime Geral,Aquisição de bens móveis,"33000000-0, Equipamento médico, medicamentos e produtos para cuidados pessoais","Hospital Garcia de Orta, E. P. E. (506361470)","B.BRAUN MEDICAL, LDA (501506543)","750,00 €",06-01-2017,09-06-2016,30 dias,"Portugal, Setúbal, Almada","Artigo 20.º, n.º 1, alínea a) do Código dos Contratos Públicos",,,,,,Não aplicável.,Não aplicável.,FALSE
CATETERES - Aj. Directo nº. 2421956,Ajuste Direto Regime Geral,Aquisição de bens móveis,"33000000-0, Equipamento médico, medicamentos e produtos para cuidados pessoais","Hospital Garcia de Orta, E. P. E. (506361470)","BSC PORTUGAL, LDA. (504988964)","500,00 €",06-01-2017,09-06-2016,30 dias,"Portugal, Setúbal, Almada","Artigo 20.º, n.º 1, alínea a) do Código dos Contratos Públicos",,,,,,Não aplicável.,Não aplicável.,FALSE
CATETERES - Aj. Directo Nº. 2421956,Ajuste Direto Regime Geral,Aquisição de bens móveis,"33000000-0, Equipamento médico, medicamentos e produtos para cuidados pessoais","Hospital Garcia de Orta, E. P. E. (506361470)",ABBOTT MEDICAL OPTICS SPAIN S.L. (980262364),"1.250,00 €",06-01-2017,09-06-2016,30 dias,"Portugal, Setúbal, Almada","Artigo 20.º, n.º 1, alínea a) do Código dos Contratos Públicos",,,,,,Não aplicável.,Não aplicável.,FALSE
STENT INTRACRANEANO /  MICRO COILS - Ajuste Directo Nº 2422446,Ajuste Direto Regime Geral,Aquisição de bens móveis,"33000000-0, Equipamento médico, medicamentos e produtos para cuidados pessoais","Hospital Garcia de Orta, E. P. E. (506361470)",MEDICINÁLIA CORMEDICA (500684324),"8.570,00 €",06-01-2017,13-06-2016,365 dias,"Portugal, Setúbal, Almada","Artigo 20.º, n.º 1, alínea a) do Código dos Contratos Públicos",,,,,,Não aplicável.,Não aplicável.,FALSE
COMPR. GAZE HIDR. 40X20CM / COMPR.GAZE HIDR.EST. 30X15CM 17F 2C  - Aj. Directo nº. 2421436,Ajuste Direto Regime Geral,Aquisição de bens móveis,"33000000-0, Equipamento médico, medicamentos e produtos para cuidados pessoais","Hospital Garcia de Orta, E. P. E. (506361470)","ALBINO DIAS ANDRADE, LDA (500013810)","7.508,40 €",05-01-2017,03-06-2016,90 dias,"Portugal, Setúbal, Almada","Artigo 20.º, n.º 1, alínea a) do Código dos Contratos Públicos",,,,,,Não aplicável.,Não aplicável.,FALSE
CINACALCET 60 MG COMP- Ajuste Directo nº 11309616,Ao abrigo de acordo-quadro (art.º 259.º),Aquisição de bens móveis,"33000000-0, Equipamento médico, medicamentos e produtos para cuidados pessoais","Hospital Garcia de Orta, E. P. E. (506361470)","AMGEN - BIOFARMACÊUTICA, LDA. (502942959)","5.362,78 €",05-01-2017,07-12-2016,180 dias,"Portugal, Setúbal, Almada",Artigo 259.º do Código dos Contratos Públicos,,,,,,1410779,CP 2015/47 - Acordo quadro para fornecimento de medicamentos do aparelho locomotor às instituições e serviços do serviço nacional de saúde,FALSE
DOLUTEGRAVIR 50 MG COMP- Ajuste Directo Nº 14308816,Ajuste Direto Regime Geral,Aquisição de bens móveis,"33000000-0, Equipamento médico, medicamentos e produtos para cuidados pessoais","Hospital Garcia de Orta, E. P. E. (506361470)","VIIVHIV HEALTHCARE, UNIPESSOAL, LDA. (509117961)","88.000,20 €",05-01-2017,15-12-2016,90 dias,"Portugal, Setúbal, Almada","Artigo 24.º, n.º 1, alínea e) do Código dos Contratos Públicos",,,,,,Não aplicável.,Não aplicável.,FALSE
EFAVIRENZ + EMTRICITABINA + TENOFOVIR (600+200+245) MG COMP.(ATRIPLA) - Ajuste Directo Nº 11314816,Ajuste Direto Regime Geral,Aquisição de bens móveis,"33000000-0, Equipamento médico, medicamentos e produtos para cuidados pessoais","Hospital Garcia de Orta, E. P. E. (506361470)","GILEAD SCIENCES, LDA. (503604704)","0,00 €",04-01-2017,15-12-2016,180 dias,"Portugal, Setúbal, Almada",Artigo 258.º do Código dos Contratos Públicos,,,,,,2520226,EFAVIRENZ + EMTRICITABINA + TENOFOVIR (600+200+245) MG COMP.(ATRIPLA),FALSE
CLORETO DE SÓDIO 9 MG/ML SOL INJ FR 3000 ML IV - Ajuste Directo Nº 11318316,Ajuste Direto Regime Geral,Aquisição de bens móveis,"33000000-0, Equipamento médico, medicamentos e produtos para cuidados pessoais","Hospital Garcia de Orta, E. P. E. (506361470)","B. BRAUN MEDICAL, LDA. (501506543)","0,00 €",04-01-2017,30-12-2016,180 dias,"Portugal, Setúbal, Almada",Artigo 258.º do Código dos Contratos Públicos,,,,,,2520172,CLORETO DE SÓDIO 9 MG/ML SOL INJ FR 3000 ML IV,FALSE
CLORETO DE SÓDIO 9 MG/ML SOL INJ FR 3000 ML IV- Ajuste Directo  nº 11318316,Ajuste Direto Regime Geral,Aquisição de bens móveis,"33000000-0, Equipamento médico, medicamentos e produtos para cuidados pessoais","Hospital Garcia de Orta, E. P. E. (506361470)",FRESENIUS KABI (504293753),"0,00 €",04-01-2017,30-12-2016,180 dias,"Portugal, Setúbal, Almada",Artigo 258.º do Código dos Contratos Públicos,,,,,,2520172,CLORETO DE SÓDIO 9 MG/ML SOL INJ FR 3000 ML IV,FALSE
STENT INTRA CORONARIO C/FARMACO - Aj. Directo nº. 2420086,Ajuste Direto Regime Geral,Aquisição de bens móveis,"33000000-0, Equipamento médico, medicamentos e produtos para cuidados pessoais","Hospital Garcia de Orta, E. P. E. (506361470)","TERUMO EUROPE ESPANA, SL (980472024)","10.880,00 €",04-01-2017,17-06-2016,30 dias,"Portugal, Setúbal, Almada","Artigo 20.º, n.º 1, alínea a) do Código dos Contratos Públicos",,,,,,Não aplicável.,Não aplicável.,FALSE
POLIELECTROLITICO + GLUCOSE 50 MG/ML SOL INJ FR 1000 ML IV - Aj. Directo nº. 11300416,Ajuste Direto Regime Geral,Aquisição de bens móveis,"33000000-0, Equipamento médico, medicamentos e produtos para cuidados pessoais","Hospital Garcia de Orta, E. P. E. (506361470)","B. Braun Medical, Lda. (501506543)","0,00 €",03-01-2017,28-11-2016,60 dias,"Portugal, Setúbal, Almada","Artigo 20.º, n.º 1, alínea a) do Código dos Contratos Públicos",,,,,,2461185,POLIELECTROLITICO + GLUCOSE 50 MG/ML SOL INJ FR 1000 ML IV,FALSE
REAGENTES - Ajuste directo Nº 1512776,Ajuste Direto Regime Geral,Aquisição de bens móveis,"33000000-0, Equipamento médico, medicamentos e produtos para cuidados pessoais","Hospital Garcia de Orta, E. P. E. (506361470)",BIO-RAD LABORATORIES LDA (501301321),"6.001,90 €",03-01-2017,09-12-2016,30 dias,"Portugal, Setúbal, Almada","Artigo 24.º, n.º 1, alínea e) do Código dos Contratos Públicos",,,,,,Não aplicável.,Não aplicável.,FALSE
BIOCARTIS_TESTE DE MUTAÇÃO BRAF- Ajuste Directo Nº 1513536,Ajuste Direto Regime Geral,Aquisição de bens móveis,"33000000-0, Equipamento médico, medicamentos e produtos para cuidados pessoais","Hospital Garcia de Orta, E. P. E. (506361470)",BIOCARTIS NV (0827475227),"5.310,00 €",03-01-2017,23-12-2016,30 dias,"Portugal, Setúbal, Almada","Artigo 24.º, n.º 1, alínea e) do Código dos Contratos Públicos",,,,,,Não aplicável.,Não aplicável.,FALSE
REAGENTES - Ajuste Directo Nº 1312366,Ajuste Direto Regime Geral,Aquisição de bens móveis,"33000000-0, Equipamento médico, medicamentos e produtos para cuidados pessoais","Hospital Garcia de Orta, E. P. E. (506361470)","SIEMENS HEALTHCARE DIAGNOSTICS, LDA (507925173)","5.948,48 €",03-01-2017,29-11-2016,60 dias,"Portugal, Setúbal, Almada","Artigo 24.º, n.º 1, alínea e) do Código dos Contratos Públicos",,,,,,Não aplicável.,Não aplicável.,FALSE
REAGENTES ( GRUPAGEM SANGUINEA P/RECEM NASCIDO ) - Ajuste Directo nº 1511886,Ajuste Direto Regime Geral,Aquisição de bens móveis,"33000000-0, Equipamento médico, medicamentos e produtos para cuidados pessoais","Hospital Garcia de Orta, E. P. E. (506361470)",BIO-RAD LABORATORIES LDA (501301321),"5.914,80 €",03-01-2017,21-11-2016,30 dias,"Portugal, Setúbal, Almada","Artigo 24.º, n.º 1, alínea e) do Código dos Contratos Públicos",,,,,,Não aplicável.,Não aplicável.,FALSE
GASES MEDICINAIS - Ajuste Directo nº 1512906,Ajuste Direto Regime Geral,Aquisição de bens móveis,"33000000-0, Equipamento médico, medicamentos e produtos para cuidados pessoais","Hospital Garcia de Orta, E. P. E. (506361470)","Praxair Portugal Gases, S.A. (501738916)","31.908,89 €",03-01-2017,05-12-2016,30 dias,"Portugal, Setúbal, Almada","Artigo 24.º, n.º 1, alínea e) do Código dos Contratos Públicos",,,,,,Não aplicável.,Não aplicável.,FALSE
PROTESES - Ajuste Directo nº 2451566,Ajuste Direto Regime Geral,Aquisição de bens móveis,"33000000-0, Equipamento médico, medicamentos e produtos para cuidados pessoais","Hospital Garcia de Orta, E. P. E. (506361470)",JOHNSON & JOHNSON (500153370),"5.080,00 €",03-01-2017,20-12-2016,365 dias,"Portugal, Setúbal, Almada","Artigo 20.º, n.º 1, alínea a) do Código dos Contratos Públicos",,,,,,Não aplicável.,Não aplicável.,FALSE
MICRO COILS - Ajuste Directo nº 2451646,Ajuste Direto Regime Geral,Aquisição de bens móveis,"33000000-0, Equipamento médico, medicamentos e produtos para cuidados pessoais","Hospital Garcia de Orta, E. P. E. (506361470)",MEDICINÁLIA CORMEDICA (500684324),"6.280,00 €",03-01-2017,20-12-2016,365 dias,"Portugal, Setúbal, Almada","Artigo 20.º, n.º 1, alínea a) do Código dos Contratos Públicos",,,,,,Não aplicável.,Não aplicável.,FALSE
MATERIAL OSTEOSINTESE- Ajuste Directo Nº 2450136,Ajuste Direto Regime Geral,Aquisição de bens móveis,"33000000-0, Equipamento médico, medicamentos e produtos para cuidados pessoais","Hospital Garcia de Orta, E. P. E. (506361470)",JOHNSON & JOHNSON (500153370),"5.336,50 €",03-01-2017,12-12-2016,365 dias,"Portugal, Setúbal, Almada","Artigo 20.º, n.º 1, alínea a) do Código dos Contratos Públicos",,,,,,Não aplicável.,Não aplicável.,FALSE
PROTESES- Ajuste Directo nº 2451586,Ajuste Direto Regime Geral,Aquisição de bens móveis,"33000000-0, Equipamento médico, medicamentos e produtos para cuidados pessoais","Hospital Garcia de Orta, E. P. E. (506361470)",JOHNSON & JOHNSON (500153370),"6.235,00 €",03-01-2017,20-12-2016,365 dias,"Portugal, Setúbal, Almada","Artigo 20.º, n.º 1, alínea a) do Código dos Contratos Públicos",,,,,,Não aplicável.,Não aplicável.,FALSE
FIOS SUTURA - Aj. Directo nº. 2318556,Ajuste Direto Regime Geral,Aquisição de bens móveis,"33000000-0, Equipamento médico, medicamentos e produtos para cuidados pessoais","Hospital Garcia de Orta, E. P. E. (506361470)",HR HOSPITALAR (501895558),"143,40 €",02-01-2017,12-05-2016,30 dias,"Portugal, Setúbal, Almada","Artigo 20.º, n.º 1, alínea a) do Código dos Contratos Públicos",,,,,,Não aplicável.,Não aplicável.,FALSE
FIOS SUTURA - Aj. Directo nº. 2318556,Ajuste Direto Regime Geral,Aquisição de bens móveis,"33000000-0, Equipamento médico, medicamentos e produtos para cuidados pessoais","Hospital Garcia de Orta, E. P. E. (506361470)","B. Braun Medical, Lda (501506543)","997,44 €",02-01-2017,12-05-2016,30 dias,"Portugal, Setúbal, Almada","Artigo 20.º, n.º 1, alínea a) do Código dos Contratos Públicos",,,,,,Não aplicável.,Não aplicável.,FALSE
FIOS SUTURA - Aj. Directo nº. 2318556,Ajuste Direto Regime Geral,Aquisição de bens móveis,"33000000-0, Equipamento médico, medicamentos e produtos para cuidados pessoais","Hospital Garcia de Orta, E. P. E. (506361470)","COVIDIEN PORTUGAL, LDA. (503413410)","196,20 €",02-01-2017,12-05-2016,30 dias,"Portugal, Setúbal, Almada","Artigo 20.º, n.º 1, alínea a) do Código dos Contratos Públicos",,,,,,Não aplicável.,Não aplicável.,FALSE
FIOS SUTURA - Aj. Directo nº. 2318556,Ajuste Direto Regime Geral,Aquisição de bens móveis,"33000000-0, Equipamento médico, medicamentos e produtos para cuidados pessoais","Hospital Garcia de Orta, E. P. E. (506361470)",JOHNSON & JOHNSON (500153370),"4.525,44 €",02-01-2017,12-05-2016,30 dias,"Portugal, Setúbal, Almada","Artigo 20.º, n.º 1, alínea a) do Código dos Contratos Públicos",,,,,,Não aplicável.,Não aplicável.,FALSE
CARDIOVERSOR DESFIBRILHADOR IMPLANTAVEL-  Ajuste Directo nº 2451856,Ajuste Direto Regime Geral,Aquisição de bens móveis,"33000000-0, Equipamento médico, medicamentos e produtos para cuidados pessoais","Hospital Garcia de Orta, E. P. E. (506361470)",BIOTRONIK Portugal Unipessoal Lda. (510726941),"17.500,00 €",02-01-2017,22-12-2016,180 dias,"Portugal, Setúbal, Almada","Artigo 20.º, n.º 1, alínea a) do Código dos Contratos Públicos",,,,,,Não aplicável.,Não aplicável.,FALSE
