Objeto do Contrato,Tipo de Procedimento,Tipo(s) de Contrato,CPVs,Entidade(s) Adjudicante(s),Entidade(s) Adjudicatária(s),Preço Contratual,Data de Publicação,Data de Celebração do Contrato,Prazo de Execução,Local de Execução,Fundamentação,Data de Fecho do Contrato,Preço Total Efetivo,Causas das Alterações ao Prazo,Causas das Alterações ao Preço,Estado,N.º registo do Acordo Quadro,Descrição do Acordo Quadro,Procedimento Centralizado
Aquisição de Material de Sutura Mecânica,Concurso público,Aquisição de bens móveis,"33000000-0, Equipamento médico, medicamentos e produtos para cuidados pessoais","Centro Hospitalar Universitário do Algarve, E.P.E. (510745997)","MEDTRONIC PORTUGAL, LDA. (504223933), JMV-PRODUTOS HOSPITALARES, LDA. (501887148)","62.319,00 €",11-09-2018,03-09-2018,183 dias,"Portugal, Faro, Faro<BR/>Portugal, Faro, Portimão<BR/>Portugal, Faro, Lagos","Artigo 20.º, n.º 1, alínea b) do Código dos Contratos Públicos",,,,,,Não aplicável.,Não aplicável.,FALSE
61/4056/2017 Medicamento Octocog alfa 250,Ajuste Direto Regime Geral,Aquisição de bens móveis,"33690000-3, Medicamentos vários","Centro Hospitalar Universitário do Algarve, E. P. E. (510745997)","Shire Pharmaceuticals Portugal, Lda. (509264662)","3.115,80 €",11-09-2018,27-10-2017,60 dias,"Portugal, Faro, Faro","Artigo 24.º, n.º 1, alínea e) do Código dos Contratos Públicos",,,,,,Não aplicável.,Não aplicável.,FALSE
61/4026/2017 Reagentes Cadeias leves livres k e Cadeias leve livres lambda,Ajuste Direto Regime Geral,Aquisição de bens móveis,"33696500-0, Reagentes de laboratório","Centro Hospitalar Universitário do Algarve, E. P. E. (510745997)",The Binding site group Ltd - Sucursal em Portugal (980525136),"6.000,00 €",11-09-2018,31-10-2017,61 dias,"Portugal, Faro, Faro","Artigo 24.º, n.º 1, alínea e) do Código dos Contratos Públicos",,,,,,Não aplicável.,Não aplicável.,FALSE
61/4023/2017 Diversos Reagentes,Ajuste Direto Regime Geral,Aquisição de bens móveis,"33696500-0, Reagentes de laboratório","Centro Hospitalar Universitário do Algarve, E. P. E. (510745997)","WERFEN PORTUGAL, LDA. (501086110)","11.060,20 €",11-09-2018,25-10-2017,67 dias,"Portugal, Faro, Faro","Artigo 24.º, n.º 1, alínea e) do Código dos Contratos Públicos",,,,,,Não aplicável.,Não aplicável.,FALSE
61/4022/2017 Reagentes para Imunoproteínas por Nefelometria,Ajuste Direto Regime Geral,Aquisição de bens móveis,"33696500-0, Reagentes de laboratório","Centro Hospitalar Universitário do Algarve, E. P. E. (510745997)","SIEMENS  HEALTHCARE , LDA (507925173)","6.439,40 €",11-09-2018,25-10-2017,67 dias,"Portugal, Faro, Faro","Artigo 24.º, n.º 1, alínea e) do Código dos Contratos Públicos",,,,,,Não aplicável.,Não aplicável.,FALSE
92/2839/2018 - Proteses Totais e Parciais do Ombro Cimentadas e não Cimentadas,Ajuste Direto Regime Geral,Aquisição de bens móveis,"33183200-8, Próteses ortopédicas","Centro Hospitalar Universitário do Algarve, E. P. E. (510745997)","JOHNSON & JOHNSON, LDA (500153370)","7.743,40 €",11-09-2018,08-08-2018,5 dias,"Portugal, Faro, Faro","Artigo 24.º, n.º 1, alínea c) do Código dos Contratos Públicos",,,,,,Não aplicável.,Não aplicável.,FALSE
47-0022-2018 - Aquisição de 100 Equipamentos de Informática - Computadores de Secretária - SPMS Refª 00055_2017,Ao abrigo de acordo-quadro (art.º 259.º),Aquisição de bens móveis,"30000000-9, Máquinas, equipamento e material de escritório e de informática, excepto mobiliário e pacotes de programas (software)","Centro Hospitalar Universitário do Algarve, E. P. E. (510745997)",Informantem – Informática E Manutenção S.A. (503670693),"49.427,00 €",10-09-2018,06-08-2018,150 dias,"Portugal, Faro, Faro<BR/>Portugal, Faro, Portimão",Artigo 259.º do Código dos Contratos Públicos,,,,,,1196657,Acordo Quadro para aquisição e aluguer operacional de equipamento informático,FALSE
21/110/2018 - Reagentes Exame Sumário da Úrina e Sedimento,Concurso público,Aquisição de bens móveis,"33696500-0, Reagentes de laboratório","Centro Hospitalar Universitário do Algarve, E. P. E. (510745997)","A SIEMENS HEALTHCARE, LDA (507925173)","29.414,00 €",03-09-2018,30-01-2018,359 dias,"Portugal, Faro, Faro","Artigo 20.º, n.º 1, alínea b) do Código dos Contratos Públicos",,,,,,Não aplicável.,Não aplicável.,FALSE
21/160/2018 - Reagentes para Hemoculturas Sistema Automático de Portimão e Lagos,Concurso público,Aquisição de bens móveis,"33696500-0, Reagentes de laboratório","Centro Hospitalar Universitário do Algarve, E. P. E. (510745997)","Biomérieux Portugal, Lda (501524177)","30.440,00 €",03-09-2018,12-03-2018,348 dias,"Portugal, Faro, Faro","Artigo 20.º, n.º 1, alínea b) do Código dos Contratos Públicos",,,,,,Não aplicável.,Não aplicável.,FALSE
92/3119/2018 - Aquisição de Pacemakers 2 Câmaras VDD,Ajuste Direto Regime Geral,Aquisição de bens móveis,"33182000-9, Material de assistência à função cardíaca","Centro Hospitalar Universitário do Algarve, E. P. E. (510745997)","BOSTON SCIENTIFIC PORTUGAL, LDA (504988964)","4.000,00 €",03-09-2018,30-08-2018,30 dias,"Portugal, Faro, Faro","Artigo 24.º, n.º 1, alínea c) do Código dos Contratos Públicos",,,,,,Não aplicável.,Não aplicável.,FALSE
