freguesia,acronym,validVotesPercentage,votes,dicofre
Lajedo,PS,50,16,480104
Lajedo,PPD/PSD,25,8,480104
Lajedo,B.E.,9.38,3,480104
Lajedo,CDS-PP,6.25,2,480104
Lajedo,L,3.13,1,480104
Lajedo,PCP-PEV,3.13,1,480104
Lajedo,PCTP/MRPP,3.13,1,480104
Lajedo,A,0,0,480104
Lajedo,IL,0,0,480104
Lajedo,MAS,0,0,480104
Lajedo,NC,0,0,480104
Lajedo,PAN,0,0,480104
Lajedo,PDR,0,0,480104
Lajedo,PNR,0,0,480104
Lajedo,PPM.PPV/CDC,0,0,480104
Lajedo,PTP,0,0,480104
Lajedo,PURP,0,0,480104
