Objeto do Contrato,Tipo de Procedimento,Tipo(s) de Contrato,CPVs,Entidade(s) Adjudicante(s),Entidade(s) Adjudicatária(s),Preço Contratual,Data de Publicação,Data de Celebração do Contrato,Prazo de Execução,Local de Execução,Fundamentação,Data de Fecho do Contrato,Preço Total Efetivo,Causas das Alterações ao Prazo,Causas das Alterações ao Preço,Estado,N.º registo do Acordo Quadro,Descrição do Acordo Quadro,Procedimento Centralizado
Aquisição de diverso material para Gastroenterologia,Ajuste Direto Regime Geral,Aquisição de bens móveis,"33000000-0, Equipamento médico, medicamentos e produtos para cuidados pessoais","Centro Hospitalar de Entre o Douro e Vouga, E.P.E. (508878462)",Olympus Ibéria S.A.U. (980474710),"17.003,24 €",21-10-2014,02-10-2014,365 dias,"Portugal, Aveiro, Santa Maria da Feira","Artigo 26.º, n.º 1, alínea a) do Código dos Contratos Públicos","","",,,,Não aplicável.,Não aplicável.,FALSE
Aquisição de Sistemas de balão intragástricos,Ajuste Direto Regime Geral,Aquisição de bens móveis,"33000000-0, Equipamento médico, medicamentos e produtos para cuidados pessoais","Centro Hospitalar de Entre o Douro e Vouga, E.P.E. (508878462)","Plastimede - Comercialização de Produtos e Equipamentos Médicos, Lda (501899820)","7.200,00 €",21-10-2014,16-10-2014,365 dias,"Portugal, Aveiro, Santa Maria da Feira","Artigo 26.º, n.º 1, alínea a) do Código dos Contratos Públicos","","",,,,Não aplicável.,Não aplicável.,FALSE
Reparação do equipamento PT1227 - Cesar - Powerpack VISUB V3000,Ajuste Direto Regime Geral,Aquisição de serviços,"50000000-5, Serviços de reparação e manutenção","Centro Hospitalar de Entre o Douro e Vouga, E.P.E. (508878462)","Philips Portuguesa, S.A. (500216843)","17.602,78 €",20-10-2014,11-09-2014,30 dias,"Portugal, Aveiro, Santa Maria da Feira","Artigo 20.º, n.º 1, alínea a) do Código dos Contratos Públicos",01-12-2014,"17.602,78 €",,,,Não aplicável.,Não aplicável.,FALSE
Aquisição de próteses para suspensão da uretra - Gynecare TVT Obturador,Ajuste Direto Regime Geral,Aquisição de bens móveis,"33000000-0, Equipamento médico, medicamentos e produtos para cuidados pessoais","Centro Hospitalar de Entre o Douro e Vouga, E.P.E. (508878462)","Johnson & Johnson , Lda (500153370)","51.480,00 €",20-10-2014,07-10-2014,365 dias,"Portugal, Aveiro, Santa Maria da Feira","Artigo 20.º, n.º 1, alínea a) do Código dos Contratos Públicos","","",,,,Não aplicável.,Não aplicável.,FALSE
"Aquisição de material cirúrgico para Prótese total do joelho de revisão da """"Stryker"""" para BO de Ortopedia",Ajuste Direto Regime Geral,Aquisição de bens móveis,"33000000-0, Equipamento médico, medicamentos e produtos para cuidados pessoais","Centro Hospitalar de Entre o Douro e Vouga, E.P.E. (508878462)","Stryker Portugal - Produtos Médicos, Lda (504594214)","19.811,95 €",15-10-2014,31-07-2014,60 dias,"Portugal, Aveiro, Santa Maria da Feira","Artigo 24.º, n.º 1, alínea e) do Código dos Contratos Públicos",13-08-2014,"19.811,95 €",,,,Não aplicável.,Não aplicável.,FALSE
