Objeto do Contrato,Tipo de Procedimento,Tipo(s) de Contrato,CPVs,Entidade(s) Adjudicante(s),Entidade(s) Adjudicatária(s),Preço Contratual,Data de Publicação,Data de Celebração do Contrato,Prazo de Execução,Local de Execução,Fundamentação,Data de Fecho do Contrato,Preço Total Efetivo,Causas das Alterações ao Prazo,Causas das Alterações ao Preço,Estado,N.º registo do Acordo Quadro,Descrição do Acordo Quadro,Procedimento Centralizado
MEDICAMENTOS ANTIMICROBIANOS,Ajuste Direto Regime Geral,Aquisição de bens móveis,"33690000-3, Medicamentos vários","Centro Hospitalar de Setúbal, E. P. E. (507606787)","AUROVITAS UNIPESSOAL LDA (513053239), SANOFI- PROD.FARMACEUTICOS, LDA (500134960), GENERIS FARMACÊUTICA, S.A. (508107997), BRISTOL-MYERS SQUIBB FARM. PORTUGUESA,SA (500048193), D.L.A. FARMACEUTICA SA (503894427), LABORATORIOS ATRAL, S.A. (500162085), RATIOPHARM, LDA. (502414910), SANDOZ - FARMACEUTICA, LDA (506985261), TECNIMED-SOCIEDADE TECNICO MEDICINAL S.A (500626413), LABORATORIOS PFIZER SA (500162166), TEVA PHARMA,PROD.FARMACEUTICOS,LDA (507045491), HIKMA FARMACEUTICA (PORTUGAL), LDA (502266791), LABORATORIO MEDINFAR (500384045), OVERPHARMA (505792362), FRESENIUS KABI PHARMA PORTUGAL LDA (504293753), MERCK SHARP & DOHME LDA (500191360)","303.826,70 €",19-05-2017,02-02-2017,365 dias,"Portugal, Setúbal, Setúbal","Artigo 20.º, n.º 1, alínea a) do Código dos Contratos Públicos",,,,,,Não aplicável.,Não aplicável.,FALSE
Lenalidomida 5 mg Cáps,Ajuste Direto Regime Geral,Aquisição de bens móveis,"33600000-6, Produtos farmacêuticos","Centro Hospitalar de Setúbal, E. P. E. (507606787)","CELGENE SOCIEDADE UNIPESSOAL, LDA (507791690)","35.623,43 €",19-05-2017,27-04-2017,365 dias,"Portugal, Setúbal, Setúbal","Artigo 24.º, n.º 1, alínea e) do Código dos Contratos Públicos",,,,,,Não aplicável.,Não aplicável.,FALSE
Serviços médicos no serviço UCI - maio a dezembro 2017,Ajuste Direto Regime Geral,Aquisição de serviços,"85000000-9, Serviços de saúde e acção social","Centro Hospitalar de Setúbal, E. P. E. (507606787)",Kuratamed (509771394),"20.160,00 €",19-05-2017,08-05-2017,245 dias,"Portugal, Setúbal, Setúbal","Artigo 20.º, n.º 1, alínea a) do Código dos Contratos Públicos",,,,,,Não aplicável.,Não aplicável.,FALSE
Serviços Médicos de Cirurgia - abril a dezembro 2017,Ajuste Direto Regime Geral,Aquisição de serviços,"85000000-9, Serviços de saúde e acção social","Centro Hospitalar de Setúbal, E. P. E. (507606787)",Edgar Rosa - Serviços Médicos Lda (509546811),"36.480,00 €",18-05-2017,08-05-2017,275 dias,"Portugal, Setúbal, Setúbal","Artigo 20.º, n.º 1, alínea a) do Código dos Contratos Públicos",,,,,,Não aplicável.,Não aplicável.,FALSE
desinfetantes para maquinas,Ajuste Direto Regime Geral,Aquisição de bens móveis,"33690000-3, Medicamentos vários","Centro Hospitalar de Setúbal, E. P. E. (507606787)",olympus iberia  (980474710),"14.407,54 €",18-05-2017,08-03-2017,365 dias,"Portugal, Setúbal, Setúbal","Artigo 24.º, n.º 1, alínea a) do Código dos Contratos Públicos",,,,,,Não aplicável.,Não aplicável.,FALSE
Aripiprazol 400 mg Pó susp inj LP Fr 2 ml IM,Ajuste Direto Regime Geral,Aquisição de bens móveis,"33600000-6, Produtos farmacêuticos","Centro Hospitalar de Setúbal, E. P. E. (507606787)",LUNDBECK PORTUGAL (503573922),"39.966,40 €",18-05-2017,26-04-2017,365 dias,"Portugal, Setúbal, Setúbal","Artigo 20.º, n.º 1, alínea a) do Código dos Contratos Públicos",,,,,,Não aplicável.,Não aplicável.,FALSE
EVEROLÍMUS [5 MG; CÁP/COMP],Ao abrigo de acordo-quadro (art.º 259.º),Aquisição de bens móveis,"33600000-6, Produtos farmacêuticos","Centro Hospitalar de Setúbal, E. P. E. (507606787)","Novartis Farma - Produtos Farmacêuticos, S.A. (500063524)","42.398,40 €",18-05-2017,26-04-2017,365 dias,"Portugal, Setúbal, Setúbal",Artigo 259.º do Código dos Contratos Públicos,,,,,,1771819,CP 2015/6 - Acordo quadro para o fornecimento de Medicamentos do Foro Oncológico,FALSE
CONCENTRADOS NEFROLOGIA,Ajuste Direto Regime Geral,Aquisição de bens móveis,"33690000-3, Medicamentos vários","Centro Hospitalar de Setúbal, E. P. E. (507606787)","FRESENIUS MEDICAL CARE PORTUGAL, S.A (503070220)","69.842,40 €",17-05-2017,20-03-2017,365 dias,"Portugal, Setúbal, Setúbal","Artigo 24.º, n.º 1, alínea e) do Código dos Contratos Públicos",,,,,,Não aplicável.,Não aplicável.,FALSE
ABACAVIR 60 0 MG+LAMIVUDINA 300 MG COMP,Ajuste Direto Regime Geral,Aquisição de bens móveis,"33690000-3, Medicamentos vários","Centro Hospitalar de Setúbal, E. P. E. (507606787)","TEVA PHARMA,PROD.FARMACEUTICOS,LDA (507045491)","19.200,00 €",17-05-2017,15-02-2017,365 dias,"Portugal, Setúbal, Setúbal","Artigo 24.º, n.º 1, alínea e) do Código dos Contratos Públicos",,,,,,Não aplicável.,Não aplicável.,FALSE
ALCOOL DIVERSO,Ajuste Direto Regime Geral,Aquisição de bens móveis,"33690000-3, Medicamentos vários","Centro Hospitalar de Setúbal, E. P. E. (507606787)",PROCLINICA (500222665),"14.034,42 €",17-05-2017,22-03-2017,365 dias,"Portugal, Setúbal, Setúbal","Artigo 20.º, n.º 1, alínea a) do Código dos Contratos Públicos",,,,,,Não aplicável.,Não aplicável.,FALSE
IOPROMIDA 769MG/ML SOL INJ FR 100ML,Ajuste Direto Regime Geral,Aquisição de bens móveis,"33690000-3, Medicamentos vários","Centro Hospitalar de Setúbal, E. P. E. (507606787)","BAYER PORTUGAL, LDA (500043256)","55.060,00 €",16-05-2017,11-01-2017,365 dias,"Portugal, Setúbal, Setúbal","Artigo 24.º, n.º 1, alínea e) do Código dos Contratos Públicos",,,,,,Não aplicável.,Não aplicável.,FALSE
GAZE com iodopovidona,Ajuste Direto Regime Geral,Aquisição de bens móveis,"33690000-3, Medicamentos vários","Centro Hospitalar de Setúbal, E. P. E. (507606787)",MEDICINALIA CORMEDICA (500684324),"33.199,20 €",16-05-2017,26-04-2017,365 dias,"Portugal, Setúbal, Setúbal","Artigo 24.º, n.º 1, alínea a) do Código dos Contratos Públicos",,,,,,Não aplicável.,Não aplicável.,FALSE
Fumarato de dimetilo 240 mg Cáps GR,Ajuste Direto Regime Geral,Aquisição de bens móveis,"33600000-6, Produtos farmacêuticos","Centro Hospitalar de Setúbal, E. P. E. (507606787)","BIOGEN PORTUGAL-SOC.FARM.UNIP., LDA (506415740)","177.172,63 €",16-05-2017,24-04-2017,365 dias,"Portugal, Setúbal, Setúbal","Artigo 24.º, n.º 1, alínea e) do Código dos Contratos Públicos",,,,,,Não aplicável.,Não aplicável.,FALSE
MEDICAMENTOS DO FORO ONCOLOGICO,Ao abrigo de acordo-quadro (art.º 259.º),Aquisição de bens móveis,"33600000-6, Produtos farmacêuticos","Centro Hospitalar de Setúbal, E. P. E. (507606787)","MERCK, SA (500650870)","410.511,30 €",16-05-2017,02-05-2017,365 dias,"Portugal, Setúbal, Setúbal",Artigo 259.º do Código dos Contratos Públicos,,,,,,1771819,CP 2015/6 - Acordo quadro para o fornecimento de Medicamentos do Foro Oncológico,FALSE
LENALIDOMIDA 10 MG CÁPS,Ajuste Direto Regime Geral,Aquisição de bens móveis,"33600000-6, Produtos farmacêuticos","Centro Hospitalar de Setúbal, E. P. E. (507606787)",CELGENE Europe Limited (507791690),"65.622,21 €",16-05-2017,20-04-2017,365 dias,"Portugal, Setúbal, Setúbal","Artigo 24.º, n.º 1, alínea e) do Código dos Contratos Públicos",,,,,,Não aplicável.,Não aplicável.,FALSE
"TALIDOMIDA 50MG,COMP",Ajuste Direto Regime Geral,Aquisição de bens móveis,"33600000-6, Produtos farmacêuticos","Centro Hospitalar de Setúbal, E. P. E. (507606787)",CELGENE Europe Limited (507791690),"30.940,00 €",16-05-2017,20-04-2017,365 dias,"Portugal, Setúbal, Setúbal","Artigo 24.º, n.º 1, alínea e) do Código dos Contratos Públicos",,,,,,Não aplicável.,Não aplicável.,FALSE
ENZALUTAMIDA [40 MG; CÁP],Ao abrigo de acordo-quadro (art.º 259.º),Aquisição de bens móveis,"33600000-6, Produtos farmacêuticos","Centro Hospitalar de Setúbal, E. P. E. (507606787)","ASTELLAS FARMA, LDA.                               (502540249)","333.950,40 €",16-05-2017,03-04-2017,365 dias,"Portugal, Setúbal, Setúbal",Artigo 259.º do Código dos Contratos Públicos,,,,,,1771819,CP 2015/6 - Acordo quadro para o fornecimento de Medicamentos do Foro Oncológico,FALSE
Equipamento de urologia (exames),Ajuste Direto Regime Geral,Aquisição de bens móveis,"33000000-0, Equipamento médico, medicamentos e produtos para cuidados pessoais","Centro Hospitalar de Setúbal, E. P. E. (507606787)","B. Braun Medical, Lda (501506543)","18.250,00 €",11-05-2017,10-05-2017,1 dias,"Portugal, Setúbal, Setúbal","Artigo 20.º, n.º 1, alínea a) do Código dos Contratos Públicos",,,,,,Não aplicável.,Não aplicável.,FALSE
