Objeto do Contrato,Tipo de Procedimento,Tipo(s) de Contrato,CPVs,Entidade(s) Adjudicante(s),Entidade(s) Adjudicatária(s),Preço Contratual,Data de Publicação,Data de Celebração do Contrato,Prazo de Execução,Local de Execução,Fundamentação,Data de Fecho do Contrato,Preço Total Efetivo,Causas das Alterações ao Prazo,Causas das Alterações ao Preço,Estado,N.º registo do Acordo Quadro,Descrição do Acordo Quadro,Procedimento Centralizado
Serviços Médicos Urgência Básica,Ajuste Direto Regime Geral,Aquisição de serviços,"85121100-4, Serviços de médicos de clínica geral","Centro Hospitalar do Algarve, E. P. E. (510745997)","OfertaFuturo-Prática Médica de Clínica Geral Unip, Lda  (508795397)","9.660,00 €",20-01-2015,18-12-2014,107 dias,"Portugal, Faro, Vila Real Sto Antonio<BR/>Portugal, Faro, Albufeira<BR/>Portugal, Faro, Loulé","Artigo 20.º, n.º 1, alínea a) do Código dos Contratos Públicos",31-12-2014,"6.900,00 €",,"O valor inicial do Contrato teve por base as necessidades estimadas para o período de 15 Setembro de 2014 a 31 Dezembro de 2014, o valor final reflecte as necessidades efectivas.",,Não aplicável.,Não aplicável.,FALSE
Serviços médicos urgência básica,Ajuste Direto Regime Geral,Aquisição de serviços,"85121100-4, Serviços de médicos de clínica geral","Centro Hospitalar do Algarve, E. P. E. (510745997)","OfertaFuturo -Prática Médica de Clínica Geral, Unip, Lda  (508795397)","22.632,00 €",09-01-2015,18-12-2014,45 dias,"Portugal, Faro, Albufeira<BR/>Portugal, Faro, Loulé<BR/>Portugal, Faro, Vila Real Sto Antonio<BR/>Portugal, Faro, Faro","Artigo 20.º, n.º 1, alínea a) do Código dos Contratos Públicos",31-12-2014,"10.465,00 €",,"O valor inicial do Contrato teve por base as necessidades estimadas para o período de 1 Agosto de 2014 a 15 de Setembro de 2014, o valor final reflecte as necessidades efectivas.",,Não aplicável.,Não aplicável.,FALSE
AD/216/2014 - Prestação de Serviços Médicos para os Serviços de Urgência Básica,Ajuste Direto Regime Geral,Aquisição de serviços,"85121100-4, Serviços de médicos de clínica geral","Administração Regional de Saúde do Algarve, I. P. (503148709)","Ofertafuturo - Prática Médica de Clínica Geral Unipessoal, Lda. (508795397)","30.360,00 €",21-07-2014,11-07-2014,74 dias,"Portugal, Faro","Artigo 20.º, n.º 1, alínea a) do Código dos Contratos Públicos","","",,"",,Não aplicável.,Não aplicável.,FALSE
