Objeto do Contrato,Tipo de Procedimento,Tipo(s) de Contrato,CPVs,Entidade(s) Adjudicante(s),Entidade(s) Adjudicatária(s),Preço Contratual,Data de Publicação,Data de Celebração do Contrato,Prazo de Execução,Local de Execução,Fundamentação,Data de Fecho do Contrato,Preço Total Efetivo,Causas das Alterações ao Prazo,Causas das Alterações ao Preço,Estado,N.º registo do Acordo Quadro,Descrição do Acordo Quadro,Procedimento Centralizado
Aquisição de Material de Tratamento,Concurso público,Aquisição de bens móveis,"33140000-3, Material médico de consumo","Hospital de Santa Maria Maior, E. P. E. (506361381)",Aviquímica (500039720),"4.435,70 €",21-03-2017,15-12-2016,365 dias,"Portugal, Braga, Barcelos","Artigo 20.º, n.º 1, alínea b) do Código dos Contratos Públicos",,,,,,Não aplicável.,Não aplicável.,FALSE
Aquisição de Material de Tratamento,Concurso público,Aquisição de bens móveis,"33140000-3, Material médico de consumo","Hospital de Santa Maria Maior, E. P. E. (506361381)",Anastácio Saldanha (505804441),"232,23 €",20-03-2017,15-12-2016,365 dias,"Portugal, Braga, Barcelos","Artigo 20.º, n.º 1, alínea b) do Código dos Contratos Públicos",,,,,,Não aplicável.,Não aplicável.,FALSE
Aquisição de Material de Tratamento,Concurso público,Aquisição de bens móveis,"33140000-3, Material médico de consumo","Hospital de Santa Maria Maior, E. P. E. (506361381)",B. Braun Medical (501506543),"36.158,72 €",20-03-2017,02-01-2017,365 dias,"Portugal, Braga, Barcelos","Artigo 20.º, n.º 1, alínea b) do Código dos Contratos Públicos",,,,,,Não aplicável.,Não aplicável.,FALSE
Aquisição de Material de Tratamento,Concurso público,Aquisição de bens móveis,"33140000-3, Material médico de consumo","Hospital de Santa Maria Maior, E. P. E. (506361381)",PMH - Produtos Médicos Hospitalares (502376899),"24.583,61 €",20-03-2017,02-01-2017,365 dias,"Portugal, Braga, Barcelos","Artigo 20.º, n.º 1, alínea b) do Código dos Contratos Públicos",,,,,,Não aplicável.,Não aplicável.,FALSE
