freguesia,acronym,validVotesPercentage,votes,dicofre
União das freguesias de Chorense e Monte,PPD/PSD.CDS-PP,62.56,137,031019
União das freguesias de Chorense e Monte,PS,22.83,50,031019
União das freguesias de Chorense e Monte,PCP-PEV,4.57,10,031019
União das freguesias de Chorense e Monte,MPT,2.28,5,031019
União das freguesias de Chorense e Monte,L,1.37,3,031019
União das freguesias de Chorense e Monte,PND,1.37,3,031019
União das freguesias de Chorense e Monte,PPM,1.37,3,031019
União das freguesias de Chorense e Monte,PTP,1.37,3,031019
União das freguesias de Chorense e Monte,PAN,0.91,2,031019
União das freguesias de Chorense e Monte,B.E.,0.46,1,031019
União das freguesias de Chorense e Monte,POUS,0.46,1,031019
União das freguesias de Chorense e Monte,PPV,0.46,1,031019
União das freguesias de Chorense e Monte,MAS,0,0,031019
União das freguesias de Chorense e Monte,PCTP/MRPP,0,0,031019
União das freguesias de Chorense e Monte,PDA,0,0,031019
União das freguesias de Chorense e Monte,PNR,0,0,031019
