freguesia,acronym,validVotesPercentage,votes,dicofre
Moimentinha,PPD/PSD.CDS-PP,43.64,24,091311
Moimentinha,PS,36.36,20,091311
Moimentinha,MPT,5.45,3,091311
Moimentinha,B.E.,3.64,2,091311
Moimentinha,PCP-PEV,3.64,2,091311
Moimentinha,PCTP/MRPP,3.64,2,091311
Moimentinha,PND,1.82,1,091311
Moimentinha,PPM,1.82,1,091311
Moimentinha,L,0,0,091311
Moimentinha,MAS,0,0,091311
Moimentinha,PAN,0,0,091311
Moimentinha,PDA,0,0,091311
Moimentinha,PNR,0,0,091311
Moimentinha,POUS,0,0,091311
Moimentinha,PPV,0,0,091311
Moimentinha,PTP,0,0,091311
