freguesia,acronym,validVotesPercentage,votes,dicofre
União das freguesias de Paradinha e Nagosa,PPD/PSD.CDS-PP,43.12,47,180721
União das freguesias de Paradinha e Nagosa,PS,31.19,34,180721
União das freguesias de Paradinha e Nagosa,MPT,7.34,8,180721
União das freguesias de Paradinha e Nagosa,PCTP/MRPP,5.5,6,180721
União das freguesias de Paradinha e Nagosa,PCP-PEV,4.59,5,180721
União das freguesias de Paradinha e Nagosa,PND,2.75,3,180721
União das freguesias de Paradinha e Nagosa,B.E.,0.92,1,180721
União das freguesias de Paradinha e Nagosa,L,0.92,1,180721
União das freguesias de Paradinha e Nagosa,PAN,0.92,1,180721
União das freguesias de Paradinha e Nagosa,PNR,0.92,1,180721
União das freguesias de Paradinha e Nagosa,POUS,0.92,1,180721
União das freguesias de Paradinha e Nagosa,PTP,0.92,1,180721
União das freguesias de Paradinha e Nagosa,MAS,0,0,180721
União das freguesias de Paradinha e Nagosa,PDA,0,0,180721
União das freguesias de Paradinha e Nagosa,PPM,0,0,180721
União das freguesias de Paradinha e Nagosa,PPV,0,0,180721
