Objeto do Contrato,Tipo de Procedimento,Tipo(s) de Contrato,CPVs,Entidade(s) Adjudicante(s),Entidade(s) Adjudicatária(s),Preço Contratual,Data de Publicação,Data de Celebração do Contrato,Prazo de Execução,Local de Execução,Fundamentação,Data de Fecho do Contrato,Preço Total Efetivo,Causas das Alterações ao Prazo,Causas das Alterações ao Preço,Estado,N.º registo do Acordo Quadro,Descrição do Acordo Quadro,Procedimento Centralizado
0402228932014 - MATERIAL DE ANGIOGRAFIA,Ajuste Direto Regime Geral,Aquisição de bens móveis,"33000000-0, Equipamento médico, medicamentos e produtos para cuidados pessoais","Centro Hospitalar e Universitário de Coimbra, E. P. E. (510103448)",MEDTRONIC (504223933),"15.550,00 €",21-04-2015,31-03-2015,30 dias,"Portugal, Coimbra, Coimbra","Artigo 24.º, n.º 1, alínea e) do Código dos Contratos Públicos",,,,,,Não aplicável.,Não aplicável.,FALSE
040207722015 - ESPACADOR DE SILICONE,Ajuste Direto Regime Geral,Aquisição de bens móveis,"33000000-0, Equipamento médico, medicamentos e produtos para cuidados pessoais","Centro Hospitalar e Universitário de Coimbra, E. P. E. (510103448)",HOSPITEX (501909842),"425,00 €",21-04-2015,17-04-2015,15 dias,"Portugal, Coimbra, Coimbra","Artigo 20.º, n.º 1, alínea a) do Código dos Contratos Públicos",,,,,,Não aplicável.,Não aplicável.,FALSE
040210452015 - DBS,Ajuste Direto Regime Geral,Aquisição de bens móveis,"33000000-0, Equipamento médico, medicamentos e produtos para cuidados pessoais","Centro Hospitalar e Universitário de Coimbra, E. P. E. (510103448)",MEDTRONIC (504223933),"21.500,00 €",21-04-2015,20-04-2015,5 dias,"Portugal, Coimbra, Coimbra","Artigo 24.º, n.º 1, alínea e) do Código dos Contratos Públicos",,,,,,Não aplicável.,Não aplicável.,FALSE
040209432015 - MATERIAL DE ANGIOGRAFIA,Ajuste Direto Regime Geral,Aquisição de bens móveis,"33000000-0, Equipamento médico, medicamentos e produtos para cuidados pessoais","Centro Hospitalar e Universitário de Coimbra, E. P. E. (510103448)",C.R. BARD (502438274),"15.340,00 €",21-04-2015,07-04-2015,10 dias,"Portugal, Coimbra, Coimbra","Artigo 24.º, n.º 1, alínea e) do Código dos Contratos Públicos",,,,,,Não aplicável.,Não aplicável.,FALSE
040209762015 - MATERIAL DE ANGIOGRAFIA,Ajuste Direto Regime Geral,Aquisição de bens móveis,"33000000-0, Equipamento médico, medicamentos e produtos para cuidados pessoais","Centro Hospitalar e Universitário de Coimbra, E. P. E. (510103448)",JOHNSON (500153370),"35.185,00 €",21-04-2015,07-04-2015,5 dias,"Portugal, Coimbra, Coimbra","Artigo 24.º, n.º 1, alínea e) do Código dos Contratos Públicos",,,,,,Não aplicável.,Não aplicável.,FALSE
040211322015  - NEUROESTIMULADORES,Ajuste Direto Regime Geral,Aquisição de bens móveis,"33000000-0, Equipamento médico, medicamentos e produtos para cuidados pessoais","Centro Hospitalar e Universitário de Coimbra, E. P. E. (510103448)",MEDTRONIC (504223933),"20.990,14 €",21-04-2015,20-04-2015,5 dias,"Portugal, Coimbra, Coimbra","Artigo 24.º, n.º 1, alínea e) do Código dos Contratos Públicos",,,,,,Não aplicável.,Não aplicável.,FALSE
040211342015 - neuroestimulador,Ajuste Direto Regime Geral,Aquisição de bens móveis,"33000000-0, Equipamento médico, medicamentos e produtos para cuidados pessoais","Centro Hospitalar e Universitário de Coimbra, E. P. E. (510103448)",MEDTRONIC (504223933),"12.000,00 €",21-04-2015,20-04-2015,10 dias,"Portugal, Coimbra, Coimbra","Artigo 24.º, n.º 1, alínea e) do Código dos Contratos Públicos",,,,,,Não aplicável.,Não aplicável.,FALSE
Papel Fotocópia Tarjado de Várias Cores,Ajuste Direto Regime Geral,Aquisição de bens móveis,"30100000-0, Máquinas, equipamento e material de escritório, excepto computadores, impressoras e mobiliário","Centro Hospitalar e Universitário de Coimbra, E.P. (510103448)","ENVELOPRINTER,LDA (508469830)","121,80 €",20-04-2015,01-04-2015,240 dias,"Portugal, Coimbra, Coimbra","Artigo 20.º, n.º 1, alínea a) do Código dos Contratos Públicos",,,,,,Não aplicável.,Não aplicável.,FALSE
Aquisição de 1 desfibrilhador para a Consulta Externa de Ortopedia (645),Ajuste Direto Regime Geral,Aquisição de bens móveis,"33000000-0, Equipamento médico, medicamentos e produtos para cuidados pessoais","Centro Hospitalar e Universitário de Coimbra, E. P. E. (510103448)",Medicinalia Cormédica (500684324),"5.800,00 €",17-04-2015,15-04-2015,15 dias,"Portugal, Coimbra, Coimbra","Artigo 20.º, n.º 1, alínea a) do Código dos Contratos Públicos",,,,,,Não aplicável.,Não aplicável.,FALSE
AQUISIÇÃO DE UM COMPUTADOR PORTÁTIL,Ajuste Direto Regime Geral,Aquisição de bens móveis,"30000000-9, Máquinas, equipamento e material de escritório e de informática, excepto mobiliário e pacotes de programas (software)","Centro Hospitalar e Universitário de Coimbra, E. P. E. (510103448)",ATM SISTEMAS DE INFORMAÇÃO (509784267),"1.052,63 €",17-04-2015,09-04-2015,15 dias,"Portugal, Coimbra, Coimbra","Artigo 20.º, n.º 1, alínea a) do Código dos Contratos Públicos",,,,,,Não aplicável.,Não aplicável.,FALSE
"Fornecimento de serviços de alimentação-polo MBB, Mar.2015",Ajuste Direto Regime Geral,Aquisição de serviços,"55520000-1, Serviços de fornecimento de refeições (catering)","Centro Hospitalar e Universitário de Coimbra, E. P. E. (510103448)",Eurest (500347506),"21.964,73 €",16-04-2015,25-02-2015,31 dias,"Portugal, Coimbra, Coimbra","Artigo 20.º, n.º 1, alínea a) do Código dos Contratos Públicos",,,,,,Não aplicável.,Não aplicável.,FALSE
"Fornecimento de serviços de alimentação ao HP, Mar.2015",Ajuste Direto Regime Geral,Sociedade<br/>Aquisição de serviços,"55520000-1, Serviços de fornecimento de refeições (catering)","Centro Hospitalar e Universitário de Coimbra, E. P. E. (510103448)",Eurest (500347506),"33.076,78 €",16-04-2015,25-02-2015,31 dias,"Portugal, Coimbra, Coimbra","Artigo 20.º, n.º 1, alínea a) do Código dos Contratos Públicos",,,,,,Não aplicável.,Não aplicável.,FALSE
"Fornecimento de serviços de alimentação-polo HG, Mar.2015",Ajuste Direto Regime Geral,Aquisição de serviços,"55520000-1, Serviços de fornecimento de refeições (catering)","Centro Hospitalar e Universitário de Coimbra, E. P. E. (510103448)",Eurest (500347506),"68.000,00 €",16-04-2015,25-02-2015,31 dias,"Portugal, Coimbra, Coimbra","Artigo 20.º, n.º 1, alínea a) do Código dos Contratos Públicos",,,,,,Não aplicável.,Não aplicável.,FALSE
Gestão integrada residuos hospitalares-HG/HP/MBB-Mar.Abr.2015,Ajuste Direto Regime Geral,Aquisição de serviços<br/>Locação de bens móveis,"90510000-5, Tratamento e eliminação de resíduos","Centro Hospitalar e Universitário de Coimbra, E. P. E. (510103448)",Ambimed (503593427),"58.522,00 €",16-04-2015,25-02-2015,61 dias,"Portugal, Coimbra, Coimbra","Artigo 20.º, n.º 1, alínea a) do Código dos Contratos Públicos",,,,,,Não aplicável.,Não aplicável.,FALSE
Manutenção e suporte da infraestrutura servidores/storage do CHUC,Ajuste Direto Regime Geral,Aquisição de serviços,"72000000-5, Serviços de TI: consultoria, desenvolvimento de software, Internet e apoio","Centro Hospitalar e Universitário de Coimbra, E. P. E. (510103448)",Hewlett Packard (502407697),"64.086,27 €",16-04-2015,25-03-2015,365 dias,"Portugal, Coimbra, Coimbra","Artigo 20.º, n.º 1, alínea a) do Código dos Contratos Públicos",,,,,,Não aplicável.,Não aplicável.,FALSE
"Aquisição de serviços de manutenção do software GHAF e PREL através dos SPMS, 2015",Ajuste Direto Regime Geral,Sociedade<br/>Aquisição de serviços,"72000000-5, Serviços de TI: consultoria, desenvolvimento de software, Internet e apoio","Centro Hospitalar e Universitário de Coimbra, E. P. E. (510103448)",ST+i (502246995),"20.750,00 €",16-04-2015,13-04-2015,365 dias,"Portugal, Coimbra, Coimbra","Artigo 20.º, n.º 1, alínea a) do Código dos Contratos Públicos",,,,,,Não aplicável.,Não aplicável.,FALSE
"Aquisição de um Acelerador Linear e Atualização da Tecnologia do Serviço de Radioterapia do CHUC, E.P.E.",Concurso público,Aquisição de bens móveis,"31643100-6, Aceleradores lineares","Centro Hospitalar e Universitário de Coimbra, E. P. E. (510103448)","Varian Medical Systems Ibérica, S.L (B-82246422)","2.533.915,00 €",16-04-2015,14-04-2015,120 dias,"Portugal, Coimbra, Coimbra","Artigo 20.º, n.º 1, alínea b) do Código dos Contratos Públicos",,,,,,Não aplicável.,Não aplicável.,FALSE
Seguro acidentes trabalho - Janeiro 2015 + Acerto 2014,Ajuste Direto Regime Geral,Aquisição de serviços,"66000000-0, Serviços de finanças e seguros","Centro Hospitalar e Universitário de Coimbra, E. P. E. (510103448)","Açoreana Seguros, S.A. (512004048)","13.481,88 €",14-04-2015,30-01-2015,31 dias,"Portugal, Coimbra, Coimbra","Artigo 20.º, n.º 1, alínea a) do Código dos Contratos Públicos",,,,,,Não aplicável.,Não aplicável.,FALSE
