Objeto do Contrato,Tipo de Procedimento,Tipo(s) de Contrato,CPVs,Entidade(s) Adjudicante(s),Entidade(s) Adjudicatária(s),Preço Contratual,Data de Publicação,Data de Celebração do Contrato,Prazo de Execução,Local de Execução,Fundamentação,Data de Fecho do Contrato,Preço Total Efetivo,Causas das Alterações ao Prazo,Causas das Alterações ao Preço,Estado,N.º registo do Acordo Quadro,Descrição do Acordo Quadro,Procedimento Centralizado
"PRESTAÇÃO DE SERVIÇOS DE INSPEÇÃO SANITÁRIA DE GENEROS ALIMENTICIOS PARA A ULSNA, EPE",Ajuste Direto Regime Geral,Aquisição de serviços,"85200000-1, Serviços de veterinária","Unidade Local de Saúde do Norte Alentejano, E. P. E. (508094461)","VETAL-CLINICA VETERINARIA DO ALTO ALENTEJO, LDA (506789357)","6.600,00 €",08-04-2014,26-02-2014,365 dias,"Portugal, Portalegre, Portalegre","Artigo 20.º, n.º 1, alínea a) do Código dos Contratos Públicos",26-02-2014,"6.600,00 €",,"",,Não aplicável.,Não aplicável.,FALSE
"PRESTAÇÃO DE SERVIÇOS DE LIMPEZA E HIGIENE NA ULSNA, EPE",Ajuste Direto Regime Geral,Aquisição de serviços,"90911000-6, Serviços de limpeza de alojamentos, edifícios e janelas","Unidade Local de Saúde do Norte Alentejano, E. P. E. (508094461)","Acciona Facility Services, SA (503431397)","574.262,74 €",08-04-2014,26-02-2014,365 dias,"Portugal, Portalegre, Portalegre","Artigo 27.º, n.º 1, alínea a) do Código dos Contratos Públicos",26-02-2014,"574.262,74 €",,"",,Não aplicável.,Não aplicável.,FALSE
PRESTAÇÃO DE SERVIÇOS DE LIMPEZA E DESINFEÇÃO DAS CONDUTAS DE AVC E TETOS FALSOS DO CENTRO DE SAÚDE DE SOUSEL,Ajuste Direto Regime Geral,Aquisição de serviços,"90911000-6, Serviços de limpeza de alojamentos, edifícios e janelas","Unidade Local de Saúde do Norte Alentejano, E. P. E. (508094461)","Acciona Facility Services, SA (503431397)","8.120,00 €",08-04-2014,19-02-2014,5 dias,"Portugal, Portalegre, Sousel","Artigo 20.º, n.º 1, alínea a) do Código dos Contratos Públicos",19-02-2014,"8.120,00 €",,"",,Não aplicável.,Não aplicável.,FALSE
"PRESTAÇÃO DE SERVIÇOS DE COPIA E IMPRESSÃO, JANEIRO A ABRIL 2014",Ajuste Direto Regime Geral,Aquisição de serviços,"72500000-0, Serviços relacionados com a informática","Unidade Local de Saúde do Norte Alentejano, E. P. E. (508094461)",CREDITEX-ALUGUER DE EQUIPAMENTOS SA (502825812),"5.117,56 €",08-04-2014,25-03-2014,120 dias,"Portugal, Portalegre, Portalegre","Artigo 20.º, n.º 1, alínea a) do Código dos Contratos Públicos",30-04-2014,"5.117,56 €",,"",,Não aplicável.,Não aplicável.,FALSE
PRESTAÇÃO DE SERVIÇOS DE ALOJAMENTO E ALIMENTAÇÃO NO ÂMBITO DO PROTOCOLO CELEBRADO DOM O HOSPITAL ESPIRITO SANTO,Ajuste Direto Regime Geral,Aquisição de serviços,"55000000-0, Serviços de hotelaria, restauração e comércio a retalho","Unidade Local de Saúde do Norte Alentejano, E. P. E. (508094461)",Hotel Dom Fernando (502677929),"6.500,00 €",08-04-2014,05-12-2013,365 dias,"Portugal, Évora, Évora","Artigo 20.º, n.º 1, alínea a) do Código dos Contratos Públicos",05-12-2013,"6.500,00 €",,"",,Não aplicável.,Não aplicável.,FALSE
"PRESTAÇÃO DE SERVIÇOS DE MANUTENÇÃO PARA 21 PORTAS AUTOMÁTICAS E 5 PORTAS MECÂNICAS DE MOLA DA UNIDADE LOCAL DE SAÚDE DO NORTE ALENTEJANO, EPE (ANO 2014)",Ajuste Direto Regime Geral,Aquisição de serviços,"50000000-5, Serviços de reparação e manutenção","Unidade Local de Saúde do Norte Alentejano, E. P. E. (508094461)","ThyssentKrupp Elevadores, SA (501445226)","5.030,00 €",08-04-2014,12-03-2014,365 dias,"Portugal, Portalegre, Portalegre","Artigo 20.º, n.º 1, alínea a) do Código dos Contratos Públicos",12-03-2014,"5.030,00 €",,"",,Não aplicável.,Não aplicável.,FALSE
Aquisição de Papel para fotocópia e Impressão,Ao abrigo de acordo-quadro (art.º 259.º),Aquisição de bens móveis,"30197643-5, Papel para fotocópia","Instituto Português do Sangue e da Transplantação, IP (502423943), Hospital Arcebispo João Crisóstomo (501626123), Instituto de Oftalmologia Dr. Gama Pinto (600000052), Direção-Geral da Saúde (600037100), Unidade Local de Saúde do Nordeste, EPE (509932584), Centro Hospitalar de Leiria-Pombal, EPE (509822932), Unidade Local de Saúde de Castelo Branco, EPE (509309844), Centro Hospitalar de Lisboa Norte, EPE (508481287), Unidade Local de Saúde do Norte Alentejano, EPE (508094461), Administração Regional de Saúde do Norte, IP (503135593), Hospital Garcia de Orta, EPE (506361470), Instituto Nacional de Emergência Médica, IP (501356126), Hospital Distrital Figueira da Foz, EPE (506361527), Centro Medicina de Reabilitação da Região Centro Rovisco Pais (503767336), Unidade Local de Saúde de Matosinhos, EPE (506361390), Unidade Local de saúde da Guarda, EPE (508752000), Hospital de Santarém, EPE (506361462), Autoridade Nacional do Medicamento e Produtos de Saúde, IP (600037002), Centro Hospitalar Barreiro Montijo, EPE (509186998), Administração Regional de Saúde do Algarve, IP (503148709), Hospital de Magalhães Lemos, EPE (502828790), Hospital José Luciano de Castro (501613021), Instituto Nacional de Saúde Dr. Ricardo Jorge, IP (501427511), Centro Hospitalar de Entre Douro e Vouga,  EPE (508878462), Centro Hospitalar Lisboa Central, EPE (508080142), Centro Hospitalar de Lisboa Ocidental, EPE (507618319), Secretaria-Geral do Ministério da Saúde (600080684), Hospital Professor Doutor Fernando Fonseca, EPE (503035416), Centro Hospitalar Cova da Beira, EPE (506361659), Centro Hospitalar de Setúbal, EPE (507606787), Centro Hospitalar Tâmega e Sousa, EPE (508318262), Administração Regional de Saúde do Alentejo, IP (503148768), Instituto Português de Oncologia do Porto Francisco Gentil, EPE (506362299), Centro Hospitalar do Médio Ave, EPE (508093937), Hospital Dr. Francisco Zagalo (507846044), Unidade Local de Saúde do Alto Minho, EPE (508786193), Centro Hospitalar do Algarve, EPE (510745997), Administração Regional de Saúde do Centro, IP (503122165), Centro Hospitalar do Médio Tejo, EPE (506361608), Serviços Partilhados do Ministério da Saúde, EPE (509540716), Centro Hospitalar de S. João, EPE (509821197), Centro Hospitalar Tondela-Viseu, EPE (509822940), Unidade Local de Saúde do Baixo Alentejo, EPE (508754275), Centro Hospitalar de Trás-os-Montes e Alto Douro, EPE (508100496), Centro Hospitalar Psiquiátrico de Lisboa (508338476), Hospital Espírito Santo, EPE (508085888), Centro Hospitalar e Universitário de Coimbra, EPE (510103448), Administração Regional de Saúde de Lisboa e Vale do Tejo, IP (503148776), Centro Hospitalar do Oeste (510412009), Inspeção-Geral das Atividades em Saúde (600018857), Hospital Santa Maria Maior, EPE (506361381), Centro Hospitalar Vila Nova de Gaia/Espinho, EPE (508142156), Centro Hospitalar do Porto, EPE (508331471), Administração Central do Sistema de Saúde, IP (508188423), Centro Hospitalar do Alto Ave, EPE (508080827), Serviço de Intervenção nos Comportamentos Aditivos e nas Dependências (600084884), Instituto Português de Oncologia de Coimbra Francisco Gentil, EPE (506361438)","Staples Portugal, S.A. (503789372)","1.678.737,97 €",01-04-2014,02-01-2014,365 dias,Portugal,Artigo 259.º do Código dos Contratos Públicos,30-01-2014,"5.443,80 €",,O total efetivo corresponde apenas a este Centro Hospitalar.,,162548,"Concurso limitado por prévia qualificação para a celebração de Acordo Quadro para fornecimento de papel, economato e consumíveis de impressão.",TRUE
Aquisição de medicamentos exclusivos,Ajuste Direto Regime Geral,Aquisição de bens móveis,"33000000-0, Equipamento médico, medicamentos e produtos para cuidados pessoais","Unidade Local de Saúde do Norte Alentejano, E. P. E. (508094461)",Sanofi Produtos Farmacêuticos Lda (500134960),"94.321,00 €",31-03-2014,12-03-2014,300 dias,"Portugal, Portalegre, Portalegre<BR/>Portugal, Portalegre, Elvas","Artigo 24.º, n.º 1, alínea e) do Código dos Contratos Públicos",31-12-2014,"94.321,00 €",,"",,Não aplicável.,Não aplicável.,FALSE
