freguesia,acronym,validVotesPercentage,votes,dicofre
Urra,PS,51.59,243,121410
Urra,PPD/PSD,15.29,72,121410
Urra,B.E.,12.1,57,121410
Urra,PCP-PEV,5.94,28,121410
Urra,CDS-PP,3.61,17,121410
Urra,PPM.PPV/CDC,3.61,17,121410
Urra,L,1.7,8,121410
Urra,A,1.49,7,121410
Urra,PAN,1.49,7,121410
Urra,PCTP/MRPP,1.27,6,121410
Urra,IL,0.42,2,121410
Urra,PTP,0.42,2,121410
Urra,PURP,0.42,2,121410
Urra,MAS,0.21,1,121410
Urra,NC,0.21,1,121410
Urra,PNR,0.21,1,121410
Urra,PDR,0,0,121410
