Objeto do Contrato,Tipo de Procedimento,Tipo(s) de Contrato,CPVs,Entidade(s) Adjudicante(s),Entidade(s) Adjudicatária(s),Preço Contratual,Data de Publicação,Data de Celebração do Contrato,Prazo de Execução,Local de Execução,Fundamentação,Data de Fecho do Contrato,Preço Total Efetivo,Causas das Alterações ao Prazo,Causas das Alterações ao Preço,Estado,N.º registo do Acordo Quadro,Descrição do Acordo Quadro,Procedimento Centralizado
Aquisição de dois Ecógrafos para o Serviço de Imagiologia,Consulta Prévia,Aquisição de bens móveis,"33110000-4, Equipamento de imagiologia para uso médico, dentário e veterinário","Unidade Local de Saúde do Alto Minho, E. P. E. (508786193)",GENERAL ELECTRIC HEALTHCARE PORTUGAL (500357129),"74.400,00 €",21-06-2018,20-04-2018,30 dias,"Portugal, Viana do Castelo","Artigo 20.º, n.º 1, alínea c) do Código dos Contratos Públicos",,,,,,Não aplicável.,Não aplicável.,FALSE
Equipamento Diverso para a Cozinha da Unidade de Convalescença de Valença,Consulta Prévia,Aquisição de bens móveis,"39100000-3, Mobiliário","Unidade Local de Saúde do Alto Minho, E. P. E. (508786193)","AMERICO ALVES, SA (506144860)","5.112,96 €",21-06-2018,10-05-2018,30 dias,"Portugal, Viana do Castelo, Valença","Artigo 20.º, n.º 1, alínea c) do Código dos Contratos Públicos",,,,,,Não aplicável.,Não aplicável.,FALSE
prestação de serviços de limpeza nas instalações de cuidados primários da ulsam,Ao abrigo de acordo-quadro (art.º 259.º),Aquisição de serviços,"90910000-9, Serviços de limpeza","Unidade Local de Saúde do Alto Minho, E. P. E. (508786193)","Euromex - Facility Services, Lda. (502629428)","205.793,40 €",20-06-2018,11-05-2018,365 dias,"Portugal, Viana do Castelo, Viana do Castelo",Artigo 259.º do Código dos Contratos Públicos,,,,,,614429,Acordo quadro para higiene e limpeza,FALSE
aquisição de serviços de aluguer de equipamentos para ventilação não invasiva (vni),Ajuste Direto Regime Geral,Aquisição de serviços,"85140000-2, Serviços de saúde diversos","Unidade Local de Saúde do Alto Minho, E. P. E. (508786193)","Linde Saúde, Lda. (500125546)","8.277,24 €",18-06-2018,14-06-2018,92 dias,"Portugal, Viana do Castelo, Viana do Castelo","Artigo 24.º, n.º 1, alínea c) do Código dos Contratos Públicos",,,,,,Não aplicável.,Não aplicável.,FALSE
manutenção preventiva e assistência técnica de infraestruturas e equipamentos para gases medicinais e afins com técnico residente,Ajuste Direto Regime Geral,Aquisição de serviços,"50510000-3, Serviços de reparação e manutenção de bombas, válvulas, torneiras e contentores de metal","Unidade Local de Saúde do Alto Minho, E. P. E. (508786193)","Sociedade Portuguesa do Ar Líquido, Arlíquido Lda. (500261512)","5.490,00 €",18-06-2018,14-06-2018,30 dias,"Portugal, Viana do Castelo, Viana do Castelo","Artigo 24.º, n.º 1, alínea c) do Código dos Contratos Públicos",,,,,,Não aplicável.,Não aplicável.,FALSE
aquisição de serviços de manutenção e assistência técnica dos sistemas de assiduidade e gestão de escalas time hr instalados na ulsam,Ajuste Direto Regime Geral,Aquisição de serviços,"72000000-5, Serviços de TI: consultoria, desenvolvimento de software, Internet e apoio","Unidade Local de Saúde do Alto Minho, E. P. E. (508786193)","ELO - SISTEMAS DE INFORMAÇÃO, LDA. (503258601)","4.069,80 €",13-06-2018,31-01-2018,365 dias,"Portugal, Viana do Castelo, Viana do Castelo","Artigo 24.º, n.º 1, alínea e), subalínea iii) do Código dos Contratos Públicos",,,,,,Não aplicável.,Não aplicável.,FALSE
"aquisição de serviços de manutenção dos sistemas sgcim, radio, sislab, sibas, anapat e epr-or instalados na ulsam",Ajuste Direto Regime Geral,Aquisição de serviços,"72000000-5, Serviços de TI: consultoria, desenvolvimento de software, Internet e apoio","Unidade Local de Saúde do Alto Minho, E. P. E. (508786193)","Glintt - Healthcare Solutions, S.A. (502479418)","46.386,26 €",13-06-2018,22-03-2018,365 dias,"Portugal, Viana do Castelo, Viana do Castelo","Artigo 24.º, n.º 1, alínea e), subalínea iii) do Código dos Contratos Públicos",,,,,,Não aplicável.,Não aplicável.,FALSE
aluguer de módulos pré-fabricados para reinstalação do piso inferior e r/chão do centro de saúde de viana do castelo,Ajuste Direto Regime Geral,Aquisição de serviços,"50000000-5, Serviços de reparação e manutenção","Unidade Local de Saúde do Alto Minho, E. P. E. (508786193)","U.E.M. - Unidade Estruturas Metálicas, S.A. (502505729)","62.755,65 €",13-06-2018,25-05-2018,275 dias,"Portugal, Viana do Castelo, Viana do Castelo","Artigo 24.º, n.º 1, alínea c) do Código dos Contratos Públicos",,,,,,Não aplicável.,Não aplicável.,FALSE
manutenção preventiva e assistência técnica para as portas e barreiras automáticas da ulsam,Ajuste Direto Regime Geral,Aquisição de serviços,"50711000-2, Serviços de reparação e manutenção de equipamento eléctrico em edifícios","Unidade Local de Saúde do Alto Minho, EPE (ULSAM) (508786193)",JOSE FERNANDO MIRANDA COSTA LDA (502662166),"5.999,00 €",13-06-2018,20-12-2017,365 dias,"Portugal, Viana do Castelo, Viana do Castelo","Artigo 20.º, n.º 1, alínea a) do Código dos Contratos Públicos",,,,,,Não aplicável.,Não aplicável.,FALSE
manutenção preventiva e assistência técnica para as portas e barreiras automáticas da ulsam.,Ajuste Direto Regime Geral,Aquisição de serviços,"50711000-2, Serviços de reparação e manutenção de equipamento eléctrico em edifícios","Unidade Local de Saúde do Alto Minho, EPE (ULSAM) (508786193)",Manusa (509477526),"18.939,00 €",13-06-2018,18-01-2018,365 dias,"Portugal, Viana do Castelo, Viana do Castelo","Artigo 20.º, n.º 1, alínea a) do Código dos Contratos Públicos",,,,,,Não aplicável.,Não aplicável.,FALSE
