freguesia,acronym,validVotesPercentage,votes,dicofre
Baguim do Monte (Rio Tinto),PS,38.79,1631,130412
Baguim do Monte (Rio Tinto),PPD/PSD.CDS-PP,23.97,1008,130412
Baguim do Monte (Rio Tinto),PCP-PEV,12.87,541,130412
Baguim do Monte (Rio Tinto),MPT,8.63,363,130412
Baguim do Monte (Rio Tinto),B.E.,6.3,265,130412
Baguim do Monte (Rio Tinto),PCTP/MRPP,2.24,94,130412
Baguim do Monte (Rio Tinto),PAN,2.09,88,130412
Baguim do Monte (Rio Tinto),L,1.97,83,130412
Baguim do Monte (Rio Tinto),PPM,0.76,32,130412
Baguim do Monte (Rio Tinto),PND,0.57,24,130412
Baguim do Monte (Rio Tinto),PTP,0.5,21,130412
Baguim do Monte (Rio Tinto),PNR,0.45,19,130412
Baguim do Monte (Rio Tinto),PPV,0.43,18,130412
Baguim do Monte (Rio Tinto),MAS,0.26,11,130412
Baguim do Monte (Rio Tinto),PDA,0.1,4,130412
Baguim do Monte (Rio Tinto),POUS,0.07,3,130412
