Objeto do Contrato,Tipo de Procedimento,Tipo(s) de Contrato,CPVs,Entidade(s) Adjudicante(s),Entidade(s) Adjudicatária(s),Preço Contratual,Data de Publicação,Data de Celebração do Contrato,Prazo de Execução,Local de Execução,Fundamentação,Data de Fecho do Contrato,Preço Total Efetivo,Causas das Alterações ao Prazo,Causas das Alterações ao Preço,Estado,N.º registo do Acordo Quadro,Descrição do Acordo Quadro,Procedimento Centralizado
"AQUISIÇÃO DE SERVIÇOS MEDICOS NA AREA DE ORTOPEDIA,OFTALMOLOGIA E ANESTESIA, JAN.2011",Ajuste Direto Regime Geral,Aquisição de serviços,"85121200-5, Serviços de medicina especializada",HOSPITAL DR FRANCISCO ZAGALO (501510150),SANTA CASA DA MISERICORDIA DE OVAR (500834610),"13.702,76 €",21-04-2011,16-03-2011,30 dias,"Portugal, Aveiro, Ovar","Artigo 20.º, n.º 1, alínea a) do Código dos Contratos Públicos",16-03-2011,"13.702,76 €",,"",,Não aplicável.,Não aplicável.,
Aquisição de Prestação de Serviços - A.A. Médica - Janeiro/2011,Ajuste Direto Regime Geral,Aquisição de serviços,"79622000-0, Serviços de fornecimento de pessoal auxiliar doméstico",HOSPITAL DR FRANCISCO ZAGALO (501510150),"RANDSTAD II -PRESTAÇÃO DE SERVIÇOS, LDA. (503298999)","14.658,48 €",21-04-2011,23-02-2011,30 dias,"Portugal, Aveiro, Ovar","Artigo 20.º, n.º 1, alínea a) do Código dos Contratos Públicos",23-02-2011,"14.658,48 €",,"",,Não aplicável.,Não aplicável.,
TRABALHO TEMPORARIO- ENFERMEIROS EM JANEIRO/2011,Ajuste Direto Regime Geral,Aquisição de serviços,"79620000-6, Serviços de fornecimento de pessoal, inclusive temporário",HOSPITAL DR FRANCISCO ZAGALO (501510150),RANDSTAD-RECURSOS HUMANOS E TRAB. TEMPOR.S.A. (503299006),"12.039,74 €",21-04-2011,23-02-2011,30 dias,"Portugal, Aveiro, Ovar","Artigo 20.º, n.º 1, alínea a) do Código dos Contratos Públicos",23-02-2011,"12.039,74 €",,"",,Não aplicável.,Não aplicável.,
PRESTAÇAO DE SERVIÇOS MÉDICOS EM ORTOPEDIA E ANESTESIOLOGIA RELATIVO A JANEIRO DE 2011,Ajuste Direto Regime Geral,Aquisição de serviços,"85121000-3, Serviços de prática médica",HOSPITAL DR FRANCISCO ZAGALO (501510150),SANTA CASA DA MISERICORDIA DE OVAR (500834610),"15.909,26 €",21-04-2011,23-02-2011,30 dias,"Portugal, Aveiro, Ovar","Artigo 20.º, n.º 1, alínea a) do Código dos Contratos Públicos",23-02-2011,"15.909,26 €",,"",,Não aplicável.,Não aplicável.,
SERVIÇOS MEDICOS  DE OTORRINO RELATIVO A JANEIRO/2011,Ajuste Direto Regime Geral,Aquisição de serviços,"85121240-7, Serviços de otorrinolaringologia ou audiologia",HOSPITAL DR FRANCISCO ZAGALO (501510150),"MESTRESTREIA-SERV. MÉDICOS, UNIPESSOAL (508679842)","13.082,00 €",21-04-2011,09-02-2011,30 dias,"Portugal, Aveiro, Ovar","Artigo 20.º, n.º 1, alínea a) do Código dos Contratos Públicos",09-02-2011,"13.082,00 €",,"",,Não aplicável.,Não aplicável.,
REPARAÇÃO DE ECOGRAFO,Ajuste Direto Regime Geral,Aquisição de serviços,"71356200-0, Serviços de assistência técnica",HOSPITAL DR FRANCISCO ZAGALO (501510150),"PHILIPS PORTUGUESA, S.A. (500216843)","5.562,55 €",21-04-2011,09-02-2011,30 dias,"Portugal, Aveiro, Ovar","Artigo 20.º, n.º 1, alínea a) do Código dos Contratos Públicos",01-03-2011,"2.674,51 €",,reparação parcial,,Não aplicável.,Não aplicável.,
AQUISIÇÃO DE SERVIÇOS MEDICOS EM VÁRIAS AREAS RELATIVO A DEZ/2010,Ajuste Direto Regime Geral,Aquisição de serviços,"85121000-3, Serviços de prática médica",HOSPITAL DR FRANCISCO ZAGALO (501510150),SANTA CASA DA MISERICORDIA DE OVAR (500834610),"7.728,26 €",21-04-2011,09-02-2011,30 dias,"Portugal, Aveiro, Ovar","Artigo 20.º, n.º 1, alínea a) do Código dos Contratos Públicos",09-02-2011,"7.728,26 €",,"",,Não aplicável.,Não aplicável.,
CONTRATO DE ASSISTENCIA TÉCNICA A ELEVADORES PARA 2011,Ajuste Direto Regime Geral,Aquisição de serviços,"71356200-0, Serviços de assistência técnica",HOSPITAL DR FRANCISCO ZAGALO (501510150),"SCHINDLER-ASCENSORES ESCADAS ROLANTES, S.A. (502353740)","6.040,46 €",20-04-2011,09-02-2011,360 dias,"Portugal, Aveiro, Ovar","Artigo 20.º, n.º 1, alínea a) do Código dos Contratos Públicos",31-12-2011,"6.040,46 €",,"",,Não aplicável.,Não aplicável.,
EXAMES DE IMAGIOLOGIA EFECTUADOS A UTENTES EM MARÇO/2011,Ajuste Direto Regime Geral,Aquisição de serviços,"85150000-5, Serviços de imagiologia médica",HOSPITAL DR FRANCISCO ZAGALO (501510150),DR. PINTO LEITE - INSTITUTO DE RADIOLOGIA (501396772),"8.889,00 €",18-04-2011,13-04-2011,30 dias,"Portugal, Aveiro, Ovar","Artigo 20.º, n.º 1, alínea a) do Código dos Contratos Públicos",13-04-2011,"8.889,00 €",,"",,Não aplicável.,Não aplicável.,
PRESTAÇÃO DE SERVIÇOS DE OFTALMOLOGIA DURANTE O MÊS DE FEVEREIRO,Ajuste Direto Regime Geral,Aquisição de serviços,"85121281-6, Serviços de oftalmologia",HOSPITAL DR FRANCISCO ZAGALO (501510150),SANTA CASA DA MISERICORDIA DE OVAR (500834610),"7.759,00 €",13-04-2011,08-04-2011,30 dias,"Portugal, Aveiro, Ovar","Artigo 20.º, n.º 1, alínea a) do Código dos Contratos Públicos",08-04-2011,"7.759,00 €",,"",,Não aplicável.,Não aplicável.,
