freguesia,acronym,validVotesPercentage,votes,dicofre
Castro Marim,PS,45.1,377,080402
Castro Marim,PPD/PSD.CDS-PP,21.65,181,080402
Castro Marim,PCP-PEV,13.4,112,080402
Castro Marim,B.E.,6.94,58,080402
Castro Marim,MPT,5.98,50,080402
Castro Marim,PCTP/MRPP,1.67,14,080402
Castro Marim,PAN,1.44,12,080402
Castro Marim,L,1.2,10,080402
Castro Marim,PND,0.72,6,080402
Castro Marim,MAS,0.6,5,080402
Castro Marim,PNR,0.36,3,080402
Castro Marim,PPM,0.36,3,080402
Castro Marim,POUS,0.24,2,080402
Castro Marim,PDA,0.12,1,080402
Castro Marim,PPV,0.12,1,080402
Castro Marim,PTP,0.12,1,080402
