Objeto do Contrato,Tipo de Procedimento,Tipo(s) de Contrato,CPVs,Entidade(s) Adjudicante(s),Entidade(s) Adjudicatária(s),Preço Contratual,Data de Publicação,Data de Celebração do Contrato,Prazo de Execução,Local de Execução,Fundamentação,Data de Fecho do Contrato,Preço Total Efetivo,Causas das Alterações ao Prazo,Causas das Alterações ao Preço,Estado,N.º registo do Acordo Quadro,Descrição do Acordo Quadro,Procedimento Centralizado
Serviços Médicos Urgência - Cirurgia Geral,Ajuste Direto Regime Geral,Aquisição de serviços,"85100000-0, Serviços de saúde","Centro Hospitalar do Algarve, E. P. E. (510745997)","ARTEZ - MEDICINA E ARTE, LDA (507354664)","1.200,00 €",27-09-2017,26-09-2017,46 dias,"Portugal, Faro, Faro","Artigo 24.º, n.º 1, alínea e) do Código dos Contratos Públicos",26-09-2017,"1.200,00 €",,,,Não aplicável.,Não aplicável.,FALSE
Aquisição de livros “FRONIMA”,Ajuste Direto Regime Geral,"","",Direcção Regional de Cultura do Centro (600025314),"Artez, Medicina e Arte, Unipessoal Lda (507354664)","15.200,00 €",27-02-2009,"",20 dias,"",Não Preenchido,"","",,,,Não aplicável.,Não aplicável.,
