freguesia,acronym,validVotesPercentage,votes,dicofre
União das freguesias de Ala e Vilarinho do Monte,PS,39.66,69,040539
União das freguesias de Ala e Vilarinho do Monte,PPD/PSD,28.74,50,040539
União das freguesias de Ala e Vilarinho do Monte,CDS-PP,10.92,19,040539
União das freguesias de Ala e Vilarinho do Monte,PTP,8.05,14,040539
União das freguesias de Ala e Vilarinho do Monte,B.E.,3.45,6,040539
União das freguesias de Ala e Vilarinho do Monte,PPM.PPV/CDC,3.45,6,040539
União das freguesias de Ala e Vilarinho do Monte,PAN,1.72,3,040539
União das freguesias de Ala e Vilarinho do Monte,PCTP/MRPP,1.15,2,040539
União das freguesias de Ala e Vilarinho do Monte,A,0.57,1,040539
União das freguesias de Ala e Vilarinho do Monte,L,0.57,1,040539
União das freguesias de Ala e Vilarinho do Monte,NC,0.57,1,040539
União das freguesias de Ala e Vilarinho do Monte,PDR,0.57,1,040539
União das freguesias de Ala e Vilarinho do Monte,PURP,0.57,1,040539
União das freguesias de Ala e Vilarinho do Monte,IL,0,0,040539
União das freguesias de Ala e Vilarinho do Monte,MAS,0,0,040539
União das freguesias de Ala e Vilarinho do Monte,PCP-PEV,0,0,040539
União das freguesias de Ala e Vilarinho do Monte,PNR,0,0,040539
