Objeto do Contrato,Tipo de Procedimento,Tipo(s) de Contrato,CPVs,Entidade(s) Adjudicante(s),Entidade(s) Adjudicatária(s),Preço Contratual,Data de Publicação,Data de Celebração do Contrato,Prazo de Execução,Local de Execução,Fundamentação,Data de Fecho do Contrato,Preço Total Efetivo,Causas das Alterações ao Prazo,Causas das Alterações ao Preço,Estado,N.º registo do Acordo Quadro,Descrição do Acordo Quadro,Procedimento Centralizado
Serviços de alojamento para participação no workshop Managed Entry Agreements (MEAS) em itália - 1 participante /2 dias,Ao abrigo de acordo-quadro (art.º 258.º),Aquisição de serviços,"63510000-7, Serviços de agências de viagens e serviços similares","INFARMED - Autoridade Nacional do Medicamento e Produtos de Saúde, I. P. (600037002)","Pamtours - Viagens e Turisma, Lda (502844779)","98,20 €",10-02-2014,05-02-2014,2 dias,Itália,"Artigo 27.º, n.º 1, alínea h) do Código dos Contratos Públicos",,,,,,273814,"Acordo Quadro de viagens, transportes aéreos e alojamentos",FALSE
"Serviços de alojamento e viagem para participação na reunião International Medical Devices Regulators Forum (IMDRF) e Working party on pharmaceuticals and medical devices , em Bruxelas - 1 participante /4 dias ( viagem reembolsada)",Ao abrigo de acordo-quadro (art.º 258.º),Aquisição de serviços,"63510000-7, Serviços de agências de viagens e serviços similares","INFARMED - Autoridade Nacional do Medicamento e Produtos de Saúde, I. P. (600037002)","Pamtours - Viagens e Turismo,Lda (502844779)","954,00 €",10-02-2014,06-02-2014,4 dias,Bélgica,"Artigo 27.º, n.º 1, alínea h) do Código dos Contratos Públicos",,,,,,273814,"Acordo Quadro de viagens, transportes aéreos e alojamentos",FALSE
"Serviços de viagem e alojamento para participação na reunião plenária CMDH e Reunião """"Varitions Subgroup"""" em Londres- 1 participante/4 dias",Ao abrigo de acordo-quadro (art.º 258.º),Aquisição de serviços,"63510000-7, Serviços de agências de viagens e serviços similares","INFARMED - Autoridade Nacional do Medicamento e Produtos de Saúde, I. P. (600037002)","Topatlantico - Viagens e Turisma, SA (501061126)","787,68 €",10-02-2014,06-02-2014,4 dias,Reino Unido,"Artigo 27.º, n.º 1, alínea h) do Código dos Contratos Públicos",,,,,,273814,"Acordo Quadro de viagens, transportes aéreos e alojamentos",FALSE
"Serviços de viagem e alojamento para participação na reunião do grupo RCG Raw materials for production of cellullar and gene transfer da Farmacopeia Europeia, em Estrasburgo- 1 partivipante/4 dias",Ao abrigo de acordo-quadro (art.º 258.º),Aquisição de serviços,"63510000-7, Serviços de agências de viagens e serviços similares","INFARMED - Autoridade Nacional do Medicamento e Produtos de Saúde, I. P. (600037002)","Topatlantico - Viagens e Turismo,SA (501061126)","1.280,35 €",10-02-2014,15-01-2014,4 dias,França,"Artigo 27.º, n.º 1, alínea h) do Código dos Contratos Públicos",,,,,,273814,"Acordo Quadro de viagens, transportes aéreos e alojamentos",FALSE
Serviços de alojamento no âmbito de inspecções a farmácias na zona de Lagos e Vilamoura - 3 participantes/3 dias,Ao abrigo de acordo-quadro (art.º 258.º),Aquisição de serviços,"63510000-7, Serviços de agências de viagens e serviços similares","INFARMED - Autoridade Nacional do Medicamento e Produtos de Saúde, I. P. (600037002)","Raso - Viagens e Turismo, SA (500886113)","453,00 €",05-02-2014,05-02-2014,3 dias,Portugal,"Artigo 27.º, n.º 1, alínea h) do Código dos Contratos Públicos",,,,,,273814,"Acordo Quadro de viagens, transportes aéreos e alojamentos",FALSE
"Serviços de alojamento no ambito de inspecções a farmácias na zona de Portimão, 6 participantes/2 dias",Ao abrigo de acordo-quadro (art.º 258.º),Aquisição de serviços,"63510000-7, Serviços de agências de viagens e serviços similares","INFARMED - Autoridade Nacional do Medicamento e Produtos de Saúde, I. P. (600037002)","Raso - Viagens e Turismo,SA (500886113)","276,00 €",05-02-2014,05-02-2014,2 dias,Portugal,"Artigo 27.º, n.º 1, alínea h) do Código dos Contratos Públicos",,,,,,273814,"Acordo Quadro de viagens, transportes aéreos e alojamentos",FALSE
Serviços de alojamento no ambito de inspeções a Farmácias na zona do Porto - 2 participantes/2 dia,Ao abrigo de acordo-quadro (art.º 258.º),Aquisição de serviços,"63510000-7, Serviços de agências de viagens e serviços similares","INFARMED - Autoridade Nacional do Medicamento e Produtos de Saúde, I. P. (600037002)","Pamtours - Viagens e Turismo, Lda (502844779)","116,00 €",05-02-2014,05-02-2014,2 dias,Portugal,"Artigo 27.º, n.º 1, alínea h) do Código dos Contratos Públicos",,,,,,273814,"Acordo Quadro de viagens, transportes aéreos e alojamentos",FALSE
Serviços de viagem e alojamento para participação na reunião do grupo Medical Devices Expert Group em Bruxelas- 1 participante/3 dias ( viagem reembolsada),Ao abrigo de acordo-quadro (art.º 258.º),Aquisição de serviços,"63510000-7, Serviços de agências de viagens e serviços similares","INFARMED - Autoridade Nacional do Medicamento e Produtos de Saúde, I. P. (600037002)","Pamtours - Viagens e Turismo,Lda (502844779)","476,00 €",04-02-2014,24-01-2014,3 dias,Bélgica,"Artigo 27.º, n.º 1, alínea h) do Código dos Contratos Públicos",,,,,,273814,"Acordo Quadro de viagens, transportes aéreos e alojamentos",FALSE
Serviços de viagem e alojamento para participação na reunião Working Party on Pharmaceuticals em Bruxelas- 1 participante/2 dias,Ao abrigo de acordo-quadro (art.º 258.º),Aquisição de serviços,"63510000-7, Serviços de agências de viagens e serviços similares","INFARMED - Autoridade Nacional do Medicamento e Produtos de Saúde, I. P. (600037002)","Pamtours, Viagens e Turismo,Lda (502844779)","665,00 €",04-02-2014,30-12-2013,2 dias,Bélgica,"Artigo 27.º, n.º 1, alínea h) do Código dos Contratos Públicos",,,,,,273814,"Acordo Quadro de viagens, transportes aéreos e alojamentos",FALSE
Serviços de viagem para participação numa reunião no depatamento de investigação e ação penal do Porto- 1 dia /1 participante,Ao abrigo de acordo-quadro (art.º 258.º),Aquisição de serviços,"63510000-7, Serviços de agências de viagens e serviços similares","INFARMED - Autoridade Nacional do Medicamento e Produtos de Saúde, I. P. (600037002)","Pamtours - Viagens e Turismo,Lda (502844779)","60,00 €",04-02-2014,09-01-2014,1 dias,Portugal,"Artigo 27.º, n.º 1, alínea h) do Código dos Contratos Públicos",,,,,,273814,"Acordo Quadro de viagens, transportes aéreos e alojamentos",FALSE
