freguesia,acronym,validVotesPercentage,votes,dicofre
Carregosa,PPD/PSD,32.29,383,011301
Carregosa,PS,32.21,382,011301
Carregosa,CDS-PP,11.55,137,011301
Carregosa,B.E.,7.93,94,011301
Carregosa,PAN,5.4,64,011301
Carregosa,L,1.85,22,011301
Carregosa,PCP-PEV,1.35,16,011301
Carregosa,A,1.18,14,011301
Carregosa,PCTP/MRPP,1.01,12,011301
Carregosa,NC,0.93,11,011301
Carregosa,PPM.PPV/CDC,0.93,11,011301
Carregosa,PURP,0.84,10,011301
Carregosa,PDR,0.76,9,011301
Carregosa,MAS,0.67,8,011301
Carregosa,IL,0.59,7,011301
Carregosa,PNR,0.25,3,011301
Carregosa,PTP,0.25,3,011301
