Objeto do Contrato,Tipo de Procedimento,Tipo(s) de Contrato,CPVs,Entidade(s) Adjudicante(s),Entidade(s) Adjudicatária(s),Preço Contratual,Data de Publicação,Data de Celebração do Contrato,Prazo de Execução,Local de Execução,Fundamentação,Data de Fecho do Contrato,Preço Total Efetivo,Causas das Alterações ao Prazo,Causas das Alterações ao Preço,Estado,N.º registo do Acordo Quadro,Descrição do Acordo Quadro,Procedimento Centralizado
62018215 - Microcuvetes p/ Hemoglobinómetro,Ajuste Direto Regime Geral,Aquisição de bens móveis,"33140000-3, Material médico de consumo","Centro Hospitalar do Algarve, E. P. E. (510745997)","IBERLAB & IMUNOREAGE-SOLUC.LABORATORIO,LDA. (503406694)","2.820,00 €",09-01-2015,17-12-2014,356 dias,"Portugal, Faro, Lagos<BR/>Portugal, Faro, Portimão<BR/>Portugal, Faro, Faro","Artigo 24.º, n.º 1, alínea e) do Código dos Contratos Públicos","","",,"",,Não aplicável.,Não aplicável.,FALSE
Material p/ preparação de citostáticos,Concurso público,Aquisição de bens móveis,"33140000-3, Material médico de consumo","Centro Hospitalar do Algarve, E. P. E. (510745997)","3M Portugal, Lda. (500193940), B. BRAUN MEDICAL,LDA. (501506543), Medline international Portugal, Unipessoal, Lda. (510533515), PMH-PROD.MEDICO-HOSPITALARES (502376899), SMITHS MEDICAL(PORTUGAL),LDA. (507445937), BASTOS VIEGAS,SA (500042772), CODAN II -VENDA E DIST. INSTRUMENTOS MÉDICOS E ACESSÓRIOS,S.A. (504923471)","102.686,92 €",09-01-2015,09-01-2015,356 dias,"Portugal, Faro, Faro<BR/>Portugal, Faro, Portimão<BR/>Portugal, Faro, Lagos","Artigo 20.º, n.º 1, alínea b) do Código dos Contratos Públicos","","",,"",,Não aplicável.,Não aplicável.,FALSE
Serviços médicos urgência básica,Ajuste Direto Regime Geral,Aquisição de serviços,"85121100-4, Serviços de médicos de clínica geral","Centro Hospitalar do Algarve, E. P. E. (510745997)","OfertaFuturo -Prática Médica de Clínica Geral, Unip, Lda  (508795397)","22.632,00 €",09-01-2015,18-12-2014,45 dias,"Portugal, Faro, Albufeira<BR/>Portugal, Faro, Faro<BR/>Portugal, Faro, Vila Real Sto Antonio<BR/>Portugal, Faro, Loulé","Artigo 20.º, n.º 1, alínea a) do Código dos Contratos Públicos",31-12-2014,"10.465,00 €",,"O valor inicial do Contrato teve por base as necessidades estimadas para o período de 1 Agosto de 2014 a 15 de Setembro de 2014, o valor final reflecte as necessidades efectivas.",,Não aplicável.,Não aplicável.,FALSE
"Proc.78/3456/14- Serviço de Comunicações Fixas, Moveis e de Dados-Dezembro/2014",Ajuste Direto Regime Geral,Aquisição de serviços,"64210000-1, Serviços telefónicos e de transmissão de dados","Centro Hospitalar do Algarve, E. P. E. (510745997)","MEO-SERV. COMUNICAÇÕES,SA (502600268)","9.740,00 €",09-01-2015,31-12-2014,30 dias,"Portugal, Faro, Portimão<BR/>Portugal, Faro, Faro<BR/>Portugal, Faro, Lagos","Artigo 20.º, n.º 1, alínea a) do Código dos Contratos Públicos","","",,"",,Não aplicável.,Não aplicável.,FALSE
"Proc.78/3456/14- Serviço de Comunicações Fixas, Moveis e de Dados-Dezembro/2014",Ajuste Direto Regime Geral,Aquisição de serviços,"64210000-1, Serviços telefónicos e de transmissão de dados","Centro Hospitalar do Algarve, E. P. E. (510745997)","PT COMUNICAÇÕES,SA (504615947)","7.260,00 €",09-01-2015,31-12-2014,30 dias,"Portugal, Faro, Lagos<BR/>Portugal, Faro, Portimão<BR/>Portugal, Faro, Faro","Artigo 20.º, n.º 1, alínea a) do Código dos Contratos Públicos","","",,"",,Não aplicável.,Não aplicável.,FALSE
"Proc.78/3246/14 -Serviço de Comunicações Fixas, Moveis e de Dados-Novembro/2014",Ajuste Direto Regime Geral,Aquisição de serviços,"64200000-8, Serviços de telecomunicações","Centro Hospitalar do Algarve, E. P. E. (510745997)","MEO-Serv. Comunicações,SA (502600268)","9.740,00 €",09-01-2015,03-12-2014,30 dias,"Portugal, Faro, Lagos<BR/>Portugal, Faro, Faro<BR/>Portugal, Faro, Portimão","Artigo 20.º, n.º 1, alínea a) do Código dos Contratos Públicos","","",,"",,Não aplicável.,Não aplicável.,FALSE
"Proc.78/3246/14 -Serviço de Comunicações Fixas, Moveis e de Dados-Novembro/2014",Ajuste Direto Regime Geral,Aquisição de serviços,"64210000-1, Serviços telefónicos e de transmissão de dados","Centro Hospitalar do Algarve, E. P. E. (510745997)","PT Comunicaçõoes, SA (504615947)","7.260,00 €",09-01-2015,03-12-2014,30 dias,"Portugal, Faro, Faro<BR/>Portugal, Faro, Portimão<BR/>Portugal, Faro, Lagos","Artigo 20.º, n.º 1, alínea a) do Código dos Contratos Públicos","","",,"",,Não aplicável.,Não aplicável.,FALSE
"Proc. 78/2948/14 - Serviço de Comunicações Fixas, Moveis e de Dados-Outubro/2014",Ajuste Direto Regime Geral,Aquisição de serviços,"64210000-1, Serviços telefónicos e de transmissão de dados","Centro Hospitalar do Algarve, E. P. E. (510745997)","MEO -Serviço de Comunicações ,SA (502600268)","9.740,00 €",09-01-2015,06-11-2014,30 dias,"Portugal, Faro, Faro<BR/>Portugal, Faro, Lagos<BR/>Portugal, Faro, Portimão","Artigo 20.º, n.º 1, alínea a) do Código dos Contratos Públicos","","",,"",,Não aplicável.,Não aplicável.,FALSE
"Proc. 78/2948/14 - Serviço de Comunicações Fixas, Moveis e de Dados-Outubro/2014",Ajuste Direto Regime Geral,Aquisição de serviços,"64210000-1, Serviços telefónicos e de transmissão de dados","Centro Hospitalar do Algarve, E. P. E. (510745997)","PT Comunicações,SA (504615947)","7.260,00 €",09-01-2015,06-11-2014,30 dias,"Portugal, Faro, Faro<BR/>Portugal, Faro, Lagos<BR/>Portugal, Faro, Portimão","Artigo 20.º, n.º 1, alínea a) do Código dos Contratos Públicos","","",,"",,Não aplicável.,Não aplicável.,FALSE
Aquisição de material de osteosintese,Ajuste Direto Regime Geral,Aquisição de bens móveis,"33184100-4, Implantes cirúrgicos","Centro Hospitalar do Algarve, E. P. E. (510745997)","Johnson & Johnson, Lda (500153370)","126.454,00 €",09-01-2015,05-01-2015,365 dias,"Portugal, Faro, Lagos<BR/>Portugal, Faro, Portimão<BR/>Portugal, Faro, Faro","Artigo 24.º, n.º 2, alínea b) do Código dos Contratos Públicos","","",,"",,Não aplicável.,Não aplicável.,FALSE
Aquisição de Próteses de Anca Cimentada e Não Cimentada,Concurso público,Aquisição de bens móveis,"33183200-8, Próteses ortopédicas","Centro Hospitalar do Algarve, E. P. E. (510745997)","Johnson & Johnson, Lda (500153370)","149.680,00 €",09-01-2015,02-01-2015,365 dias,"Portugal, Faro, Portimão<BR/>Portugal, Faro, Faro<BR/>Portugal, Faro, Lagos","Artigo 20.º, n.º 1, alínea b) do Código dos Contratos Públicos","","",,"",,Não aplicável.,Não aplicável.,FALSE
Sutura Mecânica p/ Cirurgia Aberta,Concurso público,Aquisição de bens móveis,"33141125-2, Material de sutura cirúrgica","Centro Hospitalar do Algarve, E. P. E. (510745997)","ENDOTÉCNICA - Soluções Hospitalares  (503818348), JOHNSON & JOHNSON PROD.PROF. (500153370), COVIDIEN PORTUGAL - PRODUTOS  DE SAUDE, UNIPESSOAL, LDA. (503413410), TELEFLEX MEDICAL (980249783), MOONSURGE-MATERIAL MEDICO,LDA. (506657035), B. BRAUN MEDICAL,LDA. (501506543)","184.902,78 €",07-01-2015,06-01-2015,359 dias,"Portugal, Faro, Portimão<BR/>Portugal, Faro, Faro<BR/>Portugal, Faro, Lagos","Artigo 20.º, n.º 1, alínea b) do Código dos Contratos Públicos","","",,"",,Não aplicável.,Não aplicável.,FALSE
74355914 - Diverso material Hoteleiro,Ajuste Direto Regime Geral,Aquisição de bens móveis,"39561110-6, Fitas","Centro Hospitalar do Algarve, E. P. E. (510745997)",Retrosaria Mini (118224263),"2,03 €",07-01-2015,21-11-2014,5 dias,"Portugal, Faro, Portimão<BR/>Portugal, Faro, Faro<BR/>Portugal, Faro, Lagos","Artigo 20.º, n.º 1, alínea a) do Código dos Contratos Públicos","","",,"",,Não aplicável.,Não aplicável.,FALSE
74355914 - Diverso Material Hoteleiro,Ajuste Direto Regime Geral,Aquisição de bens móveis,"39830000-9, Produtos de limpeza","Centro Hospitalar do Algarve, E. P. E. (510745997)",Biomédica (507062540),"320,00 €",07-01-2015,21-11-2014,5 dias,"Portugal, Faro, Faro<BR/>Portugal, Faro, Lagos<BR/>Portugal, Faro, Portimão","Artigo 20.º, n.º 1, alínea a) do Código dos Contratos Públicos","","",,"",,Não aplicável.,Não aplicável.,FALSE
74355914 - Diverso Material Hoteleiro,Ajuste Direto Regime Geral,Aquisição de bens móveis,"39831200-8, Detergentes","Centro Hospitalar do Algarve, E. P. E. (510745997)",Olympus (980474710),"157,62 €",07-01-2015,21-11-2014,5 dias,"Portugal, Faro, Lagos<BR/>Portugal, Faro, Faro<BR/>Portugal, Faro, Portimão","Artigo 20.º, n.º 1, alínea a) do Código dos Contratos Públicos","","",,"",,Não aplicável.,Não aplicável.,FALSE
74355914 - Diverso material Hoteleiro,Ajuste Direto Regime Geral,Aquisição de bens móveis,"33918000-8, Caixas para instrumentos ou acessórios cirúrgicos post mortem","Centro Hospitalar do Algarve, E. P. E. (510745997)",JBS (503323500),"115,80 €",07-01-2015,21-11-2014,5 dias,"Portugal, Faro, Portimão<BR/>Portugal, Faro, Lagos<BR/>Portugal, Faro, Faro","Artigo 20.º, n.º 1, alínea a) do Código dos Contratos Públicos","","",,"",,Não aplicável.,Não aplicável.,FALSE
75/00003676/2014 - Material Administrativo,Ajuste Direto Regime Geral,Aquisição de bens móveis,"30192000-1, Material de escritório","Centro Hospitalar do Algarve, E. P. E. (510745997)",PAPELARIA E LIVRARIA SAGRES (501212973),"2.020,08 €",07-01-2015,05-12-2014,365 dias,"Portugal, Faro, Portimão<BR/>Portugal, Faro, Lagos<BR/>Portugal, Faro, Faro","Artigo 20.º, n.º 1, alínea a) do Código dos Contratos Públicos","","",,"",,Não aplicável.,Não aplicável.,FALSE
75/00003676/2014 - Material Administrativo,Ajuste Direto Regime Geral,Aquisição de bens móveis,"30192000-1, Material de escritório","Centro Hospitalar do Algarve, E. P. E. (510745997)",OLMAR.FERNADO G.OLIVEIRA & CA. (500440263),"4,45 €",07-01-2015,05-12-2014,365 dias,"Portugal, Faro, Portimão<BR/>Portugal, Faro, Lagos<BR/>Portugal, Faro, Faro","Artigo 20.º, n.º 1, alínea a) do Código dos Contratos Públicos","","",,"",,Não aplicável.,Não aplicável.,FALSE
75/00003676/2014 - Material Administrativo,Ajuste Direto Regime Geral,Aquisição de bens móveis,"30192000-1, Material de escritório","Centro Hospitalar do Algarve, E. P. E. (510745997)","PRN INFORMÁTICA, LDA (504100327)","275,80 €",07-01-2015,05-12-2014,365 dias,"Portugal, Faro, Faro<BR/>Portugal, Faro, Portimão<BR/>Portugal, Faro, Lagos","Artigo 20.º, n.º 1, alínea a) do Código dos Contratos Públicos","","",,"",,Não aplicável.,Não aplicável.,FALSE
Aquisição de Máscaras,Concurso público,Aquisição de bens móveis,"33140000-3, Material médico de consumo","Centro Hospitalar do Algarve, E. P. E. (510745997)","MAQUET PORTUGAL,LDA (506819698), TEPREL-EQUIPAMENTOS MEDICOS, LDA. (502262184), TELEFLEX MEDICAL (980249783), VYGON (PORTUGAL),LDA. (503232785), QUILABAN,LDA. (500399670), INTERSURGICAL PORTUGAL,LDA. (503480045)","40.496,81 €",07-01-2015,22-12-2014,365 dias,"Portugal, Faro, Portimão<BR/>Portugal, Faro, Faro<BR/>Portugal, Faro, Lagos","Artigo 20.º, n.º 1, alínea b) do Código dos Contratos Públicos","","",,"",,Não aplicável.,Não aplicável.,FALSE
75/00003594/2014 - Material Administrativo,Ajuste Direto Regime Geral,Aquisição de bens móveis,"30192000-1, Material de escritório","Centro Hospitalar do Algarve, E. P. E. (510745997)",OLMAR.FERNADO G.OLIVEIRA & CA. (500440263),"1.480,34 €",07-01-2015,28-11-2014,365 dias,"Portugal, Faro, Portimão<BR/>Portugal, Faro, Lagos<BR/>Portugal, Faro, Faro","Artigo 20.º, n.º 1, alínea a) do Código dos Contratos Públicos","","",,"",,Não aplicável.,Não aplicável.,FALSE
72373314 - Consumo Clinico Cirurgias,Ajuste Direto Regime Geral,Aquisição de bens móveis,"33140000-3, Material médico de consumo","Centro Hospitalar do Algarve, E. P. E. (510745997)","MEDTRONIC PORTUGAL, LDA. (504223933)","1.500,00 €",07-01-2015,23-12-2014,4 dias,"Portugal, Faro, Portimão<BR/>Portugal, Faro, Faro<BR/>Portugal, Faro, Lagos","Artigo 20.º, n.º 1, alínea a) do Código dos Contratos Públicos","","",,"",,Não aplicável.,Não aplicável.,FALSE
72373314 - Consumo clinico Cirurgias,Ajuste Direto Regime Geral,Aquisição de bens móveis,"33140000-3, Material médico de consumo","Centro Hospitalar do Algarve, E. P. E. (510745997)",SOCIME II - Produtos Medicos Lda (504453939),"249,00 €",07-01-2015,23-12-2014,4 dias,"Portugal, Faro, Faro<BR/>Portugal, Faro, Lagos<BR/>Portugal, Faro, Portimão","Artigo 20.º, n.º 1, alínea a) do Código dos Contratos Públicos","","",,"",,Não aplicável.,Não aplicável.,FALSE
75/00003594/2014 - Material Administrativo,Ajuste Direto Regime Geral,Aquisição de bens móveis,"30192000-1, Material de escritório","Centro Hospitalar do Algarve, E. P. E. (510745997)",Marcos de Azevedo Dias (108701476),"6,50 €",07-01-2015,28-11-2014,365 dias,"Portugal, Faro, Lagos<BR/>Portugal, Faro, Portimão<BR/>Portugal, Faro, Faro","Artigo 20.º, n.º 1, alínea a) do Código dos Contratos Públicos","","",,"",,Não aplicável.,Não aplicável.,FALSE
72373314 - Consumo Clinico Cirurgias,Ajuste Direto Regime Geral,Aquisição de bens móveis,"33140000-3, Material médico de consumo","Centro Hospitalar do Algarve, E. P. E. (510745997)",GRUPO VITALINO SA. (513083162),"332,10 €",07-01-2015,23-12-2014,4 dias,"Portugal, Faro, Faro<BR/>Portugal, Faro, Lagos<BR/>Portugal, Faro, Portimão","Artigo 20.º, n.º 1, alínea a) do Código dos Contratos Públicos","","",,"",,Não aplicável.,Não aplicável.,FALSE
75/00003594/2014 - Material Administrativo,Ajuste Direto Regime Geral,Aquisição de bens móveis,"30192000-1, Material de escritório","Centro Hospitalar do Algarve, E. P. E. (510745997)","PRN INFORMÁTICA, LDA (504100327)","72,50 €",07-01-2015,28-11-2014,365 dias,"Portugal, Faro, Lagos<BR/>Portugal, Faro, Faro<BR/>Portugal, Faro, Portimão","Artigo 20.º, n.º 1, alínea a) do Código dos Contratos Públicos","","",,"",,Não aplicável.,Não aplicável.,FALSE
72373314 - Consumo Clinico Cirurgias,Ajuste Direto Regime Geral,Aquisição de bens móveis,"33183100-7, Implantes ortopédicos<BR/>33183000-6, Material de assistência ortopédica","Centro Hospitalar do Algarve, E. P. E. (510745997)","BIOMET PORTUGAL UNIPESSOAL,LDA (500254990)","8.495,00 €",07-01-2015,23-12-2014,4 dias,"Portugal, Faro, Faro<BR/>Portugal, Faro, Portimão<BR/>Portugal, Faro, Lagos","Artigo 20.º, n.º 1, alínea a) do Código dos Contratos Públicos","","",,"",,Não aplicável.,Não aplicável.,FALSE
72373314 - Consumo Clinico Cirurgias,Ajuste Direto Regime Geral,Aquisição de bens móveis,"33183100-7, Implantes ortopédicos","Centro Hospitalar do Algarve, E. P. E. (510745997)","SMITH & NEPHEW, LDª (503552461)","9.461,20 €",07-01-2015,23-12-2014,4 dias,"Portugal, Faro, Portimão<BR/>Portugal, Faro, Lagos<BR/>Portugal, Faro, Faro","Artigo 20.º, n.º 1, alínea a) do Código dos Contratos Públicos","","",,"",,Não aplicável.,Não aplicável.,FALSE
72373314 - Consumo Clinico Cirurgias,Ajuste Direto Regime Geral,Aquisição de bens móveis,"33140000-3, Material médico de consumo","Centro Hospitalar do Algarve, E. P. E. (510745997)",PORTOPÉDICO COMÉRCIO E APLICAÇÃO DE PRODUTOS ORTOPEDICOS (509829953),"1.420,00 €",07-01-2015,23-12-2014,4 dias,"Portugal, Faro, Portimão<BR/>Portugal, Faro, Faro<BR/>Portugal, Faro, Lagos","Artigo 20.º, n.º 1, alínea a) do Código dos Contratos Públicos","","",,"",,Não aplicável.,Não aplicável.,FALSE
72373314 - consumo Clinico Cirurgias,Ajuste Direto Regime Geral,Aquisição de bens móveis,"33140000-3, Material médico de consumo","Centro Hospitalar do Algarve, E. P. E. (510745997)",JOHNSON & JOHNSON PROD.PROF. (500153370),"294,00 €",07-01-2015,23-12-2014,4 dias,"Portugal, Faro, Portimão<BR/>Portugal, Faro, Faro<BR/>Portugal, Faro, Lagos","Artigo 20.º, n.º 1, alínea a) do Código dos Contratos Públicos","","",,"",,Não aplicável.,Não aplicável.,FALSE
72373314 - Consumo Clinico Cirurgias,Ajuste Direto Regime Geral,Aquisição de bens móveis,"33140000-3, Material médico de consumo","Centro Hospitalar do Algarve, E. P. E. (510745997)",SORIN GROUP (505514010),"875,00 €",07-01-2015,23-12-2014,4 dias,"Portugal, Faro, Lagos<BR/>Portugal, Faro, Faro<BR/>Portugal, Faro, Portimão","Artigo 20.º, n.º 1, alínea a) do Código dos Contratos Públicos","","",,"",,Não aplicável.,Não aplicável.,FALSE
72373314 - Consumo Clinico Cirurgias,Ajuste Direto Regime Geral,Aquisição de bens móveis,"33140000-3, Material médico de consumo","Centro Hospitalar do Algarve, E. P. E. (510745997)","CENTRO ORTOPEDICO DO SUL,LDA. (504836641)","160,73 €",07-01-2015,23-12-2014,4 dias,"Portugal, Faro, Portimão<BR/>Portugal, Faro, Lagos<BR/>Portugal, Faro, Faro","Artigo 20.º, n.º 1, alínea a) do Código dos Contratos Públicos","","",,"",,Não aplicável.,Não aplicável.,FALSE
Prestação de Serviços de Telemedicina,Ajuste Direto Regime Geral,Aquisição de serviços,"85000000-9, Serviços de saúde e acção social","Centro Hospitalar do Algarve, E. P. E. (510745997)",ITM - Instituto de Telemedicina (506705641),"49.765,68 €",06-01-2015,01-01-2014,322 dias,"Portugal, Faro, Faro","Artigo 20.º, n.º 1, alínea a) do Código dos Contratos Públicos","","",,"",,Não aplicável.,Não aplicável.,FALSE
75/00003556/2014 - Diverso Material Administrativo,Ajuste Direto Regime Geral,Aquisição de bens móveis,"30192700-8, Artigos de papelaria","Centro Hospitalar do Algarve, E. P. E. (510745997)",OLMAR.FERNADO G.OLIVEIRA & CA. (500440263),"7,80 €",06-01-2015,20-11-2014,365 dias,"Portugal, Faro, Lagos<BR/>Portugal, Faro, Faro<BR/>Portugal, Faro, Portimão","Artigo 20.º, n.º 1, alínea a) do Código dos Contratos Públicos","","",,"",,Não aplicável.,Não aplicável.,FALSE
75/00003556/2014 -Diverso Material Administrativo,Ajuste Direto Regime Geral,Aquisição de bens móveis,"30192800-9, Etiquetas autocolantes","Centro Hospitalar do Algarve, E. P. E. (510745997)",Marcos de Azevedo Dias (108701476),"15,90 €",06-01-2015,20-11-2014,365 dias,"Portugal, Faro, Faro<BR/>Portugal, Faro, Portimão<BR/>Portugal, Faro, Lagos","Artigo 20.º, n.º 1, alínea a) do Código dos Contratos Públicos","","",,"",,Não aplicável.,Não aplicável.,FALSE
75/00003556/2014 - Diverso Material Administrativo,Ajuste Direto Regime Geral,Aquisição de bens móveis,"30192000-1, Material de escritório","Centro Hospitalar do Algarve, E. P. E. (510745997)","PRN INFORMÁTICA, LDA (504100327)","334,00 €",06-01-2015,20-11-2014,365 dias,"Portugal, Faro, Lagos<BR/>Portugal, Faro, Portimão<BR/>Portugal, Faro, Faro","Artigo 20.º, n.º 1, alínea a) do Código dos Contratos Públicos","","",,"",,Não aplicável.,Não aplicável.,FALSE
62375714 - Consumo Clinico - Electrocateter e Cardioversor,Ajuste Direto Regime Geral,Aquisição de bens móveis,"33182000-9, Material de assistência à função cardíaca","Centro Hospitalar do Algarve, E. P. E. (510745997)",SORIN GROUP (505514010),"875,00 €",06-01-2015,19-12-2014,4 dias,"Portugal, Faro, Portimão<BR/>Portugal, Faro, Faro<BR/>Portugal, Faro, Lagos","Artigo 24.º, n.º 1, alínea e) do Código dos Contratos Públicos","","",,"",,Não aplicável.,Não aplicável.,FALSE
62375714 - Consumo Clinico - electrocateter e cardioversor,Ajuste Direto Regime Geral,Aquisição de bens móveis,"33184300-6, Próteses cardíacas","Centro Hospitalar do Algarve, E. P. E. (510745997)",BIOTRONIK Portugal (Unipessoal Lda. (510726941),"11.000,00 €",06-01-2015,19-12-2014,4 dias,"Portugal, Faro, Faro<BR/>Portugal, Faro, Portimão<BR/>Portugal, Faro, Lagos","Artigo 24.º, n.º 1, alínea e) do Código dos Contratos Públicos","","",,"",,Não aplicável.,Não aplicável.,FALSE
76359914 - Material de Conservação,Ajuste Direto Regime Geral,Aquisição de bens móveis,"31620000-8, Aparelhos de sinalização acústica ou visual","Centro Hospitalar do Algarve, E. P. E. (510745997)",Sintimex (500251118),"194,85 €",06-01-2015,28-11-2014,5 dias,"Portugal, Faro, Portimão<BR/>Portugal, Faro, Lagos<BR/>Portugal, Faro, Faro","Artigo 20.º, n.º 1, alínea a) do Código dos Contratos Públicos","","",,"",,Não aplicável.,Não aplicável.,FALSE
76359914 - Material de Conservação,Ajuste Direto Regime Geral,Aquisição de bens móveis,"35125100-7, Sensores","Centro Hospitalar do Algarve, E. P. E. (510745997)",Iberdata (501904921),"124,10 €",06-01-2015,28-11-2014,5 dias,"Portugal, Faro, Portimão<BR/>Portugal, Faro, Lagos<BR/>Portugal, Faro, Faro","Artigo 20.º, n.º 1, alínea a) do Código dos Contratos Públicos","","",,"",,Não aplicável.,Não aplicável.,FALSE
76359914 - Material de Conservação,Ajuste Direto Regime Geral,Aquisição de bens móveis,"42913000-9, Filtros para óleo, gasolina e entrada de ar","Centro Hospitalar do Algarve, E. P. E. (510745997)",Enkrott (500103461),"37,22 €",06-01-2015,28-11-2014,5 dias,"Portugal, Faro, Faro<BR/>Portugal, Faro, Portimão<BR/>Portugal, Faro, Lagos","Artigo 20.º, n.º 1, alínea a) do Código dos Contratos Públicos","","",,"",,Não aplicável.,Não aplicável.,FALSE
72330214 - Material cirurgico,Ajuste Direto Regime Geral,Aquisição de bens móveis,"33140000-3, Material médico de consumo","Centro Hospitalar do Algarve, E. P. E. (510745997)","STRYKER PORTUGAL PRODUTOS MEDICOS, LDA (504594214)","60,00 €",06-01-2015,30-10-2014,4 dias,"Portugal, Faro, Portimão<BR/>Portugal, Faro, Lagos<BR/>Portugal, Faro, Faro","Artigo 20.º, n.º 1, alínea a) do Código dos Contratos Públicos","","",,"",,Não aplicável.,Não aplicável.,FALSE
72330214 - Material Cirurgico,Ajuste Direto Regime Geral,Aquisição de bens móveis,"33140000-3, Material médico de consumo","Centro Hospitalar do Algarve, E. P. E. (510745997)",SOCIME II - Produtos Medicos Lda (504453939),"249,00 €",06-01-2015,30-10-2014,4 dias,"Portugal, Faro, Faro<BR/>Portugal, Faro, Portimão<BR/>Portugal, Faro, Lagos","Artigo 20.º, n.º 1, alínea a) do Código dos Contratos Públicos","","",,"",,Não aplicável.,Não aplicável.,FALSE
72330214 - Material Cirurgico,Ajuste Direto Regime Geral,Aquisição de bens móveis,"33183000-6, Material de assistência ortopédica<BR/>33141700-7, Material ortopédico","Centro Hospitalar do Algarve, E. P. E. (510745997)","BIOMET PORTUGAL UNIPESSOAL,LDA (500254990)","8.985,00 €",06-01-2015,30-10-2014,4 dias,"Portugal, Faro, Portimão<BR/>Portugal, Faro, Lagos<BR/>Portugal, Faro, Faro","Artigo 20.º, n.º 1, alínea a) do Código dos Contratos Públicos","","",,"",,Não aplicável.,Não aplicável.,FALSE
72330214 - Material Consumo clinico,Ajuste Direto Regime Geral,Aquisição de bens móveis,"33140000-3, Material médico de consumo<BR/>33141700-7, Material ortopédico","Centro Hospitalar do Algarve, E. P. E. (510745997)","SMITH & NEPHEW, LDª (503552461)","4.653,30 €",06-01-2015,30-10-2014,4 dias,"Portugal, Faro, Lagos<BR/>Portugal, Faro, Portimão<BR/>Portugal, Faro, Faro","Artigo 20.º, n.º 1, alínea a) do Código dos Contratos Públicos","","",,"",,Não aplicável.,Não aplicável.,FALSE
72330214 - Material Cirurgico,Ajuste Direto Regime Geral,Aquisição de bens móveis,"33184000-3, Próteses","Centro Hospitalar do Algarve, E. P. E. (510745997)",JOHNSON & JOHNSON PROD.PROF. (500153370),"10.660,75 €",06-01-2015,04-11-2014,4 dias,"Portugal, Faro, Portimão<BR/>Portugal, Faro, Faro<BR/>Portugal, Faro, Lagos","Artigo 20.º, n.º 1, alínea a) do Código dos Contratos Públicos","","",,"",,Não aplicável.,Não aplicável.,FALSE
72330214 - Material Cirurgico,Ajuste Direto Regime Geral,Aquisição de bens móveis,"33140000-3, Material médico de consumo","Centro Hospitalar do Algarve, E. P. E. (510745997)","BAXTER MEDICO-FARMACEUTICA,LDA (503347345)","1.920,00 €",06-01-2015,04-11-2014,4 dias,"Portugal, Faro, Portimão<BR/>Portugal, Faro, Faro<BR/>Portugal, Faro, Lagos","Artigo 20.º, n.º 1, alínea a) do Código dos Contratos Públicos","","",,"",,Não aplicável.,Não aplicável.,FALSE
72330214 - Material Cirurgico,Ajuste Direto Regime Geral,Aquisição de bens móveis,"33185000-0, Próteses auditivas","Centro Hospitalar do Algarve, E. P. E. (510745997)","ATOS MEDICAL SPAIN, SL - SUCURSAL EM PORTUGAL (980435978)","260,00 €",06-01-2015,04-11-2014,4 dias,"Portugal, Faro, Lagos<BR/>Portugal, Faro, Faro<BR/>Portugal, Faro, Portimão","Artigo 20.º, n.º 1, alínea a) do Código dos Contratos Públicos","","",,"",,Não aplicável.,Não aplicável.,FALSE
Proc.67/3724/14 - Upgrade TIM da Ressonancia Magnetica Siemens Magnetom Symphony,Ajuste Direto Regime Geral,Aquisição de bens móveis,"33113000-5, Equipamento de imagiologia por ressonância magnética","Centro Hospitalar do Algarve, E. P. E. (510745997)","SIEMENS, SA (500247480)","349.990,00 €",06-01-2015,30-12-2014,60 dias,"Portugal, Faro, Portimão","Artigo 24.º, n.º 1, alínea e) do Código dos Contratos Públicos","","",,"",,Não aplicável.,Não aplicável.,FALSE
Material de Penso e Campos Operatórios,Ao abrigo de acordo-quadro (art.º 259.º),Aquisição de bens móveis,"33140000-3, Material médico de consumo","Centro Hospitalar do Algarve, E. P. E. (510745997)","EZEQUIEL PANAO JORGE,LDA (501412727)","3.774,90 €",06-01-2015,09-12-2014,359 dias,"Portugal, Faro, Portimão<BR/>Portugal, Faro, Faro<BR/>Portugal, Faro, Lagos",Artigo 259.º do Código dos Contratos Públicos,"","",,"",,451780,CP 2012/24 - MATERAIL DISPOSABLE DE BLOCO OPERATORIO,FALSE
Material de Penso e Campos Operatórios,Ao abrigo de acordo-quadro (art.º 259.º),Aquisição de bens móveis,"33140000-3, Material médico de consumo","Centro Hospitalar do Algarve, E. P. E. (510745997)","SMITH & NEPHEW, LDª (503552461)","3.394,15 €",06-01-2015,09-12-2014,359 dias,"Portugal, Faro, Portimão<BR/>Portugal, Faro, Faro<BR/>Portugal, Faro, Lagos",Artigo 259.º do Código dos Contratos Públicos,"","",,"",,451780,CP 2012/24 - MATERAIL DISPOSABLE DE BLOCO OPERATORIO,FALSE
Material de Penso e Campos Operatórios,Ao abrigo de acordo-quadro (art.º 259.º),Aquisição de bens móveis,"33140000-3, Material médico de consumo","Centro Hospitalar do Algarve, E. P. E. (510745997)","DIMOR LUSITANA, LDA (500730741)","9.134,25 €",06-01-2015,09-12-2014,359 dias,"Portugal, Faro, Lagos<BR/>Portugal, Faro, Portimão<BR/>Portugal, Faro, Faro",Artigo 259.º do Código dos Contratos Públicos,"","",,"",,451780,CP 2012/24 - MATERAIL DISPOSABLE DE BLOCO OPERATORIO,FALSE
Material de Penso e Campos Operatórios,Ao abrigo de acordo-quadro (art.º 259.º),Aquisição de bens móveis,"33140000-3, Material médico de consumo","Centro Hospitalar do Algarve, E. P. E. (510745997)","PAUL HARTMANN, LDA. (502271728)","8.949,96 €",06-01-2015,09-12-2014,359 dias,"Portugal, Faro, Faro<BR/>Portugal, Faro, Portimão<BR/>Portugal, Faro, Lagos",Artigo 259.º do Código dos Contratos Públicos,"","",,"",,451780,CP 2012/24 - MATERAIL DISPOSABLE DE BLOCO OPERATORIO,FALSE
Material de Penso e Campos Operatórios,Ao abrigo de acordo-quadro (art.º 259.º),Aquisição de bens móveis,"33140000-3, Material médico de consumo","Centro Hospitalar do Algarve, E. P. E. (510745997)","OVERPHARMA,LDA. (505792362)","3.646,30 €",06-01-2015,09-12-2014,365 dias,"Portugal, Faro, Lagos<BR/>Portugal, Faro, Portimão<BR/>Portugal, Faro, Faro",Artigo 259.º do Código dos Contratos Públicos,"","",,"",,451780,CP 2012/24 - MATERAIL DISPOSABLE DE BLOCO OPERATORIO,FALSE
Material de Penso e Campos Operatórios,Ao abrigo de acordo-quadro (art.º 259.º),Aquisição de bens móveis,"33140000-3, Material médico de consumo","Centro Hospitalar do Algarve, E. P. E. (510745997)","3M Portugal, Lda. (500193940)","14.273,33 €",06-01-2015,09-12-2014,359 dias,"Portugal, Faro, Faro<BR/>Portugal, Faro, Lagos<BR/>Portugal, Faro, Portimão",Artigo 259.º do Código dos Contratos Públicos,"","",,"",,451780,CP 2012/24 - MATERAIL DISPOSABLE DE BLOCO OPERATORIO,FALSE
Material de penso e Campos Operatórios,Ao abrigo de acordo-quadro (art.º 259.º),Aquisição de bens móveis,"33140000-3, Material médico de consumo","Centro Hospitalar do Algarve, E. P. E. (510745997)","BASTOS VIEGAS,SA (500042772)","16.610,56 €",06-01-2015,09-12-2014,359 dias,"Portugal, Faro, Portimão<BR/>Portugal, Faro, Lagos<BR/>Portugal, Faro, Faro",Artigo 259.º do Código dos Contratos Públicos,"","",,"",,451780,CP 2012/24 - MATERAIL DISPOSABLE DE BLOCO OPERATORIO,FALSE
Material de Penso e Campos Operatórios,Ao abrigo de acordo-quadro (art.º 259.º),Aquisição de bens móveis,"33140000-3, Material médico de consumo","Centro Hospitalar do Algarve, E. P. E. (510745997)",ALBINO DIAS ANDRADE LDA (500013810),"71.925,53 €",06-01-2015,09-12-2014,359 dias,"Portugal, Faro, Faro<BR/>Portugal, Faro, Portimão<BR/>Portugal, Faro, Lagos",Artigo 259.º do Código dos Contratos Públicos,"","",,"",,451780,CP 2012/24 - MATERAIL DISPOSABLE DE BLOCO OPERATORIO,FALSE
Material de Penso e Campos Operatórios,Ao abrigo de acordo-quadro (art.º 259.º),Aquisição de bens móveis,"33140000-3, Material médico de consumo","Centro Hospitalar do Algarve, E. P. E. (510745997)","Vilar - Comércio e Representações, Lda. (500299269)","5.980,00 €",06-01-2015,09-12-2014,359 dias,"Portugal, Faro, Portimão<BR/>Portugal, Faro, Lagos<BR/>Portugal, Faro, Faro",Artigo 259.º do Código dos Contratos Públicos,"","",,"",,451780,CP 2012/24 - MATERAIL DISPOSABLE DE BLOCO OPERATORIO,FALSE
Proc. 67/3707/14 - Fornecimento de Sistema STEALTHSTATION S7,Ajuste Direto Regime Geral,Aquisição de bens móveis,"33162100-4, Aparelhos para blocos operatórios","Centro Hospitalar do Algarve, E. P. E. (510745997)","MEDTRONIC PORTUGAL,LDA (504223933)","247.910,00 €",06-01-2015,30-12-2014,60 dias,"Portugal, Faro, Faro","Artigo 24.º, n.º 1, alínea e) do Código dos Contratos Públicos","","",,"",,Não aplicável.,Não aplicável.,FALSE
72320014 - Pacemaker e Electrodo,Ajuste Direto Regime Geral,Aquisição de bens móveis,"33184300-6, Próteses cardíacas","Centro Hospitalar do Algarve, E. P. E. (510745997)","ST. JUDE MEDICAL PORTUGAL,LDA. (504180746)","5.000,00 €",06-01-2015,02-12-2014,4 dias,"Portugal, Faro, Faro<BR/>Portugal, Faro, Portimão<BR/>Portugal, Faro, Lagos","Artigo 20.º, n.º 1, alínea a) do Código dos Contratos Públicos","","",,"",,Não aplicável.,Não aplicável.,FALSE
Proc. 77/3753/14-Aquisição de Videonasofibroscopio  Completo (Torre) e de  Impedanciometro,Ajuste Direto Regime Geral,Aquisição de bens móveis,"33124100-6, Aparelhos para diagnóstico","Centro Hospitalar do Algarve, E. P. E. (510745997)","WIDEX,LDA (501882766)","8.597,50 €",06-01-2015,17-12-2014,60 dias,"Portugal, Faro, Portimão","Artigo 20.º, n.º 1, alínea a) do Código dos Contratos Públicos",31-12-2014,"",,Sem execução em 31/12/2014,,Não aplicável.,Não aplicável.,FALSE
Proc. 77/3753/14-Aquisição de Videonasofibroscopio  Completo (Torre) e de  Impedanciometro,Ajuste Direto Regime Geral,Aquisição de bens móveis,"33168000-5, Aparelhos para endoscopia e endocirurgia","Centro Hospitalar do Algarve, E. P. E. (510745997)","OLYMPUS IBERIA,SAU (980474710)","32.553,01 €",06-01-2015,17-12-2014,60 dias,"Portugal, Faro, Portimão","Artigo 20.º, n.º 1, alínea a) do Código dos Contratos Públicos",31-12-2014,"",,Sem execução até 31/12/2014,,Não aplicável.,Não aplicável.,FALSE
72320014 -Pacemaker e Electrodo,Ajuste Direto Regime Geral,Aquisição de bens móveis,"33184300-6, Próteses cardíacas","Centro Hospitalar do Algarve, E. P. E. (510745997)",SORIN GROUP (505514010),"645,00 €",06-01-2015,02-12-2014,4 dias,"Portugal, Faro, Faro<BR/>Portugal, Faro, Portimão<BR/>Portugal, Faro, Lagos","Artigo 20.º, n.º 1, alínea a) do Código dos Contratos Públicos","","",,"",,Não aplicável.,Não aplicável.,FALSE
62018315 - Cuvete de reacção (Immulite 2000),Ajuste Direto Regime Geral,Aquisição de bens móveis,"33140000-3, Material médico de consumo","Centro Hospitalar do Algarve, E. P. E. (510745997)","SIEMENS HEALTHCARE DIAGNOSTICS, LDA (507925173)","256,82 €",06-01-2015,31-12-2014,359 dias,"Portugal, Faro, Faro<BR/>Portugal, Faro, Lagos<BR/>Portugal, Faro, Portimão","Artigo 20.º, n.º 1, alínea a) do Código dos Contratos Públicos","","",,"",,Não aplicável.,Não aplicável.,FALSE
Monitores UCI Pediatria/Neonatologia,Ajuste Direto Regime Geral,Aquisição de bens móveis,"33123210-3, Aparelhos para monitorização cardíaca","Centro Hospitalar do Algarve, E. P. E. (510745997)",DRAGER PORTUGAL (508771323),"20.520,00 €",06-01-2015,28-11-2014,365 dias,"Portugal, Faro, Portimão<BR/>Portugal, Faro, Faro<BR/>Portugal, Faro, Lagos","Artigo 20.º, n.º 1, alínea a) do Código dos Contratos Públicos","","",,"",,Não aplicável.,Não aplicável.,FALSE
Electroencefalografo,Ajuste Direto Regime Geral,Aquisição de bens móveis,"33121100-5, Electroencefalógrafos","Centro Hospitalar do Algarve, E. P. E. (510745997)","PULMOCOR-EQUIPAMENTO MÉDICO, SA (501402578)","27.840,00 €",06-01-2015,17-12-2014,365 dias,"Portugal, Faro, Lagos<BR/>Portugal, Faro, Portimão<BR/>Portugal, Faro, Faro","Artigo 20.º, n.º 1, alínea a) do Código dos Contratos Públicos","","",,"",,Não aplicável.,Não aplicável.,FALSE
"Sondas para ecografos , Impressora e Suportes Rodados",Ajuste Direto Regime Geral,Aquisição de bens móveis,"33124100-6, Aparelhos para diagnóstico","Centro Hospitalar do Algarve, E. P. E. (510745997)","GENERAL ELECTRIC PORTUGUESA,SA (500357129)","36.340,00 €",05-01-2015,27-11-2014,365 dias,"Portugal, Faro, Faro<BR/>Portugal, Faro, Lagos<BR/>Portugal, Faro, Portimão","Artigo 20.º, n.º 1, alínea a) do Código dos Contratos Públicos","","",,"",,Não aplicável.,Não aplicável.,FALSE
Aquisição de Drenos e Sondas,Ajuste Direto Regime Geral,Aquisição de bens móveis,"33140000-3, Material médico de consumo","Centro Hospitalar do Algarve, E.P.E. (510745997)","VYGON (PORTUGAL),LDA. (503232785), HOSPITEX MATERIAL HOSPITALAR,LDA (501909842), EPJMEDICA-ARTIGOS MED.HOSPITAL (506820513), EXPOMEDICA,LDA. (501886621), COVIDIEN PORTUGAL - PRODUTOS  DE SAUDE, UNIPESSOAL, LDA. (503413410), HR  HOSPITALAR, LDA (501895558), B. BRAUN MEDICAL,LDA. (501506543), COLOPLAST PORTUGAL, SOCIEDADE UNIPESSOAL LDA. (503989037), OVERPHARMA,LDA. (505792362), JOHNSON & JOHNSON PROD.PROF. (500153370), EZEQUIEL PANAO JORGE,LDA (501412727), BASTOS VIEGAS,SA (500042772)","24.976,04 €",05-01-2015,19-12-2014,365 dias,"Portugal, Faro, Portimão<BR/>Portugal, Faro, Faro<BR/>Portugal, Faro, Lagos","Artigo 20.º, n.º 1, alínea a) do Código dos Contratos Públicos","","",,"",,Não aplicável.,Não aplicável.,FALSE
3 Ecografos,Ajuste Direto Regime Geral,Aquisição de bens móveis,"33112000-8, Equipamento de imagiologia por ecos, ultra-sons e doppler","Centro Hospitalar do Algarve, E. P. E. (510745997)","GENERAL ELECTRIC PORTUGUESA,SA (500357129)","74.500,00 €",05-01-2015,27-11-2014,365 dias,"Portugal, Faro, Lagos<BR/>Portugal, Faro, Portimão<BR/>Portugal, Faro, Faro","Artigo 20.º, n.º 1, alínea a) do Código dos Contratos Públicos","","",,"",,Não aplicável.,Não aplicável.,FALSE
Ecocardiografo GE,Ajuste Direto Regime Geral,Aquisição de bens móveis,"33112340-3, Ecocardiógrafos","Centro Hospitalar do Algarve, E. P. E. (510745997)","GENERAL ELECTRIC PORTUGUESA,SA (500357129)","30.000,00 €",05-01-2015,02-12-2014,365 dias,"Portugal, Faro, Lagos<BR/>Portugal, Faro, Portimão<BR/>Portugal, Faro, Faro","Artigo 20.º, n.º 1, alínea a) do Código dos Contratos Públicos","","",,"",,Não aplicável.,Não aplicável.,FALSE
Pletismografo,Ajuste Direto Regime Geral,Aquisição de bens móveis,"33124100-6, Aparelhos para diagnóstico","Centro Hospitalar do Algarve, E. P. E. (510745997)","PULMOCOR-EQUIPAMENTO MÉDICO, SA (501402578)","69.000,00 €",05-01-2015,02-12-2014,365 dias,"Portugal, Faro, Faro<BR/>Portugal, Faro, Portimão<BR/>Portugal, Faro, Lagos","Artigo 20.º, n.º 1, alínea a) do Código dos Contratos Públicos","","",,"",,Não aplicável.,Não aplicável.,FALSE
"Bombas , Seringas e suportes rodados ",Ajuste Direto Regime Geral,Aquisição de bens móveis,"33100000-1, Equipamento médico","Centro Hospitalar do Algarve, E. P. E. (510745997)","B. BRAUN MEDICAL,LDA. (501506543)","20.750,00 €",05-01-2015,09-12-2014,365 dias,"Portugal, Faro, Portimão<BR/>Portugal, Faro, Faro<BR/>Portugal, Faro, Lagos","Artigo 20.º, n.º 1, alínea a) do Código dos Contratos Públicos","","",,"",,Não aplicável.,Não aplicável.,FALSE
62047415 - Aquisição de material de consumo clínico,Ajuste Direto Regime Geral,Aquisição de bens móveis,"33140000-3, Material médico de consumo","Centro Hospitalar do Algarve, E. P. E. (510745997)","MED X-RAY SISTEMAS MEDICOS,LDA (506187071)","840,00 €",05-01-2015,29-12-2014,360 dias,"Portugal, Faro, Portimão<BR/>Portugal, Faro, Lagos<BR/>Portugal, Faro, Faro","Artigo 24.º, n.º 1, alínea e) do Código dos Contratos Públicos","","",,"",,Não aplicável.,Não aplicável.,FALSE
CONSUMO CLINICO FU - MED-X-RAY,Ajuste Direto Regime Geral,Aquisição de bens móveis,"33140000-3, Material médico de consumo","Centro Hospitalar do Algarve, E. P. E. (510745997)","MED X-RAY SISTEMAS MEDICOS,LDA (506187071)","2.857,68 €",05-01-2015,23-12-2014,365 dias,"Portugal, Faro, Lagos<BR/>Portugal, Faro, Faro<BR/>Portugal, Faro, Portimão","Artigo 24.º, n.º 1, alínea e) do Código dos Contratos Públicos","","",,"",,Não aplicável.,Não aplicável.,FALSE
Cuvetes p/ Baixa Hemoglobina no Plasma,Ajuste Direto Regime Geral,Aquisição de bens móveis,"33140000-3, Material médico de consumo","Centro Hospitalar do Algarve, E. P. E. (510745997)","IZASA PORTUGAL,LDA. (501086110)","250,00 €",02-01-2015,23-12-2014,365 dias,"Portugal, Faro, Faro<BR/>Portugal, Faro, Lagos<BR/>Portugal, Faro, Portimão","Artigo 24.º, n.º 1, alínea e) do Código dos Contratos Públicos","","",,"",,Não aplicável.,Não aplicável.,FALSE
62031315 - CONSUMO CLÍNICO - GRIFOLS,Ajuste Direto Regime Geral,Aquisição de bens móveis,"33140000-3, Material médico de consumo","Centro Hospitalar do Algarve, E. P. E. (510745997)","GRIFOLS PORTUGAL, LDA. (502041285)","3.200,00 €",02-01-2015,19-12-2014,365 dias,"Portugal, Faro, Lagos<BR/>Portugal, Faro, Faro<BR/>Portugal, Faro, Portimão","Artigo 24.º, n.º 1, alínea e) do Código dos Contratos Públicos","","",,"",,Não aplicável.,Não aplicável.,FALSE
"Proc.77/3763/14- Reparação de Equipamentos das Cozinhas Do CHA,EPE",Ajuste Direto Regime Geral,Aquisição de serviços,"50881000-4, Serviços de reparação e manutenção de equipamento para hotelaria","Centro Hospitalar do Algarve, E. P. E. (510745997)",SERVIÇO UTILIZAÇÃO COMUM DOS HOSPITAIS (500900469),"10.935,12 €",02-01-2015,23-12-2014,60 dias,"Portugal, Faro, Faro<BR/>Portugal, Faro, Lagos<BR/>Portugal, Faro, Portimão","Artigo 20.º, n.º 1, alínea a) do Código dos Contratos Públicos","","",,"",,Não aplicável.,Não aplicável.,FALSE
Aquisição de Pacemakers,Ao abrigo de acordo-quadro (art.º 259.º),Aquisição de bens móveis,"33140000-3, Material médico de consumo","Centro Hospitalar do Algarve, E. P. E. (510745997)",SORIN GROUP (505514010),"54.326,00 €",02-01-2015,22-12-2014,365 dias,"Portugal, Faro, Faro",Artigo 259.º do Código dos Contratos Públicos,"","",,"",,600105,"CONCURSO PÚBLICO PARA A CELEBRAÇÃO DE CONTRATOS PÚBLICOS DE APROVISIONAMENTO PARA A ÁREA DA SAÚDE, COM VISTA AO FORNECIMENTO SISTEMAS DE PACEMAKERS ÀS INSTITUIÇÕES E SERVIÇOS DO SERVIÇO NACIONAL DE SAÚDE",FALSE
Aquisição de Pacemakers,Ao abrigo de acordo-quadro (art.º 259.º),Aquisição de bens móveis,"33140000-3, Material médico de consumo","Centro Hospitalar do Algarve, E. P. E. (510745997)",BIOTRONIK Portugal (Unipessoal Lda. (510726941),"30.950,00 €",02-01-2015,22-12-2014,365 dias,"Portugal, Faro, Faro",Artigo 259.º do Código dos Contratos Públicos,"","",,"",,600105,"CONCURSO PÚBLICO PARA A CELEBRAÇÃO DE CONTRATOS PÚBLICOS DE APROVISIONAMENTO PARA A ÁREA DA SAÚDE, COM VISTA AO FORNECIMENTO SISTEMAS DE PACEMAKERS ÀS INSTITUIÇÕES E SERVIÇOS DO SERVIÇO NACIONAL DE SAÚDE",FALSE
Aquisição de pacemakers,Ao abrigo de acordo-quadro (art.º 259.º),Aquisição de bens móveis,"33140000-3, Material médico de consumo","Centro Hospitalar do Algarve, E. P. E. (510745997)","ST. JUDE MEDICAL PORTUGAL,LDA. (504180746)","82.220,00 €",02-01-2015,22-12-2014,365 dias,"Portugal, Faro, Faro",Artigo 259.º do Código dos Contratos Públicos,"","",,"",,600105,"CONCURSO PÚBLICO PARA A CELEBRAÇÃO DE CONTRATOS PÚBLICOS DE APROVISIONAMENTO PARA A ÁREA DA SAÚDE, COM VISTA AO FORNECIMENTO SISTEMAS DE PACEMAKERS ÀS INSTITUIÇÕES E SERVIÇOS DO SERVIÇO NACIONAL DE SAÚDE",FALSE
Proc. 77/3691/14 - Fornecimento e Montagem de UPS,Ajuste Direto Regime Geral,Aquisição de bens móveis,"30230000-0, Equipamento informático","Centro Hospitalar do Algarve, E. P. E. (510745997)","EMERSON NETWORK POWER,LDA (503322520)","27.720,00 €",02-01-2015,12-12-2014,60 dias,"Portugal, Faro, Faro","Artigo 20.º, n.º 1, alínea a) do Código dos Contratos Públicos","","",,"",,Não aplicável.,Não aplicável.,FALSE
62347314 - sistema Pace Bi-Ventricular c/Desfibrilhador Implantável,Ajuste Direto Regime Geral,Aquisição de bens móveis,"33184000-3, Próteses","Centro Hospitalar do Algarve, E. P. E. (510745997)",St. Jude Medical (504180746),"16.500,00 €",02-01-2015,11-11-2014,4 dias,"Portugal, Faro, Lagos<BR/>Portugal, Faro, Portimão<BR/>Portugal, Faro, Faro","Artigo 24.º, n.º 1, alínea e) do Código dos Contratos Públicos","","",,"",,Não aplicável.,Não aplicável.,FALSE
Proc. 77/3760/14-Aquisição de Monitores Multiparametros e Central de Monitorização,Ajuste Direto Regime Geral,Aquisição de bens móveis,"33195200-5, Unidade central de monitorização","Centro Hospitalar do Algarve, E. P. E. (510745997)","DIMORASEPT,LDA (510258786)","23.249,00 €",02-01-2015,23-12-2014,60 dias,"Portugal, Faro, Faro","Artigo 20.º, n.º 1, alínea a) do Código dos Contratos Públicos","","",,"",,Não aplicável.,Não aplicável.,FALSE
72230214 - Regularização Cirurgias realizadas Bloco Operatorio,Ajuste Direto Regime Geral,Aquisição de bens móveis,"33184000-3, Próteses","Centro Hospitalar do Algarve, E. P. E. (510745997)","BIOMET PORTUGAL UNIPESSOAL,LDA (500254990)","6.880,00 €",02-01-2015,12-05-2014,4 dias,"Portugal, Faro, Lagos<BR/>Portugal, Faro, Faro<BR/>Portugal, Faro, Portimão","Artigo 20.º, n.º 1, alínea a) do Código dos Contratos Públicos","","",,"",,Não aplicável.,Não aplicável.,FALSE
72230214 - Regularização Cirurgias realizadas Bloco Operatório,Ajuste Direto Regime Geral,Aquisição de bens móveis,"33184000-3, Próteses","Centro Hospitalar do Algarve, E. P. E. (510745997)","SMITH & NEPHEW, LDª (503552461)","1.800,00 €",02-01-2015,12-05-2014,4 dias,"Portugal, Faro, Faro<BR/>Portugal, Faro, Lagos<BR/>Portugal, Faro, Portimão","Artigo 20.º, n.º 1, alínea a) do Código dos Contratos Públicos","","",,"",,Não aplicável.,Não aplicável.,FALSE
72230214 - Regularização Cirurgias realizadas Bloco Operatório,Ajuste Direto Regime Geral,Aquisição de bens móveis,"33184000-3, Próteses","Centro Hospitalar do Algarve, E. P. E. (510745997)",JOHNSON & JOHNSON PROD.PROF. (500153370),"11.670,52 €",02-01-2015,12-05-2014,4 dias,"Portugal, Faro, Faro<BR/>Portugal, Faro, Portimão<BR/>Portugal, Faro, Lagos","Artigo 20.º, n.º 1, alínea a) do Código dos Contratos Públicos","","",,"",,Não aplicável.,Não aplicável.,FALSE
Proc.68/3678/14- Assistencia Tecnica Software-Alert-UBU-Agosto a Dezembro/2014-SUB´s,Ajuste Direto Regime Geral,Aquisição de serviços,"72261000-2, Serviços de assistência em matéria de software","Centro Hospitalar do Algarve, E. P. E. (510745997)","A.R.S. ALGARVE,I.P. (503148709)","11.796,75 €",02-01-2015,23-12-2014,153 dias,"Portugal, Faro, Faro","Artigo 24.º, n.º 1, alínea e) do Código dos Contratos Públicos","","",,"",,Não aplicável.,Não aplicável.,FALSE
62021315 - CONSUMO CLINICO,Ajuste Direto Regime Geral,Aquisição de bens móveis,"33140000-3, Material médico de consumo","Centro Hospitalar do Algarve, E. P. E. (510745997)","Nutricia Advanced Medical Nutrition Unipessoal, Lda (507558286)","2.349,00 €",02-01-2015,28-11-2014,365 dias,"Portugal, Faro, Faro<BR/>Portugal, Faro, Lagos<BR/>Portugal, Faro, Portimão","Artigo 24.º, n.º 1, alínea e) do Código dos Contratos Públicos","","",,"",,Não aplicável.,Não aplicável.,FALSE
Proc. 77/3690/14 - Aquisição Doppler Transcraniano,Ajuste Direto Regime Geral,Aquisição de bens móveis,"33112000-8, Equipamento de imagiologia por ecos, ultra-sons e doppler","Centro Hospitalar do Algarve, E. P. E. (510745997)","MUNDINTER-INTERCAMBIO MUNDIAL DE COMERCIO,SA (500199906)","40.000,00 €",02-01-2015,09-12-2014,60 dias,"Portugal, Faro, Faro","Artigo 20.º, n.º 1, alínea a) do Código dos Contratos Públicos","","",,"",,Não aplicável.,Não aplicável.,FALSE
72221114 - Cirurgias - Bloco Operatorio,Ajuste Direto Regime Geral,Aquisição de bens móveis,"33140000-3, Material médico de consumo","Centro Hospitalar do Algarve, E. P. E. (510745997)","ZIMMER SA, SUCURSAL EM PORTUGAL (980151716)","2.904,00 €",02-01-2015,28-04-2014,4 dias,"Portugal, Faro, Lagos<BR/>Portugal, Faro, Faro<BR/>Portugal, Faro, Portimão","Artigo 20.º, n.º 1, alínea a) do Código dos Contratos Públicos","","",,"",,Não aplicável.,Não aplicável.,FALSE
72221114 - Cirurgia Bloco Operatorio,Ajuste Direto Regime Geral,Aquisição de bens móveis,"33140000-3, Material médico de consumo","Centro Hospitalar do Algarve, E. P. E. (510745997)","BIOMET PORTUGAL UNIPESSOAL,LDA (500254990)","1.980,00 €",02-01-2015,28-04-2014,4 dias,"Portugal, Faro, Portimão<BR/>Portugal, Faro, Faro<BR/>Portugal, Faro, Lagos","Artigo 20.º, n.º 1, alínea a) do Código dos Contratos Públicos","","",,"",,Não aplicável.,Não aplicável.,FALSE
72221114 - Cirurgias - Bloco Operatorio,Ajuste Direto Regime Geral,Aquisição de bens móveis,"33140000-3, Material médico de consumo","Centro Hospitalar do Algarve, E. P. E. (510745997)","SMITH & NEPHEW, LDª (503552461)","15.909,00 €",02-01-2015,28-04-2014,4 dias,"Portugal, Faro, Faro<BR/>Portugal, Faro, Lagos<BR/>Portugal, Faro, Portimão","Artigo 20.º, n.º 1, alínea a) do Código dos Contratos Públicos","","",,"",,Não aplicável.,Não aplicável.,FALSE
62018615 - Material p/ Centrifuga Sakura,Ajuste Direto Regime Geral,Aquisição de bens móveis,"33140000-3, Material médico de consumo","Centro Hospitalar do Algarve, E. P. E. (510745997)","VWR INTERNACIONAL, LDA. (503842770)","1.583,60 €",02-01-2015,28-11-2014,365 dias,"Portugal, Faro, Faro<BR/>Portugal, Faro, Portimão<BR/>Portugal, Faro, Lagos","Artigo 24.º, n.º 1, alínea e) do Código dos Contratos Públicos","","",,"",,Não aplicável.,Não aplicável.,FALSE
72221114 - Cirurgias - Bloco Operatório,Ajuste Direto Regime Geral,Aquisição de bens móveis,"33140000-3, Material médico de consumo","Centro Hospitalar do Algarve, E. P. E. (510745997)",JOHNSON & JOHNSON PROD.PROF. (500153370),"7.790,00 €",02-01-2015,28-04-2014,4 dias,"Portugal, Faro, Lagos<BR/>Portugal, Faro, Portimão<BR/>Portugal, Faro, Faro","Artigo 20.º, n.º 1, alínea a) do Código dos Contratos Públicos","","",,"",,Não aplicável.,Não aplicável.,FALSE
Aquisição de redes de hérnia,Ajuste Direto Regime Geral,Aquisição de bens móveis,"33140000-3, Material médico de consumo","Centro Hospitalar do Algarve, E. P. E. (510745997)","JMV-PRODUTOS HOSPITALARES (501887148), B. BRAUN MEDICAL,LDA. (501506543), C.R.BARD PORTUGAL, LDA. (502438274)","38.068,84 €",02-01-2015,07-11-2014,365 dias,"Portugal, Faro, Lagos<BR/>Portugal, Faro, Portimão<BR/>Portugal, Faro, Faro","Artigo 20.º, n.º 1, alínea a) do Código dos Contratos Públicos","","",,"",,Não aplicável.,Não aplicável.,FALSE
Aquisição de Introdutores e eletrodos para o serviço de cardiologia,Concurso público,Aquisição de bens móveis,"33140000-3, Material médico de consumo","Centro Hospitalar do Algarve, E. P. E. (510745997)","Medtronic Portugal (504223933), Sorin (505514010), Medicinália Cormédica (500684324), St. Jude Medical (504180746), Vygon Portugal (503232785)","27.625,60 €",02-01-2015,16-12-2014,365 dias,"Portugal, Faro, Faro<BR/>Portugal, Faro, Lagos<BR/>Portugal, Faro, Portimão","Artigo 20.º, n.º 1, alínea b) do Código dos Contratos Públicos","","",,"",,Não aplicável.,Não aplicável.,FALSE
Aquisição de M. Intervenção para hemodinâmica e cardiologia de intervenção,Concurso público,Aquisição de bens móveis,"33140000-3, Material médico de consumo","Centro Hospitalar do Algarve, E. P. E. (510745997)","Lusopalex (503531588), Terumo Europe (980472024), Medical Value (509776531), Cardiva Portugal (508570514), Endovascular (505537494)","130.400,00 €",02-01-2015,25-11-2014,365 dias,"Portugal, Faro, Faro","Artigo 20.º, n.º 1, alínea b) do Código dos Contratos Públicos","","",,"",,Não aplicável.,Não aplicável.,FALSE
72295314 - Material Consumo Clinico,Ajuste Direto Regime Geral,Aquisição de bens móveis,"33140000-3, Material médico de consumo","Centro Hospitalar do Algarve, E. P. E. (510745997)","ST. JUDE MEDICAL PORTUGAL,LDA. (504180746)","5.000,00 €",02-01-2015,04-11-2014,4 dias,"Portugal, Faro, Portimão<BR/>Portugal, Faro, Lagos<BR/>Portugal, Faro, Faro","Artigo 20.º, n.º 1, alínea a) do Código dos Contratos Públicos","","",,"",,Não aplicável.,Não aplicável.,FALSE
72295314 - Material Consumo Clinico,Ajuste Direto Regime Geral,Aquisição de bens móveis,"33140000-3, Material médico de consumo","Centro Hospitalar do Algarve, E. P. E. (510745997)","MEDTRONIC PORTUGAL, LDA. (504223933)","14.000,00 €",02-01-2015,04-11-2014,4 dias,"Portugal, Faro, Faro<BR/>Portugal, Faro, Lagos<BR/>Portugal, Faro, Portimão","Artigo 20.º, n.º 1, alínea a) do Código dos Contratos Públicos","","",,"",,Não aplicável.,Não aplicável.,FALSE
72295314 - Material Consumo Clinico,Ajuste Direto Regime Geral,Aquisição de bens móveis,"33140000-3, Material médico de consumo","Centro Hospitalar do Algarve, E. P. E. (510745997)",OSTEOFIX DISPOSITIVOS MÉDICOS LDA (508245842),"90,00 €",02-01-2015,04-11-2014,4 dias,"Portugal, Faro, Portimão<BR/>Portugal, Faro, Lagos<BR/>Portugal, Faro, Faro","Artigo 20.º, n.º 1, alínea a) do Código dos Contratos Públicos","","",,"",,Não aplicável.,Não aplicável.,FALSE
72295314 - Material Consumo Clinico,Ajuste Direto Regime Geral,Aquisição de bens móveis,"33140000-3, Material médico de consumo","Centro Hospitalar do Algarve, E. P. E. (510745997)","3M Portugal, Lda. (500193940)","69,09 €",02-01-2015,04-11-2014,4 dias,"Portugal, Faro, Lagos<BR/>Portugal, Faro, Portimão<BR/>Portugal, Faro, Faro","Artigo 20.º, n.º 1, alínea a) do Código dos Contratos Públicos","","",,"",,Não aplicável.,Não aplicável.,FALSE
72295314 - Material Consumo Clinico,Ajuste Direto Regime Geral,Aquisição de bens móveis,"33140000-3, Material médico de consumo","Centro Hospitalar do Algarve, E. P. E. (510745997)",JOHNSON & JOHNSON PROD.PROF. (500153370),"1.056,00 €",02-01-2015,04-11-2014,4 dias,"Portugal, Faro, Portimão<BR/>Portugal, Faro, Faro<BR/>Portugal, Faro, Lagos","Artigo 20.º, n.º 1, alínea a) do Código dos Contratos Públicos","","",,"",,Não aplicável.,Não aplicável.,FALSE
72295314 - Material Consumo Clinico,Ajuste Direto Regime Geral,Aquisição de bens móveis,"33140000-3, Material médico de consumo","Centro Hospitalar do Algarve, E. P. E. (510745997)","BOSTON SCIENTIFIC PORTUGAL-DISPOSITIVOS MÉDICOS, LDA. (504988964)","19.490,00 €",02-01-2015,04-11-2014,4 dias,"Portugal, Faro, Portimão<BR/>Portugal, Faro, Faro<BR/>Portugal, Faro, Lagos","Artigo 20.º, n.º 1, alínea a) do Código dos Contratos Públicos","","",,"",,Não aplicável.,Não aplicável.,FALSE
Aquisição de Material Diagnóstico e Kit de Tabuleiro,Concurso público,Aquisição de bens móveis,"33140000-3, Material médico de consumo","Centro Hospitalar do Algarve, E. P. E. (510745997)","MEDIJOPE (503005223), JOHNSON & JOHNSON PROD.PROF. (500153370), B. BRAUN MEDICAL,LDA. (501506543), TERUMO EUROPE ESPANHA SL (980472024), MEDTRONIC PORTUGAL, LDA. (504223933)","84.990,30 €",02-01-2015,25-11-2014,365 dias,"Portugal, Faro, Faro","Artigo 20.º, n.º 1, alínea b) do Código dos Contratos Públicos","","",,"",,Não aplicável.,Não aplicável.,FALSE
72295314 - Material Consumo Clinico,Ajuste Direto Regime Geral,Aquisição de bens móveis,"33140000-3, Material médico de consumo","Centro Hospitalar do Algarve, E. P. E. (510745997)",SORIN GROUP (505514010),"14.610,00 €",02-01-2015,04-11-2014,4 dias,"Portugal, Faro, Portimão<BR/>Portugal, Faro, Faro<BR/>Portugal, Faro, Lagos","Artigo 20.º, n.º 1, alínea a) do Código dos Contratos Públicos","","",,"",,Não aplicável.,Não aplicável.,FALSE
Aquisição de Fraldas e Resguardos,Ao abrigo de acordo-quadro (art.º 259.º),Aquisição de bens móveis,"33140000-3, Material médico de consumo","Centro Hospitalar do Algarve, E. P. E. (510745997)","QUILABAN,LDA. (500399670)","34.388,00 €",02-01-2015,04-11-2014,365 dias,"Portugal, Faro, Portimão<BR/>Portugal, Faro, Lagos<BR/>Portugal, Faro, Faro",Artigo 259.º do Código dos Contratos Públicos,"","",,"",,598830,"CONCURSO PÚBLICO PARA A CELEBRAÇÃO DE CONTRATOS PÚBLICOS DE APROVISIONAMENTO PARA A ÁREA DA SAÚDE, COM VISTA AO FORNECIMENTO DE MATERIAL DE INCONTINÊNCIA, PROTEÇÃO CUTÂNEA E ALÍVIO DE PRESSÃO, ÀS INSTITUIÇÕES E SERVIÇOS DO SERVIÇO NACIONAL DE SAÚDE",FALSE
Contentores e Tubos Diversos,Ao abrigo de acordo-quadro (art.º 259.º),Aquisição de bens móveis,"33140000-3, Material médico de consumo","Centro Hospitalar do Algarve, E. P. E. (510745997)","VACUETTE PORTUGAL, S.A. (505348470)","57.135,19 €",02-01-2015,09-12-2014,365 dias,"Portugal, Faro, Faro<BR/>Portugal, Faro, Portimão<BR/>Portugal, Faro, Lagos",Artigo 259.º do Código dos Contratos Públicos,"","",,"",,1341769,"ACORDO QUADRO PARA FORNECIMENTO DE SERINGAS, AGULHAS E CONTENTORES ÀS INSTITUIÇÕES E SERVIÇOS DO SERVIÇO NACIONAL DE SAÚDE PROGRAMA DE CONCURSO",FALSE
Aquisição de Fraldas e Resguardos,Ao abrigo de acordo-quadro (art.º 259.º),Aquisição de bens móveis,"33140000-3, Material médico de consumo","Centro Hospitalar do Algarve, E. P. E. (510745997)","PROCTER & GAMBLE PORTUGALl - PRODUTOS de CCONSUMO, HIGIENE e SA (503037753)","58.826,00 €",02-01-2015,04-11-2014,365 dias,"Portugal, Faro, Portimão<BR/>Portugal, Faro, Lagos<BR/>Portugal, Faro, Faro",Artigo 259.º do Código dos Contratos Públicos,"","",,"",,598830,"CONCURSO PÚBLICO PARA A CELEBRAÇÃO DE CONTRATOS PÚBLICOS DE APROVISIONAMENTO PARA A ÁREA DA SAÚDE, COM VISTA AO FORNECIMENTO DE MATERIAL DE INCONTINÊNCIA, PROTEÇÃO CUTÂNEA E ALÍVIO DE PRESSÃO, ÀS INSTITUIÇÕES E SERVIÇOS DO SERVIÇO NACIONAL DE SAÚDE",FALSE
Contentores e Tubos Diversos,Ao abrigo de acordo-quadro (art.º 259.º),Aquisição de bens móveis,"33140000-3, Material médico de consumo","Centro Hospitalar do Algarve, E. P. E. (510745997)","Clínifar - Produtos Clínicos e Farmacêuticos, S.A. (503281115)","7.411,80 €",02-01-2015,09-12-2014,365 dias,"Portugal, Faro, Faro<BR/>Portugal, Faro, Lagos<BR/>Portugal, Faro, Portimão",Artigo 259.º do Código dos Contratos Públicos,"","",,"",,1341769,"ACORDO QUADRO PARA FORNECIMENTO DE SERINGAS, AGULHAS E CONTENTORES ÀS INSTITUIÇÕES E SERVIÇOS DO SERVIÇO NACIONAL DE SAÚDE PROGRAMA DE CONCURSO",FALSE
Aquisição de Fraldas e Resguardos,Ao abrigo de acordo-quadro (art.º 259.º),Aquisição de bens móveis,"33140000-3, Material médico de consumo","Centro Hospitalar do Algarve, E. P. E. (510745997)","INDAS PORTUGAL, LDA (503505196)","4.171,80 €",02-01-2015,04-11-2014,365 dias,"Portugal, Faro, Lagos<BR/>Portugal, Faro, Portimão<BR/>Portugal, Faro, Faro",Artigo 259.º do Código dos Contratos Públicos,"","",,"",,598830,"CONCURSO PÚBLICO PARA A CELEBRAÇÃO DE CONTRATOS PÚBLICOS DE APROVISIONAMENTO PARA A ÁREA DA SAÚDE, COM VISTA AO FORNECIMENTO DE MATERIAL DE INCONTINÊNCIA, PROTEÇÃO CUTÂNEA E ALÍVIO DE PRESSÃO, ÀS INSTITUIÇÕES E SERVIÇOS DO SERVIÇO NACIONAL DE SAÚDE",FALSE
Contentores e Tubos Diversos,Ao abrigo de acordo-quadro (art.º 259.º),Aquisição de bens móveis,"33140000-3, Material médico de consumo","Centro Hospitalar do Algarve, E. P. E. (510745997)",AMBIMED (503593427),"18.196,20 €",02-01-2015,09-12-2014,365 dias,"Portugal, Faro, Portimão<BR/>Portugal, Faro, Faro<BR/>Portugal, Faro, Lagos",Artigo 259.º do Código dos Contratos Públicos,"","",,"",,1341769,"ACORDO QUADRO PARA FORNECIMENTO DE SERINGAS, AGULHAS E CONTENTORES ÀS INSTITUIÇÕES E SERVIÇOS DO SERVIÇO NACIONAL DE SAÚDE PROGRAMA DE CONCURSO",FALSE
Aquisição de Fraldas e Resguardos,Ao abrigo de acordo-quadro (art.º 259.º),Aquisição de bens móveis,"33140000-3, Material médico de consumo","Centro Hospitalar do Algarve, E. P. E. (510745997)",ALBINO DIAS ANDRADE LDA (500013810),"35.100,00 €",02-01-2015,04-11-2014,365 dias,"Portugal, Faro, Lagos<BR/>Portugal, Faro, Portimão<BR/>Portugal, Faro, Faro",Artigo 259.º do Código dos Contratos Públicos,"","",,"",,598830,"CONCURSO PÚBLICO PARA A CELEBRAÇÃO DE CONTRATOS PÚBLICOS DE APROVISIONAMENTO PARA A ÁREA DA SAÚDE, COM VISTA AO FORNECIMENTO DE MATERIAL DE INCONTINÊNCIA, PROTEÇÃO CUTÂNEA E ALÍVIO DE PRESSÃO, ÀS INSTITUIÇÕES E SERVIÇOS DO SERVIÇO NACIONAL DE SAÚDE",FALSE
72336714 - Consumo Clinico,Ajuste Direto Regime Geral,Aquisição de bens móveis,"33140000-3, Material médico de consumo","Centro Hospitalar do Algarve, E. P. E. (510745997)",PORTOPÉDICO COMÉRCIO E APLICAÇÃO DE PRODUTOS ORTOPEDICOS (509829953),"375,00 €",02-01-2015,22-10-2014,4 dias,"Portugal, Faro, Lagos<BR/>Portugal, Faro, Faro<BR/>Portugal, Faro, Portimão","Artigo 20.º, n.º 1, alínea a) do Código dos Contratos Públicos","","",,"",,Não aplicável.,Não aplicável.,FALSE
72336714 - Consumo Clinico,Ajuste Direto Regime Geral,Aquisição de bens móveis,"33140000-3, Material médico de consumo","Centro Hospitalar do Algarve, E. P. E. (510745997)","CENTRO ORTOPEDICO DO SUL,LDA. (504836641)","155,75 €",02-01-2015,22-10-2014,4 dias,"Portugal, Faro, Lagos<BR/>Portugal, Faro, Faro<BR/>Portugal, Faro, Portimão","Artigo 20.º, n.º 1, alínea a) do Código dos Contratos Públicos","","",,"",,Não aplicável.,Não aplicável.,FALSE
Aquisição de Fios de Sutura,Concurso público,Aquisição de bens móveis,"33140000-3, Material médico de consumo","Centro Hospitalar do Algarve, E. P. E. (510745997)","HR  HOSPITALAR, LDA (501895558), JOHNSON & JOHNSON PROD.PROF. (500153370), COVIDIEN PORTUGAL - PRODUTOS  DE SAUDE, UNIPESSOAL, LDA. (503413410), SMITH & NEPHEW, LDª (503552461), SOCIME II - Produtos Medicos Lda (504453939), B. BRAUN MEDICAL,LDA. (501506543)","116.256,08 €",02-01-2015,16-12-2014,365 dias,"Portugal, Faro, Lagos<BR/>Portugal, Faro, Faro<BR/>Portugal, Faro, Portimão","Artigo 20.º, n.º 1, alínea b) do Código dos Contratos Públicos","","",,"",,Não aplicável.,Não aplicável.,FALSE
Aquisição de Próteses Cardíacas - Cardioversores,Ao abrigo de acordo-quadro (art.º 259.º),Aquisição de bens móveis,"33140000-3, Material médico de consumo","Centro Hospitalar do Algarve, E. P. E. (510745997)",BIOTRONIK Portugal (Unipessoal Lda. (510726941),"125.750,00 €",02-01-2015,12-12-2014,365 dias,"Portugal, Faro, Faro",Artigo 259.º do Código dos Contratos Públicos,"","",,"",,600027,"CONCURSO PÚBLICO PARA A CELEBRAÇÃO DE CONTRATOS PÚBLICOS DE APROVISIONAMENTO PARA A ÁREA DA SAÚDE, COM VISTA AO FORNECIMENTO DE SISTEMAS DE CARDIOVERSORES DESFIBRILHADORES IMPLANTÁVEIS ÀS INSTITUIÇÕES E SERVIÇOS DO SERVIÇO NACIONAL DE SAÚDE",FALSE
Aquisição de Próteses Cardíacas - Cardioversores,Ao abrigo de acordo-quadro (art.º 259.º),Aquisição de bens móveis,"33140000-3, Material médico de consumo","Centro Hospitalar do Algarve, E. P. E. (510745997)","ST. JUDE MEDICAL PORTUGAL,LDA. (504180746)","22.000,00 €",02-01-2015,12-12-2014,365 dias,"Portugal, Faro, Faro",Artigo 259.º do Código dos Contratos Públicos,"","",,"",,600027,"CONCURSO PÚBLICO PARA A CELEBRAÇÃO DE CONTRATOS PÚBLICOS DE APROVISIONAMENTO PARA A ÁREA DA SAÚDE, COM VISTA AO FORNECIMENTO DE SISTEMAS DE CARDIOVERSORES DESFIBRILHADORES IMPLANTÁVEIS ÀS INSTITUIÇÕES E SERVIÇOS DO SERVIÇO NACIONAL DE SAÚDE",FALSE
Aquisição de Próteses cardíacas - Cardioversores,Ao abrigo de acordo-quadro (art.º 259.º),Aquisição de bens móveis,"33140000-3, Material médico de consumo","Centro Hospitalar do Algarve, E. P. E. (510745997)","MEDTRONIC PORTUGAL, LDA. (504223933)","31.000,00 €",02-01-2015,12-12-2014,365 dias,"Portugal, Faro, Faro",Artigo 259.º do Código dos Contratos Públicos,"","",,"",,600027,"CONCURSO PÚBLICO PARA A CELEBRAÇÃO DE CONTRATOS PÚBLICOS DE APROVISIONAMENTO PARA A ÁREA DA SAÚDE, COM VISTA AO FORNECIMENTO DE SISTEMAS DE CARDIOVERSORES DESFIBRILHADORES IMPLANTÁVEIS ÀS INSTITUIÇÕES E SERVIÇOS DO SERVIÇO NACIONAL DE SAÚDE",FALSE
Aquisição de Próteses cardíacas - Cardioversores,Ao abrigo de acordo-quadro (art.º 259.º),Aquisição de bens móveis,"33140000-3, Material médico de consumo","Centro Hospitalar do Algarve, E. P. E. (510745997)",SORIN GROUP (505514010),"93.000,00 €",02-01-2015,12-12-2014,365 dias,"Portugal, Faro, Faro",Artigo 259.º do Código dos Contratos Públicos,"","",,"",,600027,"CONCURSO PÚBLICO PARA A CELEBRAÇÃO DE CONTRATOS PÚBLICOS DE APROVISIONAMENTO PARA A ÁREA DA SAÚDE, COM VISTA AO FORNECIMENTO DE SISTEMAS DE CARDIOVERSORES DESFIBRILHADORES IMPLANTÁVEIS ÀS INSTITUIÇÕES E SERVIÇOS DO SERVIÇO NACIONAL DE SAÚDE",FALSE
