Objeto do Contrato,Tipo de Procedimento,Tipo(s) de Contrato,CPVs,Entidade(s) Adjudicante(s),Entidade(s) Adjudicatária(s),Preço Contratual,Data de Publicação,Data de Celebração do Contrato,Prazo de Execução,Local de Execução,Fundamentação,Data de Fecho do Contrato,Preço Total Efetivo,Causas das Alterações ao Prazo,Causas das Alterações ao Preço,Estado,N.º registo do Acordo Quadro,Descrição do Acordo Quadro,Procedimento Centralizado
Prestação de Serviços de Formação para  a ULSAM - Gestão da Qualidade,Consulta Prévia,Aquisição de serviços,"80500000-9, Serviços de formação","Unidade Local de Saúde do Alto Minho, E. P. E. (508786193)",Instituto Politécnico de Viana do Castelo (503761877),"1.372,00 €",18-10-2018,29-01-2018,3 dias,"Portugal, Viana do Castelo, Viana do Castelo","Artigo 20.º, n.º 1, alínea c) do Código dos Contratos Públicos",,,,,,Não aplicável.,Não aplicável.,FALSE
Prestação de Serviços de Formação para a ULSAM - Envolvimento na Segurança do Doente,Consulta Prévia,Aquisição de serviços,"80500000-9, Serviços de formação","Unidade Local de Saúde do Alto Minho, E. P. E. (508786193)","Sinase - Recursos Humanos e Desenvolvimento de Empresa, Lda. (502851791)","1.038,81 €",18-10-2018,05-02-2018,3 dias,"Portugal, Viana do Castelo, Viana do Castelo","Artigo 20.º, n.º 1, alínea c) do Código dos Contratos Públicos",,,,,,Não aplicável.,Não aplicável.,FALSE
Prestação de Serviços de Formação para a ULSAM-Prevenção Ocorrência Quedas,Consulta Prévia,Aquisição de serviços,"80500000-9, Serviços de formação","Unidade Local de Saúde do Alto Minho, E. P. E. (508786193)","Sinase - Recursos Humanos e Desenvolvimento de Empresa, Lda. (502851791)","1.064,06 €",18-10-2018,06-02-2018,2 dias,"Portugal, Viana do Castelo, Viana do Castelo","Artigo 20.º, n.º 1, alínea c) do Código dos Contratos Públicos",,,,,,Não aplicável.,Não aplicável.,FALSE
Prestação de Serviços de Formação para a ULSAM - Prevenção Ocorrência Úlceras de Pressão,Consulta Prévia,Aquisição de serviços,"80500000-9, Serviços de formação","Unidade Local de Saúde do Alto Minho, E. P. E. (508786193)","Sinase - Recursos Humanos e Desenvolvimento de Empresa, Lda. (502851791)","1.064,06 €",18-10-2018,05-02-2018,2 dias,"Portugal, Viana do Castelo, Viana do Castelo","Artigo 20.º, n.º 1, alínea c) do Código dos Contratos Públicos",,,,,,Não aplicável.,Não aplicável.,FALSE
Prestação de Serviços de Formação para a ULSAM - Metedologias Lean,Consulta Prévia,Aquisição de serviços,"80500000-9, Serviços de formação","Unidade Local de Saúde do Alto Minho, E. P. E. (508786193)",Instituto Politécnico de Viana do Castelo (503761877),"800,00 €",17-10-2018,19-02-2018,2 dias,"Portugal, Viana do Castelo, Viana do Castelo","Artigo 20.º, n.º 1, alínea c) do Código dos Contratos Públicos",,,,,,Não aplicável.,Não aplicável.,FALSE
Prestação de Serviços de Colocação e Fornecimento Pessoal TDT- Serviço de Neurologia,Consulta Prévia,Aquisição de serviços,"79620000-6, Serviços de fornecimento de pessoal, inclusive temporário","Unidade Local de Saúde do Alto Minho, E. P. E. (508786193)","Medaute - Prestação de Serviços e Cuidados de Saúde, Lda. (513074619)","8.073,30 €",17-10-2018,17-05-2018,150 dias,"Portugal, Viana do Castelo, Viana do Castelo","Artigo 20.º, n.º 1, alínea c) do Código dos Contratos Públicos",,,,,,Não aplicável.,Não aplicável.,FALSE
Prestação de Serviços de Colocação e Fornecimento de Pessoal TDT - Serviço Patologia Clínica,Consulta Prévia,Aquisição de serviços,"79620000-6, Serviços de fornecimento de pessoal, inclusive temporário","Unidade Local de Saúde do Alto Minho, E. P. E. (508786193)","e-sycare, Lda (509706134)","3.182,40 €",16-10-2018,05-07-2018,60 dias,"Portugal, Viana do Castelo, Viana do Castelo","Artigo 20.º, n.º 1, alínea c) do Código dos Contratos Públicos",,,,,,Não aplicável.,Não aplicável.,FALSE
Prestação de Serviços de Colocação e Fornecimento de Pessoal Administrativo - Bloco Ambulatório,Consulta Prévia,Aquisição de serviços,"79620000-6, Serviços de fornecimento de pessoal, inclusive temporário","Unidade Local de Saúde do Alto Minho, E. P. E. (508786193)","e-sycare, Lda (509706134)","4.576,56 €",15-10-2018,27-04-2018,120 dias,"Portugal, Viana do Castelo, Viana do Castelo","Artigo 20.º, n.º 1, alínea c) do Código dos Contratos Públicos",,,,,,Não aplicável.,Não aplicável.,FALSE
Prestação de Serviços de Colocação e Fornecimento de Pessoal Administrativo - 1 Adm UCSP Valença (2014),Consulta Prévia,Aquisição de serviços,"79620000-6, Serviços de fornecimento de pessoal, inclusive temporário","Unidade Local de Saúde do Alto Minho, E. P. E. (508786193)","ManpowerGroup Solutions Unipessoal,Lda (503626007)","5.160,92 €",15-10-2018,30-05-2018,120 dias,"Portugal, Viana do Castelo, Viana do Castelo","Artigo 20.º, n.º 1, alínea c) do Código dos Contratos Públicos",,,,,,Não aplicável.,Não aplicável.,FALSE
Prestação de Serviços de Colocação e Fornecimento de Pessoal Administrativo - 1 Adm UCPS Viana do Castelo,Consulta Prévia,Aquisição de serviços,"79620000-6, Serviços de fornecimento de pessoal, inclusive temporário","Unidade Local de Saúde do Alto Minho, E. P. E. (508786193)","ManpowerGroup Solutions Unipessoal,Lda (503626007)","4.567,96 €",12-10-2018,02-10-2018,120 dias,"Portugal, Viana do Castelo, Viana do Castelo","Artigo 20.º, n.º 1, alínea c) do Código dos Contratos Públicos",,,,,,Não aplicável.,Não aplicável.,FALSE
Prestação de Serviços de Colocação e Fornecimento de Pessoal Administrativo - 1 Adm Darque,Consulta Prévia,Aquisição de serviços,"79620000-6, Serviços de fornecimento de pessoal, inclusive temporário","Unidade Local de Saúde do Alto Minho, E. P. E. (508786193)","ManpowerGroup Solutions Unipessoal,Lda (503626007)","4.567,96 €",12-10-2018,02-06-2018,120 dias,"Portugal, Viana do Castelo, Viana do Castelo","Artigo 20.º, n.º 1, alínea c) do Código dos Contratos Públicos",,,,,,Não aplicável.,Não aplicável.,FALSE
Prestação de Serviços de Colocação e Fornecimento de Pessoal Administrativo - 1 Adm Barroselas,Consulta Prévia,Aquisição de serviços,"79620000-6, Serviços de fornecimento de pessoal, inclusive temporário","Unidade Local de Saúde do Alto Minho, E. P. E. (508786193)","RH Portugal - Consultores em Investimentos Humanos, Lda (503461245)","4.610,24 €",12-10-2018,02-06-2018,120 dias,"Portugal, Viana do Castelo, Viana do Castelo","Artigo 20.º, n.º 1, alínea c) do Código dos Contratos Públicos",,,,,,Não aplicável.,Não aplicável.,FALSE
