Objeto do Contrato,Tipo de Procedimento,Tipo(s) de Contrato,CPVs,Entidade(s) Adjudicante(s),Entidade(s) Adjudicatária(s),Preço Contratual,Data de Publicação,Data de Celebração do Contrato,Prazo de Execução,Local de Execução,Fundamentação,Data de Fecho do Contrato,Preço Total Efetivo,Causas das Alterações ao Prazo,Causas das Alterações ao Preço,Estado,N.º registo do Acordo Quadro,Descrição do Acordo Quadro,Procedimento Centralizado
Aquisição de material clínico diverso para Oftalmologia,Concurso público,Aquisição de bens móveis,"33140000-3, Material médico de consumo","Centro Hospitalar de Entre o Douro e Vouga, E.P.E. (508878462)","José Cotta - Equipamento Médico e Serviços, SA (500155739)","7.519,80 €",21-01-2016,01-10-2015,1095 dias,"Portugal, Aveiro, Santa Maria da Feira","Artigo 20.º, n.º 1, alínea b) do Código dos Contratos Públicos","","",,,,Não aplicável.,Não aplicável.,FALSE
Aquisição de material clínico diverso para Oftalmologia,Concurso público,Aquisição de bens móveis,"33140000-3, Material médico de consumo","Centro Hospitalar de Entre o Douro e Vouga, E.P.E. (508878462)","Oftaldata - Produtos para Oftalmologia, Lda (504887459)","8.654,14 €",21-01-2016,01-10-2015,1095 dias,"Portugal, Aveiro, Santa Maria da Feira","Artigo 20.º, n.º 1, alínea b) do Código dos Contratos Públicos","","",,,,Não aplicável.,Não aplicável.,FALSE
Aquisição de material clínico diverso para Oftalmologia,Concurso público,Aquisição de bens móveis,"33140000-3, Material médico de consumo","Centro Hospitalar de Entre o Douro e Vouga, E.P.E. (508878462)","Alcon Portugal - Produtos e Equipamentos Oftalmológicos, Lda (501251685)","16.965,00 €",21-01-2016,07-10-2015,1095 dias,"Portugal, Aveiro, Santa Maria da Feira","Artigo 20.º, n.º 1, alínea b) do Código dos Contratos Públicos","","",,,,Não aplicável.,Não aplicável.,FALSE
Aquisição de material clínico diverso para Oftalmologia,Concurso público,Aquisição de bens móveis,"33140000-3, Material médico de consumo","Centro Hospitalar de Entre o Douro e Vouga, E.P.E. (508878462)","Overpharma - Produtos Médicos e Farmacêuticos, Lda (505792362)","35.571,42 €",21-01-2016,07-10-2015,1095 dias,"Portugal, Aveiro, Santa Maria da Feira","Artigo 20.º, n.º 1, alínea b) do Código dos Contratos Públicos","","",,,,Não aplicável.,Não aplicável.,FALSE
Aquisição de material clínico diverso para Oftalmologia,Concurso público,Aquisição de bens móveis,"33140000-3, Material médico de consumo","Centro Hospitalar de Entre o Douro e Vouga, E.P.E. (508878462)","Abbott Medical Optics Spain, S.L. (980262364)","3.330,00 €",21-01-2016,01-10-2015,1095 dias,"Portugal, Aveiro, Santa Maria da Feira","Artigo 20.º, n.º 1, alínea b) do Código dos Contratos Públicos","","",,,,Não aplicável.,Não aplicável.,FALSE
Aquisição de material clínico diverso para Oftalmologia,Concurso público,Aquisição de bens móveis,"33140000-3, Material médico de consumo","Centro Hospitalar de Entre o Douro e Vouga, E.P.E. (508878462)","Ezequiel Panão Jorge, Lda (501412727)","304,56 €",21-01-2016,01-10-2015,1095 dias,"Portugal, Aveiro, Santa Maria da Feira","Artigo 20.º, n.º 1, alínea b) do Código dos Contratos Públicos","","",,,,Não aplicável.,Não aplicável.,FALSE
Aquisição de material clínico diverso para Oftalmologia,Concurso público,Aquisição de bens móveis,"33140000-3, Material médico de consumo","Centro Hospitalar de Entre o Douro e Vouga, E.P.E. (508878462)","Bausch & Lomb, S.A. (980218764)","1.488,00 €",21-01-2016,01-10-2015,1095 dias,"Portugal, Aveiro, Santa Maria da Feira","Artigo 20.º, n.º 1, alínea b) do Código dos Contratos Públicos","","",,,,Não aplicável.,Não aplicável.,FALSE
Material clinico diverso para Oftalmologia,Concurso público,Aquisição de bens móveis,"33140000-3, Material médico de consumo","Centro Hospitalar de Entre o Douro e Vouga, E.P.E. (508878462)",HEMICARE (506517080),"45.294,00 €",21-01-2016,01-10-2015,1096 dias,"Portugal, Aveiro, Santa Maria da Feira","Artigo 20.º, n.º 1, alínea b) do Código dos Contratos Públicos","","",,,,Não aplicável.,Não aplicável.,FALSE
Aquisição de Próteses e Expansores mamários,Ajuste Direto Regime Geral,Aquisição de bens móveis,"33100000-1, Equipamento médico","CENTRO HOSPITALAR DE ENTRE O DOURO E VOUGA, E.P.E. (508878462)","Lineamédica - Dispositivos Médico Cirúrgicos, S.A. (505148676)","44.232,00 €",15-01-2016,04-11-2015,1095 dias,"Portugal, Aveiro, Santa Maria da Feira","Artigo 20.º, n.º 1, alínea a) do Código dos Contratos Públicos","","",,,,Não aplicável.,Não aplicável.,FALSE
Aquisição de placas neutro e punhos para bisturi elétrico,Ajuste Direto Regime Geral,Aquisição de bens móveis,"33140000-3, Material médico de consumo","CENTRO HOSPITALAR DE ENTRE O DOURO E VOUGA, E.P.E. (508878462)","Covidien - Produtos de Saúde, Unip., Lda (503413410)","30.240,00 €",15-01-2016,21-10-2015,1095 dias,"Portugal, Aveiro, Santa Maria da Feira","Artigo 20.º, n.º 1, alínea a) do Código dos Contratos Públicos","","",,,,Não aplicável.,Não aplicável.,FALSE
Aquisição de Placas neutro e Punhos para bisturi elétrico,Ajuste Direto Regime Geral,Aquisição de bens móveis,"33140000-3, Material médico de consumo","CENTRO HOSPITALAR DE ENTRE O DOURO E VOUGA, E.P.E. (508878462)","Clinifar - Produtos Clínicos e Farmacêuticos, S.A. (503281115)","12.933,00 €",15-01-2016,21-10-2015,1095 dias,"Portugal, Aveiro, Santa Maria da Feira","Artigo 20.º, n.º 1, alínea a) do Código dos Contratos Públicos","","",,,,Não aplicável.,Não aplicável.,FALSE
Aquisição de Esterilizador de histeroscópios para Técnicas de Ginecologia,Ajuste Direto Regime Geral,Aquisição de bens móveis,"33100000-1, Equipamento médico","CENTRO HOSPITALAR DE ENTRE O DOURO E VOUGA, E.P.E. (508878462)","Vitatech - Equipamentos e Consumíveis Hospitalares, Lda (510693660)","15.900,00 €",15-01-2016,24-11-2015,90 dias,"Portugal, Aveiro, Santa Maria da Feira","Artigo 20.º, n.º 1, alínea a) do Código dos Contratos Públicos",23-12-2015,"15.900,00 €",,,,Não aplicável.,Não aplicável.,FALSE
Aquisição de prestação de serviços de manutenção integral - Incubadoras e Ventiladores,Ajuste Direto Regime Geral,Aquisição de serviços,"50400000-9, Serviços de reparação e manutenção de equipamento médico e de precisão","CENTRO HOSPITALAR DE ENTRE O DOURO E VOUGA, E.P.E. (508878462)","STB - Serviços Telemáticos e Biomédicos, Lda (506989020)","15.840,00 €",14-01-2016,10-12-2015,365 dias,"Portugal, Aveiro, Santa Maria da Feira","Artigo 20.º, n.º 1, alínea a) do Código dos Contratos Públicos","","",,,,Não aplicável.,Não aplicável.,FALSE
