Objeto do Contrato,Tipo de Procedimento,Tipo(s) de Contrato,CPVs,Entidade(s) Adjudicante(s),Entidade(s) Adjudicatária(s),Preço Contratual,Data de Publicação,Data de Celebração do Contrato,Prazo de Execução,Local de Execução,Fundamentação,Data de Fecho do Contrato,Preço Total Efetivo,Causas das Alterações ao Prazo,Causas das Alterações ao Preço,Estado,N.º registo do Acordo Quadro,Descrição do Acordo Quadro,Procedimento Centralizado
Sistemas Fechados de Colheita (Vacuette),Ao abrigo de acordo-quadro (art.º 259.º),Aquisição de bens móveis,"33600000-6, Produtos farmacêuticos","Centro Hospitalar do Tâmega e Sousa, E. P. E. (508318262)","VACUETTE PORTUGAL - IMPORTAÇÃO E EXPORTAÇÃO DE MATERIAL HOSPITALAR, S.A (505348470)","13.153,87 €",06-10-2016,14-09-2016,109 dias,"Portugal, Porto, Penafiel<BR/>Portugal, Porto, Amarante",Artigo 259.º do Código dos Contratos Públicos,,,,,,1350003,Acordo Quadro para fornecimento de sistemas fechados e material diverso de recolha de sangue às instituições do SNS,FALSE
Sistemas Fechados de Colheita (Smith Medical),Ao abrigo de acordo-quadro (art.º 259.º),Aquisição de bens móveis,"33600000-6, Produtos farmacêuticos","Centro Hospitalar do Tâmega e Sousa, E. P. E. (508318262)","SMITHS MEDICAL, UNIPESSOAL, LDA (507445937)","666,00 €",06-10-2016,14-09-2016,109 dias,"Portugal, Porto, Amarante<BR/>Portugal, Porto, Penafiel",Artigo 259.º do Código dos Contratos Públicos,,,,,,1350003,Acordo Quadro para fornecimento de sistemas fechados e material diverso de recolha de sangue às instituições do SNS,FALSE
Sistemas Fechados de Colheita (Sarstedt),Ao abrigo de acordo-quadro (art.º 259.º),Aquisição de bens móveis,"33600000-6, Produtos farmacêuticos","Centro Hospitalar do Tâmega e Sousa, E. P. E. (508318262)","SARSTEDT - TECNOLOGIA DE LABORATÓRIO, S.A. (503019461)","4.511,40 €",06-10-2016,14-09-2016,109 dias,"Portugal, Porto, Penafiel<BR/>Portugal, Porto, Amarante",Artigo 259.º do Código dos Contratos Públicos,,,,,,1350003,Acordo Quadro para fornecimento de sistemas fechados e material diverso de recolha de sangue às instituições do SNS,FALSE
Contratação da Prestação de Serviços de Saúde (Paulo Neves),Ajuste Direto Regime Geral,Aquisição de serviços,"85100000-0, Serviços de saúde","Centro Hospitalar do Tâmega e Sousa, E. P. E. (508318262)",Paulo Jorge Ferreira de Sousa Neves (210171669),"14.400,00 €",04-10-2016,05-09-2016,118 dias,"Portugal, Porto, Penafiel<BR/>Portugal, Porto, Amarante","Artigo 20.º, n.º 1, alínea a) do Código dos Contratos Públicos",,,,,,Não aplicável.,Não aplicável.,FALSE
Prestação de Serviços de Saúde (Nelson Aguiar),Ajuste Direto Regime Geral,Aquisição de serviços,"85100000-0, Serviços de saúde","Centro Hospitalar do Tâmega e Sousa, E. P. E. (508318262)",Nelson Guilherme Teixeira Aguiar (211134007),"17.280,00 €",03-10-2016,20-09-2016,103 dias,"Portugal, Porto, Amarante<BR/>Portugal, Porto, Penafiel","Artigo 20.º, n.º 1, alínea a) do Código dos Contratos Públicos",,,,,,Não aplicável.,Não aplicável.,FALSE
Fornecimento de Produtos de higiene (Servisan),Ajuste Direto Regime Geral,Aquisição de bens móveis,"33760000-5, Papel higiénico, lenços, toalhas de mão e guardanapos","Centro Hospitalar do Tâmega e Sousa, E. P. E. (508318262)","SERVISAN - PRODUTOS DE HIGIENE, S.A (500246530)","33.108,68 €",03-10-2016,20-09-2016,103 dias,"Portugal, Porto, Penafiel<BR/>Portugal, Porto, Amarante","Artigo 20.º, n.º 1, alínea a) do Código dos Contratos Públicos",,,,,,Não aplicável.,Não aplicável.,FALSE
Fornecimento de Pinças de Selagem e Corte (Endotécnica),Ajuste Direto Regime Geral,Aquisição de bens móveis,"33161000-6, Unidade de electrocirurgia","Centro Hospitalar do Tâmega e Sousa, E. P. E. (508318262)",Endotecnica (503818348),"16.740,00 €",03-10-2016,20-09-2016,103 dias,"Portugal, Porto, Amarante<BR/>Portugal, Porto, Penafiel","Artigo 20.º, n.º 1, alínea a) do Código dos Contratos Públicos",,,,,,Não aplicável.,Não aplicável.,FALSE
