Objeto do Contrato,Tipo de Procedimento,Tipo(s) de Contrato,CPVs,Entidade(s) Adjudicante(s),Entidade(s) Adjudicatária(s),Preço Contratual,Data de Publicação,Data de Celebração do Contrato,Prazo de Execução,Local de Execução,Fundamentação,Data de Fecho do Contrato,Preço Total Efetivo,Causas das Alterações ao Prazo,Causas das Alterações ao Preço,Estado,N.º registo do Acordo Quadro,Descrição do Acordo Quadro,Procedimento Centralizado
PRESTAÇÃO DE SERVIÇOS MEDICOS - GINECOLOGIA/OBSTETRICIA 37012016 ARIL A DEZ (horas),Ajuste Direto Regime Geral,Aquisição de serviços,"85100000-0, Serviços de saúde","Centro Hospitalar do Médio Tejo, E. P. E. (506361608)","TWIN CLINIC SERVIÇOS MEDICOS ESPECIALIZADOS, LDA (513474382)","28.500,00 €",29-08-2016,28-07-2016,270 dias,"Portugal, Santarém, Torres Novas","Artigo 20.º, n.º 1, alínea a) do Código dos Contratos Públicos",,,,,,Não aplicável.,Não aplicável.,FALSE
PRESTAÇAO DE SERVIÇOS MEDICOS- IMAGIOLOGIA - ABRIL A DEZ  (horas),Ajuste Direto Regime Geral,Aquisição de serviços,"85100000-0, Serviços de saúde","Centro Hospitalar do Médio Tejo, E. P. E. (506361608)",ALINA FONTUL (280218265),"26.000,00 €",29-08-2016,21-06-2016,270 dias,"Portugal, Santarém, Torres Novas","Artigo 20.º, n.º 1, alínea a) do Código dos Contratos Públicos",,,,,,Não aplicável.,Não aplicável.,FALSE
PRESTAÇAO SERVIÇOS MEDICOS - MEDICINA INTERNA 37015916 (horas) JAN A MAR 2º Aj Drtº,Ajuste Direto Regime Geral,Aquisição de serviços,"85100000-0, Serviços de saúde","Centro Hospitalar do Médio Tejo, E. P. E. (506361608)","MEDIMATIAS, LDA (510888291)","27.265,00 €",29-08-2016,07-07-2016,90 dias,"Portugal, Santarém, Torres Novas","Artigo 20.º, n.º 1, alínea a) do Código dos Contratos Públicos",,,,,,Não aplicável.,Não aplicável.,FALSE
PRESTAÇAO SERVIÇOS MEDICOS -OFTALMOLOGIA 37004716 (horas) JAN A MARÇO,Ajuste Direto Regime Geral,Aquisição de serviços,"85100000-0, Serviços de saúde","Centro Hospitalar do Médio Tejo, E. P. E. (506361608)","ARUNA FERNANDES UNIPESSOAL, LDA (510169600)","7.500,00 €",29-08-2016,13-07-2016,90 dias,Portugal,"Artigo 20.º, n.º 1, alínea a) do Código dos Contratos Públicos",,,,,,Não aplicável.,Não aplicável.,FALSE
"Manutenção e Conservação dos Espaços Verdes das Unidades de Torres Novas e Tomar do CHMT, E.P.E.",Ajuste Direto Regime Geral,Aquisição de serviços,"77311000-3, Serviços de manutenção de jardins ornamentais e recreativos","Centro Hospitalar do Médio Tejo, E.P.E. (CHMT) (506361608)","Vibeiras - Sociedade Comercial de Plantas, S.a. (502050942)","14.160,00 €",25-08-2016,02-08-2016,365 dias,"Portugal, Santarém, Torres Novas<BR/>Portugal, Santarém, Tomar","Artigo 20.º, n.º 1, alínea a) do Código dos Contratos Públicos",,,,,,Não aplicável.,Não aplicável.,FALSE
Prestação de Serviços Médicos na área da Cirurgia Geral 37004716 (horas de jan a mar),Ajuste Direto Regime Geral,Aquisição de serviços,"85100000-0, Serviços de saúde","Centro Hospitalar do Médio Tejo, E. P. E. (506361608)","ANTONIO ESTRELA UNIPESSOAL, LDA (506900487)","12.000,00 €",23-08-2016,13-06-2016,90 dias,"Portugal, Santarém, Torres Novas","Artigo 24.º, n.º 1, alínea c) do Código dos Contratos Públicos",,,,,,Não aplicável.,Não aplicável.,FALSE
Prestação de Serviços Médicos na área da Cirurgia Geral 37014016 (horas de abril a dez),Ajuste Direto Regime Geral,Aquisição de serviços,"85100000-0, Serviços de saúde","Centro Hospitalar do Médio Tejo, E. P. E. (506361608)","ANTONIO ESTRELA UNIPESSOAL, LDA (506900487)","37.800,00 €",23-08-2016,28-07-2016,270 dias,"Portugal, Santarém, Torres Novas","Artigo 20.º, n.º 1, alínea a) do Código dos Contratos Públicos",,,,,,Não aplicável.,Não aplicável.,FALSE
Prestação serviços Médicos na área da  Oftalmologia,Ajuste Direto Regime Geral,Aquisição de serviços,"85100000-0, Serviços de saúde","Centro Hospitalar do Médio Tejo, E. P. E. (506361608)","ORTOFACE -MEDICINA DENTARIA E ORTONDONTIA UNIPESSOAL, LDA (506540324)","7.500,00 €",22-08-2016,13-06-2016,90 dias,"Portugal, Santarém, Torres Novas","Artigo 24.º, n.º 1, alínea c) do Código dos Contratos Públicos",,,,,,Não aplicável.,Não aplicável.,FALSE
