freguesia,acronym,validVotesPercentage,votes,dicofre
Pinheiro,PS,34.87,121,130314
Pinheiro,PPD/PSD.CDS-PP,33.43,116,130314
Pinheiro,MPT,11.82,41,130314
Pinheiro,PCP-PEV,5.76,20,130314
Pinheiro,B.E.,4.61,16,130314
Pinheiro,PPM,2.02,7,130314
Pinheiro,PTP,1.73,6,130314
Pinheiro,PCTP/MRPP,1.44,5,130314
Pinheiro,L,1.15,4,130314
Pinheiro,MAS,0.58,2,130314
Pinheiro,PDA,0.58,2,130314
Pinheiro,POUS,0.58,2,130314
Pinheiro,PPV,0.58,2,130314
Pinheiro,PAN,0.29,1,130314
Pinheiro,PND,0.29,1,130314
Pinheiro,PNR,0.29,1,130314
