Objeto do Contrato,Tipo de Procedimento,Tipo(s) de Contrato,CPVs,Entidade(s) Adjudicante(s),Entidade(s) Adjudicatária(s),Preço Contratual,Data de Publicação,Data de Celebração do Contrato,Prazo de Execução,Local de Execução,Fundamentação,Data de Fecho do Contrato,Preço Total Efetivo,Causas das Alterações ao Prazo,Causas das Alterações ao Preço,Estado,N.º registo do Acordo Quadro,Descrição do Acordo Quadro,Procedimento Centralizado
"20130038-Aquisição de serviços de assistência e manutenção de software """"relógio de ponto""""",Ajuste Direto Regime Geral,Aquisição de serviços,"72267000-4, Serviços de manutenção e reparação de software",Instituto Nacional de Saúde Dr.Ricardo Jorge(INSA) (501427511),"INFOCONTROL-Electrónica e Automatismo, Ldª (501395784)","2.517,44 €",21-01-2014,02-08-2013,150 dias,"Portugal, Lisboa, Lisboa","Artigo 24.º, n.º 1, alínea e) do Código dos Contratos Públicos",,,,,,Não aplicável.,Não aplicável.,FALSE
"Aquisição de serviços de transporte de pessoas e bens, incluindo desalfandegameno e alfandegamento",Concurso público,Aquisição de serviços,"60161000-4, Serviços de transporte de encomendas","Instituto Nacional de Saúde Dr. Ricardo Jorge, I.P. (501427511)","ALFA LISBON - Gestão de Processos de Expedição, Ldª (507586522)","107.765,00 €",21-01-2014,18-07-2013,168 dias,"Portugal, Lisboa, Lisboa","Artigo 20.º, n.º 1, alínea b) do Código dos Contratos Públicos",,,,,,Não aplicável.,Não aplicável.,FALSE
