freguesia,acronym,validVotesPercentage,votes,dicofre
Rio de Moinhos,PS,46.03,145,181707
Rio de Moinhos,PPD/PSD,33.33,105,181707
Rio de Moinhos,B.E.,6.35,20,181707
Rio de Moinhos,CDS-PP,5.4,17,181707
Rio de Moinhos,PAN,3.81,12,181707
Rio de Moinhos,PCP-PEV,2.22,7,181707
Rio de Moinhos,PURP,1.27,4,181707
Rio de Moinhos,PPM.PPV/CDC,0.95,3,181707
Rio de Moinhos,PCTP/MRPP,0.32,1,181707
Rio de Moinhos,PTP,0.32,1,181707
Rio de Moinhos,A,0,0,181707
Rio de Moinhos,IL,0,0,181707
Rio de Moinhos,L,0,0,181707
Rio de Moinhos,MAS,0,0,181707
Rio de Moinhos,NC,0,0,181707
Rio de Moinhos,PDR,0,0,181707
Rio de Moinhos,PNR,0,0,181707
