freguesia,acronym,validVotesPercentage,votes,dicofre
Ribeirão,PPD/PSD.CDS-PP,45.8,1271,031235
Ribeirão,PS,31.93,886,031235
Ribeirão,MPT,7.35,204,031235
Ribeirão,PCP-PEV,4.14,115,031235
Ribeirão,B.E.,3.24,90,031235
Ribeirão,PCTP/MRPP,1.73,48,031235
Ribeirão,L,1.66,46,031235
Ribeirão,PAN,0.9,25,031235
Ribeirão,PND,0.68,19,031235
Ribeirão,PPM,0.68,19,031235
Ribeirão,PNR,0.58,16,031235
Ribeirão,PPV,0.32,9,031235
Ribeirão,PTP,0.32,9,031235
Ribeirão,MAS,0.22,6,031235
Ribeirão,PDA,0.22,6,031235
Ribeirão,POUS,0.22,6,031235
