Objeto do Contrato,Tipo de Procedimento,Tipo(s) de Contrato,CPVs,Entidade(s) Adjudicante(s),Entidade(s) Adjudicatária(s),Preço Contratual,Data de Publicação,Data de Celebração do Contrato,Prazo de Execução,Local de Execução,Fundamentação,Data de Fecho do Contrato,Preço Total Efetivo,Causas das Alterações ao Prazo,Causas das Alterações ao Preço,Estado,N.º registo do Acordo Quadro,Descrição do Acordo Quadro,Procedimento Centralizado
Aquisição de Material de Penso,Ajuste Direto Regime Geral,Aquisição de bens móveis,"33690000-3, Medicamentos vários","Administração Regional de Saúde do Algarve, I.P. (503148709)","Kvtech Portugal - Produtos Médicos Unipessoal, Lda. (508671531)","400,00 €",21-08-2013,21-08-2013,129 dias,"Portugal, Faro","Artigo 20.º, n.º 1, alínea a) do Código dos Contratos Públicos",28-11-2013,"360,00 €",,Quantidades fornecidas.,,Não aplicável.,Não aplicável.,
Aquisição de Material de Penso,Ajuste Direto Regime Geral,Aquisição de bens móveis,"33600000-6, Produtos farmacêuticos<BR/>33690000-3, Medicamentos vários","Administração Regional de Saúde do Algarve, I.P. (503148709)","Smith & Nephew, Lda. (503552461)","3.275,00 €",21-08-2013,21-08-2013,129 dias,"Portugal, Faro","Artigo 20.º, n.º 1, alínea a) do Código dos Contratos Públicos",15-11-2013,"1.946,00 €",,Quantidades fornecidas.,,Não aplicável.,Não aplicável.,
Aquisição de reagente TSH,Ajuste Direto Regime Geral,Aquisição de bens móveis,"33696500-0, Reagentes de laboratório","Administração Regional de Saúde do Algarve, I.P. (503148709)","ABBOTT Laboratórios, Lda (500006148)","3.808,00 €",21-08-2013,19-08-2013,138 dias,"Portugal, Faro, Faro","Artigo 24.º, n.º 1, alínea e) do Código dos Contratos Públicos",23-12-2013,"3.808,00 €",,"",,Não aplicável.,Não aplicável.,
"Aquisição Clemastina 1 mg, Fluor 1/4 mg e Sene 12 mg",Ajuste Direto Regime Geral,Aquisição de bens móveis,"33690000-3, Medicamentos vários","Administração Regional de Saúde do Algarve, I.P. (503148709)","Novartis Consumer Health Produtos Farmacêuticos e Nutrição, Lda. (500268215)","3.283,50 €",20-08-2013,20-08-2013,130 dias,"Portugal, Faro","Artigo 24.º, n.º 1, alínea e) do Código dos Contratos Públicos",12-12-2013,"3.283,50 €",,"",,Não aplicável.,Não aplicável.,
Aquisição Estreptomicina e Priridoxina,Ajuste Direto Regime Geral,Aquisição de bens móveis,"33690000-3, Medicamentos vários","Administração Regional de Saúde do Algarve, I.P. (503148709)","Labesfal Laboratórios Almiro, S.A. (501169580)","7.258,55 €",14-08-2013,14-08-2013,135 dias,"Portugal, Faro","Artigo 24.º, n.º 1, alínea e) do Código dos Contratos Públicos",16-12-2013,"7.007,00 €",,Quantidades fornecidas.,,Não aplicável.,Não aplicável.,
AQUISIÇÃO DE FILTROS E OUTRO MATERIAL DE LABORATÓRIO,Ajuste Direto Regime Geral,Aquisição de bens móveis,"33696500-0, Reagentes de laboratório","Administração Regional de Saúde do Algarve, I.P. (503148709)","Type Solution, S.A. (508400317)","8.755,34 €",12-08-2013,12-08-2013,138 dias,"Portugal, Faro","Artigo 20.º, n.º 1, alínea a) do Código dos Contratos Públicos",04-11-2013,"8.755,34 €",,"",,Não aplicável.,Não aplicável.,
