freguesia,acronym,validVotesPercentage,votes,dicofre
Aldão,PS,40.25,161,030801
Aldão,PPD/PSD,23.5,94,030801
Aldão,B.E.,10.5,42,030801
Aldão,CDS-PP,7.25,29,030801
Aldão,PCP-PEV,6.25,25,030801
Aldão,PAN,5.25,21,030801
Aldão,L,1.5,6,030801
Aldão,NC,1.5,6,030801
Aldão,A,1,4,030801
Aldão,PNR,0.75,3,030801
Aldão,IL,0.5,2,030801
Aldão,PTP,0.5,2,030801
Aldão,PURP,0.5,2,030801
Aldão,MAS,0.25,1,030801
Aldão,PDR,0.25,1,030801
Aldão,PPM.PPV/CDC,0.25,1,030801
Aldão,PCTP/MRPP,0,0,030801
