Objeto do Contrato,Tipo de Procedimento,Tipo(s) de Contrato,CPVs,Entidade(s) Adjudicante(s),Entidade(s) Adjudicatária(s),Preço Contratual,Data de Publicação,Data de Celebração do Contrato,Prazo de Execução,Local de Execução,Fundamentação,Data de Fecho do Contrato,Preço Total Efetivo,Causas das Alterações ao Prazo,Causas das Alterações ao Preço,Estado,N.º registo do Acordo Quadro,Descrição do Acordo Quadro,Procedimento Centralizado
157049 - Aquisição de Enoxaparinas - Procedimento de Compras Centralizadas 2017 - P259-AC-86 Cf. Despacho 1571-B/2016,Ajuste Direto Regime Geral,Aquisição de bens móveis,"33600000-6, Produtos farmacêuticos",Hospital do Arcebispo João Crisóstomo  Cantanhede (501626123),"Sanofi - Produtos Farmacêuticos, Lda. (500134960)","5.295,48 €",20-09-2017,04-08-2017,150 dias,"Portugal, Coimbra, Cantanhede","Artigo 20.º, n.º 1, alínea a) do Código dos Contratos Públicos",,,,,,Não aplicável.,Não aplicável.,FALSE
157050 Adjudicação do procedimento P259-AC-2017-130 - Circular conjunta nº8/2016 - para aquisição de Factores de Coagulação à Firma Baxter,Ao abrigo de acordo-quadro (art.º 259.º),Aquisição de bens móveis,"33600000-6, Produtos farmacêuticos",Hospital Arcebispo João Crisóstomo - Cantanhede (501626123),"BAXTER MÉDICO-FARMACÊUTICA, LDA. (503347345)","520,00 €",20-09-2017,13-09-2017,120 dias,"Portugal, Coimbra, Cantanhede",Artigo 259.º do Código dos Contratos Públicos,,,,,,2124520,CP 2016/55 - Medicamentos Diversos,TRUE
