freguesia,acronym,validVotesPercentage,votes,dicofre
Vila Real,PS,32.99,1896,171438
Vila Real,PPD/PSD,28.15,1618,171438
Vila Real,B.E.,13.14,755,171438
Vila Real,CDS-PP,6.11,351,171438
Vila Real,PAN,4.24,244,171438
Vila Real,PCP-PEV,4.11,236,171438
Vila Real,A,3.15,181,171438
Vila Real,L,2.45,141,171438
Vila Real,NC,1.29,74,171438
Vila Real,PPM.PPV/CDC,1.2,69,171438
Vila Real,IL,1.06,61,171438
Vila Real,PNR,0.59,34,171438
Vila Real,PCTP/MRPP,0.56,32,171438
Vila Real,PDR,0.37,21,171438
Vila Real,PURP,0.31,18,171438
Vila Real,MAS,0.16,9,171438
Vila Real,PTP,0.14,8,171438
