freguesia,acronym,validVotesPercentage,votes,dicofre
Penas Roias,PS,47.12,49,040812
Penas Roias,PPD/PSD,33.65,35,040812
Penas Roias,B.E.,8.65,9,040812
Penas Roias,PCP-PEV,2.88,3,040812
Penas Roias,A,1.92,2,040812
Penas Roias,PPM.PPV/CDC,1.92,2,040812
Penas Roias,L,0.96,1,040812
Penas Roias,MAS,0.96,1,040812
Penas Roias,PCTP/MRPP,0.96,1,040812
Penas Roias,PDR,0.96,1,040812
Penas Roias,CDS-PP,0,0,040812
Penas Roias,IL,0,0,040812
Penas Roias,NC,0,0,040812
Penas Roias,PAN,0,0,040812
Penas Roias,PNR,0,0,040812
Penas Roias,PTP,0,0,040812
Penas Roias,PURP,0,0,040812
