Objeto do Contrato,Tipo de Procedimento,Tipo(s) de Contrato,CPVs,Entidade(s) Adjudicante(s),Entidade(s) Adjudicatária(s),Preço Contratual,Data de Publicação,Data de Celebração do Contrato,Prazo de Execução,Local de Execução,Fundamentação,Data de Fecho do Contrato,Preço Total Efetivo,Causas das Alterações ao Prazo,Causas das Alterações ao Preço,Estado,N.º registo do Acordo Quadro,Descrição do Acordo Quadro,Procedimento Centralizado
Manutenção a equipamento Sterrad NX,Ajuste Direto Regime Geral,Aquisição de serviços,"71356000-8, Serviços técnicos","Instituto Português de Oncologia do Porto Francisco Gentil, E. P. E. (506362299)","JOHNSON & JOHNSON, LDA (500153370)","9.504,00 €",11-05-2018,22-11-2017,365 dias,"Portugal, Porto, Porto","Artigo 20.º, n.º 1, alínea a) do Código dos Contratos Públicos",,,,,,Não aplicável.,Não aplicável.,FALSE
Manutenção a câmara de fluxo laminar,Ajuste Direto Regime Geral,Aquisição de serviços,"71356000-8, Serviços técnicos","Instituto Português de Oncologia do Porto Francisco Gentil, E. P. E. (506362299)","Tradelabor - Importação e Exportação, Lda (503069442)","7.427,40 €",11-05-2018,20-12-2017,365 dias,"Portugal, Porto, Porto","Artigo 20.º, n.º 1, alínea a) do Código dos Contratos Públicos",,,,,,Não aplicável.,Não aplicável.,FALSE
Manutenção aos sistemas de cloragem de água potável,Ajuste Direto Regime Geral,Aquisição de serviços,"71356200-0, Serviços de assistência técnica","Instituto Português de Oncologia do Porto Francisco Gentil, E. P. E. (506362299)",Enkrott (500103461),"7.296,00 €",11-05-2018,22-12-2017,365 dias,"Portugal, Porto, Porto","Artigo 20.º, n.º 1, alínea a) do Código dos Contratos Públicos",,,,,,Não aplicável.,Não aplicável.,FALSE
Manutenção a RX Telecomandado,Ajuste Direto Regime Geral,Aquisição de serviços,"71356000-8, Serviços técnicos","Instituto Português de Oncologia do Porto Francisco Gentil, E. P. E. (506362299)","Micromil – Sistemas Médicos e Industriais, S.A. (501605770)","7.200,00 €",11-05-2018,22-11-2017,365 dias,"Portugal, Porto, Porto","Artigo 20.º, n.º 1, alínea a) do Código dos Contratos Públicos",,,,,,Não aplicável.,Não aplicável.,FALSE
Responsabilidade pela instalação elétrica,Ajuste Direto Regime Geral,Aquisição de serviços,"71300000-1, Serviços de engenharia","Instituto Português de Oncologia do Porto Francisco Gentil, E. P. E. (506362299)",ATM (502700823),"6.960,00 €",11-05-2018,20-12-2017,365 dias,"Portugal, Porto, Porto","Artigo 20.º, n.º 1, alínea a) do Código dos Contratos Públicos",,,,,,Não aplicável.,Não aplicável.,FALSE
Manutenção a central telefónica,Ajuste Direto Regime Geral,Aquisição de serviços,"71356000-8, Serviços técnicos","Instituto Português de Oncologia do Porto Francisco Gentil, E. P. E. (506362299)",WARPCOM SERVICES S.A. (505134195),"6.950,00 €",11-05-2018,22-11-2017,365 dias,"Portugal, Porto, Porto","Artigo 20.º, n.º 1, alínea a) do Código dos Contratos Públicos",,,,,,Não aplicável.,Não aplicável.,FALSE
Manutenção a sistema de digitalização,Ajuste Direto Regime Geral,Aquisição de serviços,"71356200-0, Serviços de assistência técnica","Instituto Português de Oncologia do Porto Francisco Gentil, E. P. E. (506362299)","Carestream Health Portugal, Lda (508054320)","6.896,00 €",11-05-2018,13-12-2017,365 dias,"Portugal, Porto, Porto","Artigo 20.º, n.º 1, alínea a) do Código dos Contratos Públicos",,,,,,Não aplicável.,Não aplicável.,FALSE
Consultoria de segurança,Ajuste Direto Regime Geral,Aquisição de serviços,"79000000-4, Serviços a empresas: direito, comercialização, consultoria, recrutamento, impressão e segurança","Instituto Português de Oncologia do Porto Francisco Gentil, E. P. E. (506362299)",CODIGO PRODIGIO UNIPESSOAL LDA (510728855),"6.628,92 €",11-05-2018,14-11-2017,365 dias,"Portugal, Porto, Porto","Artigo 20.º, n.º 1, alínea a) do Código dos Contratos Públicos",,,,,,Não aplicável.,Não aplicável.,FALSE
Manutenção a equipamento de detecção de incêncido,Ajuste Direto Regime Geral,Aquisição de serviços,"71356200-0, Serviços de assistência técnica","Instituto Português de Oncologia do Porto Francisco Gentil, E. P. E. (506362299)","Siemens, S.A. (500247480)","6.500,00 €",11-05-2018,29-11-2017,365 dias,"Portugal, Porto, Porto","Artigo 20.º, n.º 1, alínea a) do Código dos Contratos Públicos",,,,,,Não aplicável.,Não aplicável.,FALSE
Manutenção ao aplicativo SHSTGest,Ajuste Direto Regime Geral,Aquisição de serviços,"72200000-7, Serviços de consultoria e de programação de software","Instituto Português de Oncologia do Porto Francisco Gentil, E. P. E. (506362299)","Utilsoft - Utilitários e Software, Lda (503041688)","5.715,12 €",11-05-2018,22-11-2017,365 dias,"Portugal, Porto, Porto","Artigo 20.º, n.º 1, alínea a) do Código dos Contratos Públicos",,,,,,Não aplicável.,Não aplicável.,FALSE
Manutenção a electrobisturis,Ajuste Direto Regime Geral,Aquisição de serviços,"71356200-0, Serviços de assistência técnica","Instituto Português de Oncologia do Porto Francisco Gentil, E. P. E. (506362299)","CLINIFAR - PROD. CLINICOS E FARMACEUTICOS, S.A. (503281115)","5.572,00 €",11-05-2018,20-12-2017,365 dias,"Portugal, Porto, Porto","Artigo 20.º, n.º 1, alínea a) do Código dos Contratos Públicos",,,,,,Não aplicável.,Não aplicável.,FALSE
Manutenção a analisadores genéticos,Ajuste Direto Regime Geral,Aquisição de serviços,"71356200-0, Serviços de assistência técnica","Instituto Português de Oncologia do Porto Francisco Gentil, E. P. E. (506362299)",LIFE TECHNOLOGIES EUROPE B.V. (980158419),"51.231,12 €",10-05-2018,19-03-2018,365 dias,"Portugal, Porto, Porto","Artigo 24.º, n.º 1, alínea e), subalínea i) do Código dos Contratos Públicos",,,,,,Não aplicável.,Não aplicável.,FALSE
Seguro de Acidentes de Trabalho para 2018,Concurso público,Aquisição de serviços,"66510000-8, Serviços de seguros","Instituto Português de Oncologia do Porto Francisco Gentil, E. P. E. (506362299)","COSTA DUARTE – Corretor de Seguros, SA  (503976555)","314.373,16 €",10-05-2018,11-01-2018,365 dias,"Portugal, Porto, Porto","Artigo 20.º, n.º 1, alínea b) do Código dos Contratos Públicos",,,,,,Não aplicável.,Não aplicável.,FALSE
Manutenção de teor residual de gases,Ajuste Direto Regime Geral,Aquisição de serviços,"71356200-0, Serviços de assistência técnica","Instituto Português de Oncologia do Porto Francisco Gentil, E. P. E. (506362299)",Such (500900469),"13.628,52 €",10-05-2018,21-03-2018,365 dias,"Portugal, Porto, Porto","Artigo 20.º, n.º 1, alínea d) do Código dos Contratos Públicos",,,,,,Não aplicável.,Não aplicável.,FALSE
Manutenção a equipamento de física médica,Ajuste Direto Regime Geral,Aquisição de serviços,"71356200-0, Serviços de assistência técnica","Instituto Português de Oncologia do Porto Francisco Gentil, E. P. E. (506362299)","Ibervoxel - Equipamentos Médicos e de Laboratório, Unip. Lda. (506716899)","43.911,00 €",10-05-2018,28-02-2018,365 dias,"Portugal, Porto, Porto","Artigo 20.º, n.º 1, alínea d) do Código dos Contratos Públicos",,,,,,Não aplicável.,Não aplicável.,FALSE
"Aquisição centralizada SPMS, Acordo Quadro 2015/6 - P259-AC2017-121 -  ",Ao abrigo de acordo-quadro (art.º 259.º),Aquisição de bens móveis,"33600000-6, Produtos farmacêuticos","Instituto Português de Oncologia do Porto Francisco Gentil, E. P. E. (506362299)",AUROVITAS UNIPESSOAL (513053239),"9.396,10 €",07-05-2018,10-10-2017,10 dias,"Portugal, Porto, Porto",Artigo 259.º do Código dos Contratos Públicos,,,,,,1771819,CP 2015/6 - Acordo quadro para o fornecimento de Medicamentos do Foro Oncológico,FALSE
"Aquisição centralizada SPMS, Acordo Quadro 2015/6 - P259-AC2017-121 - Fluorouracilo ",Ao abrigo de acordo-quadro (art.º 259.º),Aquisição de bens móveis,"33600000-6, Produtos farmacêuticos","Instituto Português de Oncologia do Porto Francisco Gentil, E. P. E. (506362299)","ACCORD HEALTHCARE, UNIPESSOAL, LDA (508622263)","16.386,30 €",07-05-2018,10-10-2017,10 dias,"Portugal, Porto, Porto",Artigo 259.º do Código dos Contratos Públicos,,,,,,1771819,CP 2015/6 - Acordo quadro para o fornecimento de Medicamentos do Foro Oncológico,FALSE
"Aquisição centralizada SPMS, Acordo Quadro 2015/6 - P259-AC2017-121 - Doxorrubicina ",Ao abrigo de acordo-quadro (art.º 259.º),Aquisição de bens móveis,"33600000-6, Produtos farmacêuticos","Instituto Português de Oncologia do Porto Francisco Gentil, E. P. E. (506362299)",MEDAC (980369959),"5.172,90 €",07-05-2018,10-10-2017,10 dias,"Portugal, Porto, Porto",Artigo 259.º do Código dos Contratos Públicos,,,,,,1771819,CP 2015/6 - Acordo quadro para o fornecimento de Medicamentos do Foro Oncológico,FALSE
"Aquisição centralizada SPMS, Acordo Quadro 2015/6 - P259-AC2017-121 - Anastrozol ",Ao abrigo de acordo-quadro (art.º 259.º),Aquisição de bens móveis,"33600000-6, Produtos farmacêuticos","Instituto Português de Oncologia do Porto Francisco Gentil, E. P. E. (506362299)",FARMOZ-SOC. TÉCNICA-MEDICINAL (501505334),"10.636,02 €",07-05-2018,10-10-2017,10 dias,"Portugal, Porto, Porto",Artigo 259.º do Código dos Contratos Públicos,,,,,,1771819,CP 2015/6 - Acordo quadro para o fornecimento de Medicamentos do Foro Oncológico,FALSE
"Aquisição centralizada SPMS, AD-AC-2017-143 - Lenalidomida ",Ajuste Direto Regime Geral,Aquisição de bens móveis,"33600000-6, Produtos farmacêuticos","Instituto Português de Oncologia do Porto Francisco Gentil, E. P. E. (506362299)","CELGENE SOCIEDADE UNIPESSOAL, LDA (507791690)","173.213,74 €",07-05-2018,01-02-2018,365 dias,"Portugal, Porto, Porto","Artigo 24.º, n.º 1, alínea e) do Código dos Contratos Públicos",,,,,,Não aplicável.,Não aplicável.,FALSE
"Aquisição centralizada SPMS, AD-AC-2017-139 - Trabectedina ",Ajuste Direto Regime Geral,Aquisição de bens móveis,"33600000-6, Produtos farmacêuticos","Instituto Português de Oncologia do Porto Francisco Gentil, E. P. E. (506362299)","LOGIFARMA - LOGISTICA FARMACEUTICA, S.A. (503934640)","6.476,52 €",07-05-2018,11-12-2017,365 dias,"Portugal, Porto, Porto","Artigo 24.º, n.º 1, alínea e) do Código dos Contratos Públicos",,,,,,Não aplicável.,Não aplicável.,FALSE
"Aquisição centralizada SPMS, AD-AC-2017-127 - Cabazitaxel",Ajuste Direto Regime Geral,Aquisição de bens móveis,"33600000-6, Produtos farmacêuticos","Instituto Português de Oncologia do Porto Francisco Gentil, E. P. E. (506362299)","Sanofi - Produtos Farmacêuticos, Lda. (500134960)","150.898,00 €",07-05-2018,29-11-2017,365 dias,"Portugal, Porto, Porto","Artigo 24.º, n.º 1, alínea e) do Código dos Contratos Públicos",,,,,,Não aplicável.,Não aplicável.,FALSE
"Aquisição centralizada SPMS, AD-AC-2017-125 - Lenalidomida e Talidomida ",Ajuste Direto Regime Geral,Aquisição de bens móveis,"33600000-6, Produtos farmacêuticos","Instituto Português de Oncologia do Porto Francisco Gentil, E. P. E. (506362299)","CELGENE SOCIEDADE UNIPESSOAL, LDA (507791690)","283.062,14 €",07-05-2018,16-11-2017,365 dias,"Portugal, Porto, Porto","Artigo 24.º, n.º 1, alínea e) do Código dos Contratos Públicos",,,,,,Não aplicável.,Não aplicável.,FALSE
Aquisição de endoscópios.,Ajuste Direto Regime Geral,Aquisição de bens móveis,"33168100-6, Endoscópios","Instituto Português de Oncologia do Porto Francisco Gentil, E. P. E. (506362299)",OLYMPUS IBERIA (980474710),"68.597,50 €",04-05-2018,12-04-2018,30 dias,"Portugal, Porto, Porto","Artigo 20.º, n.º 1, alínea a) do Código dos Contratos Públicos",,,,,,Não aplicável.,Não aplicável.,FALSE
Serviços de desenvolvimento e implementação de serviços de segurança e integrações no âmbito do projeto Odisseia.,Concurso público,Aquisição de serviços,"72212730-5, Serviços de desenvolvimento de software de segurança","IPO Porto FG, EPE (506362299)","Glintt - Healthcare Solutions, S.  A. (502479418)","158.125,00 €",04-05-2018,30-01-2018,300 dias,"Portugal, Porto, Porto","Artigo 20.º, n.º 1, alínea b) do Código dos Contratos Públicos",,,,,,Não aplicável.,Não aplicável.,FALSE
Atualização de ressonancia magnética,Ajuste Direto Regime Geral,Aquisição de bens móveis,"33113000-5, Equipamento de imagiologia por ressonância magnética","IPO Porto FG, EPE (506362299)",GENERAL ELECTRIC (500357129),"70.000,00 €",04-05-2018,12-04-2018,84 dias,"Portugal, Porto, Porto","Artigo 20.º, n.º 1, alínea a) do Código dos Contratos Públicos",,,,,,Não aplicável.,Não aplicável.,FALSE
