Objeto do Contrato,Tipo de Procedimento,Tipo(s) de Contrato,CPVs,Entidade(s) Adjudicante(s),Entidade(s) Adjudicatária(s),Preço Contratual,Data de Publicação,Data de Celebração do Contrato,Prazo de Execução,Local de Execução,Fundamentação,Data de Fecho do Contrato,Preço Total Efetivo,Causas das Alterações ao Prazo,Causas das Alterações ao Preço,Estado,N.º registo do Acordo Quadro,Descrição do Acordo Quadro,Procedimento Centralizado
"serviços de alojamento e viagem para participação na reunião """"Working Party on Pharmceuticals and Medical Devices - GMDM - regulamento Ensaios Clínicos"""" - 1 Participante/ 2 dias",Ao abrigo de acordo-quadro (art.º 258.º),Aquisição de serviços,"63510000-7, Serviços de agências de viagens e serviços similares","INFARMED - Autoridade Nacional do Medicamento e Produtos de Saúde, I.P. (600037002)","TQ- Travel Quality, Viagens e Turismo, Lda (501313915)","700,31 €",11-06-2013,07-06-2013,2 dias,Bélgica,"Artigo 27.º, n.º 1, alínea h) do Código dos Contratos Públicos",,,,,,273814,"Acordo Quadro de viagens, transportes aéreos e alojamentos",
"Serviços de viagem e alojamento  para participação numa inspecção conjunta com a MHRA - Medicines and Healthcare Products Regulatory Agency  (Joint Visit GDP Pic´S), em Londres - 1 Participante/ 7 dias",Ao abrigo de acordo-quadro (art.º 258.º),Aquisição de serviços,"63510000-7, Serviços de agências de viagens e serviços similares","INFARMED - Autoridade Nacional do Medicamento e Produtos de Saúde, I.P. (600037002)","Topatlantico - Viagens e Turismo, SA (501061126)","1.359,97 €",11-06-2013,21-05-2013,7 dias,Reino Unido,"Artigo 27.º, n.º 1, alínea h) do Código dos Contratos Públicos",,,,,,273814,"Acordo Quadro de viagens, transportes aéreos e alojamentos",
Aquisição de serviços de alojamento no âmbito do processo de inspecções GMP na àrea de Viseu-- 1 Participante/5 dias,Ao abrigo de acordo-quadro (art.º 258.º),Aquisição de serviços,"63510000-7, Serviços de agências de viagens e serviços similares","INFARMED - Autoridade Nacional do Medicamento e Produtos de Saúde, I.P. (600037002)","Topatlantico- Viagens e Turismo, SA (501061126)","208,00 €",07-06-2013,06-06-2013,5 dias,Portugal,"Artigo 27.º, n.º 1, alínea h) do Código dos Contratos Públicos",,,,,,273814,"Acordo Quadro de viagens, transportes aéreos e alojamentos",
Aquisição de serviços de alojamento no âmbito do processo de inspecções a farmácias na àrea de Portimão- 3 Participantes/2 dias,Ao abrigo de acordo-quadro (art.º 258.º),Aquisição de serviços,"63510000-7, Serviços de agências de viagens e serviços similares","INFARMED - Autoridade Nacional do Medicamento e Produtos de Saúde, I.P. (600037002)","TopAtlantico - Viagens e Turismo, SA (501061126)","174,00 €",07-06-2013,06-06-2013,2 dias,Portugal,"Artigo 27.º, n.º 1, alínea h) do Código dos Contratos Públicos",,,,,,273814,"Acordo Quadro de viagens, transportes aéreos e alojamentos",
Aquisição de serviços de alojamento no âmbito do processo de inspecções a farmácias na àrea do Porto - 3 Participantes/3 dias,Ao abrigo de acordo-quadro (art.º 258.º),Aquisição de serviços,"63510000-7, Serviços de agências de viagens e serviços similares","INFARMED - Autoridade Nacional do Medicamento e Produtos de Saúde, I.P. (600037002)","Topatlantico - Viagens e Turismo, SA (501061126)","600,00 €",07-06-2013,06-06-2013,3 dias,Portugal,"Artigo 27.º, n.º 1, alínea h) do Código dos Contratos Públicos",,,,,,273814,"Acordo Quadro de viagens, transportes aéreos e alojamentos",
"Contratação excecional de serviços de limpeza geral, pelo período de 3 meses ",Ajuste Direto Regime Geral,Aquisição de serviços<br/>Locação de bens móveis,"39000000-2, Mobiliário (incl. de escritório), acessórios, aparelhos domésticos (excl. iluminação) e produtos de limpeza","INFARMED - Autoridade Nacional do Medicamento e Produtos de Saúde, I.P. (600037002)","INTERLIMPE, SA. (502611057)","42.884,00 €",07-06-2013,24-05-2013,90 dias,Portugal,"Artigo 24.º, n.º 1, alínea c) do Código dos Contratos Públicos",,,,,,Não aplicável.,Não aplicável.,
"Aquisição de meio de cultura, reagentes e galerias e identificação de micro-organismos ",Ajuste Direto Regime Geral,Locação de bens móveis,"33000000-0, Equipamento médico, medicamentos e produtos para cuidados pessoais","INFARMED - Autoridade Nacional do Medicamento e Produtos de Saúde, I.P. (600037002)","BIOMERIEUX PORTUGAL, LDA. (501524177)","15.567,90 €",07-06-2013,27-05-2013,365 dias,Portugal,"Artigo 20.º, n.º 1, alínea a) do Código dos Contratos Públicos",,,,,,Não aplicável.,Não aplicável.,
"Aquisição de serviços de assessoria e consultadoria jurídica, para 2013 ",Ajuste Direto Regime Geral,Aquisição de serviços,"79100000-5, Serviços jurídicos",INFARMED - Autoridade Nacional do Medicamento e Produtos de Saúde I.P. (600037002),BAS - SOCIEDADE DE ADVOGADOS (509100007),"105.300,00 €",06-06-2013,23-05-2013,365 dias,Portugal,"Artigo 27.º, n.º 1, alínea b) e n.º 3 do Código dos Contratos Públicos",,,,,,Não aplicável.,Não aplicável.,
"Serviços de alojamento e viagem para participação na reunião do grupo COEN (Compliance and Enforcement Group), em Bruxelas - 1 Participante/2 dias",Ao abrigo de acordo-quadro (art.º 258.º),Aquisição de serviços,"63510000-7, Serviços de agências de viagens e serviços similares","INFARMED - Autoridade Nacional do Medicamento e Produtos de Saúde, I.P. (600037002)","Topatlantico - Viagens e Turismo, SA (501061126)","876,31 €",06-06-2013,05-06-2013,2 dias,Bélgica,"Artigo 27.º, n.º 1, alínea h) do Código dos Contratos Públicos",,,,,,273814,"Acordo Quadro de viagens, transportes aéreos e alojamentos",
"Serviços de alojamento e viagem, para participação na reunião WGEO, em Dublin- 1 participante/4 dias",Ao abrigo de acordo-quadro (art.º 258.º),Aquisição de serviços,"63510000-7, Serviços de agências de viagens e serviços similares","INFARMED - Autoridade Nacional do Medicamento e Produtos de Saúde, I.P. (600037002)","Travel Quality - Viagens e Turismo, Lda (501313915)","1.031,70 €",05-06-2013,06-03-2013,4 dias,Irlanda,"Artigo 27.º, n.º 1, alínea h) do Código dos Contratos Públicos",,,,,,273814,"Acordo Quadro de viagens, transportes aéreos e alojamentos",
"Serviços de alojamenento e viagem, para participação na reunião WGEO, em Dublin - 1 Participante/4 dias",Ao abrigo de acordo-quadro (art.º 258.º),Aquisição de serviços,"63510000-7, Serviços de agências de viagens e serviços similares","INFARMED - Autoridade Nacional do Medicamento e Produtos de Saúde, I.P. (600037002)","Travel Quality - Viagens e Turismo,Lda (501313915)","1.031,70 €",05-06-2013,06-03-2013,4 dias,Irlanda,"Artigo 27.º, n.º 1, alínea h) do Código dos Contratos Públicos",,,,,,273814,"Acordo Quadro de viagens, transportes aéreos e alojamentos",
"Serviços de alojamento e viagem, para participação na reunião ,Management Board Plenary em Londres - 1 Participante/2 dias",Ao abrigo de acordo-quadro (art.º 258.º),Aquisição de serviços,"63510000-7, Serviços de agências de viagens e serviços similares","INFARMED - Autoridade Nacional do Medicamento e Produtos de Saúde, I.P. (600037002)","Travel Quality, Viagens e Turismo, Lda (501313915)","563,38 €",05-06-2013,27-05-2013,2 dias,Reino Unido,"Artigo 27.º, n.º 1, alínea h) do Código dos Contratos Públicos",,,,,,273814,"Acordo Quadro de viagens, transportes aéreos e alojamentos",
"Serviços de alojamento e viagem para participação na reunião Working group of communication professionals, em dublin - 1 participante/3 dias",Ao abrigo de acordo-quadro (art.º 258.º),Aquisição de serviços,"63510000-7, Serviços de agências de viagens e serviços similares","INFARMED - Autoridade Nacional do Medicamento e Produtos de Saúde, I.P. (600037002)","Pamtours - Viagens e Turismo,Lda (502844779)","615,00 €",03-06-2013,27-05-2013,3 dias,Irlanda,"Artigo 27.º, n.º 1, alínea h) do Código dos Contratos Públicos",,,,,,273814,"Acordo Quadro de viagens, transportes aéreos e alojamentos",
"Serviços de alojamento e viagem para participação na reunião da Comissão europeia sobr PAES ( Post-authoristion efficacy studies - human medicinal products), em Bruxelas - 1 Participante/2 dias",Ao abrigo de acordo-quadro (art.º 258.º),Aquisição de serviços,"63510000-7, Serviços de agências de viagens e serviços similares","INFARMED - Autoridade Nacional do Medicamento e Produtos de Saúde, I.P. (600037002)","Topatlantico - Viagens e Turismo, SA (501061126)","1.055,31 €",03-06-2013,23-05-2013,2 dias,Bélgica,"Artigo 27.º, n.º 1, alínea h) do Código dos Contratos Públicos",,,,,,273814,"Acordo Quadro de viagens, transportes aéreos e alojamentos",
