Objeto do Contrato,Tipo de Procedimento,Tipo(s) de Contrato,CPVs,Entidade(s) Adjudicante(s),Entidade(s) Adjudicatária(s),Preço Contratual,Data de Publicação,Data de Celebração do Contrato,Prazo de Execução,Local de Execução,Fundamentação,Data de Fecho do Contrato,Preço Total Efetivo,Causas das Alterações ao Prazo,Causas das Alterações ao Preço,Estado,N.º registo do Acordo Quadro,Descrição do Acordo Quadro,Procedimento Centralizado
SEGURO RESPONSABILIDADE CIVIL ADMINISTRADORES,Ajuste Direto Regime Geral,Aquisição de serviços,"66000000-0, Serviços de finanças e seguros","Instituto Português de Oncologia de Coimbra Francisco Gentil, E. P. E. (506361438)",AIG EUROPE LIMITED-SUCURSAL EM PORTUGAL (980051070),"2.660,00 €",22-12-2016,15-11-2016,364 dias,"Portugal, Coimbra, Coimbra","Artigo 20.º, n.º 1, alínea a) do Código dos Contratos Públicos",,,,,,Não aplicável.,Não aplicável.,FALSE
FORMACAO NORMA NP EN ISSO 9001:2015,Ajuste Direto Regime Geral,Aquisição de serviços,"80000000-4, Serviços de ensino e formação","Instituto Português de Oncologia de Coimbra Francisco Gentil, E. P. E. (506361438)",BUREAU VERITAS RINAVE - SOCIEDADE UNIPESSOAL LDA (502054883),"1.488,40 €",22-12-2016,09-09-2016,2 dias,"Portugal, Coimbra, Coimbra","Artigo 20.º, n.º 1, alínea a) do Código dos Contratos Públicos",,,,,,Não aplicável.,Não aplicável.,FALSE
MANUT. ELEVADORES (dezembro de 2015),Ajuste Direto Regime Geral,Aquisição de serviços,"50000000-5, Serviços de reparação e manutenção","Instituto Português de Oncologia de Coimbra Francisco Gentil, E. P. E. (506361438)","OTIS - ELEVADORES, SA (500069824)","286,59 €",21-12-2016,20-01-2016,31 dias,"Portugal, Coimbra, Coimbra","Artigo 20.º, n.º 1, alínea a) do Código dos Contratos Públicos",,,,,,Não aplicável.,Não aplicável.,FALSE
