freguesia,acronym,validVotesPercentage,votes,dicofre
Seixo de Gatões,PS,32.53,95,061010
Seixo de Gatões,PPD/PSD,27.4,80,061010
Seixo de Gatões,B.E.,11.3,33,061010
Seixo de Gatões,PCP-PEV,8.56,25,061010
Seixo de Gatões,PAN,7.53,22,061010
Seixo de Gatões,A,2.4,7,061010
Seixo de Gatões,CDS-PP,2.05,6,061010
Seixo de Gatões,PNR,1.71,5,061010
Seixo de Gatões,NC,1.37,4,061010
Seixo de Gatões,PCTP/MRPP,1.37,4,061010
Seixo de Gatões,L,1.03,3,061010
Seixo de Gatões,PPM.PPV/CDC,1.03,3,061010
Seixo de Gatões,IL,0.68,2,061010
Seixo de Gatões,MAS,0.34,1,061010
Seixo de Gatões,PDR,0.34,1,061010
Seixo de Gatões,PTP,0.34,1,061010
Seixo de Gatões,PURP,0,0,061010
