Objeto do Contrato,Tipo de Procedimento,Tipo(s) de Contrato,CPVs,Entidade(s) Adjudicante(s),Entidade(s) Adjudicatária(s),Preço Contratual,Data de Publicação,Data de Celebração do Contrato,Prazo de Execução,Local de Execução,Fundamentação,Data de Fecho do Contrato,Preço Total Efetivo,Causas das Alterações ao Prazo,Causas das Alterações ao Preço,Estado,N.º registo do Acordo Quadro,Descrição do Acordo Quadro,Procedimento Centralizado
Aquisição de Serviços para diferentes àreas funcionais do CHPL - Mês de Maio 2013,Ajuste Direto Regime Geral,Aquisição de serviços,"79000000-4, Serviços a empresas: direito, comercialização, consultoria, recrutamento, impressão e segurança",Centro Hospitalar Psiquiatrico de Lisboa (508338476),"WORKFORCE REC. HUMANOS -Emp. Trab. Temp., S.A (504647148)","29.982,39 €",24-05-2013,13-05-2013,31 dias,"Portugal, Lisboa, Lisboa","Artigo 24.º, n.º 1, alínea c) do Código dos Contratos Públicos",31-05-2013,"29.982,39 €",,,,Não aplicável.,Não aplicável.,
"Execução Financeira, Prestação de contas e acompanhamento de processos financiados pelo Pooh - Qren",Ajuste Direto Regime Geral,Aquisição de serviços,"80000000-4, Serviços de ensino e formação",Centro Hospitalar Psiquiatrico de Lisboa (508338476),SINASE (502851791),"7.875,00 €",24-05-2013,20-05-2013,66 dias,"Portugal, Lisboa, Lisboa","Artigo 20.º, n.º 1, alínea a) do Código dos Contratos Públicos",20-05-2013,"7.875,00 €",,,,Não aplicável.,Não aplicável.,
Publicação de Anuncio - Beneficiação do Sistema de Aquecimento do CHPL,Ajuste Direto Regime Geral,Aquisição de serviços,"79000000-4, Serviços a empresas: direito, comercialização, consultoria, recrutamento, impressão e segurança",Centro Hospitalar Psiquiatrico de Lisboa (508338476),"IMPRENSA NACIONAL - Casa da Moeda, SA (500792887)","567,12 €",24-05-2013,23-05-2013,8 dias,"Portugal, Lisboa, Lisboa","Artigo 20.º, n.º 1, alínea a) do Código dos Contratos Públicos",23-05-2013,"567,12 €",,,,Não aplicável.,Não aplicável.,
