freguesia,acronym,validVotesPercentage,votes,dicofre
Pala,PS,49.01,74,091015
Pala,PPD/PSD.CDS-PP,27.81,42,091015
Pala,PCP-PEV,7.28,11,091015
Pala,B.E.,4.64,7,091015
Pala,MPT,3.97,6,091015
Pala,MAS,1.99,3,091015
Pala,L,1.32,2,091015
Pala,PCTP/MRPP,1.32,2,091015
Pala,PAN,0.66,1,091015
Pala,PND,0.66,1,091015
Pala,PPM,0.66,1,091015
Pala,PTP,0.66,1,091015
Pala,PDA,0,0,091015
Pala,PNR,0,0,091015
Pala,POUS,0,0,091015
Pala,PPV,0,0,091015
