Objeto do Contrato,Tipo de Procedimento,Tipo(s) de Contrato,CPVs,Entidade(s) Adjudicante(s),Entidade(s) Adjudicatária(s),Preço Contratual,Data de Publicação,Data de Celebração do Contrato,Prazo de Execução,Local de Execução,Fundamentação,Data de Fecho do Contrato,Preço Total Efetivo,Causas das Alterações ao Prazo,Causas das Alterações ao Preço,Estado,N.º registo do Acordo Quadro,Descrição do Acordo Quadro,Procedimento Centralizado
DOPAMINA 200MG/5ML SOLUÇÃO INJETÁVEL IV,Ajuste Direto Regime Geral,Aquisição de bens móveis,"33690000-3, Medicamentos vários","Administração Regional de Saúde de Lisboa e Vale do Tejo, I. P. (503148776)","Overpharma - Produtos Médicos e Farmacêuticos, Lda (505792362)","23,50 €",13-03-2014,13-03-2014,20 dias,"Portugal, Lisboa, Lisboa","Artigo 26.º, n.º 1, alínea e) do Código dos Contratos Públicos",,,,,,Não aplicável.,Não aplicável.,FALSE
AQUISIÇÃO DE ETINILESTRADIOL 0.02 + GESTODENO,Ajuste Direto Regime Geral,Aquisição de bens móveis,"33641400-9, Contraceptivos","Administração Regional de Saúde de Lisboa e Vale do Tejo, I. P. (503148776)","Bayer Portugal, S.A. (500043256)","50.000,00 €",13-03-2014,13-03-2014,20 dias,"Portugal, Lisboa, Lisboa","Artigo 26.º, n.º 1, alínea e) do Código dos Contratos Públicos",,,,,,Não aplicável.,Não aplicável.,FALSE
Rede Tubular Elástica Nº 5 e Nº 7,Ajuste Direto Regime Geral,Aquisição de bens móveis,"33140000-3, Material médico de consumo","Administração Regional de Saúde de Lisboa e Vale do Tejo, I.P. (503148776)","Bastos Viegas, S.A. (500042772)","8.697,60 €",13-03-2014,13-03-2014,20 dias,"Portugal, Lisboa, Lisboa","Artigo 20.º, n.º 1, alínea a) do Código dos Contratos Públicos",,,,,,Não aplicável.,Não aplicável.,FALSE
PENSO ADESIVO NÃO TECIDO 20X8,Ajuste Direto Regime Geral,Aquisição de bens móveis,"33141111-1, Pensos adesivos","Administração Regional de Saúde de Lisboa e Vale do Tejo, I. P. (503148776)","Smith & Nephew, Lda (503552461)","18.684,00 €",13-03-2014,13-03-2014,20 dias,"Portugal, Lisboa, Lisboa","Artigo 26.º, n.º 1, alínea e) do Código dos Contratos Públicos",,,,,,Não aplicável.,Não aplicável.,FALSE
ALUGUER DE PLATAFORMAS ELEVATÓRIAS.,Ajuste Direto Regime Geral,Aquisição de serviços,"63110000-3, Serviços de movimentação de carga","Administração Regional de Saúde de Lisboa e Vale do Tejo, I. P. (503148776)","Transportes Barata & Carvalho, Lda (500425299)","5.830,00 €",13-03-2014,13-03-2014,20 dias,"Portugal, Lisboa, Lisboa","Artigo 20.º, n.º 1, alínea a) do Código dos Contratos Públicos",,,,,,Não aplicável.,Não aplicável.,FALSE
LIGAÇÃO À REDE BT (COMPARTICIPAÇÃO NAS REDES + SERVIÇOS DE LIGAÇÃO BT) NA ESTRADA PONTINHA 9011 CS.,Ajuste Direto Regime Geral,Aquisição de serviços,"65310000-9, Distribuição de electricidade","Administração Regional de Saúde de Lisboa e Vale do Tejo, I. P. (503148776)","EDP - Distribuição Energia, S.A. (504394029)","2.029,21 €",13-03-2014,13-03-2014,20 dias,"Portugal, Lisboa, Odivelas","Artigo 24.º, n.º 1, alínea e) do Código dos Contratos Públicos",,,,,,Não aplicável.,Não aplicável.,FALSE
REAGENTES PARA A UNIDADE ANALITICA DE APOIO À AUTORIDADE DE SAUDE (IBERLAB),Ajuste Direto Regime Geral,Aquisição de bens móveis,"33696000-5, Reagentes e meios de contraste","Administração Regional de Saúde de Lisboa e Vale do Tejo, I. P. (503148776)","Iberlab & Imunoreage - Soluções para laboratórios, S.A. (503406694)","73.500,00 €",13-03-2014,06-03-2014,300 dias,"Portugal, Lisboa, Lisboa","Artigo 24.º, n.º 1, alínea e) do Código dos Contratos Públicos",,,,,,Não aplicável.,Não aplicável.,FALSE
AQUISIÇÃO DE PIRIDOXINA 40 MG CP,Ajuste Direto Regime Geral,Aquisição de bens móveis,"33690000-3, Medicamentos vários","Administração Regional de Saúde de Lisboa e Vale do Tejo, I. P. (503148776)","Labesfal - Laboratórios Amiro, S.A. (501169580)","112.840,00 €",13-03-2014,04-03-2014,365 dias,"Portugal, Lisboa, Lisboa","Artigo 24.º, n.º 1, alínea e) do Código dos Contratos Públicos",,,,,,Não aplicável.,Não aplicável.,FALSE
"PRESTAÇÃO DE SERVIÇOS DE ASSESSORIA DE COMUNICAÇÃO PARA O CONSELHO DA ARSLVT,IP. - PERÍODO DE 01/03/2014 A 31-12-2014",Ajuste Direto Regime Geral,Aquisição de serviços,"98390000-3, Outros serviços","Administração Regional de Saúde de Lisboa e Vale do Tejo, I. P. (503148776)",Agostinho Macedo Esteves (202143732),"15.000,00 €",13-03-2014,11-03-2014,306 dias,"Portugal, Lisboa, Lisboa","Artigo 27.º, n.º 1, alínea b) e n.º 3 do Código dos Contratos Públicos",,,,,,Não aplicável.,Não aplicável.,FALSE
"Prestação de serviços para assegurar o patrocínio judicial e de consultoria jurídica, respeitante à área da Península de Setúbal. Acompanhamento judicial de processos referentes à extinção do Centro Hospitalar de Cascais e do Hospital Reynaldo dos Santos. Período de 01/MARÇ/2014 até 31/DEZ/2014.",Ajuste Direto Regime Geral,Aquisição de serviços,"79111000-5, Serviços de assessoria jurídica","Administração Regional de Saúde de Lisboa e Vale do Tejo, I. P. (503148776)","Ferreira, Lima & Associados - De Advogados, R.L. (507177690)","18.396,36 €",11-03-2014,05-03-2014,270 dias,"Portugal, Lisboa, Lisboa","Artigo 27.º, n.º 1, alínea b) e n.º 3 do Código dos Contratos Públicos",,,,,,Não aplicável.,Não aplicável.,FALSE
AQUISIÇÃO DE SERVIÇOS JURÍDICOS PARA AS ÁREAS DE SANTARÉM E OESTE PARA O ANO DE 2014.,Ajuste Direto Regime Geral,Aquisição de serviços,"79100000-5, Serviços jurídicos","Administração Regional de Saúde de Lisboa e Vale do Tejo, I. P. (503148776)","Ana Martinho Rosário, Isabel A. Matos e Victor Batista - Sociedade de Advogados (502744669)","13.365,00 €",11-03-2014,06-03-2014,30 dias,"Portugal, Lisboa, Lisboa","Artigo 27.º, n.º 1, alínea b) e n.º 3 do Código dos Contratos Públicos",,,,,,Não aplicável.,Não aplicável.,FALSE
AQUISIÇÃO DE SERVIÇOS DE MANUTENÇÃO- ASSISTÊNCIA TÉCNICA AOS SERVIDORES,Ajuste Direto Regime Geral,Aquisição de serviços,"72267100-0, Manutenção de software para as tecnologias da infomação","Administração Regional de Saúde de Lisboa e Vale do Tejo, I. P. (503148776)","ATM - Sistemas de Informação e Serviços, S.A. (509784267)","43.800,00 €",11-03-2014,27-02-2014,365 dias,"Portugal, Lisboa, Lisboa","Artigo 20.º, n.º 1, alínea a) do Código dos Contratos Públicos",,,,,,Não aplicável.,Não aplicável.,FALSE
AQUISIÇÃO DE COMPRESSA TECIDO NÃO TECIDO: NÃO ESTÉRIL 30X15 E 15X20 ESTÉRIL: 15X20,Ajuste Direto Regime Geral,Aquisição de bens móveis,"33141119-7, Compressas","Administração Regional de Saúde de Lisboa e Vale do Tejo, I. P. (503148776)","Albino Dias de Andrade, Lda (500013810)","234.552,60 €",11-03-2014,11-03-2014,20 dias,"Portugal, Lisboa, Lisboa","Artigo 26.º, n.º 1, alínea e) do Código dos Contratos Públicos",,,,,,Não aplicável.,Não aplicável.,FALSE
"AQUISIÇÃO DE VAC BCG 0,75MG INJ 10 DOSES",Ajuste Direto Regime Geral,Aquisição de bens móveis,"33651600-4, Vacinas","Administração Regional de Saúde de Lisboa e Vale do Tejo, I. P. (503148776)","JM - Farmaceutica, Lda (503550558)","106.560,00 €",11-03-2014,10-03-2014,20 dias,"Portugal, Lisboa, Lisboa","Artigo 26.º, n.º 1, alínea e) do Código dos Contratos Públicos",,,,,,Não aplicável.,Não aplicável.,FALSE
"AQUISIÇÃO DE TUBERCULINA 0,4MCG/ML INJ 1,5ML MULTIDOS",Ajuste Direto Regime Geral,Aquisição de bens móveis,"33651600-4, Vacinas","Administração Regional de Saúde de Lisboa e Vale do Tejo, I. P. (503148776)","JM - Farmaceutica, Lda (503550558)","40.900,00 €",11-03-2014,10-03-2014,20 dias,"Portugal, Lisboa, Lisboa","Artigo 26.º, n.º 1, alínea e) do Código dos Contratos Públicos",,,,,,Não aplicável.,Não aplicável.,FALSE
AQUISIÇÃO DE VAC TRIPLICE DTPA SUSP INJ IM,Ajuste Direto Regime Geral,Aquisição de bens móveis,"33651600-4, Vacinas","Administração Regional de Saúde de Lisboa e Vale do Tejo, I. P. (503148776)","Glaxosmithkline - Produtos Farmacêuticos, Lda (500139962)","6.872,00 €",11-03-2014,10-03-2014,20 dias,"Portugal, Lisboa, Lisboa","Artigo 26.º, n.º 1, alínea e) do Código dos Contratos Públicos",,,,,,Não aplicável.,Não aplicável.,FALSE
AQUISIÇÃO DE VAC HEPATITE B ADULTO 20 MCG/ML SUSP INJ,Ajuste Direto Regime Geral,Aquisição de bens móveis,"33651600-4, Vacinas","Administração Regional de Saúde de Lisboa e Vale do Tejo, I. P. (503148776)","Glaxosmithkline - Produtos Farmacêuticos, Lda (500139962)","53.120,00 €",11-03-2014,10-03-2014,20 dias,"Portugal, Lisboa, Lisboa","Artigo 26.º, n.º 1, alínea e) do Código dos Contratos Públicos",,,,,,Não aplicável.,Não aplicável.,FALSE
"Aquisição de Mobiliário para as Extensões de Saúde do Vimeiro, A-dos-Negros, Carnide e Quinta da Lomba",Ajuste Direto Regime Geral,Aquisição de bens móveis,"30190000-7, Equipamento e material de escritório diverso","Administração Regional de Saúde de Lisboa e Vale do Tejo, I. P. (503148776)","Haworth Portugal - Mobiliário de Escritório, S.A. (500077622)","28.142,46 €",11-03-2014,03-02-2014,20 dias,"Portugal, Lisboa",Artigo 258.º do Código dos Contratos Públicos,,,,,,1177503," Aquisição de Mobiliário para as Extensões de Saúde do Vimeiro, A-dos-Negros, Carnide e Quinta da Lomba",FALSE
"AQUISIÇÃO DE VAC FEBRE TIFOIDE 25MCG/0,5ML INJ IM SC",Ajuste Direto Regime Geral,Aquisição de bens móveis,"33651600-4, Vacinas","Administração Regional de Saúde de Lisboa e Vale do Tejo, I. P. (503148776)","Sanofi Pasteur MSD, S.A. (507632796)","139.875,00 €",11-03-2014,10-03-2014,20 dias,"Portugal, Lisboa, Lisboa","Artigo 26.º, n.º 1, alínea e) do Código dos Contratos Públicos",,,,,,Não aplicável.,Não aplicável.,FALSE
"Aquisição de um Transformador de Potência  do Posto de Transformação do Centro de Saúde de Oeiras, na Av. Salvador Allende",Ajuste Direto Regime Geral,Aquisição de bens móveis,"31100000-7, Motores, geradores e transformadores eléctricos","Administração Regional de Saúde de Lisboa e Vale do Tejo, I. P. (503148776)",João Jacinto Tomé S.A. (500149771),"14.386,80 €",11-03-2014,06-03-2014,60 dias,"Portugal, Lisboa, Oeiras","Artigo 20.º, n.º 1, alínea a) do Código dos Contratos Públicos",,,,,,Não aplicável.,Não aplicável.,FALSE
Aquisição de toalhetes de mãos.,Ajuste Direto Regime Geral,Aquisição de bens móveis,"33141118-0, Toalhetes","Administração Regional de Saúde de Lisboa e Vale do Tejo, I. P. (503148776)","Servisan - Produtos de higiene, S.A. (500246530)","26.893,76 €",10-03-2014,10-03-2014,20 dias,"Portugal, Lisboa, Lisboa","Artigo 20.º, n.º 1, alínea a) do Código dos Contratos Públicos",,,,,,Não aplicável.,Não aplicável.,FALSE
Aluguer de equipamento,Ajuste Direto Regime Geral,Locação de bens móveis,"34000000-7, Equipamento e produtos auxiliares de transporte","Administração Regional de Saúde de Lisboa e Vale do Tejo, I. P. (503148776)","TRANSBUSINESS, Sociedade Unipessoal, LDa (508794544)","2.500,00 €",10-03-2014,13-01-2014,20 dias,"Portugal, Lisboa, Loures","Artigo 20.º, n.º 1, alínea a) do Código dos Contratos Públicos",,,,,,Não aplicável.,Não aplicável.,FALSE
Atilhos para Sacos plásticos,Ajuste Direto Regime Geral,Aquisição de bens móveis,"39000000-2, Mobiliário (incl. de escritório), acessórios, aparelhos domésticos (excl. iluminação) e produtos de limpeza","Administração Regional de Saúde de Lisboa e Vale do Tejo, I. P. (503148776)","ENGELS - Logística e ambiente Unipessoal, Lda (507736915)","103,00 €",10-03-2014,16-01-2014,6 dias,"Portugal, Lisboa, Loures","Artigo 24.º, n.º 1, alínea e) do Código dos Contratos Públicos",,,,,,Não aplicável.,Não aplicável.,FALSE
Aquisição de ferramentas de desgaste rápido,Ajuste Direto Regime Geral,Aquisição de bens móveis,"31000000-6, Maquinaria, aparelhagem, equipamento e consumíveis eléctricos; iluminação","Administração Regional de Saúde de Lisboa e Vale do Tejo, I. P. (503148776)","ELECTROSACAVÉM - de António A. Maio, Lda (500344795)","310,00 €",10-03-2014,10-03-2014,20 dias,"Portugal, Lisboa, Loures","Artigo 20.º, n.º 1, alínea a) do Código dos Contratos Públicos",,,,,,Não aplicável.,Não aplicável.,FALSE
Aquisição de papel higiénico.,Ajuste Direto Regime Geral,Aquisição de bens móveis,"33761000-2, Papel higiénico","Administração Regional de Saúde de Lisboa e Vale do Tejo, I. P. (503148776)","Servisan - Produtos de Higiene, S.A. (500246530)","11.981,60 €",10-03-2014,10-03-2014,20 dias,"Portugal, Lisboa, Lisboa","Artigo 20.º, n.º 1, alínea a) do Código dos Contratos Públicos",,,,,,Não aplicável.,Não aplicável.,FALSE
"AQUISIÇÃO DE HIPOCLORITO SODIO 0,5% FR 250ML",Ajuste Direto Regime Geral,Aquisição de bens móveis,"33600000-6, Produtos farmacêuticos","Administração Regional de Saúde de Lisboa e Vale do Tejo, I. P. (503148776)","Proclinica - Equipamentos e produtos clinicos, Lda (500222665)","43,20 €",05-03-2014,04-03-2014,20 dias,"Portugal, Lisboa, Lisboa","Artigo 26.º, n.º 1, alínea e) do Código dos Contratos Públicos",,,,,,Não aplicável.,Não aplicável.,FALSE
Metoclopramida 10MG/2ML,Ajuste Direto Regime Geral,Aquisição de bens móveis,"33690000-3, Medicamentos vários","Administração Regional de Saúde de Lisboa e Vale do Tejo, I. P. (503148776)","Labesfal - Laboratórios Almiro, S.A. (501169580)","2.542,50 €",05-03-2014,03-03-2014,20 dias,"Portugal, Lisboa, Lisboa","Artigo 26.º, n.º 1, alínea e) do Código dos Contratos Públicos",,,,,,Não aplicável.,Não aplicável.,FALSE
AQUISIÇÃO DE CARVAO ACTIVADO 50 G SUSP ORAL FR 500ML,Ajuste Direto Regime Geral,Aquisição de bens móveis,"33690000-3, Medicamentos vários","Administração Regional de Saúde de Lisboa e Vale do Tejo, I. P. (503148776)","Laboratorio Medinfar - Produtos Farmacêuticos, Lda (500384045)","1.349,50 €",05-03-2014,28-02-2014,20 dias,"Portugal, Lisboa, Lisboa","Artigo 26.º, n.º 1, alínea e) do Código dos Contratos Públicos",,,,,,Não aplicável.,Não aplicável.,FALSE
AQUISIÇÃO DE VAC DIFTERIA TETANO (TD) SUSP INJ IM,Ajuste Direto Regime Geral,Aquisição de bens móveis,"33651600-4, Vacinas","Administração Regional de Saúde de Lisboa e Vale do Tejo, I.P. (503148776)","Sanofi Pasteur MSD, S.A. (507632796)","196.000,00 €",04-03-2014,28-02-2014,60 dias,"Portugal, Lisboa, Lisboa","Artigo 26.º, n.º 1, alínea e) do Código dos Contratos Públicos",,,,,,Não aplicável.,Não aplicável.,FALSE
Amoxicilina + Ácido Clavulânico (500MG + 125MG),Ajuste Direto Regime Geral,Aquisição de bens móveis,"33690000-3, Medicamentos vários","Administração Regional de Saúde de Lisboa e Vale do Tejo, I. P. (503148776)","Generis Farmacêutica, S.A. (508107997)","2.800,00 €",04-03-2014,28-02-2014,20 dias,"Portugal, Lisboa, Lisboa","Artigo 26.º, n.º 1, alínea e) do Código dos Contratos Públicos",,,,,,Não aplicável.,Não aplicável.,FALSE
Claritromicina 500MG,Ajuste Direto Regime Geral,Aquisição de bens móveis,"33690000-3, Medicamentos vários","Administração Regional de Saúde de Lisboa e Vale do Tejo, I. P. (503148776)","Generis Farmacêutica, S.A. (508107997)","4.623,52 €",04-03-2014,28-02-2014,20 dias,"Portugal, Lisboa, Lisboa","Artigo 26.º, n.º 1, alínea e) do Código dos Contratos Públicos",,,,,,Não aplicável.,Não aplicável.,FALSE
AQUISIÇÃO DE PDAS PARA A UOFF NO AMBITO DO SGCIM - SISTEMA DE GESTÃO DO CIRCUITO INTEGRADO DO MEDICAMENTO,Ajuste Direto Regime Geral,Aquisição de bens móveis,"30216110-0, Scanners para computadores","Administração Regional de Saúde de Lisboa e Vale do Tejo, I. P. (503148776)",Glintt - Healthcare solutions (502479418),"7.807,60 €",04-03-2014,04-03-2014,20 dias,"Portugal, Lisboa, Lisboa","Artigo 24.º, n.º 1, alínea e) do Código dos Contratos Públicos",,,,,,Não aplicável.,Não aplicável.,FALSE
"Fornecimento de telecomunicações fixas de voz para as instalações da ARSLVT, IP. Periodo de Janeiro a Março de 2014",Ajuste Direto Regime Geral,Aquisição de serviços,"64200000-8, Serviços de telecomunicações","Administração Regional de Saúde de Lisboa e Vale do Tejo, I. P. (503148776)","PT Comunicações, S.A. (504615947)","19.259,80 €",04-03-2014,04-03-2014,90 dias,"Portugal, Lisboa, Lisboa","Artigo 24.º, n.º 1, alínea e) do Código dos Contratos Públicos",,,,,,Não aplicável.,Não aplicável.,FALSE
Fornecimento de comunicações fixas de dados para as instalações do DICAD. Periodo de Janeiro a Março de 2014,Ajuste Direto Regime Geral,Aquisição de serviços,"64200000-8, Serviços de telecomunicações","Administração Regional de Saúde de Lisboa e Vale do Tejo, I. P. (503148776)","PT Comunicações, SA (504615947)","2.925,00 €",04-03-2014,04-03-2014,90 dias,"Portugal, Lisboa, Lisboa","Artigo 24.º, n.º 1, alínea e) do Código dos Contratos Públicos",,,,,,Não aplicável.,Não aplicável.,FALSE
APLICAÇÃO DE MATERIAIS E CONTRATO DE MANUTENÇÃO PERIÓDICA ADVANCED - ACES AMADORA - 2014,Ajuste Direto Regime Geral,Aquisição de serviços,"50334130-5, Serviços de reparação e manutenção de aparelhos de comutação telefónica","Administração Regional de Saúde de Lisboa e Vale do Tejo, I. P. (503148776)","Fonotel - Comunicações, S.A. (501397469)","6.653,40 €",04-03-2014,04-03-2014,20 dias,"Portugal, Lisboa, Amadora","Artigo 20.º, n.º 1, alínea a) do Código dos Contratos Públicos",,,,,,Não aplicável.,Não aplicável.,FALSE
PAPEL A4 - LOTE 1 DO AQ PECI 2014,Ajuste Direto Regime Geral,Aquisição de bens móveis,"30197630-1, Papel para impressão","Administração Regional de Saúde de Lisboa e Vale do Tejo, I. P. (503148776)","Staples Portugal - Equipamento Escritório, S.A. (503789372)","295.360,00 €",04-03-2014,25-02-2014,365 dias,"Portugal, Lisboa",Artigo 258.º do Código dos Contratos Públicos,,,,,,Não aplicável.,Não aplicável.,FALSE
AQUISIÇÃO DE NIFEDIPINA 5MG COMPRIMIDO,Ajuste Direto Regime Geral,Aquisição de bens móveis,"33690000-3, Medicamentos vários","Administração Regional de Saúde de Lisboa e Vale do Tejo, I. P. (503148776)","Bayer Portugal, S.A. (500043256)","500,00 €",03-03-2014,28-02-2014,20 dias,"Portugal, Lisboa, Lisboa","Artigo 26.º, n.º 1, alínea e) do Código dos Contratos Públicos",,,,,,Não aplicável.,Não aplicável.,FALSE
AQUISIÇÃO DE AMIODARONA 150MG/3ML SOLUÇÃO INJETÁVEL IV,Ajuste Direto Regime Geral,Aquisição de bens móveis,"33690000-3, Medicamentos vários","Administração Regional de Saúde de Lisboa e Vale do Tejo, I. P. (503148776)","HIKMA FARMACÊUTICA (PORTUGAL), S.A. (502266791)","300,00 €",03-03-2014,28-02-2014,20 dias,"Portugal, Lisboa, Lisboa","Artigo 26.º, n.º 1, alínea e) do Código dos Contratos Públicos",,,,,,Não aplicável.,Não aplicável.,FALSE
