freguesia,acronym,validVotesPercentage,votes,dicofre
Penacova,PS,43.46,399,061307
Penacova,PPD/PSD.CDS-PP,33.12,304,061307
Penacova,PCP-PEV,9.04,83,061307
Penacova,MPT,4.25,39,061307
Penacova,B.E.,4.03,37,061307
Penacova,PCTP/MRPP,1.74,16,061307
Penacova,L,1.09,10,061307
Penacova,PND,0.65,6,061307
Penacova,MAS,0.54,5,061307
Penacova,PPM,0.54,5,061307
Penacova,PTP,0.54,5,061307
Penacova,PAN,0.44,4,061307
Penacova,PPV,0.33,3,061307
Penacova,PNR,0.22,2,061307
Penacova,PDA,0,0,061307
Penacova,POUS,0,0,061307
