Objeto do Contrato,Tipo de Procedimento,Tipo(s) de Contrato,CPVs,Entidade(s) Adjudicante(s),Entidade(s) Adjudicatária(s),Preço Contratual,Data de Publicação,Data de Celebração do Contrato,Prazo de Execução,Local de Execução,Fundamentação,Data de Fecho do Contrato,Preço Total Efetivo,Causas das Alterações ao Prazo,Causas das Alterações ao Preço,Estado,N.º registo do Acordo Quadro,Descrição do Acordo Quadro,Procedimento Centralizado
Aquisição de Vacina Pneumocócica Polissacarida conjugada de 13 valências,Ao abrigo de acordo-quadro (art.º 259.º),Aquisição de bens móveis,"33651600-4, Vacinas","Administração Regional de Saúde de Lisboa e Vale do Tejo, I. P. (503148776)","Pfizer Biofarmacêutica, Sociedade Unipessoal, Lda (513300376)","457.300,00 €",10-12-2015,09-12-2015,20 dias,"Portugal, Lisboa, Lisboa",Artigo 259.º do Código dos Contratos Públicos,,,,,,1479090,VACINA PNEUMOCOCICA POLIOSIDICA (PREVENAR)- CONTRATO MANDATO,FALSE
"AQUISIÇÃO DE EQUIPAMENTO PARA VÁRIAS USF DO ACES ALMADA-SEIXAL, PARA A USF PARQUE E PARA A UNIDADE DE INTERNAMENTO DAS TAIPAS",Concurso público,Aquisição de bens móveis,"33100000-1, Equipamento médico","Administração Regional de Saúde de Lisboa e Vale do Tejo, I. P. (503148776)","Alfraphar - Equipamentos e Produtos Farmacêuticos, Lda. (504223895)","32.976,25 €",07-12-2015,19-11-2015,15 dias,"Portugal, Setúbal, Almada","Artigo 20.º, n.º 1, alínea b) do Código dos Contratos Públicos",,,,,,Não aplicável.,Não aplicável.,FALSE
"AQUISIÇÃO DE EQUIPAMENTO PARA VÁRIAS USF DO ACES ALMADA-SEIXAL, PARA A USF PARQUE E PARA A UNIDADE DE INTERNAMENTO DAS TAIPAS",Concurso público,Aquisição de bens móveis,"33192300-5, Mobiliário para fins médicos, excepto camas e mesas","Administração Regional de Saúde de Lisboa e Vale do Tejo, I. P. (503148776)",Cenatolim Lda. (507397924),"17.990,50 €",07-12-2015,19-11-2015,15 dias,"Portugal, Lisboa, Lisboa","Artigo 20.º, n.º 1, alínea b) do Código dos Contratos Públicos",,,,,,Não aplicável.,Não aplicável.,FALSE
"AQUISIÇÃO DE EQUIPAMENTO PARA VÁRIAS USF DO ACES ALMADA-SEIXAL, PARA A USF PARQUE E PARA A UNIDADE DE INTERNAMENTO DAS TAIPAS",Concurso público,Aquisição de bens móveis,"39130000-2, Mobiliário de escritório","Administração Regional de Saúde de Lisboa e Vale do Tejo, I. P. (503148776)","Euroshelves - Estantes Metálicas, Lda. (504204440)","7.064,00 €",07-12-2015,19-11-2015,15 dias,"Portugal, Setúbal, Almada","Artigo 20.º, n.º 1, alínea b) do Código dos Contratos Públicos",,,,,,Não aplicável.,Não aplicável.,FALSE
"AQUISIÇÃO DE EQUIPAMENTO PARA VÁRIAS USF DO ACES ALMADA-SEIXAL, PARA A USF PARQUE E PARA A UNIDADE DE INTERNAMENTO DAS TAIPAS",Concurso público,Aquisição de bens móveis,"39130000-2, Mobiliário de escritório","Administração Regional de Saúde de Lisboa e Vale do Tejo, I. P. (503148776)",Cenatolim Lda. (507397924),"367,00 €",07-12-2015,19-11-2015,15 dias,"Portugal, Setúbal, Almada","Artigo 20.º, n.º 1, alínea b) do Código dos Contratos Públicos",,,,,,Não aplicável.,Não aplicável.,FALSE
"AQUISIÇÃO DE EQUIPAMENTO PARA VÁRIAS USF DO ACES ALMADA-SEIXAL, PARA A USF PARQUE E PARA A UNIDADE DE INTERNAMENTO DAS TAIPAS",Concurso público,Aquisição de bens móveis,"33100000-1, Equipamento médico","Administração Regional de Saúde de Lisboa e Vale do Tejo, I. P. (503148776)",Cenatolim Lda. (507397924),"4.118,00 €",07-12-2015,19-11-2015,15 dias,"Portugal, Setúbal, Almada","Artigo 20.º, n.º 1, alínea b) do Código dos Contratos Públicos",,,,,,Não aplicável.,Não aplicável.,FALSE
"AQUISIÇÃO DE EQUIPAMENTO PARA VÁRIAS USF DO ACES ALMADA-SEIXAL, PARA A USF PARQUE E PARA A UNIDADE DE INTERNAMENTO DAS TAIPAS",Concurso público,Aquisição de bens móveis,"39130000-2, Mobiliário de escritório","Administração Regional de Saúde de Lisboa e Vale do Tejo, I. P. (503148776)","Ergotec - Equipamento para Escritórios, Lda. (503455105)","8.513,00 €",07-12-2015,30-11-2015,15 dias,"Portugal, Setúbal, Almada","Artigo 20.º, n.º 1, alínea b) do Código dos Contratos Públicos",,,,,,Não aplicável.,Não aplicável.,FALSE
Obras de reparação de danos nos edifícios de S. João do Estoril e S. Domingos de Rana - ACES Cascais,Ajuste Direto Regime Geral,Empreitadas de obras públicas,"45113000-2, Obras no local","Administração Regional de Saúde de Lisboa e Vale do Tejo, I. P. (503148776)","Ramiro & Delgado - Const. Civis e Obras Públicas, Lda. (501301704)","8.012,00 €",03-12-2015,02-12-2015,5 dias,"Portugal, Lisboa, Lisboa","Artigo 19.º, alínea a) do Código dos Contratos Públicos",,,,,,Não aplicável.,Não aplicável.,FALSE
Obra de reparação de rotura na prumada de esgoto da unidade de saúde da Alameda.,Ajuste Direto Regime Geral,Empreitadas de obras públicas,"45113000-2, Obras no local","Administração Regional de Saúde de Lisboa e Vale do Tejo, I. P. (503148776)","METAL CUBICO, LDA (503852880)","4.900,00 €",03-12-2015,01-12-2015,10 dias,"Portugal, Lisboa, Lisboa","Artigo 19.º, alínea a) do Código dos Contratos Públicos",,,,,,Não aplicável.,Não aplicável.,FALSE
Obras de reparação na cobertura e gabinetes da USF Monte da Caparica,Ajuste Direto Regime Geral,Empreitadas de obras públicas,"45113000-2, Obras no local","Administração Regional de Saúde de Lisboa e Vale do Tejo, I. P. (503148776)",ESTABIL - Engenheiros Associados (502522798),"4.457,22 €",03-12-2015,01-12-2015,15 dias,"Portugal, Setúbal, Almada","Artigo 19.º, alínea a) do Código dos Contratos Públicos",,,,,,Não aplicável.,Não aplicável.,FALSE
Obras de instalação de sistema de iluminação no sótão do Centro de  Saúde do Bombarral,Ajuste Direto Regime Geral,Empreitadas de obras públicas,"45113000-2, Obras no local","Administração Regional de Saúde de Lisboa e Vale do Tejo, I. P. (503148776)","AMPERMAGO - Instalações Elétricas, Lda. (508125871)","4.693,13 €",03-12-2015,01-12-2015,15 dias,"Portugal, Lisboa, Torres Vedras","Artigo 19.º, alínea a) do Código dos Contratos Públicos",,,,,,Não aplicável.,Não aplicável.,FALSE
Aquisição de Fluoreto de Sódio 2MG/ML Solução Bucal 100ML,Ao abrigo de acordo-quadro (art.º 258.º),Aquisição de bens móveis,"33690000-3, Medicamentos vários","Administração Regional de Saúde de Lisboa e Vale do Tejo, I. P. (503148776)","Labesfal - Laboratórios Almiro, S.A. (501169580)","29.248,50 €",02-12-2015,02-12-2015,20 dias,"Portugal, Lisboa, Lisboa",Artigo 258.º do Código dos Contratos Públicos,,,,,,1194708,"CONCURSO PÚBLICO PARA A CELEBRAÇÃO DE CONTRATOS PÚBLICOS DE APROVISIONAMENTO PARA A ÁREA DA SAÚDE, MEDICAMENTOS DO APARELHO DIGESTIVO, ÀS INSTITUIÇÕES E SERVIÇOS DO SERVIÇO NACIONAL DE SAÚDE",FALSE
Aquisição de Moxifloxina 400MG,Ao abrigo de acordo-quadro (art.º 259.º),Aquisição de bens móveis,"33690000-3, Medicamentos vários","Administração Regional de Saúde de Lisboa e Vale do Tejo, I. P. (503148776)","Mylan, Lda (502248793)","2.285,98 €",02-12-2015,01-12-2015,20 dias,"Portugal, Lisboa, Lisboa",Artigo 259.º do Código dos Contratos Públicos,,,,,,1326195,ACORDO QUADRO PARA FORNECIMENTO DE MEDICAMENTOS ANTI-INFECIOSOS: EXCETO ANTIVÍRICOS E ANTIFÚNGICOS ÀS INSTITUIÇÕES E SERVIÇOS DO SERVIÇO NACIONAL DE SAÚDE,FALSE
Serviços na área da psicologia,Concurso público,Aquisição de serviços,"75120000-3, Serviços administrativos das agências","Administração Regional de Saúde de Lisboa e Vale do Tejo, I. P. (503148776)","Kelly Services Healthcare Unipessoal, Lda. (510723691)","28.182,00 €",01-12-2015,03-11-2015,424 dias,"Portugal, Lisboa, Lisboa",Artigo 155.º do Código dos Contratos Públicos,,,,,,Não aplicável.,Não aplicável.,FALSE
Serviços na área da nutrição,Concurso público,Aquisição de serviços,"75120000-3, Serviços administrativos das agências","Administração Regional de Saúde de Lisboa e Vale do Tejo, I. P. (503148776)","Kelly Services Healthcare Unipessoal, Lda. (510723691)","93.940,00 €",01-12-2015,03-11-2015,424 dias,"Portugal, Lisboa, Lisboa",Artigo 155.º do Código dos Contratos Públicos,,,,,,Não aplicável.,Não aplicável.,FALSE
Serviços de Supervisão na área da nutrição,Concurso público,Aquisição de serviços,"75120000-3, Serviços administrativos das agências","Administração Regional de Saúde de Lisboa e Vale do Tejo, I. P. (503148776)","Kelly Services Healthcare Unipessoal, Lda. (510723691)","25.132,00 €",01-12-2015,03-11-2015,424 dias,"Portugal, Lisboa, Lisboa",Artigo 155.º do Código dos Contratos Públicos,,,,,,Não aplicável.,Não aplicável.,FALSE
Consumíveis de impressão da marca Lexmark ou Compatível,Concurso público,Locação de bens móveis,"30125100-2, Cartuchos de tinta (toner)","Administração Regional de Saúde de Lisboa e Vale do Tejo, I. P. (503148776)","Toptoner - Reciclagem e Comercialização de Consumíveis Informáticos, Lda. (504242644)","75.000,00 €",01-12-2015,30-11-2015,20 dias,"Portugal, Lisboa, Lisboa","Artigo 20.º, n.º 1, alínea b) do Código dos Contratos Públicos",,,,,,Não aplicável.,Não aplicável.,FALSE
