freguesia,acronym,validVotesPercentage,votes,dicofre
São Martinho das Amoreiras,PS,55.56,150,021107
São Martinho das Amoreiras,PCP-PEV,14.81,40,021107
São Martinho das Amoreiras,PPD/PSD,10.74,29,021107
São Martinho das Amoreiras,B.E.,4.81,13,021107
São Martinho das Amoreiras,PAN,3.33,9,021107
São Martinho das Amoreiras,CDS-PP,2.59,7,021107
São Martinho das Amoreiras,PCTP/MRPP,1.85,5,021107
São Martinho das Amoreiras,PURP,1.48,4,021107
São Martinho das Amoreiras,PPM.PPV/CDC,1.11,3,021107
São Martinho das Amoreiras,A,0.74,2,021107
São Martinho das Amoreiras,L,0.74,2,021107
São Martinho das Amoreiras,PDR,0.74,2,021107
São Martinho das Amoreiras,PNR,0.74,2,021107
São Martinho das Amoreiras,IL,0.37,1,021107
São Martinho das Amoreiras,MAS,0.37,1,021107
São Martinho das Amoreiras,NC,0,0,021107
São Martinho das Amoreiras,PTP,0,0,021107
