freguesia,acronym,validVotesPercentage,votes,dicofre
São Pedro,PPD/PSD.CDS-PP,29.71,688,310308
São Pedro,PS,26.64,617,310308
São Pedro,MPT,11.96,277,310308
São Pedro,PCP-PEV,7.51,174,310308
São Pedro,B.E.,5.31,123,310308
São Pedro,PTP,5.18,120,310308
São Pedro,PAN,3.58,83,310308
São Pedro,PND,2.94,68,310308
São Pedro,L,2.33,54,310308
São Pedro,PCTP/MRPP,1.9,44,310308
São Pedro,PPM,1.08,25,310308
São Pedro,PPV,0.52,12,310308
São Pedro,PNR,0.47,11,310308
São Pedro,MAS,0.3,7,310308
São Pedro,POUS,0.3,7,310308
São Pedro,PDA,0.26,6,310308
