Objeto do Contrato,Tipo de Procedimento,Tipo(s) de Contrato,CPVs,Entidade(s) Adjudicante(s),Entidade(s) Adjudicatária(s),Preço Contratual,Data de Publicação,Data de Celebração do Contrato,Prazo de Execução,Local de Execução,Fundamentação,Data de Fecho do Contrato,Preço Total Efetivo,Causas das Alterações ao Prazo,Causas das Alterações ao Preço,Estado,N.º registo do Acordo Quadro,Descrição do Acordo Quadro,Procedimento Centralizado
"Aquisição de serviços para o programa iniciativas em saúde pública, no âmbito dos EEA Grants - área Jurídica",Ajuste Direto Regime Geral,Aquisição de serviços,"79111000-5, Serviços de assessoria jurídica","Administração Central do Sistema de Saúde, I. P. (508188423)",Joana Rita da Silva Almeida (246262419),"17.529,48 €",17-01-2018,11-12-2017,365 dias,"Portugal, Lisboa, Lisboa","Artigo 20.º, n.º 1, alínea a) do Código dos Contratos Públicos",30-11-2018,"16.068,69 €","",revogação do contrato entre as partes,,Não aplicável.,Não aplicável.,FALSE
Aquisição de serviços para apoio técnico à AEC da ACSS,Ajuste Direto Regime Geral,Aquisição de serviços,"71356300-1, Serviços de apoio técnico","Administração Central do Sistema de Saúde, I. P. (508188423)",Ana Rita da Silva Almeida (212978004),"14.417,76 €",16-01-2018,04-01-2018,365 dias,"Portugal, Lisboa, Lisboa","Artigo 20.º, n.º 1, alínea a) do Código dos Contratos Públicos",30-11-2018,"13.216,28 €","",revogação do contrato entre as partes,,Não aplicável.,Não aplicável.,FALSE
Aquisição de serviços para apoio técnico à UOC da ACSS.,Ajuste Direto Regime Geral,Aquisição de serviços,"71356300-1, Serviços de apoio técnico","Administração Central do Sistema de Saúde, I. P. (508188423)",Andreia Sofia Furtado de Almeida (238937046),"14.417,76 €",16-01-2018,27-12-2017,365 dias,"Portugal, Lisboa, Lisboa","Artigo 20.º, n.º 1, alínea a) do Código dos Contratos Públicos",30-11-2018,"13.216,28 €",Revogação do contrato entre as partes,Revogação do contrato entre as partes,,Não aplicável.,Não aplicável.,FALSE
Aquisição de serviços para apoio técnico ao DPS da ACSS,Ajuste Direto Regime Geral,Aquisição de serviços,"71356300-1, Serviços de apoio técnico","Administração Central do Sistema de Saúde, I. P. (508188423)",Tânia Marisa Maciel Morgado Almeida (206484267),"14.417,76 €",16-01-2018,04-01-2018,365 dias,"Portugal, Lisboa, Lisboa","Artigo 20.º, n.º 1, alínea a) do Código dos Contratos Públicos",30-11-2018,"13.216,28 €","",revogação do contrato entre as partes,,Não aplicável.,Não aplicável.,FALSE
Aquisição de serviços para apoio técnico à UGCM na área das ciências Farmacêuticas,Ajuste Direto Regime Geral,Aquisição de serviços,"72221000-0, Serviços de consultoria em matéria de análise de gestão","Administração Central do Sistema de Saúde, I. P. (508188423)",Hélder André Martins Duarte (226468038),"14.499,96 €",16-01-2018,12-12-2017,1449996 dias,"Portugal, Lisboa, Lisboa","Artigo 20.º, n.º 1, alínea a) do Código dos Contratos Públicos",30-11-2018,"13.216,28 €","",revogação do contrato entre as partes,,Não aplicável.,Não aplicável.,FALSE
Aquisição de serviços para apoio técnico à UIE - Eng.º de Energia e Ambiente,Ajuste Direto Regime Geral,Aquisição de serviços,"71356300-1, Serviços de apoio técnico","Administração Central do Sistema de Saúde, I. P. (508188423)",Paulo Ricardo Mendonça Mil Homens (260436372),"14.417,76 €",16-01-2018,12-12-2017,365 dias,"Portugal, Lisboa, Lisboa","Artigo 20.º, n.º 1, alínea a) do Código dos Contratos Públicos",31-10-2018,"12.014,80 €",Regularização  ao Abrigo do PREVPAP,Revogação entre as partes,,Não aplicável.,Não aplicável.,FALSE
Aquisição de serviços de consultoria na área médica e colaboração na definição de estratégia e planeamento,Ajuste Direto Regime Geral,Aquisição de serviços,"73200000-4, Serviços de consultoria em matéria de investigação e desenvolvimento","Administração Central do Sistema de Saúde, I. P. (508188423)",Multimedicina (503384887),"21.660,00 €",16-01-2018,12-12-2017,365 dias,"Portugal, Lisboa, Lisboa","Artigo 20.º, n.º 1, alínea a) do Código dos Contratos Públicos",31-12-2018,"21.660,00 €","","",,Não aplicável.,Não aplicável.,FALSE
"Aquisição de serviços para o programa iniciativas em saúde pública, no âmbito dos EEA Grants -área Financeira",Ajuste Direto Regime Geral,Aquisição de serviços,"66171000-9, Serviços de consultoria financeira","Administração Central do Sistema de Saúde, I. P. (508188423)",Carmen Susana Costa (223471801),"17.529,48 €",16-01-2018,11-12-2017,365 dias,"Portugal, Lisboa, Lisboa","Artigo 20.º, n.º 1, alínea a) do Código dos Contratos Públicos",30-11-2018,"16.068,69 €","",revogação  do contrato entre as partes,,Não aplicável.,Não aplicável.,FALSE
Aquisição de serviços para apoio técnico ao DRH da ACSS,Ajuste Direto Regime Geral,Aquisição de serviços,"71356300-1, Serviços de apoio técnico","Administração Central do Sistema de Saúde, I. P. (508188423)",Sara Elisabete Gonçalves da Silva (256750220),"14.417,76 €",16-01-2018,04-01-2018,365 dias,"Portugal, Lisboa, Lisboa","Artigo 20.º, n.º 1, alínea a) do Código dos Contratos Públicos",30-11-2018,"13.216,28 €","",revogação do contrato entre as partes,,Não aplicável.,Não aplicável.,FALSE
Aquisição de serviços para apoio técnico à UIE área Eng. do Ambiente,Ajuste Direto Regime Geral,Aquisição de serviços,"71356000-8, Serviços técnicos","Administração Central do Sistema de Saúde, I. P. (508188423)",Lúcia Patricia Alves Dantas  (218086571),"14.417,76 €",16-01-2018,12-12-2017,365 dias,"Portugal, Lisboa, Lisboa","Artigo 20.º, n.º 1, alínea a) do Código dos Contratos Públicos",31-10-2018,"12.014,80 €",Regularização  ao Abrigo do PREVPAP,Revogação entre as partes.,,Não aplicável.,Não aplicável.,FALSE
Prestação de Serviços de Vigilância e Segurança Humana e de ligação à Central de receção e monitorização de alarmes.,Ao abrigo de acordo-quadro (art.º 259.º),Aquisição de serviços,"79710000-4, Serviços de segurança","Administração Central do Sistema de Saúde, I. P. (508188423)",PRESTIBEL (501326456),"101.719,08 €",16-01-2018,11-12-2017,365 dias,"Portugal, Lisboa, Lisboa",Artigo 259.º do Código dos Contratos Públicos,31-12-2018,"101.719,08 €","","",,613183,Acordo quadro para a prestação de serviços de vigilância e segurança,FALSE
