Objeto do Contrato,Tipo de Procedimento,Tipo(s) de Contrato,CPVs,Entidade(s) Adjudicante(s),Entidade(s) Adjudicatária(s),Preço Contratual,Data de Publicação,Data de Celebração do Contrato,Prazo de Execução,Local de Execução,Fundamentação,Data de Fecho do Contrato,Preço Total Efetivo,Causas das Alterações ao Prazo,Causas das Alterações ao Preço,Estado,N.º registo do Acordo Quadro,Descrição do Acordo Quadro,Procedimento Centralizado
Aquisição de DM oftalmologia,Concurso público,Aquisição de bens móveis,"33190000-8, Dispositivos e produtos médicos variados","Hospital do Espírito Santo de Évora, E.P.E. (508085888)","Oftaltec (503197149), Abbott Medical (980262364), Alcon (501251685), Optifar (501609377), Bausch & Lomb (980218764), Filsat (506708616)","380.520,00 €",27-02-2014,13-01-2014,365 dias,"Portugal, Évora, Évora","Artigo 20.º, n.º 1, alínea b) do Código dos Contratos Públicos",,,,,,Não aplicável.,Não aplicável.,FALSE
"Aquisição de DM, cateteres e fios guia",Concurso público,Aquisição de bens móveis,"33141210-5, Cateteres de balão","Hospital do Espírito Santo de Évora, E. P. E. (508085888)","Terumo (980472024), Medtrónic Portugal (504223933)","92.117,50 €",27-02-2014,05-02-2014,365 dias,"Portugal, Évora, Évora","Artigo 20.º, n.º 1, alínea b) do Código dos Contratos Públicos",,,,,,Não aplicável.,Não aplicável.,FALSE
"190027/13 - PET, Tomografia de Positrões",Concurso público,Aquisição de serviços,"85150000-5, Serviços de imagiologia médica","Hospital do Espírito Santo de Évora, E. P. E. (508085888)",FUNDAÇÃO D ANNA S C DR CARLOS M CHAMPALIMAUD (507131827),"8.490,57 €",26-02-2014,06-11-2013,60 dias,"Portugal, Évora, Évora","Artigo 20.º, n.º 1, alínea b) do Código dos Contratos Públicos",,,,,,Não aplicável.,Não aplicável.,FALSE
Aquisição de MCDT,Concurso público,Aquisição de serviços,"85150000-5, Serviços de imagiologia médica","Hospital do Espírito Santo de Évora, E. P. E. (508085888)",Clinica do Coração do Alentejo (502376457),"24.257,64 €",21-02-2014,14-02-2014,365 dias,"Portugal, Évora, Évora","Artigo 20.º, n.º 1, alínea b) do Código dos Contratos Públicos",,,,,,Não aplicável.,Não aplicável.,FALSE
Acessos Venosos,Concurso público,Aquisição de serviços,"85121220-1, Serviços especializados de nefrologia ou do sistema nervoso","Hospital do Espírito Santo de Évora, E.P.E. (508085888)",Hospital Cuf Infante Santo (500142742),"76.900,00 €",21-02-2014,30-01-2014,365 dias,"Portugal, Lisboa, Lisboa","Artigo 20.º, n.º 1, alínea b) do Código dos Contratos Públicos",,,,,,Não aplicável.,Não aplicável.,FALSE
