Objeto do Contrato,Tipo de Procedimento,Tipo(s) de Contrato,CPVs,Entidade(s) Adjudicante(s),Entidade(s) Adjudicatária(s),Preço Contratual,Data de Publicação,Data de Celebração do Contrato,Prazo de Execução,Local de Execução,Fundamentação,Data de Fecho do Contrato,Preço Total Efetivo,Causas das Alterações ao Prazo,Causas das Alterações ao Preço,Estado,N.º registo do Acordo Quadro,Descrição do Acordo Quadro,Procedimento Centralizado
Aquisição de KIT´S ginecológicos para o processamento de citologia cervical em meio líquido.,Concurso público,Aquisição de bens móveis,"33141625-7, Kits de diagnóstico","Administração Regional de Saúde do Algarve, I. P. (503148709)","HOLOGIC IBERIA, S.L (980277230)","202.400,00 €",11-02-2015,23-01-2015,365 dias,"Portugal, Faro","Artigo 20.º, n.º 1, alínea b) do Código dos Contratos Públicos",18-11-2015,"202.400,00 €",Quantidades fornecidas.,"",,Não aplicável.,Não aplicável.,FALSE
Aquisição de seguro automóvel para as viaturas da sede da ARS e dos ACES.,Ajuste Direto Regime Geral,Aquisição de serviços,"66514110-0, Serviços de seguro automóvel","Administração Regional de Saúde do Algarve, I. P. (503148709)","MACIF PORTUGAL, Companhia de Seguros, S.A  (503640549)","6.667,75 €",05-02-2015,25-01-2015,365 dias,"Portugal, Faro, Faro","Artigo 20.º, n.º 1, alínea a) do Código dos Contratos Públicos",24-01-2016,"6.667,75 €","","",,Não aplicável.,Não aplicável.,FALSE
Não exigível redução do contrato a escrito - Lote 4 - Aquisição de electroforese de proteínas (Posição 98) para o período de 15-01-2015 a 14-01-2018.,Concurso público,Aquisição de bens móveis,"33696600-1, Reagentes para electroforese","Administração Regional de Saúde do Algarve, I. P. (503148709)","Phadia Sociedade Unipessoal, Lda. (506916243)","9.900,00 €",04-02-2015,15-01-2015,1095 dias,"Portugal, Faro, Faro","Artigo 20.º, n.º 1, alínea b) do Código dos Contratos Públicos",07-02-2017,"9.900,00 €","","",,Não aplicável.,Não aplicável.,FALSE
Não exigível redução do contrato a escrito - Lote 3 - Aquisição de testes Serologia (Posições 85 a 97) para o período de 15-01-2015 a 14-01-2018.,Concurso público,Aquisição de bens móveis,"33696500-0, Reagentes de laboratório","Administração Regional de Saúde do Algarve, I. P. (503148709)","Vidrolab 2 - Equipamentos e Materiais de Laboratório, Análise, Diagnóstico e Saúde, S. A. (501450629)","4.167,01 €",04-02-2015,15-01-2015,1095 dias,"Portugal, Faro, Faro","Artigo 20.º, n.º 1, alínea b) do Código dos Contratos Públicos",25-06-2015,"221,36 €","",quantidades encomendas e satisfeitas.,,Não aplicável.,Não aplicável.,FALSE
Contrato 4/2015 - Lote 2 - Aquisição de testes Urina II (Posições 83 a 84) para o período de 15-01-2015 a 14-01-2018.,Concurso público,Aquisição de bens móveis,"33696500-0, Reagentes de laboratório","Administração Regional de Saúde do Algarve, I. P. (503148709)","Menarini Diagnósticos - Material de Laboratório, Lda. (502610069)","38.000,00 €",04-02-2015,15-01-2015,1095 dias,"Portugal, Faro, Faro","Artigo 20.º, n.º 1, alínea b) do Código dos Contratos Públicos",29-11-2017,"14.154,00 €","",quantidades encomendadas e satisfeitas,,Não aplicável.,Não aplicável.,FALSE
Contrato 5/2015 - Lote 1 - Aquisição de testes de bioquímica e Imunoquimica (Posições 1 a 82) para o período de 15-01-2015 a 14-01-2018.,Concurso público,Aquisição de bens móveis,"33696500-0, Reagentes de laboratório","Administração Regional de Saúde do Algarve, I. P. (503148709)","Roche - Sistemas de Diagnóstico, Lda. (504282921)","467.921,02 €",04-02-2015,15-01-2015,1095 dias,"Portugal, Faro, Faro","Artigo 20.º, n.º 1, alínea b) do Código dos Contratos Públicos",14-12-2017,"208.717,37 €","",quantidades encomendadas e satisfeitas,,Não aplicável.,Não aplicável.,FALSE
AM 96/2015 - Aquisição de reagentes de Hemoglobina A1C,Ajuste Direto Regime Geral,Aquisição de bens móveis,"33696500-0, Reagentes de laboratório","Administração Regional de Saúde do Algarve, I. P. (503148709)","WERFEN PORTUGAL, LDA (501086110)","28.500,00 €",04-02-2015,02-02-2015,330 dias,"Portugal, Faro, Faro","Artigo 24.º, n.º 1, alínea e) do Código dos Contratos Públicos",17-02-2015,"28.500,00 €","","",,Não aplicável.,Não aplicável.,FALSE
Fornecimento de Refeições Confeccionadas e Serviços Associados nas instalações da  Unidade de Desabituação,Ajuste Direto Regime Geral,Aquisição de serviços,"55500000-5, Serviços de cantinas e de fornecimento de refeições (catering)","Administração Regional de Saúde do Algarve, I. P. (503148709)","SOCIGESTE-Serviços, Industria e Comércio de Refeições (504215965), GERTAL-Companhia Geral de Restaurantes e Alimentação, S.A (500126623), ITAU-Instituto Técnico de Alimentação Humana, S.A (500142858)","16.498,80 €",03-02-2015,20-01-2015,90 dias,"Portugal, Faro, Olhão","Artigo 20.º, n.º 1, alínea a) do Código dos Contratos Públicos",31-03-2015,"11.087,30 €","",Quantidades fornecidas.,,Não aplicável.,Não aplicável.,FALSE
AM 21/2015 - Aquisição de reagentes para controlo da qualidade da água para as USP,Ajuste Direto Regime Geral,Aquisição de bens móveis,"33696500-0, Reagentes de laboratório","Administração Regional de Saúde do Algarve, I. P. (503148709)","HANNA INSTRUMENTS PORTUGAL - instrumentos de controle, lda (502540141)","1.208,50 €",03-02-2015,02-02-2015,20 dias,"Portugal, Faro, Faro","Artigo 24.º, n.º 1, alínea e) do Código dos Contratos Públicos",26-02-2015,"1.208,50 €","","",,Não aplicável.,Não aplicável.,FALSE
