freguesia,acronym,validVotesPercentage,votes,dicofre
Parada,PPD/PSD.CDS-PP,66.83,139,180206
Parada,PS,14.9,31,180206
Parada,MPT,6.73,14,180206
Parada,PCP-PEV,4.33,9,180206
Parada,B.E.,1.44,3,180206
Parada,PCTP/MRPP,1.44,3,180206
Parada,PAN,0.96,2,180206
Parada,PND,0.96,2,180206
Parada,L,0.48,1,180206
Parada,MAS,0.48,1,180206
Parada,PNR,0.48,1,180206
Parada,PPM,0.48,1,180206
Parada,PTP,0.48,1,180206
Parada,PDA,0,0,180206
Parada,POUS,0,0,180206
Parada,PPV,0,0,180206
