freguesia,acronym,validVotesPercentage,votes,dicofre
Ponta Delgada (Santa Clara),PS,43.72,216,420325
Ponta Delgada (Santa Clara),PPD/PSD.CDS-PP,26.52,131,420325
Ponta Delgada (Santa Clara),MPT,9.51,47,420325
Ponta Delgada (Santa Clara),B.E.,5.67,28,420325
Ponta Delgada (Santa Clara),PCP-PEV,5.67,28,420325
Ponta Delgada (Santa Clara),PAN,2.43,12,420325
Ponta Delgada (Santa Clara),L,1.82,9,420325
Ponta Delgada (Santa Clara),PDA,1.42,7,420325
Ponta Delgada (Santa Clara),PND,1.01,5,420325
Ponta Delgada (Santa Clara),PCTP/MRPP,0.81,4,420325
Ponta Delgada (Santa Clara),MAS,0.61,3,420325
Ponta Delgada (Santa Clara),PPM,0.4,2,420325
Ponta Delgada (Santa Clara),PNR,0.2,1,420325
Ponta Delgada (Santa Clara),PTP,0.2,1,420325
Ponta Delgada (Santa Clara),POUS,0,0,420325
Ponta Delgada (Santa Clara),PPV,0,0,420325
