Objeto do Contrato,Tipo de Procedimento,Tipo(s) de Contrato,CPVs,Entidade(s) Adjudicante(s),Entidade(s) Adjudicatária(s),Preço Contratual,Data de Publicação,Data de Celebração do Contrato,Prazo de Execução,Local de Execução,Fundamentação,Data de Fecho do Contrato,Preço Total Efetivo,Causas das Alterações ao Prazo,Causas das Alterações ao Preço,Estado,N.º registo do Acordo Quadro,Descrição do Acordo Quadro,Procedimento Centralizado
Aquisição de serviços de manutenção de espaços existentes na AR61,Ajuste Direto Regime Geral,Aquisição de serviços,"50000000-5, Serviços de reparação e manutenção","SPMS - Serviços Partilhados do Ministério da Saúde, E. P. E. (509540716)","DIFERENTE E CINTILANTE, LDA (513868747)","74.200,00 €",28-09-2017,30-12-2016,365 dias,Portugal,"Artigo 20.º, n.º 1, alínea a) do Código dos Contratos Públicos",01-01-2018,"74.200,00 €",,,,Não aplicável.,Não aplicável.,FALSE
Aquisição de serviços de manutenção de espaços existentes nas instalações da SPMS no Porto,Ajuste Direto Regime Geral,Aquisição de serviços,"50700000-2, Serviços de reparação e manutenção de equipamento em edifícios","SPMS - Serviços Partilhados do Ministério da Saúde, E. P. E. (509540716)","Mário Calçada Pereira - Canalizações, Lda (510971369)","73.700,00 €",28-09-2017,30-12-2016,365 dias,Portugal,"Artigo 20.º, n.º 1, alínea a) do Código dos Contratos Públicos",29-12-2017,"73.700,00 €",,,,Não aplicável.,Não aplicável.,FALSE
Aquisição de Serviços de manutenção corretiva e evolutiva do SICA,Ao abrigo de acordo-quadro (art.º 259.º),Aquisição de serviços,"72500000-0, Serviços relacionados com a informática","SPMS - Serviços Partilhados do Ministério da Saúde, E. P. E. (509540716)",Novabase (504857312),"174.873,60 €",28-09-2017,16-08-2017,365 dias,Portugal,Artigo 259.º do Código dos Contratos Públicos,"","",,,,1423482,CELEBRAÇÃO DE ACORDO QUADRO PARA PRESTAÇÃO DE SERVIÇOS TIC E INTEROPERABILIDADE NA ÁREA DA SAÚDE,FALSE
"Aquisição de serviços de gestão e apoio ao projeto de vacinas na SPMS, EPE",Ajuste Direto Regime Geral,Outros Tipos (Concessão de exploração de bens do domínio público),"79411000-8, Serviços gerais de consultoria em matéria de gestão geral","SPMS- Serviços Partilhados do M. da Saúde, E.P.E. (509540716)","DARWING, Lda (514163755)","35.000,00 €",28-09-2017,29-06-2017,365 dias,Portugal,"Artigo 20.º, n.º 1, alínea a) do Código dos Contratos Públicos","","",,,,Não aplicável.,Não aplicável.,FALSE
Aquisição de serviços de gestão e monitorização do portal do SNS,Ajuste Direto Regime Geral,Outros Tipos (Concessão de exploração de bens do domínio público),"79411000-8, Serviços gerais de consultoria em matéria de gestão geral","SPMS- Serviços Partilhados do M. da Saúde, E.P.E. (509540716)","DARWING, Lda (514163755)","33.000,00 €",28-09-2017,29-06-2017,365 dias,Portugal,"Artigo 20.º, n.º 1, alínea a) do Código dos Contratos Públicos","","",,,,Não aplicável.,Não aplicável.,FALSE
Aquisição de serviços de manutenção de Bases de dados e manutenção de software Primavera,Ao abrigo de acordo-quadro (art.º 259.º),Aquisição de serviços,"72611000-6, Serviços de assistência técnica informática","SPMS - Serviços Partilhados do Ministério da Saúde, E. P. E. (509540716)","INCENTEA, SA (501968326)","16.501,95 €",28-09-2017,29-08-2017,227 dias,Portugal,Artigo 259.º do Código dos Contratos Públicos,29-12-2017,"16.501,95 €",,,,610968,Acordo quadro de licenciamento de software e serviços conexos,FALSE
Convite ao abrigo do acordo quadro - Aquisição de serviços de manutenção evolutiva e corretiva nos sistemas e projetos SLICA – SCLINICO Hospitalar  (Sub-lote 3),Ao abrigo de acordo-quadro (art.º 259.º),Aquisição de serviços,"72500000-0, Serviços relacionados com a informática","SPMS - Serviços Partilhados do Ministério da Saúde, E. P. E. (509540716)","AltranPortugal, S.A. (504272179)","194.304,00 €",28-09-2017,24-08-2017,900 dias,Portugal,Artigo 259.º do Código dos Contratos Públicos,"","",,,,1423482,CELEBRAÇÃO DE ACORDO QUADRO PARA PRESTAÇÃO DE SERVIÇOS TIC E INTEROPERABILIDADE NA ÁREA DA SAÚDE,FALSE
Convite ao abrigo do acordo quadro - Aquisição de serviços de apoio ao SCLINICO Hospitalar  (Sub-lote 2),Ao abrigo de acordo-quadro (art.º 259.º),Aquisição de serviços,"72500000-0, Serviços relacionados com a informática","SPMS - Serviços Partilhados do Ministério da Saúde, E. P. E. (509540716)","Timestamp - Sistemas de Informação, S.A. (506360237)","158.400,00 €",28-09-2017,24-08-2017,900 dias,Portugal,Artigo 259.º do Código dos Contratos Públicos,"","",,,,1423482,CELEBRAÇÃO DE ACORDO QUADRO PARA PRESTAÇÃO DE SERVIÇOS TIC E INTEROPERABILIDADE NA ÁREA DA SAÚDE,FALSE
Aquisição de serviços auxiliares dos transportes rodoviarios  (Estacionamento),Ajuste Direto Regime Geral,Aquisição de serviços,"98351100-9, Serviços de parques de estacionamento","SPMS - Serviços Partilhados do Ministério da Saúde, E. P. E. (509540716)","Empark II - Gestão e Exploração de Estacionamentos, S.A (502936312)","19.434,14 €",28-09-2017,10-08-2017,710 dias,Portugal,"Artigo 20.º, n.º 1, alínea a) do Código dos Contratos Públicos","","",,,,Não aplicável.,Não aplicável.,FALSE
Convite ao abrigo do acordo quadro - Aquisição de serviços para análise funcional nos sistemas e projetos SLICA-SCLINICO Hospitalar (Sub-lote 1),Ao abrigo de acordo-quadro (art.º 259.º),Aquisição de serviços,"72500000-0, Serviços relacionados com a informática","SPMS - Serviços Partilhados do Ministério da Saúde, E. P. E. (509540716)","AltranPortugal, S.A. (504272179)","158.385,60 €",28-09-2017,24-08-2017,900 dias,Portugal,Artigo 259.º do Código dos Contratos Públicos,"","",,,,1423482,CELEBRAÇÃO DE ACORDO QUADRO PARA PRESTAÇÃO DE SERVIÇOS TIC E INTEROPERABILIDADE NA ÁREA DA SAÚDE,FALSE
Aquisição de serviços de manutenção do licenciamento do SAAS para gestão especializada de terminologia clínica (Healthterm),Ajuste Direto Regime Geral,Aquisição de serviços,"72267100-0, Manutenção de software para as tecnologias da infomação","SPMS - Serviços Partilhados do Ministério da Saúde, E. P. E. (509540716)",Carecom A/S (24242005),"75.000,00 €",28-09-2017,21-08-2017,547 dias,Portugal,"Artigo 24.º, n.º 1, alínea e) do Código dos Contratos Públicos","","",,,,Não aplicável.,Não aplicável.,FALSE
"Aquisição de Serviços de Manutenção Corretiva, Evolutiva e Preventiva do SIGEF",Concurso público,Aquisição de serviços,"72500000-0, Serviços relacionados com a informática","SPMS- Serviços Partilhados do M. da Saúde, E.P.E. (509540716)","AltranPortugal, S.A. (504272179)","84.965,76 €",28-09-2017,14-08-2017,365 dias,Portugal,Artigo 28.º do Código dos Contratos Públicos,"","",,,,Não aplicável.,Não aplicável.,FALSE
Aquisição de serviços especializados na área de anatomia patológica para o Centro Nacional de Telesaúde,Ajuste Direto Regime Geral,Aquisição de serviços,"71319000-7, Serviços de consultoria de peritos","SPMS - Serviços Partilhados do Ministério da Saúde, E. P. E. (509540716)","LFG - Prestação de Serviços, Lda (513440755)","18.396,00 €",28-09-2017,14-08-2017,365 dias,Portugal,"Artigo 20.º, n.º 1, alínea a) do Código dos Contratos Públicos","","",,,,Não aplicável.,Não aplicável.,FALSE
