freguesia,acronym,validVotesPercentage,votes,dicofre
Silvares,PS,54.83,159,050424
Silvares,PPD/PSD.CDS-PP,23.45,68,050424
Silvares,PCP-PEV,4.83,14,050424
Silvares,MPT,4.48,13,050424
Silvares,B.E.,4.14,12,050424
Silvares,PCTP/MRPP,2.76,8,050424
Silvares,L,1.72,5,050424
Silvares,PND,1.03,3,050424
Silvares,PTP,1.03,3,050424
Silvares,PAN,0.69,2,050424
Silvares,PPV,0.69,2,050424
Silvares,POUS,0.34,1,050424
Silvares,MAS,0,0,050424
Silvares,PDA,0,0,050424
Silvares,PNR,0,0,050424
Silvares,PPM,0,0,050424
