Objeto do Contrato,Tipo de Procedimento,Tipo(s) de Contrato,CPVs,Entidade(s) Adjudicante(s),Entidade(s) Adjudicatária(s),Preço Contratual,Data de Publicação,Data de Celebração do Contrato,Prazo de Execução,Local de Execução,Fundamentação,Data de Fecho do Contrato,Preço Total Efetivo,Causas das Alterações ao Prazo,Causas das Alterações ao Preço,Estado,N.º registo do Acordo Quadro,Descrição do Acordo Quadro,Procedimento Centralizado
4S0043/2017 SERV MED NO AMBITO DA VMER (INCLUI COORDENAÇÃO OPERACIONAL DAS EQUIPAS DA VMER) P/ ANO 2017,Ajuste Direto Regime Geral,Aquisição de serviços,"85100000-0, Serviços de saúde","Centro Hospitalar Barreiro Montijo, E. P. E. (509186998)",Raíz Binária Lda (513213392),"29.640,00 €",20-04-2018,13-02-2017,365 dias,"Portugal, Setúbal, Barreiro","Artigo 20.º, n.º 1, alínea a) do Código dos Contratos Públicos",31-12-2017,"13.674,67 €",,Consumo efetivo inferior ao estimado,,Não aplicável.,Não aplicável.,FALSE
FI0010/2018- MED. GRUPO 4: SANGUE,Ao abrigo de acordo-quadro (art.º 259.º),Aquisição de bens móveis,"33600000-6, Produtos farmacêuticos","CHBM - Centro Hospital Barreiro Montijo, EPE (509186998)","UNILFARMA, LDA (500293023)","6.204,60 €",20-04-2018,20-12-2017,365 dias,"Portugal, Setúbal, Barreiro",Artigo 259.º do Código dos Contratos Públicos,"","",,"",,2489595,CP 2016/18 - Acordo quadro para fornecimento de Medicamentos do Grupo 4: Sangue às Instituições e Serviços do Serviço Nacional de Saúde,FALSE
FI0010/2018- MED. GRUPO 4: SANGUE,Ao abrigo de acordo-quadro (art.º 259.º),Aquisição de bens móveis,"33600000-6, Produtos farmacêuticos","CHBM - Centro Hospital Barreiro Montijo, EPE (509186998)","BAYER PORTUGAL, S.A. (500043256)","350,00 €",20-04-2018,20-12-2017,365 dias,"Portugal, Setúbal, Barreiro",Artigo 259.º do Código dos Contratos Públicos,"","",,"",,2489595,CP 2016/18 - Acordo quadro para fornecimento de Medicamentos do Grupo 4: Sangue às Instituições e Serviços do Serviço Nacional de Saúde,FALSE
FI0010/2018- MED. GRUPO 4: SANGUE,Ao abrigo de acordo-quadro (art.º 259.º),Aquisição de bens móveis,"33600000-6, Produtos farmacêuticos","CHBM - Centro Hospital Barreiro Montijo, EPE (509186998)","B. BRAUN MEDICAL, LDA (501506543)","560,00 €",20-04-2018,20-12-2017,365 dias,"Portugal, Setúbal, Barreiro",Artigo 259.º do Código dos Contratos Públicos,"","",,"",,2489595,CP 2016/18 - Acordo quadro para fornecimento de Medicamentos do Grupo 4: Sangue às Instituições e Serviços do Serviço Nacional de Saúde,FALSE
FI0010/2018- MED. GRUPO 4: SANGUE,Ao abrigo de acordo-quadro (art.º 259.º),Aquisição de bens móveis,"33600000-6, Produtos farmacêuticos","CHBM - Centro Hospital Barreiro Montijo, EPE (509186998)","LABORATORIOS PFIZER, S.A. (500162166)","9.090,00 €",20-04-2018,20-12-2017,365 dias,"Portugal, Setúbal, Barreiro",Artigo 259.º do Código dos Contratos Públicos,"","",,"",,2489595,CP 2016/18 - Acordo quadro para fornecimento de Medicamentos do Grupo 4: Sangue às Instituições e Serviços do Serviço Nacional de Saúde,FALSE
FI0010/2018- MED. GRUPO 4: SANGUE,Ao abrigo de acordo-quadro (art.º 259.º),Aquisição de bens móveis,"33600000-6, Produtos farmacêuticos","CHBM - Centro Hospital Barreiro Montijo, EPE (509186998)","ACCORD HEALTHCARE, UNIPESSOAL, LDA (508622263)","93,70 €",20-04-2018,20-12-2017,365 dias,"Portugal, Setúbal, Barreiro",Artigo 259.º do Código dos Contratos Públicos,"","",,"",,2489595,CP 2016/18 - Acordo quadro para fornecimento de Medicamentos do Grupo 4: Sangue às Instituições e Serviços do Serviço Nacional de Saúde,FALSE
FI0010/2018- MED. GRUPO 4: SANGUE,Ao abrigo de acordo-quadro (art.º 259.º),Aquisição de bens móveis,"33600000-6, Produtos farmacêuticos","CHBM - Centro Hospital Barreiro Montijo, EPE (509186998)","ROCHE FARMACEUTICA QUIMICA, LDA (500233810)","6.000,00 €",20-04-2018,20-12-2017,365 dias,"Portugal, Setúbal, Barreiro",Artigo 259.º do Código dos Contratos Públicos,"","",,"",,2489595,CP 2016/18 - Acordo quadro para fornecimento de Medicamentos do Grupo 4: Sangue às Instituições e Serviços do Serviço Nacional de Saúde,FALSE
FI0010/2018- MED. GRUPO 4: SANGUE,Ao abrigo de acordo-quadro (art.º 259.º),Aquisição de bens móveis,"33600000-6, Produtos farmacêuticos","CHBM - Centro Hospital Barreiro Montijo, EPE (509186998)","OM PHARMA, SA (500207410)","104.917,40 €",20-04-2018,20-12-2017,365 dias,"Portugal, Setúbal, Barreiro",Artigo 259.º do Código dos Contratos Públicos,"","",,"",,2489595,CP 2016/18 - Acordo quadro para fornecimento de Medicamentos do Grupo 4: Sangue às Instituições e Serviços do Serviço Nacional de Saúde,FALSE
FI0010/2018- MED. GRUPO 4: SANGUE,Ao abrigo de acordo-quadro (art.º 259.º),Aquisição de bens móveis,"33600000-6, Produtos farmacêuticos","CHBM - Centro Hospital Barreiro Montijo, EPE (509186998)",LABORATORIOS BIAL (500220913),"1.303,40 €",20-04-2018,20-12-2017,365 dias,"Portugal, Setúbal, Barreiro",Artigo 259.º do Código dos Contratos Públicos,"","",,"",,2489595,CP 2016/18 - Acordo quadro para fornecimento de Medicamentos do Grupo 4: Sangue às Instituições e Serviços do Serviço Nacional de Saúde,FALSE
FI0010/2018- MED. GRUPO 4: SANGUE,Ao abrigo de acordo-quadro (art.º 259.º),Aquisição de bens móveis,"33600000-6, Produtos farmacêuticos","CHBM - Centro Hospital Barreiro Montijo, EPE (509186998)","GENERIS-FARMACEUTICA, S.A. (508107997)","4.854,50 €",20-04-2018,20-12-2017,365 dias,"Portugal, Setúbal, Barreiro",Artigo 259.º do Código dos Contratos Públicos,"","",,"",,2489595,CP 2016/18 - Acordo quadro para fornecimento de Medicamentos do Grupo 4: Sangue às Instituições e Serviços do Serviço Nacional de Saúde,FALSE
FI0010/2018 - MEDICAMENTOS GRUPO 4 - SANGUE,Ao abrigo de acordo-quadro (art.º 259.º),Aquisição de bens móveis,"33600000-6, Produtos farmacêuticos","CHBM - Centro Hospital Barreiro Montijo, EPE (509186998)","SPCARE ESPECIALIDADES FARMACEUTICAS, LDA (508284872)","10,02 €",19-04-2018,20-12-2017,365 dias,"Portugal, Setúbal, Barreiro",Artigo 259.º do Código dos Contratos Públicos,"","",,"",,2489595,CP 2016/18 - Acordo quadro para fornecimento de Medicamentos do Grupo 4: Sangue às Instituições e Serviços do Serviço Nacional de Saúde,FALSE
F60008/2018 - MATÉRIAS PRIMAS,Consulta Prévia,Aquisição de bens móveis,"33600000-6, Produtos farmacêuticos","Centro Hospitalar Barreiro Montijo, E. P. E. (509186998)",LABORSPIRIT (507485149),"744,06 €",19-04-2018,27-03-2018,365 dias,"Portugal, Setúbal, Barreiro","Artigo 20.º, n.º 1, alínea c) do Código dos Contratos Públicos","","",,"",,Não aplicável.,Não aplicável.,FALSE
F60008/2018 -MATÉRIAS PRIMAS,Consulta Prévia,Aquisição de bens móveis,"33600000-6, Produtos farmacêuticos","Centro Hospitalar Barreiro Montijo, E. P. E. (509186998)","Z-MED EQUIPAMENTOS MÉDICOS E HOSPITALARES, LDA (508531535)","577,49 €",19-04-2018,27-03-2018,365 dias,"Portugal, Setúbal, Barreiro","Artigo 20.º, n.º 1, alínea c) do Código dos Contratos Públicos","","",,"",,Não aplicável.,Não aplicável.,FALSE
F60008/2018 - MATÉRIAS PRIMAS,Consulta Prévia,Aquisição de bens móveis,"33600000-6, Produtos farmacêuticos","Centro Hospitalar Barreiro Montijo, E. P. E. (509186998)","JOSE MANUEL GOMES DOS SANTOS, LDA (501399224)","283,23 €",18-04-2018,27-03-2018,365 dias,"Portugal, Setúbal, Barreiro","Artigo 20.º, n.º 1, alínea c) do Código dos Contratos Públicos","","",,"",,Não aplicável.,Não aplicável.,FALSE
F60008/2018 - MATÉRIAS PRIMAS,Consulta Prévia,Aquisição de bens móveis,"33600000-6, Produtos farmacêuticos","Centro Hospitalar Barreiro Montijo, E. P. E. (509186998)","VWR INTERNACIONAL - MATERIAL DE LABORATÓRIO, LDA. (503842770)","3.883,11 €",18-04-2018,27-03-2018,365 dias,"Portugal, Setúbal, Barreiro","Artigo 20.º, n.º 1, alínea c) do Código dos Contratos Públicos","","",,"",,Não aplicável.,Não aplicável.,FALSE
F60008/2018 - MATÉRIAS PRIMAS,Consulta Prévia,Aquisição de bens móveis,"33600000-6, Produtos farmacêuticos","Centro Hospitalar Barreiro Montijo, E. P. E. (509186998)",ALCON PORTUGAL (501251685),"1.476,00 €",18-04-2018,27-03-2018,365 dias,"Portugal, Setúbal, Barreiro","Artigo 20.º, n.º 1, alínea c) do Código dos Contratos Públicos","","",,"",,Não aplicável.,Não aplicável.,FALSE
F60008/2018 - MATÉRIAS PRIMAS,Consulta Prévia,Aquisição de bens móveis,"33600000-6, Produtos farmacêuticos","Centro Hospitalar Barreiro Montijo, E. P. E. (509186998)","ENZYMATIC, SA (510662625)","163,68 €",17-04-2018,27-03-2018,365 dias,"Portugal, Setúbal, Barreiro","Artigo 20.º, n.º 1, alínea c) do Código dos Contratos Públicos","","",,"",,Não aplicável.,Não aplicável.,FALSE
"4S0099/2017 SERV MED NO AMBITO DA VMER, COM INICIO 1 DE AGOSTO - DR. PEDRO BATARDA SENA",Ajuste Direto Regime Geral,Aquisição de serviços,"85100000-0, Serviços de saúde","Centro Hospitalar Barreiro Montijo, E. P. E. (509186998)","3HEALTH - MEDICAL CARE, LDA. (513707182)","15.422,88 €",16-04-2018,08-08-2017,365 dias,"Portugal, Setúbal, Barreiro","Artigo 20.º, n.º 1, alínea a) do Código dos Contratos Públicos",31-12-2017,"9.464,04 €",,Consumo efetivo inferior ao estimado,,Não aplicável.,Não aplicável.,FALSE
"F60012/2018 - ATROPINA 0,5MG (0,1 MG/ML SER PRE-CHEIA 5ML) SOL INJ",Consulta Prévia,Aquisição de bens móveis,"33600000-6, Produtos farmacêuticos","Centro Hospitalar Barreiro Montijo, E. P. E. (509186998)","BIOJAM, SA (513642749)","7.485,00 €",13-04-2018,09-04-2018,365 dias,"Portugal, Setúbal, Barreiro","Artigo 20.º, n.º 1, alínea c) do Código dos Contratos Públicos","","",,"",,Não aplicável.,Não aplicável.,FALSE
FEXC0010/2018 - AZUL DE METILENO 50 MG (5 MG/ML FRS 10 ML) SOL INJ,Consulta Prévia,Aquisição de bens móveis,"33600000-6, Produtos farmacêuticos","Centro Hospitalar Barreiro Montijo, E. P. E. (509186998)","LABESFAL-L. ESP. FARM. ALMIRO, (501169580)","8.614,32 €",13-04-2018,12-02-2018,365 dias,"Portugal, Setúbal, Barreiro","Artigo 20.º, n.º 1, alínea c) do Código dos Contratos Públicos","","",,"",,Não aplicável.,Não aplicável.,FALSE
F60005/2018 - TENOFOVIR 245MG COMP REVEST,Consulta Prévia,Aquisição de bens móveis,"33600000-6, Produtos farmacêuticos","Centro Hospitalar Barreiro Montijo, E. P. E. (509186998)","TEVA-PHARMA - PRODUTOS FARMACÊUTICOS, LDA. (507045491)","15.195,60 €",13-04-2018,23-01-2018,365 dias,"Portugal, Setúbal, Barreiro","Artigo 20.º, n.º 1, alínea c) do Código dos Contratos Públicos","","",,"",,Não aplicável.,Não aplicável.,FALSE
F60003/2018 - ABACAVIR 600MG + LAMIVUDINA 300MG COMP,Consulta Prévia,Aquisição de bens móveis,"33600000-6, Produtos farmacêuticos","Centro Hospitalar Barreiro Montijo, E. P. E. (509186998)","TEVA-PHARMA - PRODUTOS FARMACÊUTICOS, LDA. (507045491)","17.199,00 €",13-04-2018,08-02-2018,365 dias,"Portugal, Setúbal, Barreiro","Artigo 20.º, n.º 1, alínea c) do Código dos Contratos Públicos","","",,"",,Não aplicável.,Não aplicável.,FALSE
FEXC0062/2018 - MEDICAMENTOS LOGIFARMA,Ajuste Direto Regime Geral,Aquisição de bens móveis,"33600000-6, Produtos farmacêuticos","Centro Hospitalar Barreiro Montijo, E. P. E. (509186998)","LOGIFARMA - LOGISTICA FARMACEUTICA, S.A. (503934640)","4.612,00 €",13-04-2018,27-03-2018,365 dias,"Portugal, Setúbal, Barreiro","Artigo 24.º, n.º 1, alínea e), subalínea iii) do Código dos Contratos Públicos","","",,"",,Não aplicável.,Não aplicável.,FALSE
FEXC0061/2018 - DIGOXINA 0.125 E 0.25MG COMP E 0.5MG SOL INJ,Ajuste Direto Regime Geral,Aquisição de bens móveis,"33600000-6, Produtos farmacêuticos","Centro Hospitalar Barreiro Montijo, E. P. E. (509186998)",BDRPHARMA (513077332),"383,15 €",13-04-2018,14-03-2018,365 dias,"Portugal, Setúbal, Barreiro","Artigo 24.º, n.º 1, alínea e), subalínea iii) do Código dos Contratos Públicos","","",,"",,Não aplicável.,Não aplicável.,FALSE
FEXC0060/2018 - TICAGRELOR 90 MG COMP REVES,Ajuste Direto Regime Geral,Aquisição de bens móveis,"33600000-6, Produtos farmacêuticos","Centro Hospitalar Barreiro Montijo, E. P. E. (509186998)","ASTRA ZENECA - PROD.FARMACEUTICOS, LDA. (502942240)","2.948,70 €",13-04-2018,14-03-2018,365 dias,"Portugal, Setúbal, Barreiro","Artigo 24.º, n.º 1, alínea e), subalínea iii) do Código dos Contratos Públicos","","",,"",,Não aplicável.,Não aplicável.,FALSE
FEXC0059/2018 - ZUCLOPENTIXOL 200 MG/ML AMP SOL INJ,Ajuste Direto Regime Geral,Aquisição de bens móveis,"33600000-6, Produtos farmacêuticos","Centro Hospitalar Barreiro Montijo, E. P. E. (509186998)","LUNDBECK PORTUGAL - PRODUTOS FARMACÊUTICOS, LDA. (503573922)","4.910,50 €",12-04-2018,14-03-2018,365 dias,"Portugal, Setúbal, Barreiro","Artigo 24.º, n.º 1, alínea e), subalínea iii) do Código dos Contratos Públicos","","",,"",,Não aplicável.,Não aplicável.,FALSE
FEXC0056/2018 - CETRIMIDA 0.5% + CLORO-HEXIDINA 10MG/GR - EXCLUSIVO CS PORTUGAL,Ajuste Direto Regime Geral,Aquisição de bens móveis,"33600000-6, Produtos farmacêuticos","Centro Hospitalar Barreiro Montijo, E. P. E. (509186998)","C.S. PORTUGAL - PRODUTOS FARMACÊUTICOS, LDA. (503395960)","4.017,50 €",12-04-2018,13-03-2018,365 dias,"Portugal, Setúbal, Barreiro","Artigo 24.º, n.º 1, alínea e), subalínea iii) do Código dos Contratos Públicos","","",,"",,Não aplicável.,Não aplicável.,FALSE
FEXC0055/2018 - HEXAFLURETO DE ENXOFRE 8 MCG/ML,Ajuste Direto Regime Geral,Aquisição de bens móveis,"33600000-6, Produtos farmacêuticos","Centro Hospitalar Barreiro Montijo, E. P. E. (509186998)","LAB. FARMACÊUTICOS ROVI, S.A. (980166705)","3.500,00 €",12-04-2018,06-03-2018,365 dias,"Portugal, Setúbal, Barreiro","Artigo 24.º, n.º 1, alínea e), subalínea iii) do Código dos Contratos Públicos","","",,"",,Não aplicável.,Não aplicável.,FALSE
FEXC0054/2018- VORICONAZOL 200MG (10MG/ML FRS/AMP 20ML) SOL INJ,Ajuste Direto Regime Geral,Aquisição de bens móveis,"33600000-6, Produtos farmacêuticos","CHBM - Centro Hospital Barreiro Montijo, EPE (509186998)","LABORATORIOS PFIZER, S.A. (500162166)","1.800,00 €",12-04-2018,13-03-2018,365 dias,"Portugal, Setúbal, Barreiro","Artigo 24.º, n.º 1, alínea e) do Código dos Contratos Públicos","","",,"",,Não aplicável.,Não aplicável.,FALSE
4EXC0014/2018 AMPOLA P RX,Ajuste Direto Regime Geral,Aquisição de bens móveis,"33000000-0, Equipamento médico, medicamentos e produtos para cuidados pessoais","Centro Hospitalar Barreiro Montijo, E. P. E. (509186998)","SIEMENS HEALTHCARE, LDA. (507925173)","60.000,00 €",12-04-2018,04-01-2018,20 dias,"Portugal, Setúbal, Barreiro","Artigo 24.º, n.º 1, alínea e), subalínea iii) do Código dos Contratos Públicos",26-01-2018,"60.000,00 €",,"",,Não aplicável.,Não aplicável.,FALSE
FEXC0052/2018 - OXITOCINA E CLOMIPRAMINA,Ajuste Direto Regime Geral,Aquisição de bens móveis,"33600000-6, Produtos farmacêuticos","Centro Hospitalar Barreiro Montijo, E. P. E. (509186998)",ALFASIGMA PORT. LDA (EX-ALFA WASSERMANN) (502857722),"1.240,54 €",12-04-2018,28-02-2018,365 dias,"Portugal, Setúbal, Barreiro","Artigo 24.º, n.º 1, alínea e), subalínea iii) do Código dos Contratos Públicos","","",,"",,Não aplicável.,Não aplicável.,FALSE
FEXC0051/2018 - SOL SALINA EQUILIBRADA FRS 500 ML SOL IRRIGAÇÃO,Ajuste Direto Regime Geral,Aquisição de bens móveis,"33600000-6, Produtos farmacêuticos","Centro Hospitalar Barreiro Montijo, E. P. E. (509186998)",ABBOTT MEDICAL OPTICS SPAIN (980262364),"2.170,00 €",12-04-2018,26-02-2018,365 dias,"Portugal, Setúbal, Barreiro","Artigo 24.º, n.º 1, alínea e), subalínea iii) do Código dos Contratos Públicos","","",,"",,Não aplicável.,Não aplicável.,FALSE
FEXC0050/2018 - CLORETO DE BENZALCÓNIO EM 2-PROPANOL FRS 250ML,Ajuste Direto Regime Geral,Aquisição de bens móveis,"33600000-6, Produtos farmacêuticos","Centro Hospitalar Barreiro Montijo, E. P. E. (509186998)","PAUL HARTMANN, LDA. (502271728)","290,00 €",12-04-2018,26-02-2018,365 dias,"Portugal, Setúbal, Barreiro","Artigo 24.º, n.º 1, alínea e), subalínea iii) do Código dos Contratos Públicos","","",,"",,Não aplicável.,Não aplicável.,FALSE
FEXC0046/2018 - COLISTINA 2.000.000 UI FRS/AMP PÓ,Ajuste Direto Regime Geral,Aquisição de bens móveis,"33600000-6, Produtos farmacêuticos","Centro Hospitalar Barreiro Montijo, E. P. E. (509186998)","PHARMIS BIOFARMACEUTICA, LDA. (502595442)","15.960,00 €",12-04-2018,28-02-2018,365 dias,"Portugal, Setúbal, Barreiro","Artigo 24.º, n.º 1, alínea e) do Código dos Contratos Públicos","","",,"",,Não aplicável.,Não aplicável.,FALSE
FEXC0018 - FOSFATO DISSÓDICO E MONOSSÓDICO ENEMA 118 ML,Ajuste Direto Regime Geral,Aquisição de bens móveis,"33600000-6, Produtos farmacêuticos","Centro Hospitalar Barreiro Montijo, E. P. E. (509186998)","JABA RECORDATI, S.A (500492867)","14.190,00 €",12-04-2018,27-01-2018,365 dias,"Portugal, Setúbal, Barreiro","Artigo 24.º, n.º 1, alínea e), subalínea iii) do Código dos Contratos Públicos","","",,"",,Não aplicável.,Não aplicável.,FALSE
FEXC0049/2018 - ETOMIDATO 20 MG (2 MG / 1ML AMP 10 ML) SOL INJ,Ajuste Direto Regime Geral,Aquisição de bens móveis,"33600000-6, Produtos farmacêuticos","Centro Hospitalar Barreiro Montijo, E. P. E. (509186998)","B. BRAUN MEDICAL, LDA (501506543)","229,87 €",12-04-2018,26-02-2018,365 dias,"Portugal, Setúbal, Barreiro","Artigo 24.º, n.º 1, alínea e), subalínea iii) do Código dos Contratos Públicos","","",,"",,Não aplicável.,Não aplicável.,FALSE
"FEXC0048/2018 - FENILEFRINA 0,25% + FENILEFRINA 0,5% GOTAS NASAIS",Ajuste Direto Regime Geral,Aquisição de bens móveis,"33600000-6, Produtos farmacêuticos","Centro Hospitalar Barreiro Montijo, E. P. E. (509186998)","OMEGA PHARMA PORTUGUESA, LDA (506112233)","2.684,00 €",11-04-2018,28-02-2018,365 dias,"Portugal, Setúbal, Barreiro","Artigo 24.º, n.º 1, alínea e), subalínea iii) do Código dos Contratos Públicos","","",,"",,Não aplicável.,Não aplicável.,FALSE
FEXC0045/2018- LEVOSIMENDAN 12.5MG (2.5MG/ML FRS/AMP 5ML) SOL INJ,Ajuste Direto Regime Geral,Aquisição de bens móveis,"33600000-6, Produtos farmacêuticos","CHBM - Centro Hospital Barreiro Montijo, EPE (509186998)","ORIONFIN UNIPESSOAL, LDA (508907365)","9.431,90 €",11-04-2018,28-02-2018,365 dias,"Portugal, Setúbal, Barreiro","Artigo 24.º, n.º 1, alínea e) do Código dos Contratos Públicos","","",,"",,Não aplicável.,Não aplicável.,FALSE
FEXC0041/2018 - DINITRATO DE ISOSSORBIDO 10MG (1MG/ML AMP 10ML) SOL INJ,Ajuste Direto Regime Geral,Aquisição de bens móveis,"33600000-6, Produtos farmacêuticos","Centro Hospitalar Barreiro Montijo, E. P. E. (509186998)","SPCARE ESPECIALIDADES FARMACEUTICAS, LDA (508284872)","26.964,00 €",11-04-2018,15-02-2018,365 dias,"Portugal, Setúbal, Barreiro","Artigo 24.º, n.º 1, alínea e) do Código dos Contratos Públicos","","",,"",,Não aplicável.,Não aplicável.,FALSE
FEXC0044/2018- TRASTUZUMAB EMTANSINA 100MG PÓ SOL INJ,Ajuste Direto Regime Geral,Aquisição de bens móveis,"33600000-6, Produtos farmacêuticos","CHBM - Centro Hospital Barreiro Montijo, EPE (509186998)","ROCHE FARMACEUTICA QUIMICA, LDA (500233810)","136.768,50 €",11-04-2018,28-02-2018,365 dias,"Portugal, Setúbal, Barreiro","Artigo 24.º, n.º 1, alínea e) do Código dos Contratos Públicos","","",,"",,Não aplicável.,Não aplicável.,FALSE
FEXC0040/2018 - DEXAMETASONA 5 MG (5 MG/ML AMP 1ML) SOL INJ,Ajuste Direto Regime Geral,Aquisição de bens móveis,"33600000-6, Produtos farmacêuticos","Centro Hospitalar Barreiro Montijo, E. P. E. (509186998)",BDRPHARMA (513077332),"16.800,00 €",11-04-2018,09-02-2018,365 dias,"Portugal, Setúbal, Barreiro","Artigo 24.º, n.º 1, alínea e), subalínea iii) do Código dos Contratos Públicos","","",,"",,Não aplicável.,Não aplicável.,FALSE
FEXC0039/2018 - MEDICAMENTOS LABESFAL,Ajuste Direto Regime Geral,Aquisição de bens móveis,"33600000-6, Produtos farmacêuticos","Centro Hospitalar Barreiro Montijo, E. P. E. (509186998)","LABESFAL-L. ESP. FARM. ALMIRO, (501169580)","6.121,99 €",11-04-2018,12-02-2018,365 dias,"Portugal, Setúbal, Barreiro","Artigo 24.º, n.º 1, alínea e), subalínea iii) do Código dos Contratos Públicos","","",,"",,Não aplicável.,Não aplicável.,FALSE
FEXC0038/2018 - MIFEPRISTONA 200MG COMP E CINCHOCAINA POMADA 20 G BISNAGA,Ajuste Direto Regime Geral,Aquisição de bens móveis,"33600000-6, Produtos farmacêuticos","Centro Hospitalar Barreiro Montijo, E. P. E. (509186998)","DISTRIFARMA - COMPT. DISTRIB. FARM., S.A. (502948663)","13.660,00 €",11-04-2018,07-02-2018,365 dias,"Portugal, Setúbal, Barreiro","Artigo 24.º, n.º 1, alínea e), subalínea iii) do Código dos Contratos Públicos","","",,"",,Não aplicável.,Não aplicável.,FALSE
FEXC0034/2018 - BENZILPENICILINAS - ATRAL,Ajuste Direto Regime Geral,Aquisição de bens móveis,"33600000-6, Produtos farmacêuticos","Centro Hospitalar Barreiro Montijo, E. P. E. (509186998)",LABORATORIOS ATRAL-SA (500162085),"8.028,32 €",11-04-2018,02-02-2018,365 dias,"Portugal, Setúbal, Barreiro","Artigo 24.º, n.º 1, alínea e), subalínea iii) do Código dos Contratos Públicos","","",,"",,Não aplicável.,Não aplicável.,FALSE
FEXC0033/2018 - PEMBROLIZUMAB 100 MG (25 MG/ML FRS 4 ML) SOL INJ,Ajuste Direto Regime Geral,Aquisição de bens móveis,"33600000-6, Produtos farmacêuticos","Centro Hospitalar Barreiro Montijo, E. P. E. (509186998)","MERCK SHARP & DOHME, LDA (500191360)","113.400,00 €",11-04-2018,31-01-2018,365 dias,"Portugal, Setúbal, Barreiro","Artigo 24.º, n.º 1, alínea e), subalínea iii) do Código dos Contratos Públicos","","",,"",,Não aplicável.,Não aplicável.,FALSE
"FEXC0031/2018 - DESMA LABORATÓRIO FARMACÊUTICO, S.L.",Ajuste Direto Regime Geral,Aquisição de bens móveis,"33600000-6, Produtos farmacêuticos","Centro Hospitalar Barreiro Montijo, E. P. E. (509186998)","DESMA LABORATÓRIO FARMACÊUTICO, S.L. (980300649)","1.007,63 €",11-04-2018,25-01-2018,365 dias,"Portugal, Setúbal, Barreiro","Artigo 24.º, n.º 1, alínea e), subalínea iii) do Código dos Contratos Públicos","","",,"",,Não aplicável.,Não aplicável.,FALSE
FEXC0025/2018 - PACLITAXEL-ALBUMINA 100MG (5MG/ML FRS/AMP 20ML) PO INJ,Ajuste Direto Regime Geral,Aquisição de bens móveis,"33600000-6, Produtos farmacêuticos","Centro Hospitalar Barreiro Montijo, E. P. E. (509186998)","CELGENE, SOCIEDADE UNIPESSOAL, LDA (507791690)","68.750,00 €",11-04-2018,26-01-2018,365 dias,"Portugal, Setúbal, Barreiro","Artigo 24.º, n.º 1, alínea e), subalínea iii) do Código dos Contratos Públicos","","",,"",,Não aplicável.,Não aplicável.,FALSE
