Objeto do Contrato,Tipo de Procedimento,Tipo(s) de Contrato,CPVs,Entidade(s) Adjudicante(s),Entidade(s) Adjudicatária(s),Preço Contratual,Data de Publicação,Data de Celebração do Contrato,Prazo de Execução,Local de Execução,Fundamentação,Data de Fecho do Contrato,Preço Total Efetivo,Causas das Alterações ao Prazo,Causas das Alterações ao Preço,Estado,N.º registo do Acordo Quadro,Descrição do Acordo Quadro,Procedimento Centralizado
Elaboração de projetos de eficiência energética,Consulta Prévia,Aquisição de serviços,"71000000-8, Serviços de arquitectura, construção, engenharia e inspecção",Serviço de Utilização Comum dos Hospitais (500900469),"CCenergia - Auditoria e Consultoria Energética, Lda (507144767)","55.185,00 €",20-06-2018,07-05-2018,60 dias,"Portugal, Setúbal, Almada","Artigo 20.º, n.º 1, alínea c) do Código dos Contratos Públicos",,,,,,Não aplicável.,Não aplicável.,FALSE
Instalação  de um sistema de tratamento de aguas na central térmica,Ajuste Direto Regime Geral,Aquisição de serviços,"50000000-5, Serviços de reparação e manutenção",Serviço de Utilização Comum dos Hospitais (500900469),"Vaporel - Sociedade Industrial Metalo Mecânica, Lda. (500295433)","9.272,00 €",19-06-2018,18-06-2018,30 dias,"Portugal, Lisboa, Lisboa","Artigo 20.º, n.º 1, alínea d) do Código dos Contratos Públicos",,,,,,Não aplicável.,Não aplicável.,FALSE
Elaboração de projetos de execução para implementação de medidas de eficiência energética para o HFF,Consulta Prévia,Aquisição de serviços,"71000000-8, Serviços de arquitectura, construção, engenharia e inspecção",Serviço de Utilização Comum dos Hospitais (500900469),"MECFLUI - Engenharia, Lda (504713507)","49.000,00 €",19-06-2018,21-05-2018,90 dias,"Portugal, Lisboa, Amadora","Artigo 20.º, n.º 1, alínea c) do Código dos Contratos Públicos",,,,,,Não aplicável.,Não aplicável.,FALSE
Forn. e Montagem de equipamento.,Ajuste Direto Regime Geral,Aquisição de bens móveis,"31212000-5, Disjuntores",Serviço de Utilização Comum dos Hospitais (500900469),"Schneider Electric Portugal, Lda (500281858)","8.210,00 €",18-06-2018,18-06-2018,30 dias,"Portugal, Lisboa, Lisboa","Artigo 20.º, n.º 1, alínea d) do Código dos Contratos Públicos",,,,,,Não aplicável.,Não aplicável.,FALSE
reparação de equipamento,Ajuste Direto Regime Geral,Aquisição de serviços,"50000000-5, Serviços de reparação e manutenção",Serviço de Utilização Comum dos Hospitais (500900469),Tunemedix Lda (509653979),"6.090,80 €",15-06-2018,14-06-2018,20 dias,"Portugal, Lisboa, Lisboa","Artigo 24.º, n.º 1, alínea e), subalínea ii) do Código dos Contratos Públicos",,,,,,Não aplicável.,Não aplicável.,FALSE
Prestação de Serviços de reparação da Estação de Tratamento de Águas Residuais do Hospital São Francisco Xavier,Ajuste Direto Regime Geral,Aquisição de serviços,"90400000-1, Serviços relacionados com águas residuais",Serviço de Utilização Comum dos Hospitais (500900469),"AQUAREZ - ENGINEERING & ENVIRONMENTAL SERVICES, LDA (509781489)","19.800,00 €",11-06-2018,11-06-2018,20 dias,"Portugal, Lisboa, Lisboa","Artigo 20.º, n.º 1, alínea d) do Código dos Contratos Públicos",,,,,,Não aplicável.,Não aplicável.,FALSE
Aquisição de Serviços de Desinfestação a Executar nas Instalações do SUCH,Ajuste Direto Regime Geral,Aquisição de serviços,"90000000-7, Serviços relativos a águas residuais, resíduos, limpeza e ambiente",Serviço de Utilização Comum dos Hospitais (500900469),Anticimex Portugal Lda  (507583698),"18.342,90 €",11-06-2018,11-06-2018,240 dias,Portugal,"Artigo 20.º, n.º 1, alínea d) do Código dos Contratos Públicos",,,,,,Não aplicável.,Não aplicável.,FALSE
Aquisição de Cabides para Sistema de Transporte de Roupa para a Lavandaria Do Hospital Magalhães Lemos,Ajuste Direto Regime Geral,Aquisição de bens móveis,"42720000-9, Peças para máquinas para as indústrias têxtil e do vestuário",Serviço de Utilização Comum dos Hospitais (500900469),"PNA LAUNDRY SOLUTIONS, UNIPESSOAL, LDA. (513759867)","11.000,00 €",11-06-2018,17-05-2018,20 dias,"Portugal, Porto, Matosinhos","Artigo 20.º, n.º 1, alínea d) do Código dos Contratos Públicos",,,,,,Não aplicável.,Não aplicável.,FALSE
Prestação de serviços de alojamento em cloud com firewall e contact center e prestação de serviços de dados fixos,Ajuste Direto Regime Geral,Aquisição de serviços,"64000000-6, Serviços postais e de telecomunicações",Serviço de Utilização Comum dos Hospitais (500900469),"Meo-Serviços de Comunicações e Multimédia, S.A (504615947)","49.800,00 €",11-06-2018,18-05-2018,90 dias,Portugal,"Artigo 24.º, n.º 1, alínea c) do Código dos Contratos Públicos",,,,,,Não aplicável.,Não aplicável.,FALSE
