Objeto do Contrato,Tipo de Procedimento,Tipo(s) de Contrato,CPVs,Entidade(s) Adjudicante(s),Entidade(s) Adjudicatária(s),Preço Contratual,Data de Publicação,Data de Celebração do Contrato,Prazo de Execução,Local de Execução,Fundamentação,Data de Fecho do Contrato,Preço Total Efetivo,Causas das Alterações ao Prazo,Causas das Alterações ao Preço,Estado,N.º registo do Acordo Quadro,Descrição do Acordo Quadro,Procedimento Centralizado
Aquisição de blocos de verbetes de socorro,Ajuste Direto Regime Geral,Aquisição de bens móveis,"22000000-0, Material impresso e afins","Instituto Nacional de Emergência Médica, I. P. (501356126)",Editorial do Ministério da Educação e Ciência (600000532),"11.000,00 €",21-07-2017,13-07-2017,25 dias,"Portugal, Portugal Continental","Artigo 20.º, n.º 1, alínea a) do Código dos Contratos Públicos",,,,,,Não aplicável.,Não aplicável.,FALSE
Aquisição de mochilas de emergência,Ajuste Direto Regime Geral,Aquisição de bens móveis,"18900000-8, Artigos de selaria, malas, bolsas, sacos e outros artigos de viagem","Instituto Nacional de Emergência Médica, I. P. (501356126)","HR Protecção, S.A. (505766205)","8.400,00 €",21-07-2017,06-06-2017,20 dias,"Portugal, Lisboa, Lisboa","Artigo 20.º, n.º 1, alínea a) do Código dos Contratos Públicos",,,,,,Não aplicável.,Não aplicável.,FALSE
Aquisição de lactato de ringer,Ajuste Direto Regime Geral,Aquisição de bens móveis,"33600000-6, Produtos farmacêuticos","Instituto Nacional de Emergência Médica, I. P. (501356126)","Grifols Portugal, Produtos Farmacêuticos e Hospitalares, Lda. (502041285)","0,00 €",21-07-2017,20-07-2017,1 dias,Portugal,"Artigo 26.º, n.º 1, alínea e) do Código dos Contratos Públicos",,,,,,2846398,Aquisição de lactato de ringer,FALSE
Aquisição de ampolas de propofol,Ajuste Direto Regime Geral,Aquisição de bens móveis,"33600000-6, Produtos farmacêuticos","Instituto Nacional de Emergência Médica, I. P. (501356126)","Fresenius Kabi Pharma Portugal, Lda. (504293753)","0,00 €",21-07-2017,20-07-2017,1 dias,"Portugal, Lisboa, Lisboa","Artigo 26.º, n.º 1, alínea e) do Código dos Contratos Públicos",,,,,,2846339,Aquisição de ampolas de propofol,FALSE
Aquisição de cateteres endovenosos periféricos,Ajuste Direto Regime Geral,Aquisição de bens móveis,"33100000-1, Equipamento médico","Instituto Nacional de Emergência Médica, I. P. (501356126)","Smiths Medical (Portugal), Lda. (507445937)","0,00 €",21-07-2017,20-07-2017,3 dias,"Portugal, Lisboa, Lisboa","Artigo 26.º, n.º 1, alínea e) do Código dos Contratos Públicos",,,,,,2846277,Aquisição de cateteres endovenosos,FALSE
Serviços de limpeza - julho 2017,Ajuste Direto Regime Geral,Aquisição de serviços,"90900000-6, Serviços de limpeza e saneamento","Instituto Nacional de Emergência Médica, I. P. (501356126)","Interlimpe - Facility Services, S.A. (502611057)","23.201,39 €",21-07-2017,14-07-2017,31 dias,"Portugal, Portugal Continental","Artigo 24.º, n.º 1, alínea c) do Código dos Contratos Públicos",,,,,,Não aplicável.,Não aplicável.,FALSE
Aquisição de luvas de exame nitrilo,Ajuste Direto Regime Geral,Aquisição de bens móveis,"33700000-7, Produtos para cuidados pessoais","Instituto Nacional de Emergência Médica, I. P. (501356126)","Docworld, Lda. (508592909)","6.692,00 €",20-07-2017,14-07-2017,2 dias,"Portugal, Portugal Continental","Artigo 20.º, n.º 1, alínea a) do Código dos Contratos Públicos",,,,,,Não aplicável.,Não aplicável.,FALSE
Aquisição de trolamina - biaf.emulsão,Ajuste Direto Regime Geral,Aquisição de bens móveis,"33600000-6, Produtos farmacêuticos","Instituto Nacional de Emergência Médica, I. P. (501356126)","Johnson & Johnson, Lda. (500153370)","0,00 €",20-07-2017,17-07-2017,2 dias,"Portugal, Lisboa, Lisboa","Artigo 26.º, n.º 1, alínea e) do Código dos Contratos Públicos",,,,,,2844351,Aquisição de trolamina - biaf. emulsão,FALSE
Aquisição de rolos de pano para limpeza e desinfeção,Ajuste Direto Regime Geral,Aquisição de bens móveis,"19000000-6, Materiais têxteis, de couro, de plástico e de borracha","Instituto Nacional de Emergência Médica, I. P. (501356126)","SERVISAN - Produtos de Higiene, S.A. (500246530)","3.405,00 €",20-07-2017,17-07-2017,5 dias,"Portugal, Portugal Continental","Artigo 20.º, n.º 1, alínea a) do Código dos Contratos Públicos",,,,,,Não aplicável.,Não aplicável.,FALSE
Aquisição de ampolas de haloperidol,Ajuste Direto Regime Geral,Aquisição de bens móveis,"33600000-6, Produtos farmacêuticos","Instituto Nacional de Emergência Médica, I. P. (501356126)","Ratiopharm, Comércio e Indústria de Produtos Farmacêuticos, Lda. (502414910)","0,00 €",20-07-2017,19-07-2017,1 dias,"Portugal, Lisboa, Lisboa","Artigo 26.º, n.º 1, alínea e) do Código dos Contratos Públicos",,,,,,2844205,Aquisição de ampolas de haloperidol,FALSE
Aquisição de fardamento - parkas e blusões,Ajuste Direto Regime Geral,Aquisição de bens móveis,"18100000-0, Vestuário profissional, vestuário de trabalho especial e acessórios","Instituto Nacional de Emergência Médica, I. P. (501356126)","Fugal, Comércio Internacional de Vestuário, Lda. (510541283)","52.399,60 €",18-07-2017,03-07-2017,6 dias,"Portugal, Portugal Continental","Artigo 20.º, n.º 1, alínea a) do Código dos Contratos Públicos",,,,,,Não aplicável.,Não aplicável.,FALSE
Aquisição de serviços de Gestão Oficinal de Frota,Ajuste Direto Regime Geral,Aquisição de serviços,"50000000-5, Serviços de reparação e manutenção","Instituto Nacional de Emergência Médica, I. P. (501356126)","FINLOG - ALUGUER E COMÉRCIO DE AUTOMÓVEIS, S.A. (502584866)","251.000,00 €",14-07-2017,30-06-2017,31 dias,"Portugal, Portugal Continental","Artigo 27.º, n.º 1, alínea a) do Código dos Contratos Públicos",,,,,,Não aplicável.,Não aplicável.,FALSE
Disponibilização de contentores asséticos,Ajuste Direto Regime Geral,Aquisição de serviços,"90000000-7, Serviços relativos a águas residuais, resíduos, limpeza e ambiente","Instituto Nacional de Emergência Médica, I. P. (501356126)",INTERLIMP FACILITY SERVICES SA (502611057),"3.351,60 €",14-07-2017,14-07-2017,365 dias,"Portugal, Faro, Faro<BR/>Portugal, Porto, Vila Nova de Gaia<BR/>Portugal, Lisboa, Lisboa<BR/>Portugal, Coimbra, Coimbra<BR/>Portugal, Porto, Porto","Artigo 20.º, n.º 1, alínea a) do Código dos Contratos Públicos",,,,,,Não aplicável.,Não aplicável.,FALSE
Reparação de LP 12 sn 32205897,Ajuste Direto Regime Geral,Aquisição de serviços,"50400000-9, Serviços de reparação e manutenção de equipamento médico e de precisão","Instituto Nacional de Emergência Médica, I. P. (501356126)",Physio Portugal Sales (510137946),"961,85 €",14-07-2017,04-04-2017,30 dias,"Portugal, Lisboa, Lisboa","Artigo 24.º, n.º 1, alínea e) do Código dos Contratos Públicos",,,,,,Não aplicável.,Não aplicável.,FALSE
Aquisição de serviços de seguros,Ajuste Direto Regime Geral,Aquisição de serviços,"66000000-0, Serviços de finanças e seguros","Instituto Nacional de Emergência Médica, I. P. (501356126)","Fidelidade – Companhia de Seguros, S.A (500918880)","192.471,97 €",13-07-2017,30-06-2017,92 dias,"Portugal, Portugal Continental","Artigo 27.º, n.º 1, alínea a) do Código dos Contratos Públicos",,,,,,Não aplicável.,Não aplicável.,FALSE
Reparação de LP 12 sn 35810141,Ajuste Direto Regime Geral,Aquisição de serviços,"50400000-9, Serviços de reparação e manutenção de equipamento médico e de precisão","Instituto Nacional de Emergência Médica, I. P. (501356126)",Physio Portugal Sales (510137946),"3.727,13 €",12-07-2017,04-04-2017,30 dias,"Portugal, Lisboa, Lisboa","Artigo 24.º, n.º 1, alínea e) do Código dos Contratos Públicos",,,,,,Não aplicável.,Não aplicável.,FALSE
Reparação de um LP 12 sn 30290024,Ajuste Direto Regime Geral,Aquisição de serviços,"50400000-9, Serviços de reparação e manutenção de equipamento médico e de precisão","Instituto Nacional de Emergência Médica, I. P. (501356126)",Physio Portugal Sales (510137946),"518,83 €",12-07-2017,04-04-2017,30 dias,"Portugal, Lisboa, Lisboa","Artigo 24.º, n.º 1, alínea e) do Código dos Contratos Públicos",,,,,,Não aplicável.,Não aplicável.,FALSE
Aluguer de fontes de água,Ajuste Direto Regime Geral,Aquisição de serviços,"50700000-2, Serviços de reparação e manutenção de equipamento em edifícios","Instituto Nacional de Emergência Médica, I. P. (501356126)","Jet Cooler Águas e Cafés, S. A . (502127856)","6.612,00 €",11-07-2017,16-02-2017,365 dias,"Portugal, Lisboa, Lisboa","Artigo 20.º, n.º 1, alínea a) do Código dos Contratos Públicos",,,,,,Não aplicável.,Não aplicável.,FALSE
Reparação de seringa bbraun sn 41415,Ajuste Direto Regime Geral,Aquisição de serviços,"50400000-9, Serviços de reparação e manutenção de equipamento médico e de precisão","Instituto Nacional de Emergência Médica, I. P. (501356126)","B.Braun Medical, Lda (501506543)","139,67 €",11-07-2017,03-02-2017,30 dias,"Portugal, Lisboa, Lisboa","Artigo 24.º, n.º 1, alínea e) do Código dos Contratos Públicos",,,,,,Não aplicável.,Não aplicável.,FALSE
Reparação de seringa bbraun sn 35554,Ajuste Direto Regime Geral,Aquisição de serviços,"50400000-9, Serviços de reparação e manutenção de equipamento médico e de precisão","Instituto Nacional de Emergência Médica, I. P. (501356126)","B.Braun Medical, Lda (501506543)","224,15 €",11-07-2017,03-02-2017,30 dias,"Portugal, Lisboa, Lisboa","Artigo 24.º, n.º 1, alínea e) do Código dos Contratos Públicos",,,,,,Não aplicável.,Não aplicável.,FALSE
Reparação de seringa fresenius vial pilot A2 sn 016043/17460,Ajuste Direto Regime Geral,Aquisição de serviços,"50400000-9, Serviços de reparação e manutenção de equipamento médico e de precisão","Instituto Nacional de Emergência Médica, I. P. (501356126)","FRESENIUS KABI PHARMA PORTUGAL,LDA (504293753)","317,88 €",11-07-2017,03-02-2017,30 dias,"Portugal, Lisboa, Lisboa","Artigo 24.º, n.º 1, alínea e) do Código dos Contratos Públicos",,,,,,Não aplicável.,Não aplicável.,FALSE
Reparação de seringa fresenius vial pilot A2 sn 16623915,Ajuste Direto Regime Geral,Aquisição de serviços,"50400000-9, Serviços de reparação e manutenção de equipamento médico e de precisão","Instituto Nacional de Emergência Médica, I. P. (501356126)",Fresenius Kabi (504293753),"50,59 €",11-07-2017,03-02-2017,30 dias,"Portugal, Lisboa, Lisboa","Artigo 24.º, n.º 1, alínea e) do Código dos Contratos Públicos",,,,,,Não aplicável.,Não aplicável.,FALSE
