Objeto do Contrato,Tipo de Procedimento,Tipo(s) de Contrato,CPVs,Entidade(s) Adjudicante(s),Entidade(s) Adjudicatária(s),Preço Contratual,Data de Publicação,Data de Celebração do Contrato,Prazo de Execução,Local de Execução,Fundamentação,Data de Fecho do Contrato,Preço Total Efetivo,Causas das Alterações ao Prazo,Causas das Alterações ao Preço,Estado,N.º registo do Acordo Quadro,Descrição do Acordo Quadro,Procedimento Centralizado
59000615-fornecimento de gas natural,Ajuste Direto Regime Geral,Aquisição de serviços,"76000000-3, Serviços relacionados com as indústrias do gás e do petróleo",Hospital Dr. Francisco Zagalo (501510150),"EDP COMERCIAL-Comercialização de Energia,S.A. (503504564)","55.605,55 €",22-07-2016,01-01-2015,433 dias,"Portugal, Aveiro, Ovar",Artigo 258.º do Código dos Contratos Públicos,08-03-2016,"55.605,55 €",,,,Não aplicável.,Não aplicável.,FALSE
59000415-Fornecimento de eletricidade,Ajuste Direto Regime Geral,Aquisição de serviços,"76000000-3, Serviços relacionados com as indústrias do gás e do petróleo",Hospital Dr. Francisco Zagalo (501510150),"GALP POWER, S.A. (504723456)","52.073,46 €",22-07-2016,22-01-2015,270 dias,"Portugal, Aveiro, Ovar",Artigo 258.º do Código dos Contratos Públicos,31-12-2015,"52.073,46 €",,,,Não aplicável.,Não aplicável.,FALSE
59000515-combustiveis rodoviarios,Ajuste Direto Regime Geral,Aquisição de serviços,"76000000-3, Serviços relacionados com as indústrias do gás e do petróleo",Hospital Dr. Francisco Zagalo (501510150),PETROGAL-PETROLEOS DE PORTUGAL - GALP (500697370),"4.810,75 €",22-07-2016,22-12-2014,365 dias,"Portugal, Aveiro, Ovar",Artigo 258.º do Código dos Contratos Públicos,31-01-2016,"4.810,75 €",,,,Não aplicável.,Não aplicável.,FALSE
