freguesia,acronym,validVotesPercentage,votes,dicofre
São Martinho de Sardoura,PPD/PSD.CDS-PP,44.28,240,010608
São Martinho de Sardoura,PS,34.69,188,010608
São Martinho de Sardoura,MPT,7.56,41,010608
São Martinho de Sardoura,B.E.,4.98,27,010608
São Martinho de Sardoura,L,2.4,13,010608
São Martinho de Sardoura,PCP-PEV,2.21,12,010608
São Martinho de Sardoura,PCTP/MRPP,1.29,7,010608
São Martinho de Sardoura,PAN,0.74,4,010608
São Martinho de Sardoura,PND,0.55,3,010608
São Martinho de Sardoura,PDA,0.37,2,010608
São Martinho de Sardoura,PPM,0.37,2,010608
São Martinho de Sardoura,PNR,0.18,1,010608
São Martinho de Sardoura,PPV,0.18,1,010608
São Martinho de Sardoura,PTP,0.18,1,010608
São Martinho de Sardoura,MAS,0,0,010608
São Martinho de Sardoura,POUS,0,0,010608
