Objeto do Contrato,Tipo de Procedimento,Tipo(s) de Contrato,CPVs,Entidade(s) Adjudicante(s),Entidade(s) Adjudicatária(s),Preço Contratual,Data de Publicação,Data de Celebração do Contrato,Prazo de Execução,Local de Execução,Fundamentação,Data de Fecho do Contrato,Preço Total Efetivo,Causas das Alterações ao Prazo,Causas das Alterações ao Preço,Estado,N.º registo do Acordo Quadro,Descrição do Acordo Quadro,Procedimento Centralizado
AD2871-217 VINORELBINA,Ajuste Direto Regime Geral,Aquisição de bens móveis,"33600000-6, Produtos farmacêuticos","Instituto Português de Oncologia de Lisboa FG, E.P.E. (506361616)",PIERRE FABRE MÉDICAMENT PORTUGAL LDA (500230366),"1.774,80 €",20-10-2017,19-10-2017,30 dias,"Portugal, Lisboa, Lisboa","Artigo 20.º, n.º 1, alínea a) do Código dos Contratos Públicos",,,,,,Não aplicável.,Não aplicável.,FALSE
AD1232-2017 FORNECIMENTO DE 2 SISTEMAS DE VIDEOENDOSCOPIA,Concurso público,Aquisição de bens móveis,"33000000-0, Equipamento médico, medicamentos e produtos para cuidados pessoais","Instituto Português de Oncologia de Lisboa Francisco Gentil, E. P. E. (506361616)","TEPREL-EQUIPAMENTOS  MÉDICOS, SA (502262184)","69.126,40 €",20-10-2017,04-10-2017,30 dias,"Portugal, Lisboa, Lisboa","Artigo 20.º, n.º 1, alínea b) do Código dos Contratos Públicos",,,,,,Não aplicável.,Não aplicável.,FALSE
AD1219-2017FORNECIMENTO DE TORRE DE ARTROSCOPIA,Ajuste Direto Regime Geral,Aquisição de bens móveis,"33100000-1, Equipamento médico","Instituto Português de Oncologia de Lisboa Francisco Gentil, E. P. E. (506361616)","STRYKER PORTUGAL, PRODUTOS MÉDICOS,UNIPESSOAL,LDA (504594214)","36.705,26 €",20-10-2017,25-09-2017,30 dias,"Portugal, Lisboa, Lisboa","Artigo 20.º, n.º 1, alínea a) do Código dos Contratos Públicos",,,,,,Não aplicável.,Não aplicável.,FALSE
"AQUISIÇÃO DE EQUIPAMENTO INFORMÁTICO DE DIGITALIZAÇÃO DE LÂMINAS PARA RASTREABILIDADE DE AMOSTRAS E GESTÃO DO LABORATÓRIO DE ANATOMIA PATOLÓGICA, AO INSTITUTO PORTUGUÊS DE ONCOLOGIA DE LISBOA FRANCISCO GENTIL, EPE",Concurso público,Aquisição de bens móveis,"30000000-9, Máquinas, equipamento e material de escritório e de informática, excepto mobiliário e pacotes de programas (software)","Instituto Português de Oncologia de Lisboa Francisco Gentil, E. P. E. (506361616)","Gonçalves & Novais, Ldª (513423818)","25.336,47 €",19-10-2017,16-10-2017,60 dias,"Portugal, Lisboa, Lisboa","Artigo 20.º, n.º 1, alínea b) do Código dos Contratos Públicos",,,,,,Não aplicável.,Não aplicável.,FALSE
"AD2301-2017DARATUMUMAB 20 MGIINJ 5 BML,20 MG INJ 20 ML",Ajuste Direto Regime Geral,Aquisição de bens móveis,"33600000-6, Produtos farmacêuticos","Instituto Português de Oncologia de Lisboa Francisco Gentil, E. P. E. (506361616)",JANSSEN- CILAG FARMACEUTICA LDA (500189412),"132.677,52 €",18-10-2017,29-09-2017,92 dias,"Portugal, Lisboa, Lisboa","Artigo 24.º, n.º 1, alínea e) do Código dos Contratos Públicos",,,,,,Não aplicável.,Não aplicável.,FALSE
AQUISIÇÃO DE UM EQUIPAMENTE DE QUIMIOTERAPIA REGIONAL,Ajuste Direto Regime Geral,Aquisição de bens móveis,"33100000-1, Equipamento médico","Instituto Português de Oncologia de Lisboa FG, E.P.E. (506361616)","MERCÉ V. ELECTROMEDECINA, S.L. (B-96056023)","64.950,00 €",18-10-2017,09-10-2017,30 dias,"Portugal, Lisboa, Lisboa","Artigo 20.º, n.º 1, alínea a) do Código dos Contratos Públicos",,,,,,Não aplicável.,Não aplicável.,FALSE
AD2856-2017BRENTUXIMAB VEDOTIN,Ajuste Direto Regime Geral,Aquisição de bens móveis,"33600000-6, Produtos farmacêuticos","Instituto Português de Oncologia de Lisboa Francisco Gentil, E. P. E. (506361616)","TAKEDA -FARMACEUTICOS PORTUGAL, LDA (502801204)","31.626,00 €",18-10-2017,09-10-2017,30 dias,"Portugal, Lisboa, Lisboa","Artigo 24.º, n.º 1, alínea c) do Código dos Contratos Públicos",,,,,,Não aplicável.,Não aplicável.,FALSE
AD185-2017TASONERMINA 1 MG INJ,Ajuste Direto Regime Geral,Aquisição de bens móveis,"33600000-6, Produtos farmacêuticos","Instituto Português de Oncologia de Lisboa Francisco Gentil, E. P. E. (506361616)","UNILFARMA -UNIÃO INTERNACIONAL SDE LABORATÓRIOS FARMACEUTICODD , LDA (500293023)","23.240,00 €",16-10-2017,31-03-2017,270 dias,"Portugal, Lisboa, Lisboa","Artigo 24.º, n.º 1, alínea e) do Código dos Contratos Públicos",,,,,,Não aplicável.,Não aplicável.,FALSE
AD744-2017-FORNECIMENTO DE REAGENTES PARA O LAB.ANATOMIA PATOLÓGICA AO  IPOL F.G.,Ajuste Direto Regime Geral,Aquisição de bens móveis,"33696500-0, Reagentes de laboratório","Instituto Português de Oncologia de Lisboa FG, E.P.E. (506361616)",VWR-INTERNATIONAL DE LABORATÓRIO LDA (503842770),"26.151,65 €",13-10-2017,07-07-2017,176 dias,"Portugal, Lisboa, Lisboa","Artigo 20.º, n.º 1, alínea a) do Código dos Contratos Públicos",,,,,,Não aplicável.,Não aplicável.,FALSE
AD1560-2017OSIMERTINIB 80 MG CP,Ajuste Direto Regime Geral,Aquisição de bens móveis,"33600000-6, Produtos farmacêuticos","Instituto Português de Oncologia de Lisboa Francisco Gentil, E. P. E. (506361616)",ASTRAZENECA- PRODUTOS FARMACEUTICOS LDA (502942240),"139.200,00 €",12-10-2017,30-05-2017,215 dias,"Portugal, Lisboa, Lisboa","Artigo 24.º, n.º 1, alínea e) do Código dos Contratos Públicos",,,,,,Não aplicável.,Não aplicável.,FALSE
AD1227-2017 DUAS GAMAS SONDA,Ajuste Direto Regime Geral,Aquisição de bens móveis,"33100000-1, Equipamento médico","Instituto Português de Oncologia de Lisboa Francisco Gentil, E. P. E. (506361616)","CATETER PRODUTOS MÉDICOS HOSPITALARES, LDA (502914319)","28.480,00 €",11-10-2017,03-10-2017,30 dias,"Portugal, Lisboa, Lisboa","Artigo 20.º, n.º 1, alínea a) do Código dos Contratos Públicos",,,,,,Não aplicável.,Não aplicável.,FALSE
