freguesia,acronym,validVotesPercentage,votes,dicofre
Sete Cidades,PS,60,51,420322
Sete Cidades,PPD/PSD,14.12,12,420322
Sete Cidades,PAN,7.06,6,420322
Sete Cidades,B.E.,5.88,5,420322
Sete Cidades,CDS-PP,3.53,3,420322
Sete Cidades,PCP-PEV,2.35,2,420322
Sete Cidades,PDR,2.35,2,420322
Sete Cidades,IL,1.18,1,420322
Sete Cidades,L,1.18,1,420322
Sete Cidades,PCTP/MRPP,1.18,1,420322
Sete Cidades,PTP,1.18,1,420322
Sete Cidades,A,0,0,420322
Sete Cidades,MAS,0,0,420322
Sete Cidades,NC,0,0,420322
Sete Cidades,PNR,0,0,420322
Sete Cidades,PPM.PPV/CDC,0,0,420322
Sete Cidades,PURP,0,0,420322
