Objeto do Contrato,Tipo de Procedimento,Tipo(s) de Contrato,CPVs,Entidade(s) Adjudicante(s),Entidade(s) Adjudicatária(s),Preço Contratual,Data de Publicação,Data de Celebração do Contrato,Prazo de Execução,Local de Execução,Fundamentação,Data de Fecho do Contrato,Preço Total Efetivo,Causas das Alterações ao Prazo,Causas das Alterações ao Preço,Estado,N.º registo do Acordo Quadro,Descrição do Acordo Quadro,Procedimento Centralizado
"Aquisição de serviços de consultoria clínica por um profissional licenciado em enfermagem, inscrito na respetiva ordem profissional, para apoio à Unidade de Fiscalizações do Departamento de Registo e Licenciamento.",Ajuste Direto Regime Geral,Aquisição de serviços,"73200000-4, Serviços de consultoria em matéria de investigação e desenvolvimento",Entidade Reguladora da Saúde (507021266),Ana Filipa Lamas Azevedo (248900757),"39.957,84 €",08-03-2017,01-02-2017,730 dias,"Portugal, Porto, Porto","Artigo 20.º, n.º 1, alínea a) do Código dos Contratos Públicos",,,,,,Não aplicável.,Não aplicável.,FALSE
"Aquisição de serviços de consultoria clínica por um profissional licenciado em medicina dentária, inscrito na respetiva ordem profissional.",Ajuste Direto Regime Geral,Aquisição de serviços,"73200000-4, Serviços de consultoria em matéria de investigação e desenvolvimento",Entidade Reguladora da Saúde (507021266),Pedro Miguel da Costa Azevedo Almeida (209854057),"9.000,00 €",08-03-2017,14-02-2017,365 dias,"Portugal, Porto, Porto","Artigo 20.º, n.º 1, alínea a) do Código dos Contratos Públicos",,,,,,Não aplicável.,Não aplicável.,FALSE
"Aquisição de serviços de consultoria clínica por um profissional licenciado em medicina dentária, inscrito na respetiva ordem profissional.",Ajuste Direto Regime Geral,Aquisição de serviços,"73200000-4, Serviços de consultoria em matéria de investigação e desenvolvimento",Entidade Reguladora da Saúde (507021266),Inês Sousa Mota Oliveira (228988705),"9.000,00 €",08-03-2017,14-02-2017,365 dias,"Portugal, Porto, Porto","Artigo 20.º, n.º 1, alínea a) do Código dos Contratos Públicos",,,,,,Não aplicável.,Não aplicável.,FALSE
"Aquisição de serviços de consultoria clínica por um profissional licenciado em medicina de saúde familiar, inscrito na respetiva ordem profissional.",Ajuste Direto Regime Geral,Aquisição de serviços,"73200000-4, Serviços de consultoria em matéria de investigação e desenvolvimento",Entidade Reguladora da Saúde (507021266),"Stomachion, Lda (508994977)","9.600,00 €",08-03-2017,09-02-2017,365 dias,"Portugal, Porto, Porto","Artigo 20.º, n.º 1, alínea a) do Código dos Contratos Públicos",,,,,,Não aplicável.,Não aplicável.,FALSE
"Aquisição de serviços para implementação de um sistema contabilidade analítica e de controlo de gestão, assim como o apoio à melhoria dos mecanismos de controlo de gestão existentes ou em implementação. ",Ajuste Direto Regime Geral,Aquisição de serviços,"73200000-4, Serviços de consultoria em matéria de investigação e desenvolvimento",Entidade Reguladora da Saúde (507021266),"Mapitol, Sysstems, Lda (508322162)","17.472,00 €",08-03-2017,15-02-2017,180 dias,"Portugal, Porto, Porto","Artigo 20.º, n.º 1, alínea a) do Código dos Contratos Públicos",,,,,,Não aplicável.,Não aplicável.,FALSE
"Aquisição de bens e serviços destinados à implementação de um automatismo de controlo dos deveres de pontualidade e assiduidade dos colaboradores da Entidade Reguladora da Saúde (ERS), com software de apoio à gestão e equipamentos necessários.",Ajuste Direto Regime Geral,Aquisição de bens móveis,"35123300-5, Sistema de relógio de ponto",Entidade Reguladora da Saúde (507021266),"Elo - Sistemas de Informação, Lda (503258601)","9.895,00 €",08-03-2017,16-01-2017,45 dias,"Portugal, Porto, Porto","Artigo 20.º, n.º 1, alínea a) do Código dos Contratos Públicos",,,,,,Não aplicável.,Não aplicável.,FALSE
"aquisição de serviços de suporte de apoio técnico e manutenção aos programas informáticos denominados SRER e SGREC, à Intranet e ao Site Institucional",Ajuste Direto Regime Geral,Aquisição de serviços,"72267100-0, Manutenção de software para as tecnologias da infomação",Entidade Reguladora da Saúde (507021266),"Change Tomorrow, Lda. (513104640)","11.385,00 €",07-03-2017,02-11-2016,1095 dias,"Portugal, Porto, Porto","Artigo 20.º, n.º 1, alínea a) do Código dos Contratos Públicos",,,,,,Não aplicável.,Não aplicável.,FALSE
Aquisição de serviços para implementação do Sistema de Normalização Contabilística (SNC) em ERP Primavera Public e instalação do módulo Office Extensions.,Ajuste Direto Regime Geral,Aquisição de serviços,"72212443-6, Serviços de desenvolvimento de software para contabilidade",Entidade Reguladora da Saúde (507021266),"Primavera Business Software Solutions, S.A. (503140600)","16.850,00 €",07-03-2017,09-12-2016,22 dias,"Portugal, Porto, Porto","Artigo 20.º, n.º 1, alínea a) do Código dos Contratos Públicos",,,,,,Não aplicável.,Não aplicável.,FALSE
"Aquisição de uma solução de Segurança, Anti-Spam, Anti-Malware, Anti-phishing e Motor Antivírus.",Ajuste Direto Regime Geral,Aquisição de bens móveis,"48730000-4, Pacote de software de segurança",Entidade Reguladora da Saúde (507021266),Gonksys S.A. (510874169),"4.988,00 €",07-03-2017,11-01-2017,10 dias,"Portugal, Porto, Porto","Artigo 20.º, n.º 1, alínea a) do Código dos Contratos Públicos",,,,,,Não aplicável.,Não aplicável.,FALSE
