freguesia,acronym,validVotesPercentage,votes,dicofre
Escalhão,PS,55.39,113,090406
Escalhão,PPD/PSD,27.94,57,090406
Escalhão,B.E.,3.92,8,090406
Escalhão,CDS-PP,3.92,8,090406
Escalhão,A,1.96,4,090406
Escalhão,PDR,1.96,4,090406
Escalhão,PCP-PEV,1.47,3,090406
Escalhão,PCTP/MRPP,0.98,2,090406
Escalhão,L,0.49,1,090406
Escalhão,MAS,0.49,1,090406
Escalhão,NC,0.49,1,090406
Escalhão,PAN,0.49,1,090406
Escalhão,PTP,0.49,1,090406
Escalhão,IL,0,0,090406
Escalhão,PNR,0,0,090406
Escalhão,PPM.PPV/CDC,0,0,090406
Escalhão,PURP,0,0,090406
