freguesia,acronym,validVotesPercentage,votes,dicofre
Ponta Delgada,PPD/PSD.CDS-PP,46.58,204,311002
Ponta Delgada,PS,33.11,145,311002
Ponta Delgada,MPT,7.08,31,311002
Ponta Delgada,PTP,3.88,17,311002
Ponta Delgada,B.E.,1.83,8,311002
Ponta Delgada,PAN,1.6,7,311002
Ponta Delgada,PCP-PEV,1.37,6,311002
Ponta Delgada,L,1.14,5,311002
Ponta Delgada,PPM,1.14,5,311002
Ponta Delgada,PND,0.68,3,311002
Ponta Delgada,MAS,0.46,2,311002
Ponta Delgada,PCTP/MRPP,0.46,2,311002
Ponta Delgada,PNR,0.23,1,311002
Ponta Delgada,POUS,0.23,1,311002
Ponta Delgada,PPV,0.23,1,311002
Ponta Delgada,PDA,0,0,311002
