Objeto do Contrato,Tipo de Procedimento,Tipo(s) de Contrato,CPVs,Entidade(s) Adjudicante(s),Entidade(s) Adjudicatária(s),Preço Contratual,Data de Publicação,Data de Celebração do Contrato,Prazo de Execução,Local de Execução,Fundamentação,Data de Fecho do Contrato,Preço Total Efetivo,Causas das Alterações ao Prazo,Causas das Alterações ao Preço,Estado,N.º registo do Acordo Quadro,Descrição do Acordo Quadro,Procedimento Centralizado
Serviços de manutenção ao equipamento de Oftalmologia Laser VISX S44 (37000618),Ajuste Direto Regime Geral,Aquisição de serviços,"50800000-3, Serviços de reparação e manutenção diversos","Centro Hospitalar do Médio Tejo, E.P.E. (CHMT) (506361608)",ABBOTT MEDICAL OPTICS SPAIN SL SUCURSAL EM PORTUGAL  (980262364),"31.716,00 €",21-02-2018,12-10-2017,365 dias,"Portugal, Santarém, Tomar","Artigo 20.º, n.º 1, alínea a) do Código dos Contratos Públicos","","",,,,Não aplicável.,Não aplicável.,FALSE
"Serviços de manutenção de equipamentos de eletromedicina, 2018 (37000418)",Ajuste Direto Regime Geral,Aquisição de serviços,"50800000-3, Serviços de reparação e manutenção diversos","Centro Hospitalar do Médio Tejo, E.P.E. (CHMT) (506361608)",STB - Serviços Telemáticos e Biomédicos Unipessoal Lda (506989020),"56.664,00 €",21-02-2018,12-10-2017,365 dias,"Portugal, Santarém, Torres Novas","Artigo 20.º, n.º 1, alínea a) do Código dos Contratos Públicos","","",,,,Não aplicável.,Não aplicável.,FALSE
"Assistência técnica e manutenção às Centrais de Produção de Ar Medicinal, 2018 (37000718)",Ajuste Direto Regime Geral,Aquisição de serviços,"50800000-3, Serviços de reparação e manutenção diversos","Centro Hospitalar do Médio Tejo, E.P.E. (CHMT) (506361608)",AIR LIQUIDE MEDICINAL SA (501576436),"22.303,84 €",21-02-2018,12-10-2017,365 dias,"Portugal, Santarém, Torres Novas","Artigo 20.º, n.º 1, alínea a) do Código dos Contratos Públicos","","",,,,Não aplicável.,Não aplicável.,FALSE
Serviços de Manutenção da Central Telefónica para 2018 (3700018),Ajuste Direto Regime Geral,Aquisição de serviços,"50000000-5, Serviços de reparação e manutenção","Centro Hospitalar do Médio Tejo, E. P. E. (506361608)","Movirede II - Comunicação e Serviços, Lda (505919737)","12.500,00 €",21-02-2018,12-10-2017,365 dias,"Portugal, Santarém, Torres Novas","Artigo 20.º, n.º 1, alínea a) do Código dos Contratos Públicos","","",,,,Não aplicável.,Não aplicável.,FALSE
Manutenção ao equipamento Blispack e Cardex 2018 (37000118),Ajuste Direto Regime Geral,Aquisição de serviços,"50800000-3, Serviços de reparação e manutenção diversos","Centro Hospitalar do Médio Tejo, E.P.E. (CHMT) (506361608)","GRIFOLS PORTUGAL,PROD.FARMACÊUTICOS HOSPITAL LDA (502041285)","11.100,00 €",21-02-2018,12-10-2017,365 dias,"Portugal, Santarém, Abrantes","Artigo 20.º, n.º 1, alínea a) do Código dos Contratos Públicos","","",,,,Não aplicável.,Não aplicável.,FALSE
"Assistência Técnica e manutenção aos equipamentos de Hotelaria, Cozinha e Arcas Frigorificas, para 2018 (37001118)",Ajuste Direto Regime Geral,Aquisição de serviços,"50000000-5, Serviços de reparação e manutenção","Centro Hospitalar do Médio Tejo, E. P. E. (506361608)","Abranfrio - Equipamentos Hoteleiros, Lda (501392416)","11.910,00 €",20-02-2018,20-12-2017,365 dias,"Portugal, Santarém, Torres Novas","Artigo 21.º, n.º 1, alínea c) do Código dos Contratos Públicos",20-12-2017,"11.910,00 €",,,,Não aplicável.,Não aplicável.,FALSE
Aquisição artigos para anestesia,Ajuste Direto Regime Geral,Aquisição de bens móveis,"33100000-1, Equipamento médico","Centro Hospitalar do Médio Tejo, E.P.E. (CHMT) (506361608)","INTERSURGICAL PORTUGAL - Comércio de Produtos Hospitalares, Lda. (503480045)","16.030,50 €",20-02-2018,08-01-2018,365 dias,"Portugal, Santarém, Tomar<BR/>Portugal, Santarém, Abrantes<BR/>Portugal, Santarém, Torres Novas","Artigo 20.º, n.º 1, alínea a) do Código dos Contratos Públicos","","",,,,Não aplicável.,Não aplicável.,FALSE
