Objeto do Contrato,Tipo de Procedimento,Tipo(s) de Contrato,CPVs,Entidade(s) Adjudicante(s),Entidade(s) Adjudicatária(s),Preço Contratual,Data de Publicação,Data de Celebração do Contrato,Prazo de Execução,Local de Execução,Fundamentação,Data de Fecho do Contrato,Preço Total Efetivo,Causas das Alterações ao Prazo,Causas das Alterações ao Preço,Estado,N.º registo do Acordo Quadro,Descrição do Acordo Quadro,Procedimento Centralizado
Aquisição de Scanner,Ajuste Direto Regime Geral,Aquisição de bens móveis,"30236200-4, Equipamento para processamento de dados","SPMS- Serviços Partilhados do M. da Saúde, E.P.E. (509540716)","EDNI - Empresa Distrubuidora de material Informático, Lda. (503258121)","2.492,28 €",31-12-2014,12-12-2014,1095 dias,"Portugal, Lisboa, Lisboa","Artigo 20.º, n.º 1, alínea a) do Código dos Contratos Públicos",31-12-2014,"2.492,28 €","","",,Não aplicável.,Não aplicável.,FALSE
Aquisição de serviços de assessment á política de segurança de informação,Ajuste Direto Regime Geral,Aquisição de serviços,"72910000-2, Serviços informáticos de segurança","SPMS - Serviços Partilhados do Ministério da Saúde, E. P. E. (509540716)","NovaBase Business Solutions, Soluções de Consultoria, Desenvolvimento, Integração, Outsourcing, Manutenção e Operações de Sistemas de Informação, S. A. (504857312)","74.800,00 €",31-12-2014,22-12-2014,52 dias,Portugal,"Artigo 20.º, n.º 1, alínea a) do Código dos Contratos Públicos",28-02-2015,"74.800,00 €","","",,Não aplicável.,Não aplicável.,FALSE
"Aquisição de serviços de manutenção evolutiva e corretiva do sistema de informação e monitorização do SNS, SIM@SNS",Ajuste Direto Regime Geral,Aquisição de serviços,"72212100-0, Serviços de desenvolvimento de software para sectores específicos","SPMS - Serviços Partilhados do Ministério da Saúde, E. P. E. (509540716)","ALTRANPORTUGAL, S. A (504272179)","9.600,00 €",31-12-2014,23-12-2014,67 dias,"Portugal, Porto, Porto","Artigo 20.º, n.º 1, alínea a) do Código dos Contratos Públicos",28-02-2015,"9.600,00 €","","",,Não aplicável.,Não aplicável.,FALSE
Aquisição de formação na área da contratação,Ajuste Direto Regime Geral,Aquisição de serviços,"79632000-3, Serviços de formação de pessoal","SPMS - Serviços Partilhados do Ministério da Saúde, E. P. E. (509540716)","Vortal - Comércio Electrónico, Consultadoria e Multimédia, S. A. (505141019)","12.000,00 €",30-12-2014,29-12-2014,4 dias,Portugal,"Artigo 20.º, n.º 1, alínea a) do Código dos Contratos Públicos",31-12-2014,"12.000,00 €","","",,Não aplicável.,Não aplicável.,FALSE
Aquisição de formação em Oracle PL/SQL e JAVA,Ajuste Direto Regime Geral,Aquisição de serviços,"79632000-3, Serviços de formação de pessoal","SPMS - Serviços Partilhados do Ministério da Saúde, E. P. E. - SNCP (509540716)","Rumos, Formação e Comunicação, S. A. (500366039)","68.020,00 €",30-12-2014,28-10-2014,2 dias,"Portugal, Lisboa, Lisboa","Artigo 20.º, n.º 1, alínea a) do Código dos Contratos Públicos",31-12-2014,"68.020,00 €","","",,Não aplicável.,Não aplicável.,FALSE
Aquisição de serviços de uma base de dados de apoio à decisão clínica baseada em evidências para o SNS,Ajuste Direto Regime Geral,Aquisição de serviços,"72322000-8, Serviços de gestão de dados","SPMS - Serviços Partilhados do Ministério da Saúde, E. P. E. - SNCP (509540716)",BMJ Publishing Group Limited (GB 674738491),"74.990,00 €",30-12-2014,11-12-2014,365 dias,Portugal,"Artigo 20.º, n.º 1, alínea a) do Código dos Contratos Públicos",31-12-2015,"74.990,00 €","","",,Não aplicável.,Não aplicável.,FALSE
"Aquisição de serviços técnicos de ensaio, análise e consultoria na área das compras transversais",Ajuste Direto Regime Geral,Aquisição de serviços,"71600000-4, Serviços técnicos de ensaio, análise e consultoria","SPMS - Serviços Partilhados do Ministério da Saúde, E. P. E. (509540716)","Accenture, Consultores de Gestão, S. A. (502309440)","67.499,00 €",30-12-2014,22-12-2014,84 dias,"Portugal, Lisboa, Lisboa","Artigo 20.º, n.º 1, alínea a) do Código dos Contratos Públicos","","","","",,Não aplicável.,Não aplicável.,FALSE
Aquisição de serviços de integração SI-VIDA e SINAVE,Ajuste Direto Regime Geral,Aquisição de serviços,"72541000-9, Serviços de expansão informática","SPMS - Serviços Partilhados do Ministério da Saúde, E. P. E. (509540716)","Olisipo - Formação e Consultoria em Tecnologoas de Informação, S. A. (503169714)","9.849,00 €",30-12-2014,09-12-2014,105 dias,"Portugal, Lisboa, Lisboa","Artigo 20.º, n.º 1, alínea a) do Código dos Contratos Públicos",31-03-2015,"9.849,00 €","","",,Não aplicável.,Não aplicável.,FALSE
Aquisição de serviços de consultadoria na preparação de procedimentos para a área farmacêutica de contratação pública,Ajuste Direto Regime Geral,Aquisição de serviços,"79418000-7, Serviços de consultoria em matéria de aquisições","SPMS - Serviços Partilhados do Ministério da Saúde, E. P. E. (509540716)","Crucialintuition, Lda (513256709)","32.412,96 €",26-12-2014,10-12-2014,365 dias,"Portugal, Lisboa, Lisboa","Artigo 20.º, n.º 1, alínea a) do Código dos Contratos Públicos",30-05-2015,"16.255,27 €","Verificou-se a revogação do contrato por acordo entre as partes, ao abrigo do artigo 331.º do Código dos Contratos Públicos.","Verificou-se a revogação do contrato por acordo entre as partes, ao abrigo do artigo 331.º do Código dos Contratos Públicos.",,Não aplicável.,Não aplicável.,FALSE
Aquisição de serviços de emissão de certificados digitais Business SSL Wildcard,Ajuste Direto Regime Geral,Aquisição de serviços,"79132000-8, Serviços de certificação","SPMS - Serviços Partilhados do Ministério da Saúde, E. P. E. (509540716)","MARKETWARE - Soluções para Mercados Digitais, Lda. (505385864)","2.800,00 €",26-12-2014,05-12-2014,1095 dias,"Portugal, Lisboa, Lisboa","Artigo 20.º, n.º 1, alínea a) do Código dos Contratos Públicos",31-12-2014,"2.800,00 €","","",,Não aplicável.,Não aplicável.,FALSE
Aquisição de serviços de gestão de base de dados,Ajuste Direto Regime Geral,Aquisição de serviços,"72322000-8, Serviços de gestão de dados","SPMS - Serviços Partilhados do Ministério da Saúde, E. P. E. (509540716)",Gartener Portugal - Sucursal de Gartener España S. L. (980312450),"9.900,00 €",26-12-2014,10-12-2014,20 dias,Portugal,"Artigo 20.º, n.º 1, alínea a) do Código dos Contratos Públicos","","","","",,Não aplicável.,Não aplicável.,FALSE
"Aquisição de serviços para gestão e formação da aplicação SONHO V2 - Roll out das entidades IPOL, ULSLA e CHL",Ajuste Direto Regime Geral,Aquisição de serviços,"72510000-3, Serviços de gestão relacionados com a informática","SPMS- Serviços Partilhados do M. da Saúde, E.P.E. (509540716)","WINTRUST - Consultoria e Serviços, Lda. (507673263)","72.600,00 €",26-12-2014,10-12-2014,109 dias,"Portugal, Lisboa, Lisboa","Artigo 20.º, n.º 1, alínea a) do Código dos Contratos Públicos",31-08-2015,"72.600,00 €","","",,Não aplicável.,Não aplicável.,FALSE
Aquisição de bens periféricos,Ajuste Direto Regime Geral,Aquisição de bens móveis,"30232000-4, Equipamento periférico","SPMS - Serviços Partilhados do Ministério da Saúde, E. P. E. (509540716)","Code2ID Tecnologias para a Mobilidade, Lda. (507999410)","1.571,40 €",26-12-2014,14-10-2014,7 dias,"Portugal<BR/>Portugal, Lisboa, Lisboa","Artigo 20.º, n.º 1, alínea a) do Código dos Contratos Públicos",30-11-2014,"1.571,40 €","","",,Não aplicável.,Não aplicável.,FALSE
Aquisição de serviços de consultoria para os negócios e a gestão de organismos públicos,Ajuste Direto Regime Geral,Aquisição de serviços,"72510000-3, Serviços de gestão relacionados com a informática","SPMS - Serviços Partilhados do Ministério da Saúde, E. P. E. (509540716)","Crucialintuition, Lda. (513256709)","40.516,20 €",26-12-2014,17-11-2014,365 dias,"Portugal, Lisboa, Lisboa","Artigo 20.º, n.º 1, alínea a) do Código dos Contratos Públicos",30-05-2015,"23.634,45 €",Revogação do contrato ao abrigo do artigo 331.º do Código dos Contratos Públicos,Revogação do contrato ao abrigo do artigo 331.º do Código dos Contratos Públicos,,Não aplicável.,Não aplicável.,FALSE
Aquisição de serviços de consultoria na área técnica,Ajuste Direto Regime Geral,Aquisição de serviços,"71356100-9, Serviços de controlo técnico","SPMS - Serviços Partilhados do Ministério da Saúde, E. P. E. (509540716)","Crucialintuition, Lda. (513256709)","32.412,96 €",26-12-2014,05-11-2014,365 dias,"Portugal, Lisboa, Lisboa","Artigo 20.º, n.º 1, alínea a) do Código dos Contratos Públicos",31-10-2015,"32.412,96 €","","",,Não aplicável.,Não aplicável.,FALSE
Aquisição de serviços de consultoria na área da contratação pública,Ajuste Direto Regime Geral,Aquisição de serviços,"79418000-7, Serviços de consultoria em matéria de aquisições","SPMS - Serviços Partilhados do Ministério da Saúde, E. P. E. (509540716)","Crucialintuition, Lda. (513256709)","27.010,80 €",26-12-2014,17-11-2014,365 dias,"Portugal, Lisboa, Lisboa","Artigo 20.º, n.º 1, alínea a) do Código dos Contratos Públicos",31-10-2015,"27.010,80 €","","",,Não aplicável.,Não aplicável.,FALSE
Aquisição de equipamentos de comunicação,Ajuste Direto Regime Geral,Aquisição de bens móveis,"32252110-8, Telemóveis mãos livres (sem fios)","SPMS - Serviços Partilhados do Ministério da Saúde, E. P. E. (509540716)","Vodafone Portugal - Comunicações Pessoais, S. A. (502544180)","9.900,00 €",26-12-2014,26-12-2014,30 dias,Portugal,"Artigo 20.º, n.º 1, alínea a) do Código dos Contratos Públicos","","","","",,Não aplicável.,Não aplicável.,FALSE
"Aquisição de serviços de desenvolvimento no novo sítio de Internet e Intranet para a ACSS, IP",Ajuste Direto Regime Geral,Aquisição de serviços,"72421000-7, Serviços de desenvolvimento de aplicações para clientes de Internet ou intranet","SPMS - Serviços Partilhados do Ministério da Saúde, E. P. E. (509540716)","Master Link - Sistemas de Informação, Lda. (504143603)","29.950,00 €",26-12-2014,04-11-2014,55 dias,"Portugal, Lisboa, Lisboa","Artigo 20.º, n.º 1, alínea a) do Código dos Contratos Públicos","","","","",,Não aplicável.,Não aplicável.,FALSE
Aquisição de serviços de patrocínio jurídico ao contencioso RIS até à decisão final da 1.ª instância,Ajuste Direto Regime Geral,Aquisição de serviços,"79100000-5, Serviços jurídicos","SPMS - Serviços Partilhados do Ministério da Saúde, E. P. E. (509540716)","Sérvulo & Associados - Sociedade de Advoogados, RL (504344285)","40.000,00 €",23-12-2014,18-11-2014,365 dias,"Portugal, Lisboa, Lisboa","Artigo 20.º, n.º 1, alínea a) do Código dos Contratos Públicos",31-10-2015,"40.000,00 €","","",,Não aplicável.,Não aplicável.,FALSE
Aquisição de serviços de consultoria para levantamento da infraestrutura e parque aplicacional do Centro de Medicina Física e de Reabilitação do Sul,Ajuste Direto Regime Geral,Aquisição de serviços,"71311300-4, Serviços de consultoria em matéria de infra-estruturas","SPMS - Serviços Partilhados do Ministério da Saúde, E. P. E. (509540716)","ACCENTURE, Consultores de Gestão, S. A. (502309440)","9.700,00 €",22-12-2014,26-11-2014,15 dias,"Portugal, Faro, São Brás de Alportel<BR/>Portugal, Lisboa, Lisboa","Artigo 20.º, n.º 1, alínea a) do Código dos Contratos Públicos",31-12-2014,"9.700,00 €","","",,Não aplicável.,Não aplicável.,FALSE
