Objeto do Contrato,Tipo de Procedimento,Tipo(s) de Contrato,CPVs,Entidade(s) Adjudicante(s),Entidade(s) Adjudicatária(s),Preço Contratual,Data de Publicação,Data de Celebração do Contrato,Prazo de Execução,Local de Execução,Fundamentação,Data de Fecho do Contrato,Preço Total Efetivo,Causas das Alterações ao Prazo,Causas das Alterações ao Preço,Estado,N.º registo do Acordo Quadro,Descrição do Acordo Quadro,Procedimento Centralizado
"Fornecimento de 120 ampolas de Tiocolquicosido, amp. 4mg/2ml",Ajuste Direto Regime Geral,Aquisição de bens móveis,"33000000-0, Equipamento médico, medicamentos e produtos para cuidados pessoais","Instituto Nacional de Emergência Médica, IP (501356126)","SANOFI - PRODUTOS FARMACÊUTICOS, LDA. (500134960)","50,40 €",31-07-2013,28-06-2013,30 dias,"Portugal, Lisboa, Lisboa","Artigo 26.º, n.º 1, alínea e) do Código dos Contratos Públicos",,,,,,1038044,"Fornecimento de 120 ampolas de Tiocolquicosido, amp. 4mg/2ml",
Aquisição de Conjunto para Parto Súbito,Ajuste Direto Regime Geral,Aquisição de bens móveis,"33000000-0, Equipamento médico, medicamentos e produtos para cuidados pessoais","Instituto Nacional de Emergência Médica, IP (501356126)","BASTOS VIEGAS, S.A. (500042772)","778,68 €",31-07-2013,28-06-2013,30 dias,"Portugal, Lisboa, Lisboa","Artigo 26.º, n.º 1, alínea e) do Código dos Contratos Públicos",,,,,,1038059,Aquisição de Conjunto para Parto Súbito,
Reparação de LP 12 número de série 32205013.,Ajuste Direto Regime Geral,Aquisição de serviços,"50000000-5, Serviços de reparação e manutenção","Instituto Nacional de Emergência Médica, IP (501356126)",Physio Portugal Sales (510137946),"310,47 €",31-07-2013,31-07-2013,30 dias,"Portugal, Lisboa, Lisboa","Artigo 24.º, n.º 1, alínea e) do Código dos Contratos Públicos",,,,,,Não aplicável.,Não aplicável.,
Reparação de LP 500 número de série 32177070.,Ajuste Direto Regime Geral,Aquisição de serviços,"50000000-5, Serviços de reparação e manutenção","Instituto Nacional de Emergência Médica, IP (501356126)","PHYSIO PORTUGAL SALES, UNIPESSOAL, LDA. (510137946)","156,24 €",31-07-2013,28-06-2013,30 dias,"Portugal, Lisboa, Lisboa","Artigo 24.º, n.º 1, alínea e) do Código dos Contratos Públicos",,,,,,Não aplicável.,Não aplicável.,
Reparação de LP 500 número de série 32177084.,Ajuste Direto Regime Geral,Aquisição de serviços,"50000000-5, Serviços de reparação e manutenção","Instituto Nacional de Emergência Médica, IP (501356126)","PHYSIO PORTUGAL SALES, UNIPESSOAL, LDA. (510137946)","156,24 €",31-07-2013,28-06-2013,30 dias,"Portugal, Lisboa, Lisboa","Artigo 24.º, n.º 1, alínea e) do Código dos Contratos Públicos",,,,,,Não aplicável.,Não aplicável.,
Reparação de LP 500 número de série 32177063.,Ajuste Direto Regime Geral,Aquisição de serviços,"50000000-5, Serviços de reparação e manutenção","Instituto Nacional de Emergência Médica, IP (501356126)","PHYSIO PORTUGAL SALES, UNIPESSOAL, LDA. (510137946)","156,24 €",31-07-2013,28-06-2013,30 dias,"Portugal, Lisboa, Lisboa","Artigo 24.º, n.º 1, alínea e) do Código dos Contratos Públicos",,,,,,Não aplicável.,Não aplicável.,
Reparação de seringa B. Braun número de série 88796.,Ajuste Direto Regime Geral,Aquisição de serviços,"50000000-5, Serviços de reparação e manutenção","Instituto Nacional de Emergência Médica, IP (501356126)","B. BRAUN MEDICAL, LDA. (501506543)","299,21 €",31-07-2013,15-07-2013,30 dias,"Portugal, Lisboa, Lisboa","Artigo 24.º, n.º 1, alínea e) do Código dos Contratos Públicos",,,,,,Não aplicável.,Não aplicável.,
Reparação de seringa B. Braun número de série 35313.,Ajuste Direto Regime Geral,Aquisição de serviços,"50000000-5, Serviços de reparação e manutenção","Instituto Nacional de Emergência Médica, IP (501356126)","B. BRAUN MEDICAL, LDA. (501506543)","755,00 €",31-07-2013,15-07-2013,30 dias,"Portugal, Lisboa, Lisboa","Artigo 24.º, n.º 1, alínea e) do Código dos Contratos Públicos",,,,,,Não aplicável.,Não aplicável.,
Reparação de LP 12 número de série 13083108.,Ajuste Direto Regime Geral,Aquisição de serviços,"50000000-5, Serviços de reparação e manutenção","Instituto Nacional de Emergência Médica, IP (501356126)","PHYSIO PORTUGAL SALES, UNIPESSOAL, LDA. (510137946)","1.254,07 €",31-07-2013,28-06-2013,30 dias,"Portugal, Lisboa, Lisboa","Artigo 24.º, n.º 1, alínea e) do Código dos Contratos Públicos",,,,,,Não aplicável.,Não aplicável.,
Reparação de LP 12 número de série 13083093.,Ajuste Direto Regime Geral,Aquisição de serviços,"50000000-5, Serviços de reparação e manutenção","Instituto Nacional de Emergência Médica, IP (501356126)","PHYSIO PORTUGAL SALES, UNIPESSOAL, LDA (510137946)","794,16 €",31-07-2013,28-06-2013,30 dias,"Portugal, Lisboa, Lisboa","Artigo 24.º, n.º 1, alínea e) do Código dos Contratos Públicos",,,,,,Não aplicável.,Não aplicável.,
Reparação de seringa Fresenius 17491148.,Ajuste Direto Regime Geral,Aquisição de serviços,"50000000-5, Serviços de reparação e manutenção","Instituto Nacional de Emergência Médica, IP (501356126)",FRESENIUS KABI PHARMA PORTUGAL (504293753),"99,29 €",31-07-2013,11-07-2013,30 dias,"Portugal, Lisboa, Lisboa","Artigo 20.º, n.º 1, alínea a) do Código dos Contratos Públicos",,,,,,Não aplicável.,Não aplicável.,
Reparação de monitor de parâmetros vitais NONIM número de série 500689097,Ajuste Direto Regime Geral,Aquisição de serviços,"50000000-5, Serviços de reparação e manutenção","Instituto Nacional de Emergência Médica, IP (501356126)","SPACE MEDICAL - EQUIPAMENTOS MÉDICOS, LDA. (507662407)","500,00 €",31-07-2013,11-07-2013,30 dias,"Portugal, Lisboa, Lisboa","Artigo 24.º, n.º 1, alínea e) do Código dos Contratos Públicos",,,,,,Não aplicável.,Não aplicável.,
Reparação de monitor de parâmetros vitais NONIM número de série 500683400.,Ajuste Direto Regime Geral,Aquisição de serviços,"50000000-5, Serviços de reparação e manutenção","Instituto Nacional de Emergência Médica, IP (501356126)","SPACE - EQUIPAMENTOS MÉDICOS, LDA. (507662407)","500,00 €",31-07-2013,11-07-2013,30 dias,"Portugal, Lisboa, Lisboa","Artigo 24.º, n.º 1, alínea e) do Código dos Contratos Públicos",,,,,,Não aplicável.,Não aplicável.,
Reparação de monitor de parâmetros vitais Propac número de série 04327012 (GA010373).,Ajuste Direto Regime Geral,Aquisição de serviços,"50000000-5, Serviços de reparação e manutenção","Instituto Nacional de Emergência Médica, IP (501356126)","ELNOR - Equipamentos Técnicos e de Laboratório, S.A. (500094403)","170,00 €",29-07-2013,11-07-2013,30 dias,"Portugal, Lisboa, Lisboa","Artigo 24.º, n.º 1, alínea e) do Código dos Contratos Públicos",,,,,,Não aplicável.,Não aplicável.,
Reparação de seringa B. Braun número de série 82354.,Ajuste Direto Regime Geral,Aquisição de serviços,"50000000-5, Serviços de reparação e manutenção","Instituto Nacional de Emergência Médica, IP (501356126)","B. BRAUN MEDICAL, LDA. (501506543)","350,75 €",29-07-2013,11-07-2013,30 dias,"Portugal, Lisboa, Lisboa","Artigo 24.º, n.º 1, alínea e) do Código dos Contratos Públicos",,,,,,Não aplicável.,Não aplicável.,
Reparação de seringa B. Braun número de série 105098.,Ajuste Direto Regime Geral,Aquisição de serviços,"50000000-5, Serviços de reparação e manutenção","Instituto Nacional de Emergência Médica, IP (501356126)",B. BRAUN MEDICAL (501506543),"344,51 €",29-07-2013,11-07-2013,30 dias,"Portugal, Lisboa, Lisboa","Artigo 24.º, n.º 1, alínea e) do Código dos Contratos Públicos",,,,,,Não aplicável.,Não aplicável.,
Reparação de seringa B. Braun número de série 101249.,Ajuste Direto Regime Geral,Aquisição de serviços,"50000000-5, Serviços de reparação e manutenção","Instituto Nacional de Emergência Médica, IP (501356126)","B. BRAUN MEDICAL, LDA. (501506543)","423,23 €",29-07-2013,11-07-2013,30 dias,"Portugal, Lisboa, Lisboa","Artigo 24.º, n.º 1, alínea e) do Código dos Contratos Públicos",,,,,,Não aplicável.,Não aplicável.,
Prestação de serviços jurídicos,Ajuste Direto Regime Geral,Aquisição de serviços,"98000000-3, Outros serviços comunitários, sociais e pessoais","Instituto Nacional de Emergência Médica, IP (501356126)","Velosa da Silva e Associados, Sociedade de Advogados, R.L. (507781503)","9.000,00 €",26-07-2013,22-07-2013,180 dias,"Portugal, Lisboa, Lisboa","Artigo 27.º, n.º 1, alínea b) do Código dos Contratos Públicos",,,,,,Não aplicável.,Não aplicável.,
Aquisição de diverso material clínico,Ajuste Direto Regime Geral,Aquisição de bens móveis,"33000000-0, Equipamento médico, medicamentos e produtos para cuidados pessoais","Instituto Nacional de Emergência Médica, IP (501356126)","Iberdata - Equipamentos, S.A. (501904921)","2.696,96 €",26-07-2013,18-07-2013,60 dias,"Portugal, Lisboa, Lisboa","Artigo 20.º, n.º 1, alínea a) do Código dos Contratos Públicos",,,,,,Não aplicável.,Não aplicável.,
Aquisição de diverso material clínico,Ajuste Direto Regime Geral,Aquisição de bens móveis,"33000000-0, Equipamento médico, medicamentos e produtos para cuidados pessoais","Instituto Nacional de Emergência Médica, IP (501356126)","FUTURVIDA - Fabricação de Veículos Especias, Lda. (504260510)","2.330,00 €",26-07-2013,18-07-2013,60 dias,"Portugal, Lisboa, Lisboa","Artigo 20.º, n.º 1, alínea a) do Código dos Contratos Públicos",,,,,,Não aplicável.,Não aplicável.,
Aquisição de 600 contentores para recolha de cortantes contaminados,Ajuste Direto Regime Geral,Aquisição de bens móveis,"33000000-0, Equipamento médico, medicamentos e produtos para cuidados pessoais","Instituto Nacional de Emergência Médica, IP (501356126)","Overpharma, Produtos Médicos e Farmacêuticos, Lda. (505792362)","330,00 €",26-07-2013,15-07-2013,60 dias,"Portugal, Lisboa, Lisboa","Artigo 26.º, n.º 1, alínea e) do Código dos Contratos Públicos",,,,,,1046758,Aquisição de contentor para recolha de cortantes contaminados,
Aquisição de 2010 toalhetes de papel para mãos zig-zag,Ajuste Direto Regime Geral,Aquisição de bens móveis,"33000000-0, Equipamento médico, medicamentos e produtos para cuidados pessoais","Instituto Nacional de Emergência Médica, IP (501356126)","Servisan - Produtos de Higiene, S.A. (500246530)","1.338,66 €",26-07-2013,17-07-2013,60 dias,"Portugal, Lisboa, Lisboa","Artigo 20.º, n.º 1, alínea a) do Código dos Contratos Públicos",,,,,,Não aplicável.,Não aplicável.,
Aquisição de diverso material clínico,Ajuste Direto Regime Geral,Aquisição de bens móveis,"33000000-0, Equipamento médico, medicamentos e produtos para cuidados pessoais","Instituto Nacional de Emergência Médica, IP (501356126)","Intersurgical Portugal - Comércio de Produtos Hospitalares, Lda. (503480045)","3.270,00 €",26-07-2013,15-07-2013,60 dias,"Portugal, Lisboa, Lisboa","Artigo 20.º, n.º 1, alínea a) do Código dos Contratos Públicos",,,,,,Não aplicável.,Não aplicável.,
Aquisição de diverso material clínico,Ajuste Direto Regime Geral,Aquisição de bens móveis,"33000000-0, Equipamento médico, medicamentos e produtos para cuidados pessoais","Instituto Nacional de Emergência Médica, IP (501356126)","Physio Portugal Sales, Unipessoal Lda. (510137946)","34.233,25 €",26-07-2013,18-07-2013,60 dias,"Portugal, Lisboa, Lisboa","Artigo 24.º, n.º 1, alínea e) do Código dos Contratos Públicos",,,,,,Não aplicável.,Não aplicável.,
Aquisição de Cloreto de Sódio,Ajuste Direto Regime Geral,Aquisição de bens móveis,"33000000-0, Equipamento médico, medicamentos e produtos para cuidados pessoais","Instituto Nacional de Emergência Médica, IP (501356126)","Baxter Médico Farmacêutica, Lda. (503347345)","2.741,55 €",26-07-2013,11-07-2013,60 dias,"Portugal, Lisboa, Lisboa","Artigo 26.º, n.º 1, alínea e) do Código dos Contratos Públicos",,,,,,1045565,Aquisição de Cloreto de Sódio,
Aquisição de ligaduras e compressas,Ajuste Direto Regime Geral,Aquisição de bens móveis,"33000000-0, Equipamento médico, medicamentos e produtos para cuidados pessoais","Instituto Nacional de Emergência Médica, IP (501356126)","Albino Dias Andrade, Lda. (500013810)","974,74 €",26-07-2013,17-07-2013,60 dias,"Portugal, Lisboa, Lisboa","Artigo 26.º, n.º 1, alínea e) do Código dos Contratos Públicos",,,,,,1045569,Aquisição de ligaduras e compressas,
Aquisição de ligaduras e compressas,Ajuste Direto Regime Geral,Aquisição de bens móveis,"33000000-0, Equipamento médico, medicamentos e produtos para cuidados pessoais","Instituto Nacional de Emergência Médica, IP (501356126)","Albino Dias Andrade, Lda. (500013810)","974,74 €",26-07-2013,17-07-2013,60 dias,"Portugal, Lisboa, Lisboa","Artigo 26.º, n.º 1, alínea e) do Código dos Contratos Públicos",,,,,,1046728,Aquisição de ligaduras e compressas,
reparação de aspirador Laerdal LSU,Ajuste Direto Regime Geral,Aquisição de serviços,"50000000-5, Serviços de reparação e manutenção","Instituto Nacional de Emergência Médica, IP (501356126)","Medicinália - Cormédica, Lda (500684324)","209,90 €",25-07-2013,11-07-2013,90 dias,"Portugal, Lisboa, Lisboa","Artigo 24.º, n.º 1, alínea e) do Código dos Contratos Públicos",,,,,,Não aplicável.,Não aplicável.,
aquisição de detergente desinfetante,Ajuste Direto Regime Geral,Aquisição de bens móveis,"33000000-0, Equipamento médico, medicamentos e produtos para cuidados pessoais","Instituto Nacional de Emergência Médica, IP (501356126)","Air Liquide Medicinal, S.A. (501576436)","128,62 €",25-07-2013,28-06-2013,30 dias,"Portugal, Lisboa, Lisboa","Artigo 20.º, n.º 1, alínea a) do Código dos Contratos Públicos",,,,,,Não aplicável.,Não aplicável.,
Aquisição de 50 frascos de Glucagon,Ajuste Direto Regime Geral,Aquisição de bens móveis,"33000000-0, Equipamento médico, medicamentos e produtos para cuidados pessoais","Instituto Nacional de Emergência Médica, IP (501356126)","Novo Nordisk, Lda. (501485210)","682,50 €",25-07-2013,18-07-2013,30 dias,"Portugal, Lisboa, Lisboa","Artigo 20.º, n.º 1, alínea a) do Código dos Contratos Públicos",,,,,,Não aplicável.,Não aplicável.,
Aquisição de 80000 lancetas de uso único estéril,Ajuste Direto Regime Geral,Aquisição de bens móveis,"33000000-0, Equipamento médico, medicamentos e produtos para cuidados pessoais","Instituto Nacional de Emergência Médica, IP (501356126)","Iberlab & Imunorege, Lda (503406694)","3.920,00 €",25-07-2013,17-07-2013,30 dias,"Portugal, Lisboa, Lisboa","Artigo 20.º, n.º 1, alínea a) do Código dos Contratos Públicos",,,,,,Não aplicável.,Não aplicável.,
Aquisição de placa de primário para central telefónica Avaya,Ajuste Direto Regime Geral,Aquisição de bens móveis,"32000000-3, Equipamento de rádio, televisão, comunicação, telecomunicações e afins","Instituto Nacional de Emergência Médica, IP (501356126)","PAPTI - Sol. Globais de Telecom. e Informática, S.A. (503280550)","4.245,00 €",25-07-2013,25-07-2013,30 dias,"Portugal, Lisboa, Lisboa","Artigo 20.º, n.º 1, alínea a) do Código dos Contratos Públicos",,,,,,Não aplicável.,Não aplicável.,
Plataforma Eletrónica de Contratação Pública,Ajuste Direto Regime Geral,Aquisição de serviços,"72000000-5, Serviços de TI: consultoria, desenvolvimento de software, Internet e apoio","Instituto Nacional de Emergência Médica, IP (501356126)","Saphety Level - Trusted Services, S.A. (507957547)","2.700,00 €",25-07-2013,05-06-2013,365 dias,"Portugal, Lisboa, Lisboa",Artigo 258.º do Código dos Contratos Públicos,,,,,,Não aplicável.,Não aplicável.,
Reparação de incubadora Atom Acutronic,Ajuste Direto Regime Geral,Aquisição de serviços,"50000000-5, Serviços de reparação e manutenção","Instituto Nacional de Emergência Médica, IP (501356126)","Pulmocor - Equipamento médico, S.A. (501402578)","6.535,00 €",25-07-2013,19-07-2013,30 dias,"Portugal, Lisboa, Lisboa","Artigo 20.º, n.º 1, alínea a) do Código dos Contratos Públicos",,,,,,Não aplicável.,Não aplicável.,
Comunicação móveis - Março/Abril 2013,Ajuste Direto Regime Geral,Aquisição de serviços,"64000000-6, Serviços postais e de telecomunicações","Instituto Nacional de Emergência Médica, IP (501356126)","Vodafone Portugal - Comunicações Pessoais, S.A. (502544180)","25.000,00 €",25-07-2013,25-03-2013,60 dias,"Portugal, Lisboa, Lisboa","Artigo 24.º, n.º 1, alínea c) do Código dos Contratos Públicos",,,,,,Não aplicável.,Não aplicável.,
