freguesia,acronym,validVotesPercentage,votes,dicofre
União das freguesias de Cortiçadas de Lavre e Lavre,PCP-PEV,50.82,310,070611
União das freguesias de Cortiçadas de Lavre e Lavre,PS,22.95,140,070611
União das freguesias de Cortiçadas de Lavre e Lavre,PPD/PSD.CDS-PP,14.59,89,070611
União das freguesias de Cortiçadas de Lavre e Lavre,PCTP/MRPP,2.95,18,070611
União das freguesias de Cortiçadas de Lavre e Lavre,B.E.,2.46,15,070611
União das freguesias de Cortiçadas de Lavre e Lavre,L,1.97,12,070611
União das freguesias de Cortiçadas de Lavre e Lavre,MPT,1.97,12,070611
União das freguesias de Cortiçadas de Lavre e Lavre,PAN,0.98,6,070611
União das freguesias de Cortiçadas de Lavre e Lavre,MAS,0.33,2,070611
União das freguesias de Cortiçadas de Lavre e Lavre,PPM,0.33,2,070611
União das freguesias de Cortiçadas de Lavre e Lavre,PTP,0.33,2,070611
União das freguesias de Cortiçadas de Lavre e Lavre,PND,0.16,1,070611
União das freguesias de Cortiçadas de Lavre e Lavre,PNR,0.16,1,070611
União das freguesias de Cortiçadas de Lavre e Lavre,PDA,0,0,070611
União das freguesias de Cortiçadas de Lavre e Lavre,POUS,0,0,070611
União das freguesias de Cortiçadas de Lavre e Lavre,PPV,0,0,070611
