Objeto do Contrato,Tipo de Procedimento,Tipo(s) de Contrato,CPVs,Entidade(s) Adjudicante(s),Entidade(s) Adjudicatária(s),Preço Contratual,Data de Publicação,Data de Celebração do Contrato,Prazo de Execução,Local de Execução,Fundamentação,Data de Fecho do Contrato,Preço Total Efetivo,Causas das Alterações ao Prazo,Causas das Alterações ao Preço,Estado,N.º registo do Acordo Quadro,Descrição do Acordo Quadro,Procedimento Centralizado
"Prestação de serviços de fornecimento de alimentação para a Unidade de S. Gonçalo, com colocação de equipamento",Concurso público,Aquisição de serviços,"55322000-3, Serviços de confecção de refeições","Centro Hospitalar do Tâmega e Sousa, EPE (508318262)",Serviço de Utilização Comum dos Hospitais (500900469),"208.397,50 €",06-10-2011,22-09-2011,366 dias,"Portugal, Porto, Amarante","Artigo 20.º, n.º 1, alínea b) do Código dos Contratos Públicos",,,,,,Não aplicável.,Não aplicável.,
"Prestação de serviços de fornecimento de alimentação para a Unidade Padre Américo, com colocação de equipamento",Concurso público,Aquisição de serviços,"55322000-3, Serviços de confecção de refeições","Centro Hospitalar do Tâmega e Sousa, EPE (508318262)",Serviço de Utilização Comum dos Hospitais (500900469),"3.036.693,62 €",06-10-2011,22-09-2011,1096 dias,"Portugal, Porto, Penafiel","Artigo 20.º, n.º 1, alínea b) do Código dos Contratos Públicos",,,,,,Não aplicável.,Não aplicável.,
