freguesia,acronym,validVotesPercentage,votes,dicofre
União das freguesias de Carvalhais e Candal,PPD/PSD.CDS-PP,43.79,208,181620
União das freguesias de Carvalhais e Candal,PS,36.63,174,181620
União das freguesias de Carvalhais e Candal,MPT,6.53,31,181620
União das freguesias de Carvalhais e Candal,B.E.,3.58,17,181620
União das freguesias de Carvalhais e Candal,PCP-PEV,2.32,11,181620
União das freguesias de Carvalhais e Candal,PCTP/MRPP,1.89,9,181620
União das freguesias de Carvalhais e Candal,PND,1.68,8,181620
União das freguesias de Carvalhais e Candal,PTP,1.68,8,181620
União das freguesias de Carvalhais e Candal,L,0.63,3,181620
União das freguesias de Carvalhais e Candal,MAS,0.42,2,181620
União das freguesias de Carvalhais e Candal,PAN,0.21,1,181620
União das freguesias de Carvalhais e Candal,PDA,0.21,1,181620
União das freguesias de Carvalhais e Candal,PPM,0.21,1,181620
União das freguesias de Carvalhais e Candal,PPV,0.21,1,181620
União das freguesias de Carvalhais e Candal,PNR,0,0,181620
União das freguesias de Carvalhais e Candal,POUS,0,0,181620
