Objeto do Contrato,Tipo de Procedimento,Tipo(s) de Contrato,CPVs,Entidade(s) Adjudicante(s),Entidade(s) Adjudicatária(s),Preço Contratual,Data de Publicação,Data de Celebração do Contrato,Prazo de Execução,Local de Execução,Fundamentação,Data de Fecho do Contrato,Preço Total Efetivo,Causas das Alterações ao Prazo,Causas das Alterações ao Preço,Estado,N.º registo do Acordo Quadro,Descrição do Acordo Quadro,Procedimento Centralizado
"Fornecimento Gadolinium 279,32 Ml INJ-15Ml",Ajuste Direto Regime Geral,Aquisição de bens móveis,"33600000-6, Produtos farmacêuticos","Instituto Português de Oncologia de Lisboa FG, E.P.E. (506361616)","A. MARTINS & FERNANDES, SA (501172114)","72.000,00 €",11-04-2016,15-03-2016,365 dias,"Portugal, Lisboa, Lisboa","Artigo 20.º, n.º 1, alínea a) do Código dos Contratos Públicos",,,,,,Não aplicável.,Não aplicável.,FALSE
Aparelho de lipomassagem,Ajuste Direto Regime Geral,Aquisição de bens móveis,"33100000-1, Equipamento médico","Instituto Português de Oncologia de Lisboa FG, E.P.E. (506361616)","BTL PORTUGAL, LDA (508192943)","14.000,00 €",06-04-2016,09-12-2015,28 dias,"Portugal, Lisboa, Lisboa","Artigo 20.º, n.º 1, alínea a) do Código dos Contratos Públicos",,,,,,Não aplicável.,Não aplicável.,FALSE
Aquisição de actualização de sistema de cariotipagem,Ajuste Direto Regime Geral,Aquisição de bens móveis,"48180000-3, Pacote de software para medicina","Instituto Português de Oncologia de Lisboa FG, E.P.E. (506361616)","leica microssistemas, lda (500301921)","51.612,00 €",05-04-2016,19-10-2015,30 dias,"Portugal, Lisboa, Lisboa","Artigo 24.º, n.º 1, alínea e) do Código dos Contratos Públicos",,,,,,Não aplicável.,Não aplicável.,FALSE
CP2371-15Fornecimento de equipamento endoscopio 3 videos gastroscopios 1 video colonoscopiio e 1 torre de endoscopia,Concurso público,Aquisição de bens móveis,"33168000-5, Aparelhos para endoscopia e endocirurgia","Instituto Português de Oncologia de Lisboa Francisco Gentil, E. P. E. (506361616)",OLYMPUS IBERIA SAU (980474710),"99.600,00 €",04-04-2016,11-12-2015,30 dias,"Portugal, Lisboa, Lisboa","Artigo 20.º, n.º 2 do Código dos Contratos Públicos",,,,,,Não aplicável.,Não aplicável.,FALSE
Aquisição de 3 videolaringoscopios e de 1 videoprocessador,Ajuste Direto Regime Geral,Aquisição de bens móveis,"33100000-1, Equipamento médico","Instituto Português de Oncologia de Lisboa FG, E.P.E. (506361616)","OLYMPUS IBERIA , S.A.A.U-SUCURSAL EM PORTUGAL (980474710)","32.000,00 €",04-04-2016,12-10-2015,30 dias,"Portugal, Lisboa, Lisboa","Artigo 20.º, n.º 1, alínea a) do Código dos Contratos Públicos",,,,,,Não aplicável.,Não aplicável.,FALSE
Fornecimento de Core de Rede e switch de acesso ao IPO LISBOA F.G.EPE,Ajuste Direto Regime Geral,Aquisição de serviços,"72500000-0, Serviços relacionados com a informática","Instituto Português de Oncologia de Lisboa FG, E.P.E. (506361616)","ozona Consulting, SL-Sucursal em Portugal (980315921)","70.746,59 €",04-04-2016,10-03-2016,295 dias,"Portugal, Lisboa, Lisboa","Artigo 24.º, n.º 1, alínea e) do Código dos Contratos Públicos",,,,,,Não aplicável.,Não aplicável.,FALSE
