freguesia,acronym,validVotesPercentage,votes,dicofre
Alcaria,PS,41.81,125,050402
Alcaria,PPD/PSD,21.74,65,050402
Alcaria,B.E.,12.71,38,050402
Alcaria,PAN,4.35,13,050402
Alcaria,PCP-PEV,3.68,11,050402
Alcaria,A,3.34,10,050402
Alcaria,CDS-PP,2.34,7,050402
Alcaria,L,2.01,6,050402
Alcaria,PCTP/MRPP,1.67,5,050402
Alcaria,IL,1.34,4,050402
Alcaria,PPM.PPV/CDC,1.34,4,050402
Alcaria,PURP,1,3,050402
Alcaria,NC,0.67,2,050402
Alcaria,PDR,0.67,2,050402
Alcaria,PNR,0.67,2,050402
Alcaria,MAS,0.33,1,050402
Alcaria,PTP,0.33,1,050402
