Objeto do Contrato,Tipo de Procedimento,Tipo(s) de Contrato,CPVs,Entidade(s) Adjudicante(s),Entidade(s) Adjudicatária(s),Preço Contratual,Data de Publicação,Data de Celebração do Contrato,Prazo de Execução,Local de Execução,Fundamentação,Data de Fecho do Contrato,Preço Total Efetivo,Causas das Alterações ao Prazo,Causas das Alterações ao Preço,Estado,N.º registo do Acordo Quadro,Descrição do Acordo Quadro,Procedimento Centralizado
Detergentes para esterilização,Ajuste Direto Regime Geral,Aquisição de bens móveis,"33100000-1, Equipamento médico","Centro Hospitalar do Médio Tejo, E.P.E. (CHMT) (506361608)","A. MENDES SILVA, LDA (502064080)","11.712,98 €",05-01-2018,18-12-2017,365 dias,"Portugal, Santarém, Abrantes<BR/>Portugal, Santarém, Torres Novas<BR/>Portugal, Santarém, Tomar","Artigo 20.º, n.º 1, alínea a) do Código dos Contratos Públicos",,,,,,Não aplicável.,Não aplicável.,FALSE
Aquisição dispositivos para evacuação e para banho,Ao abrigo de acordo-quadro (art.º 259.º),Aquisição de bens móveis,"33600000-6, Produtos farmacêuticos","Centro Hospitalar do Médio Tejo, E.P.E. (CHMT) (506361608)","EZEQUIEL PANAO JORGE,LDA (501412727)","7.661,40 €",03-01-2018,07-09-2017,365 dias,"Portugal, Santarém, Abrantes<BR/>Portugal, Santarém, Torres Novas<BR/>Portugal, Santarém, Tomar",Artigo 259.º do Código dos Contratos Públicos,,,,,,2349400,Acordo quadro para o fornecimento de Dispositivos para evacuação e para banho.,FALSE
Aquisição dispositivos para evacuação e para banho,Ao abrigo de acordo-quadro (art.º 259.º),Aquisição de bens móveis,"33600000-6, Produtos farmacêuticos","Centro Hospitalar do Médio Tejo, E.P.E. (CHMT) (506361608)","BASTOS VIEGAS, SA (500042772)","2.954,00 €",03-01-2018,07-09-2017,365 dias,"Portugal, Santarém, Torres Novas<BR/>Portugal, Santarém, Abrantes<BR/>Portugal, Santarém, Tomar",Artigo 259.º do Código dos Contratos Públicos,,,,,,2349400,Acordo quadro para o fornecimento de Dispositivos para evacuação e para banho.,FALSE
Aquisição material urologia parte II,Ajuste Direto Regime Geral,Aquisição de bens móveis,"33100000-1, Equipamento médico","Centro Hospitalar do Médio Tejo, E.P.E. (CHMT) (506361608)","COLOPLAST PORTUGAL, SOCIEDADE UNIPESSOAL LDA. (503989037)","17.930,00 €",03-01-2018,01-09-2017,365 dias,"Portugal, Santarém, Sardoal","Artigo 20.º, n.º 1, alínea a) do Código dos Contratos Públicos",,,,,,Não aplicável.,Não aplicável.,FALSE
Aquisição de consumíveis de impressão,Ajuste Direto Regime Geral,Aquisição de bens móveis,"30125100-2, Cartuchos de tinta (toner)","Centro Hospitalar do Médio Tejo, E. P. E. (506361608)","NOVABIT - INFORMÁTICA, UNIPESSOAL, LDA.  (503411302)","4.736,91 €",03-01-2018,10-11-2017,365 dias,"Portugal, Santarém, Torres Novas","Artigo 20.º, n.º 1, alínea a) do Código dos Contratos Públicos",,,,,,Não aplicável.,Não aplicável.,FALSE
Aquisição 6 cardioversores desfibrilhadores,Ajuste Direto Regime Geral,Aquisição de bens móveis,"33100000-1, Equipamento médico","Centro Hospitalar do Médio Tejo, E. P. E. (506361608)","St. Jude Medical Portugal, Lda. (504180746)","67.000,00 €",02-01-2018,21-12-2017,10 dias,"Portugal, Santarém, Abrantes","Artigo 24.º, n.º 1, alínea c) do Código dos Contratos Públicos",,,,,,Não aplicável.,Não aplicável.,FALSE
"Aquisição de Serviços Médicos na Área da Medicina Interna, (horas de julho a dez) 37028417",Ajuste Direto Regime Geral,Aquisição de serviços,"85100000-0, Serviços de saúde","Centro Hospitalar do Médio Tejo, E. P. E. (506361608)",Luis Manuel Barrena Santana (274980827),"8.763,00 €",02-01-2018,09-11-2017,180 dias,"Portugal, Santarém, Torres Novas","Artigo 20.º, n.º 1, alínea a) do Código dos Contratos Públicos",,,,,,Não aplicável.,Não aplicável.,FALSE
"Aquisição de Serviços Médicos na Área da Ortopedia, (horas- jan a dez 2017) 37005617",Ajuste Direto Regime Geral,Aquisição de serviços,"85100000-0, Serviços de saúde","Centro Hospitalar do Médio Tejo, E. P. E. (506361608)","Hugo Esteves Cardoso & Costa, Lda (513848096)","43.200,00 €",02-01-2018,13-01-2017,365 dias,"Portugal, Santarém, Torres Novas","Artigo 20.º, n.º 1, alínea a) do Código dos Contratos Públicos",,,,,,Não aplicável.,Não aplicável.,FALSE
"Aquisição de Serviços Médicos na Área da Cardiologia, (horas de jan a dez) 37020517",Ajuste Direto Regime Geral,Aquisição de serviços,"85100000-0, Serviços de saúde","Centro Hospitalar do Médio Tejo, E. P. E. (506361608)",Antonio Manuel Cardoso Canaveira Manso (205621147),"48.000,00 €",02-01-2018,04-05-2017,365 dias,"Portugal, Santarém, Torres Novas","Artigo 20.º, n.º 1, alínea a) do Código dos Contratos Públicos",,,,,,Não aplicável.,Não aplicável.,FALSE
