Objeto do Contrato,Tipo de Procedimento,Tipo(s) de Contrato,CPVs,Entidade(s) Adjudicante(s),Entidade(s) Adjudicatária(s),Preço Contratual,Data de Publicação,Data de Celebração do Contrato,Prazo de Execução,Local de Execução,Fundamentação,Data de Fecho do Contrato,Preço Total Efetivo,Causas das Alterações ao Prazo,Causas das Alterações ao Preço,Estado,N.º registo do Acordo Quadro,Descrição do Acordo Quadro,Procedimento Centralizado
"aquisição de serviços combinados de vigilância e segurança  com ligação a central de alarmes para a ARSLVT, IP",Ajuste Direto Regime Geral,Aquisição de serviços,"79710000-4, Serviços de segurança","Administração Regional de Saúde de Lisboa e Vale do Tejo, I. P. (503148776)","Prestibel - Empresa de Segurança, SA (501326456)","1.225.173,42 €",10-05-2018,07-05-2018,61 dias,"Portugal, Santarém<BR/>Portugal, Lisboa<BR/>Portugal, Leiria<BR/>Portugal, Setúbal","Artigo 24.º, n.º 1, alínea c) do Código dos Contratos Públicos",,,,,,Não aplicável.,Não aplicável.,FALSE
Aquisição de 10.000 frascos de Fluoreto Sódio 2mg / ml Sol Bucal 1000ml,Ajuste Direto Regime Geral,Aquisição de bens móveis,"33690000-3, Medicamentos vários","Administração Regional de Saúde de Lisboa e Vale do Tejo, I. P. (503148776)","Labesfal - Laboratórios Almiro, SA (501169580)","103.600,00 €",10-05-2018,12-02-2018,323 dias,"Portugal, Lisboa","Artigo 24.º, n.º 1, alínea e) do Código dos Contratos Públicos",,,,,,Não aplicável.,Não aplicável.,FALSE
"Aquisição de serviços médicos sem especialidade para os serviços da dependência da ARSLVT, IP",Ajuste Direto Regime Geral,Aquisição de serviços,"85141000-9, Serviços prestados pelo pessoal médico","Administração Regional de Saúde de Lisboa e Vale do Tejo, I. P. (503148776)",Sabina Shmatko (258529695),"29.920,00 €",10-05-2018,26-04-2018,306 dias,"Portugal, Lisboa, Cascais","Artigo 20.º, n.º 1, alínea a) do Código dos Contratos Públicos",,,,,,Não aplicável.,Não aplicável.,FALSE
Aquisição de sacos plásticos para recolha seletiva,Ajuste Direto Regime Geral,Aquisição de bens móveis,"19640000-4, Sacos de polietileno para recolha de lixo e resíduos","Administração Regional de Saúde de Lisboa e Vale do Tejo, I. P. (503148776)","Fitisan - Produtos de Higiene e Embalagem, Lda. (506320073)","819,00 €",10-05-2018,09-05-2018,20 dias,"Portugal, Lisboa, Lisboa","Artigo 20.º, n.º 1, alínea a) do Código dos Contratos Públicos",,,,,,Não aplicável.,Não aplicável.,FALSE
Aquisição de escovilhão cervical para citologia,Ajuste Direto Regime Geral,Aquisição de bens móveis,"33140000-3, Material médico de consumo","Administração Regional de Saúde de Lisboa e Vale do Tejo, I. P. (503148776)","Speculum - Artigos Médicos, SA (502996323)","3.864,00 €",10-05-2018,08-05-2018,20 dias,"Portugal, Lisboa, Lisboa","Artigo 20.º, n.º 1, alínea d) do Código dos Contratos Públicos",,,,,,Não aplicável.,Não aplicável.,FALSE
"Aquisição de 25.000 unidades de Ipratrópio Brometo 0,25mg / ml Inal frasco 2ml ",Ajuste Direto Regime Geral,Aquisição de bens móveis,"33690000-3, Medicamentos vários","Administração Regional de Saúde de Lisboa e Vale do Tejo, I. P. (503148776)","Unilfarma - União Internacional de Laboratórios Farmacêuticos, Lda (500293023)","3.750,00 €",10-05-2018,05-02-2018,330 dias,"Portugal, Lisboa","Artigo 24.º, n.º 1, alínea e) do Código dos Contratos Públicos",,,,,,Não aplicável.,Não aplicável.,FALSE
Aquisição de fornecimento de comunicações de voz e dados em local fixo para o mês de janeiro de 2018,Ajuste Direto Regime Geral,Aquisição de serviços,"64200000-8, Serviços de telecomunicações","Administração Regional de Saúde de Lisboa e Vale do Tejo, I. P. (503148776)","NOS Comunicações, SA (502604751)","6.797,45 €",10-05-2018,19-03-2018,31 dias,"Portugal, Lisboa, Lisboa","Artigo 24.º, n.º 1, alínea c) do Código dos Contratos Públicos",,,,,,Não aplicável.,Não aplicável.,FALSE
Aquisição de 2.000 frascos de Cloreto de Etilo Sol Cut 100ml,Ajuste Direto Regime Geral,Aquisição de bens móveis,"33690000-3, Medicamentos vários","Administração Regional de Saúde de Lisboa e Vale do Tejo, I. P. (503148776)","Proclínica Equipamentos e Produtos Clínicos, Lda (500222665)","9.600,00 €",10-05-2018,06-02-2018,329 dias,"Portugal, Lisboa","Artigo 20.º, n.º 1, alínea a) do Código dos Contratos Públicos",,,,,,Não aplicável.,Não aplicável.,FALSE
Aquisição de 30.000 ampolas de Lidocaína 40mg / 2ml Sol Inj IV SC,Ao abrigo de acordo-quadro (art.º 259.º),Aquisição de bens móveis,"33690000-3, Medicamentos vários","Administração Regional de Saúde de Lisboa e Vale do Tejo, I. P. (503148776)","Labesfal - Laboratórios Almiro, SA (501169580)","21.870,00 €",10-05-2018,06-02-2018,329 dias,"Portugal, Lisboa",Artigo 259.º do Código dos Contratos Públicos,,,,,,2211341,Medicamentos anestésicos e relaxantes musculares,FALSE
Aquisição de 183.000 comprimidos de Isoniazida 150mg + Ribampicina 300mg,Ao abrigo de acordo-quadro (art.º 259.º),Aquisição de bens móveis,"33690000-3, Medicamentos vários","Administração Regional de Saúde de Lisboa e Vale do Tejo, I. P. (503148776)","Sanofi - Produtos Farmacêuticos, Lda  (500134960)","25.620,00 €",10-05-2018,29-01-2018,337 dias,"Portugal, Lisboa",Artigo 259.º do Código dos Contratos Públicos,,,,,,1326195,ACORDO QUADRO PARA FORNECIMENTO DE MEDICAMENTOS ANTI-INFECIOSOS: EXCETO ANTIVÍRICOS E ANTIFÚNGICOS ÀS INSTITUIÇÕES E SERVIÇOS DO SERVIÇO NACIONAL DE SAÚDE,FALSE
Aquisição de 60.000 ampolas de Tiocolquicozido Sol Inj 4mg/2ml IM,Ao abrigo de acordo-quadro (art.º 259.º),Aquisição de bens móveis,"33690000-3, Medicamentos vários","Administração Regional de Saúde de Lisboa e Vale do Tejo, I. P. (503148776)","Korangi Produtos Farmacêuticos, Lda (505322307)","25.140,00 €",10-05-2018,24-01-2018,236 dias,"Portugal, Lisboa",Artigo 259.º do Código dos Contratos Públicos,,,,,,2211341,Medicamentos anestésicos e relaxantes musculares,FALSE
Aquisição de papel de marquesa,Concurso público,Locação de bens móveis,"33140000-3, Material médico de consumo","Administração Regional de Saúde de Lisboa e Vale do Tejo, I. P. (503148776)","FACTORMED - COMÉRCIO E DISTRIBUIÇÃO PRODUTOS MÉDICOS, LDA (506986918)","112.980,00 €",09-05-2018,03-04-2018,243 dias,"Portugal, Lisboa",Artigo 155.º do Código dos Contratos Públicos,,,,,,Não aplicável.,Não aplicável.,FALSE
Aquisição de papel de marquesa,Concurso público,Locação de bens móveis,"33140000-3, Material médico de consumo","Administração Regional de Saúde de Lisboa e Vale do Tejo, I. P. (503148776)","FACTORMED - COMÉRCIO E DISTRIBUIÇÃO PRODUTOS MÉDICOS, LDA (506986918)","37.260,00 €",09-05-2018,03-04-2018,243 dias,"Portugal, Lisboa",Artigo 155.º do Código dos Contratos Públicos,,,,,,Não aplicável.,Não aplicável.,FALSE
Pedido de Mediação relacionado com o contrato de Gestão do Hospital Beatriz Ângelo em regime de Parceria Público-Privada (PPP) - designação de Mandatário Judicial.,Ajuste Direto Regime Geral,Aquisição de serviços,"79110000-8, Serviços de assessoria e representação jurídicas","Administração Regional de Saúde de Lisboa e Vale do Tejo, I. P. (503148776)",PEDRO MANUEL DE ALMEIDA MADEIRA (168957973),"4.851,75 €",09-05-2018,08-05-2018,240 dias,"Portugal, Lisboa, Lisboa","Artigo 20.º, n.º 1, alínea d) do Código dos Contratos Públicos",,,,,,Não aplicável.,Não aplicável.,FALSE
"Aquisição de serviços médicos sem especialidade para a ARSLVT, IP",Ajuste Direto Regime Geral,Aquisição de serviços,"85141000-9, Serviços prestados pelo pessoal médico","Administração Regional de Saúde de Lisboa e Vale do Tejo, I. P. (503148776)",José Luis Expósito Lorenzo (168235471),"41.600,00 €",08-05-2018,24-04-2018,365 dias,"Portugal, Lisboa, Amadora","Artigo 20.º, n.º 1, alínea a) do Código dos Contratos Públicos",,,,,,Não aplicável.,Não aplicável.,FALSE
"Aquisição de serviços médicos sem especialidade para a ARSLVT, IP",Ajuste Direto Regime Geral,Aquisição de serviços,"85141000-9, Serviços prestados pelo pessoal médico","Administração Regional de Saúde de Lisboa e Vale do Tejo, I. P. (503148776)",Nataliia Kotovska (285670891),"31.360,00 €",08-05-2018,24-04-2018,334 dias,"Portugal, Santarém","Artigo 20.º, n.º 1, alínea a) do Código dos Contratos Públicos",,,,,,Não aplicável.,Não aplicável.,FALSE
"PRESTAÇÃO DE SERVIÇOS MÉDICOS SEM ESPECIALIDADE PARA A ARSLVT, IP",Ajuste Direto Regime Geral,Aquisição de serviços,"85141000-9, Serviços prestados pelo pessoal médico","Administração Regional de Saúde de Lisboa e Vale do Tejo, I. P. (503148776)",António Sério do Espírito Santo (147730112),"38.400,00 €",07-05-2018,23-04-2018,334 dias,"Portugal, Lisboa, Sintra","Artigo 20.º, n.º 1, alínea a) do Código dos Contratos Públicos",,,,,,Não aplicável.,Não aplicável.,FALSE
"PRESTAÇÃO DE SERVIÇOS MÉDICOS SEM ESPECIALIDADE PARA A ARSLVT, IP",Ajuste Direto Regime Geral,Aquisição de serviços,"85141000-9, Serviços prestados pelo pessoal médico","Administração Regional de Saúde de Lisboa e Vale do Tejo, I. P. (503148776)",Marta Sena Gromicho (224531670),"19.500,00 €",07-05-2018,24-04-2018,275 dias,"Portugal, Lisboa, Cascais","Artigo 20.º, n.º 1, alínea a) do Código dos Contratos Públicos",,,,,,Não aplicável.,Não aplicável.,FALSE
"PRESTAÇÃO DE SERVIÇOS MÉDICOS SEM ESPECIALIDADE PARA A ARSLVT, IP",Ajuste Direto Regime Geral,Aquisição de serviços,"85141000-9, Serviços prestados pelo pessoal médico","Administração Regional de Saúde de Lisboa e Vale do Tejo, I. P. (503148776)",Oleg Podlesnyy (236519417),"39.200,00 €",07-05-2018,20-04-2018,334 dias,"Portugal, Santarém","Artigo 20.º, n.º 1, alínea a) do Código dos Contratos Públicos",,,,,,Não aplicável.,Não aplicável.,FALSE
Prestação de serviços médicos sem especialidade para o mês de fevereiro de 2018,Ajuste Direto Regime Geral,Aquisição de serviços,"85121100-4, Serviços de médicos de clínica geral","Administração Regional de Saúde de Lisboa e Vale do Tejo, I. P. (503148776)",Kelly Healthcare Resourses (510723691),"66.017,60 €",04-05-2018,23-04-2018,28 dias,"Portugal, Lisboa","Artigo 27.º, n.º 1, alínea a) do Código dos Contratos Públicos",,,,,,Não aplicável.,Não aplicável.,FALSE
Aluguer de central telefónica VOIP e SWITCH para a U.S. Barcarena do ACES Lisboa Ocidental e Oeiras.,Ajuste Direto Regime Geral,Aquisição de serviços,"64200000-8, Serviços de telecomunicações",Adm.Reg.de Saúde de Lisboa e Vale do Tejo (ARSLVT) (503148776),"IP Wire - Tecnologias para comunicações, Lda (513603107)","5.550,00 €",02-05-2018,19-04-2018,180 dias,"Portugal, Lisboa, Lisboa","Artigo 20.º, n.º 1, alínea a) do Código dos Contratos Públicos",,,,,,Não aplicável.,Não aplicável.,FALSE
