Objeto do Contrato,Tipo de Procedimento,Tipo(s) de Contrato,CPVs,Entidade(s) Adjudicante(s),Entidade(s) Adjudicatária(s),Preço Contratual,Data de Publicação,Data de Celebração do Contrato,Prazo de Execução,Local de Execução,Fundamentação,Data de Fecho do Contrato,Preço Total Efetivo,Causas das Alterações ao Prazo,Causas das Alterações ao Preço,Estado,N.º registo do Acordo Quadro,Descrição do Acordo Quadro,Procedimento Centralizado
Aquisição de Laringoscópio Rigido,Ajuste Direto Regime Geral,Aquisição de bens móveis,"33160000-9, Técnicas cirúrgicas","Unidade Local de Saúde do Alto Minho, EPE (ULSAM) (508786193)","Olympus Iberia S.A.U., Sucursal em Portugal (980474710)","1.500,00 €",21-03-2014,20-03-2014,30 dias,"Portugal, Viana do Castelo, Viana do Castelo","Artigo 20.º, n.º 1, alínea a) do Código dos Contratos Públicos",,,,,,Não aplicável.,Não aplicável.,FALSE
Aquisição de Ventilador,Ajuste Direto Regime Geral,Aquisição de bens móveis,"33172000-6, Aparelhos para anestesia e reanimação","Unidade Local de Saúde do Alto Minho, EPE (ULSAM) (508786193)","Iberdata - Equipamentos, S. A. (501904921)","7.585,00 €",12-03-2014,10-03-2014,30 dias,"Portugal, Viana do Castelo, Ponte de Lima","Artigo 20.º, n.º 1, alínea a) do Código dos Contratos Públicos",,,,,,Não aplicável.,Não aplicável.,FALSE
