Objeto do Contrato,Tipo de Procedimento,Tipo(s) de Contrato,CPVs,Entidade(s) Adjudicante(s),Entidade(s) Adjudicatária(s),Preço Contratual,Data de Publicação,Data de Celebração do Contrato,Prazo de Execução,Local de Execução,Fundamentação,Data de Fecho do Contrato,Preço Total Efetivo,Causas das Alterações ao Prazo,Causas das Alterações ao Preço,Estado,N.º registo do Acordo Quadro,Descrição do Acordo Quadro,Procedimento Centralizado
Aquisição de vinhetas e blocos de receituario  - ACES Oeste Sul,Ajuste Direto Regime Geral,Aquisição de bens móveis,"30199761-2, Etiquetas com códigos de barras","Administração Regional de Saúde de Lisboa e Vale do Tejo, I. P. (503148776)",INCM Imprensa Nacional Casa da Moeda (500792887),"142,00 €",08-04-2016,12-02-2016,20 dias,"Portugal, Lisboa, Torres Vedras","Artigo 24.º, n.º 1, alínea e) do Código dos Contratos Públicos",12-02-2016,"142,00 €",,,,Não aplicável.,Não aplicável.,FALSE
AQUISIÇÃO DE EQUIPAMENTO PARA A USF ABRANTES SO ACES MÉDIO TEJO,Ajuste Direto Regime Geral,Aquisição de bens móveis,"33100000-1, Equipamento médico","Administração Regional de Saúde de Lisboa e Vale do Tejo, I. P. (503148776)","PARAMEDICA - EQUIPAMENTOS MÉDICOS, LDA (501393005)","2.590,00 €",08-04-2016,08-04-2016,20 dias,"Portugal, Santarém, Abrantes","Artigo 24.º, n.º 1, alínea a) do Código dos Contratos Públicos","","",,,,Não aplicável.,Não aplicável.,FALSE
Aquisição de 15.000 frascos de Iodopovidona 100mg/ml,Ao abrigo de acordo-quadro (art.º 259.º),Aquisição de bens móveis,"33690000-3, Medicamentos vários","Administração Regional de Saúde de Lisboa e Vale do Tejo, I. P. (503148776)",Vygon ( Portugal) - Produtos Medicos e Farmacêuticos Limitada  (503232785),"9.675,00 €",08-04-2016,07-04-2016,268 dias,"Portugal, Lisboa, Lisboa",Artigo 259.º do Código dos Contratos Públicos,"","",,,,549298,"Concurso Público para a celebração de Contratos Publicos de Aprovisionamento para a área da saúde com vista ao fornecimento de Antisepticos, Desinfetantes e Outros, às Instituições e Serviços do Serviço Nacional de Saúde.",FALSE
Aquisição de 1.000 cápsulas de Clofazimina 100mg,Ajuste Direto Regime Geral,Aquisição de bens móveis,"33690000-3, Medicamentos vários","Administração Regional de Saúde de Lisboa e Vale do Tejo, I. P. (503148776)","Dux Pharma, Unipessoal Lda  (510803679)","1.990,00 €",08-04-2016,07-04-2016,268 dias,"Portugal, Lisboa, Lisboa","Artigo 24.º, n.º 1, alínea e) do Código dos Contratos Públicos","","",,,,Não aplicável.,Não aplicável.,FALSE
Aquisição de 2.000 ampolas de Tramadol 100mg/2ml Sol. Inj. IM IV SC,Ao abrigo de acordo-quadro (art.º 259.º),Aquisição de bens móveis,"33690000-3, Medicamentos vários","Administração Regional de Saúde de Lisboa e Vale do Tejo, I. P. (503148776)",Labesfal - Laboratórios Almiro S.A. (501169580),"236,00 €",08-04-2016,07-04-2016,268 dias,"Portugal, Lisboa, Lisboa",Artigo 259.º do Código dos Contratos Públicos,"","",,,,1974985,"Medicamentos Analgésicos, Antipiréticos e Antidepressivos",FALSE
"Aquisição de 2.000 ampolas de Atropina Sol. Inj. 0,5mg/1ml IV SC",Ao abrigo de acordo-quadro (art.º 259.º),Aquisição de bens móveis,"33690000-3, Medicamentos vários","Administração Regional de Saúde de Lisboa e Vale do Tejo, I. P. (503148776)",Labesfal - Laboratórios Almiro S.A. (501169580),"1.594,00 €",08-04-2016,07-04-2016,269 dias,"Portugal, Lisboa, Lisboa",Artigo 259.º do Código dos Contratos Públicos,"","",,,,1179915,"CONCURSO PÚBLICO PARA A CELEBRAÇÃO DE CONTRATOS PÚBLICOS DE APROVISIONAMENTO PARA A ÁREA DA SAÚDE, COM VISTA AO FORNECIMENTO DE MEDICAMENTOS DO APARELHO CARDIOVASCULAR, ÀS INSTITUIÇÕES E SERVIÇOS DO SERVIÇO NACIONAL DE SAÚDE",FALSE
Aquisição de vinhetas e blocos de receituario  - ACES Oeste Sul,Ajuste Direto Regime Geral,Aquisição de bens móveis,"30199761-2, Etiquetas com códigos de barras","Administração Regional de Saúde de Lisboa e Vale do Tejo, I. P. (503148776)",INCM- Imprensa Nacional Casa da Moeda (500792887),"65,00 €",08-04-2016,29-01-2016,20 dias,"Portugal, Lisboa, Torres Vedras","Artigo 24.º, n.º 1, alínea e) do Código dos Contratos Públicos",29-01-2016,"65,00 €",,,,Não aplicável.,Não aplicável.,FALSE
"Aquisição de serviços de recolha de equipamentos de esterilização, material médico e outros",Ajuste Direto Regime Geral,Aquisição de serviços,"60000000-8, Serviços de transporte (excl. transporte de resíduos)","Administração Regional de Saúde de Lisboa e Vale do Tejo, I. P. (503148776)","Transbusiness, Sociedade Unipessoal, Lda (508794544)","18.216,00 €",08-04-2016,01-04-2016,275 dias,"Portugal, Lisboa, Loures<BR/>Portugal, Lisboa, Odivelas","Artigo 24.º, n.º 1, alínea b) do Código dos Contratos Públicos","","",,,,Não aplicável.,Não aplicável.,FALSE
Prestação de serviços de manutenção e suporte à implementação SAP- 1340 horas,Ajuste Direto Regime Geral,Aquisição de serviços,"50000000-5, Serviços de reparação e manutenção","Administração Regional de Saúde de Lisboa e Vale do Tejo, I. P. (503148776)","Novabase Business Solutions- Soluções de Consultoria, Desenvolvimento , Integração, Outsourcing, Manutenção e Operação de Sistemas De Informação, SA (504857312)","46.900,00 €",07-04-2016,01-04-2016,30 dias,"Portugal, Lisboa, Lisboa","Artigo 20.º, n.º 1, alínea a) do Código dos Contratos Públicos","","",,,,Não aplicável.,Não aplicável.,FALSE
Serviço de emissão de certificado pessoal,Ajuste Direto Regime Geral,Aquisição de serviços,"72000000-5, Serviços de TI: consultoria, desenvolvimento de software, Internet e apoio","Administração Regional de Saúde de Lisboa e Vale do Tejo, I. P. (503148776)",CEGER (600055639),"150,00 €",06-04-2016,06-04-2016,1825 dias,"Portugal, Lisboa, Lisboa","Artigo 24.º, n.º 1, alínea e) do Código dos Contratos Públicos","","",,,,Não aplicável.,Não aplicável.,FALSE
"Aquisição de 100 ampolas de Flumazenilo 0,1mg/ml Sol. Inj. Fr. 5ml IV",Ao abrigo de acordo-quadro (art.º 259.º),Aquisição de bens móveis,"33690000-3, Medicamentos vários","Administração Regional de Saúde de Lisboa e Vale do Tejo, I. P. (503148776)","Accord Healthcare, Unipessoal Lda  (508622263)","119,00 €",06-04-2016,06-04-2016,269 dias,"Portugal, Lisboa, Lisboa",Artigo 259.º do Código dos Contratos Públicos,"","",,,,1338581,"Acordo quadro para fornecimento de Medicação antialérgica, medicamentos usados no tratamento de intoxicações, vitaminas e sais minerais e grupo 20.9 - outros produtos às instituições e serviços do serviço nacional de saúde",FALSE
Renovação de licenças SAP Professional User - Ano 2016,Ajuste Direto Regime Geral,Aquisição de serviços,"72000000-5, Serviços de TI: consultoria, desenvolvimento de software, Internet e apoio","Administração Regional de Saúde de Lisboa e Vale do Tejo, I. P. (503148776)","SAP Portugal- Sistemas, Aplicações e Produtos Informáticos, Sociedade Unipessoal, Lda (504569759)","43.623,82 €",06-04-2016,22-02-2016,270 dias,"Portugal, Lisboa, Lisboa","Artigo 24.º, n.º 1, alínea e) do Código dos Contratos Públicos","","",,,,Não aplicável.,Não aplicável.,FALSE
"Aquisição de serviços de higiene e limpeza para os serviços da dependência da ARSLVT, IP ",Ajuste Direto Regime Geral,Aquisição de serviços,"90910000-9, Serviços de limpeza","Administração Regional de Saúde de Lisboa e Vale do Tejo, I. P. (503148776)","Fine Facility Services, Lda (509418627)","148.220,19 €",06-04-2016,23-03-2016,29 dias,"Portugal, Lisboa","Artigo 24.º, n.º 1, alínea c) do Código dos Contratos Públicos","","",,,,Não aplicável.,Não aplicável.,FALSE
Aquisição de ratos e teclados USB,Ajuste Direto Regime Geral,Aquisição de bens móveis,"30000000-9, Máquinas, equipamento e material de escritório e de informática, excepto mobiliário e pacotes de programas (software)","Administração Regional de Saúde de Lisboa e Vale do Tejo, I. P. (503148776)","ATM- Sistemas de Informação e Serviços, SA (509784267)","9.240,00 €",05-04-2016,14-03-2016,10 dias,"Portugal, Lisboa, Lisboa","Artigo 20.º, n.º 1, alínea a) do Código dos Contratos Públicos","","",,,,Não aplicável.,Não aplicável.,FALSE
Aquisição de 20.000 unidades de Parafina + Lanolina Creme Hidratante Bisnaga 100g,Ao abrigo de acordo-quadro (art.º 259.º),Aquisição de bens móveis,"33690000-3, Medicamentos vários","Administração Regional de Saúde de Lisboa e Vale do Tejo, I. P. (503148776)","PMH - Produtos Médicos-Hospitalares, S.A. (502376899)","23.500,00 €",05-04-2016,05-04-2016,270 dias,"Portugal, Lisboa, Lisboa",Artigo 259.º do Código dos Contratos Públicos,"","",,,,549298,"Concurso Público para a celebração de Contratos Publicos de Aprovisionamento para a área da saúde com vista ao fornecimento de Antisepticos, Desinfetantes e Outros, às Instituições e Serviços do Serviço Nacional de Saúde.",FALSE
Aquisição de Seringas,Ao abrigo de acordo-quadro (art.º 259.º),Aquisição de bens móveis,"33140000-3, Material médico de consumo","Administração Regional de Saúde de Lisboa e Vale do Tejo, I. P. (503148776)",Becton Dickinson S.A. - Sucursal em Portugal (980245214),"4.775,00 €",05-04-2016,05-04-2016,270 dias,"Portugal, Lisboa, Lisboa",Artigo 259.º do Código dos Contratos Públicos,"","",,,,1341769,"ACORDO QUADRO PARA FORNECIMENTO DE SERINGAS, AGULHAS E CONTENTORES ÀS INSTITUIÇÕES E SERVIÇOS DO SERVIÇO NACIONAL DE SAÚDE PROGRAMA DE CONCURSO",FALSE
Aquisição de Seringas,Ao abrigo de acordo-quadro (art.º 259.º),Aquisição de bens móveis,"33140000-3, Material médico de consumo","Administração Regional de Saúde de Lisboa e Vale do Tejo, I. P. (503148776)",Becton Dickinson S.A. Sucursal em Portugal (980245214),"5.152,00 €",05-04-2016,05-04-2016,270 dias,"Portugal, Lisboa, Lisboa",Artigo 259.º do Código dos Contratos Públicos,"","",,,,1341769,"ACORDO QUADRO PARA FORNECIMENTO DE SERINGAS, AGULHAS E CONTENTORES ÀS INSTITUIÇÕES E SERVIÇOS DO SERVIÇO NACIONAL DE SAÚDE PROGRAMA DE CONCURSO",FALSE
Aquisição de Seringas,Ao abrigo de acordo-quadro (art.º 259.º),Aquisição de bens móveis,"33140000-3, Material médico de consumo","Administração Regional de Saúde de Lisboa e Vale do Tejo, I. P. (503148776)","Lineamédica - Dispositivos Médico-Cirúrgicos, S.A. (505148676)","941,50 €",05-04-2016,05-04-2016,270 dias,"Portugal, Lisboa, Lisboa",Artigo 259.º do Código dos Contratos Públicos,"","",,,,1341769,"ACORDO QUADRO PARA FORNECIMENTO DE SERINGAS, AGULHAS E CONTENTORES ÀS INSTITUIÇÕES E SERVIÇOS DO SERVIÇO NACIONAL DE SAÚDE PROGRAMA DE CONCURSO",FALSE
Aquisição de Seringas,Ao abrigo de acordo-quadro (art.º 259.º),Aquisição de bens móveis,"33140000-3, Material médico de consumo","Administração Regional de Saúde de Lisboa e Vale do Tejo, I. P. (503148776)",Pergut Portugal - Comércio Produtos Hospitalares e Médico (501799729),"132,50 €",05-04-2016,05-04-2016,270 dias,"Portugal, Lisboa, Lisboa",Artigo 259.º do Código dos Contratos Públicos,"","",,,,1341769,"ACORDO QUADRO PARA FORNECIMENTO DE SERINGAS, AGULHAS E CONTENTORES ÀS INSTITUIÇÕES E SERVIÇOS DO SERVIÇO NACIONAL DE SAÚDE PROGRAMA DE CONCURSO",FALSE
"PC Nº 3400009367, NPD Nº16E00155 E COMPROMISSO Nº5016012662 AQUISIÇÃO DE BRAÇADEIRAS E PÊRAS ",Ajuste Direto Regime Geral,Aquisição de bens móveis,"19000000-6, Materiais têxteis, de couro, de plástico e de borracha","Administração Regional de Saúde de Lisboa e Vale do Tejo, I. P. (503148776)",M.I. MEDICAL IMPORT. PROD MEDICO-HOSPITALARES LDA (506662055),"440,00 €",05-04-2016,14-03-2016,5 dias,"Portugal, Lisboa, Loures","Artigo 20.º, n.º 1, alínea a) do Código dos Contratos Públicos","","",,,,Não aplicável.,Não aplicável.,FALSE
"AQUISIÇÃO DE CARIMBOS PARA A UNIDADE DE FAMÕES PC Nº 3400009421, NPD Nº16E00172 e COMPROMISSO Nº 5016013249",Ajuste Direto Regime Geral,Aquisição de bens móveis,"19000000-6, Materiais têxteis, de couro, de plástico e de borracha","Administração Regional de Saúde de Lisboa e Vale do Tejo, I. P. (503148776)",A UM-  EQUIPAMENTO MAT. ESCRITÓRIO  (502129425),"29,05 €",05-04-2016,17-03-2016,5 dias,"Portugal, Lisboa, Loures","Artigo 20.º, n.º 1, alínea a) do Código dos Contratos Públicos","","",,,,Não aplicável.,Não aplicável.,FALSE
"Aquisição de 130 unidades de Vacina contra a Raiva 2,5 UI/ML Inativada Pó ",Ajuste Direto Regime Geral,Aquisição de bens móveis,"33690000-3, Medicamentos vários","Administração Regional de Saúde de Lisboa e Vale do Tejo, I. P. (503148776)",Novartis Farma - Produtos Farmacêuticos S.A. (500063524),"3.373,50 €",05-04-2016,05-04-2016,270 dias,"Portugal, Lisboa, Lisboa",Artigo 258.º do Código dos Contratos Públicos,"","",,,,Não aplicável.,Não aplicável.,FALSE
"AQUISIÇÃO DE VINHETAS  PC Nº3400009525, NPD Nº16J00254 e COMPROMISSO Nº5016016171",Ajuste Direto Regime Geral,Aquisição de bens móveis,"22000000-0, Material impresso e afins","Administração Regional de Saúde de Lisboa e Vale do Tejo, I. P. (503148776)",IMPRENSA NACIONAL CASA DA MOEDA  (500792887),"50,00 €",05-04-2016,04-04-2016,5 dias,"Portugal, Lisboa, Loures","Artigo 24.º, n.º 1, alínea e) do Código dos Contratos Públicos","","",,,,Não aplicável.,Não aplicável.,FALSE
"EQUIPAMENTO E MOBILIÁRIO HOSPITALAR PARA VÁRIAS UNIDADES DO ACES ALMADA SEIXAL, DO ACES LISBOA",Concurso público,Aquisição de bens móveis,"33100000-1, Equipamento médico","Administração Regional de Saúde de Lisboa e Vale do Tejo, I. P. (503148776)","Bacelar & Irmão, Lda. (500532818)","9.610,00 €",05-04-2016,23-03-2016,20 dias,"Portugal, Lisboa, Lisboa",Artigo 259.º do Código dos Contratos Públicos,"","",,,,Não aplicável.,Não aplicável.,FALSE
"EQUIPAMENTO E MOBILIÁRIO HOSPITALAR PARA VÁRIAS UNIDADES DO ACES ALMADA SEIXAL, DO ACES LISBOA",Concurso público,Aquisição de bens móveis,"33100000-1, Equipamento médico","Administração Regional de Saúde de Lisboa e Vale do Tejo, I. P. (503148776)","Frisinde - Equipamentos Hoteleiros, Lda. (502365889)","375,00 €",05-04-2016,16-03-2016,20 dias,"Portugal, Santarém, Santarém",Artigo 259.º do Código dos Contratos Públicos,"","",,,,Não aplicável.,Não aplicável.,FALSE
"EQUIPAMENTO E MOBILIÁRIO HOSPITALAR PARA VÁRIAS UNIDADES DO ACES ALMADA SEIXAL, DO ACES LISBOA",Concurso público,Aquisição de bens móveis,"33100000-1, Equipamento médico","Administração Regional de Saúde de Lisboa e Vale do Tejo, I. P. (503148776)","Bacelar & Irmão, Lda. (500532818)","1.160,00 €",05-04-2016,15-03-2016,20 dias,"Portugal, Santarém, Santarém",Artigo 259.º do Código dos Contratos Públicos,"","",,,,Não aplicável.,Não aplicável.,FALSE
"EQUIPAMENTO E MOBILIÁRIO HOSPITALAR PARA VÁRIAS UNIDADES DO ACES ALMADA SEIXAL, DO ACES LISBOA",Concurso público,Aquisição de bens móveis,"33100000-1, Equipamento médico","Administração Regional de Saúde de Lisboa e Vale do Tejo, I. P. (503148776)","Paramédica - Equipamentos Médicos, Lda. (501393005)","1.450,50 €",05-04-2016,16-03-2016,20 dias,"Portugal, Santarém, Santarém",Artigo 259.º do Código dos Contratos Públicos,"","",,,,Não aplicável.,Não aplicável.,FALSE
"EQUIPAMENTO E MOBILIÁRIO HOSPITALAR PARA VÁRIAS UNIDADES DO ACES ALMADA SEIXAL, DO ACES LISBOA",Concurso público,Aquisição de bens móveis,"33100000-1, Equipamento médico","Administração Regional de Saúde de Lisboa e Vale do Tejo, I. P. (503148776)","Frisinde - Equipamentos Hoteleiros, Lda. (502365889)","40,00 €",05-04-2016,16-03-2016,20 dias,"Portugal, Lisboa, Lisboa",Artigo 259.º do Código dos Contratos Públicos,"","",,,,Não aplicável.,Não aplicável.,FALSE
"EQUIPAMENTO E MOBILIÁRIO HOSPITALAR PARA VÁRIAS UNIDADES DO ACES ALMADA SEIXAL, DO ACES LISBOA",Concurso público,Aquisição de bens móveis,"33100000-1, Equipamento médico","Administração Regional de Saúde de Lisboa e Vale do Tejo, I. P. (503148776)","Epjmédica - Artigos Médicos e Hospitalares, Lda. (506820513)","1.663,15 €",05-04-2016,16-03-2016,20 dias,"Portugal, Santarém, Santarém",Artigo 259.º do Código dos Contratos Públicos,"","",,,,Não aplicável.,Não aplicável.,FALSE
"EQUIPAMENTO E MOBILIÁRIO HOSPITALAR PARA VÁRIAS UNIDADES DO ACES ALMADA SEIXAL, DO ACES LISBOA",Concurso público,Aquisição de bens móveis,"33100000-1, Equipamento médico","Administração Regional de Saúde de Lisboa e Vale do Tejo, I. P. (503148776)","Sano-Técnica, Lda (500239819)","4.232,05 €",05-04-2016,16-03-2016,20 dias,"Portugal, Lisboa, Sintra",Artigo 259.º do Código dos Contratos Públicos,"","",,,,Não aplicável.,Não aplicável.,FALSE
"REPARAÇÃO DE FOTOCOPIADORAS PC Nº 3400007025, NPD Nº15E00104 e COMPROMISSO Nº 5015003059",Ajuste Direto Regime Geral,Aquisição de serviços,"50000000-5, Serviços de reparação e manutenção","Administração Regional de Saúde de Lisboa e Vale do Tejo, I. P. (503148776)","CANON PORTUGAL, S.A. (507477740)","5.000,00 €",05-04-2016,13-02-2015,5 dias,"Portugal, Lisboa, Loures","Artigo 20.º, n.º 1, alínea a) do Código dos Contratos Públicos","","",,,,Não aplicável.,Não aplicável.,FALSE
"EQUIPAMENTO E MOBILIÁRIO HOSPITALAR PARA VÁRIAS UNIDADES DO ACES ALMADA SEIXAL, DO ACES LISBOA",Concurso público,Aquisição de bens móveis,"33100000-1, Equipamento médico","Administração Regional de Saúde de Lisboa e Vale do Tejo, I. P. (503148776)","Bacelar & Irmão, Lda. (500532818)","1.275,00 €",05-04-2016,16-03-2016,20 dias,"Portugal, Lisboa, Sintra",Artigo 259.º do Código dos Contratos Públicos,"","",,,,Não aplicável.,Não aplicável.,FALSE
"EQUIPAMENTO E MOBILIÁRIO HOSPITALAR PARA VÁRIAS UNIDADES DO ACES ALMADA SEIXAL, DO ACES LISBOA",Concurso público,Aquisição de bens móveis,"33110000-4, Equipamento de imagiologia para uso médico, dentário e veterinário","Administração Regional de Saúde de Lisboa e Vale do Tejo, I. P. (503148776)","Paramédica - Equipamentos Médicos, Lda. (501393005)","467,50 €",05-04-2016,16-03-2016,20 dias,"Portugal, Lisboa, Sintra",Artigo 259.º do Código dos Contratos Públicos,"","",,,,Não aplicável.,Não aplicável.,FALSE
"EQUIPAMENTO E MOBILIÁRIO HOSPITALAR PARA VÁRIAS UNIDADES DO ACES ALMADA SEIXAL, DO ACES LISBOA",Concurso público,Aquisição de bens móveis,"33100000-1, Equipamento médico","Administração Regional de Saúde de Lisboa e Vale do Tejo, I. P. (503148776)","Filsat - Equipamentos Médico - Científicos, Lda. (506708616)","2.595,00 €",05-04-2016,16-03-2016,20 dias,"Portugal, Lisboa, Sintra",Artigo 259.º do Código dos Contratos Públicos,"","",,,,Não aplicável.,Não aplicável.,FALSE
"EQUIPAMENTO E MOBILIÁRIO HOSPITALAR PARA VÁRIAS UNIDADES DO ACES ALMADA SEIXAL, DO ACES LISBOA",Concurso público,Aquisição de bens móveis,"33100000-1, Equipamento médico","Administração Regional de Saúde de Lisboa e Vale do Tejo, I. P. (503148776)","Frilabo II, Lda. (507958861)","485,00 €",05-04-2016,16-03-2016,20 dias,"Portugal, Leiria, Caldas da Rainha",Artigo 259.º do Código dos Contratos Públicos,"","",,,,Não aplicável.,Não aplicável.,FALSE
"EQUIPAMENTO E MOBILIÁRIO HOSPITALAR PARA VÁRIAS UNIDADES DO ACES ALMADA SEIXAL, DO ACES LISBOA",Concurso público,Aquisição de bens móveis,"33100000-1, Equipamento médico","Administração Regional de Saúde de Lisboa e Vale do Tejo, I. P. (503148776)","Frisinde - Equipamentos Hoteleiros, Lda. (502365889)","325,00 €",05-04-2016,16-03-2016,20 dias,"Portugal, Leiria, Caldas da Rainha",Artigo 259.º do Código dos Contratos Públicos,"","",,,,Não aplicável.,Não aplicável.,FALSE
"EQUIPAMENTO E MOBILIÁRIO HOSPITALAR PARA VÁRIAS UNIDADES DO ACES ALMADA SEIXAL, DO ACES LISBOA",Concurso público,Aquisição de bens móveis,"33100000-1, Equipamento médico","Administração Regional de Saúde de Lisboa e Vale do Tejo, I. P. (503148776)","Filsat - Equipamentos Médico - Científicos, Lda. (506708616)","68,00 €",05-04-2016,16-03-2016,20 dias,"Portugal, Leiria, Caldas da Rainha",Artigo 259.º do Código dos Contratos Públicos,"","",,,,Não aplicável.,Não aplicável.,FALSE
"EQUIPAMENTO E MOBILIÁRIO HOSPITALAR PARA VÁRIAS UNIDADES DO ACES ALMADA SEIXAL, DO ACES LISBOA",Concurso público,Aquisição de bens móveis,"33100000-1, Equipamento médico","Administração Regional de Saúde de Lisboa e Vale do Tejo, I. P. (503148776)","Frisinde - Equipamentos Hoteleiros, Lda. (507958861)","1.140,00 €",05-04-2016,08-03-2016,20 dias,"Portugal, Leiria, Caldas da Rainha",Artigo 259.º do Código dos Contratos Públicos,"","",,,,Não aplicável.,Não aplicável.,FALSE
"EQUIPAMENTO E MOBILIÁRIO HOSPITALAR PARA VÁRIAS UNIDADES DO ACES ALMADA SEIXAL, DO ACES LISBOA",Concurso público,Aquisição de bens móveis,"33100000-1, Equipamento médico","Administração Regional de Saúde de Lisboa e Vale do Tejo, I. P. (503148776)","Frisinde - Equipamentos Hoteleiros, Lda. (502365889)","1.790,00 €",05-04-2016,16-03-2016,20 dias,"Portugal, Leiria, Caldas da Rainha",Artigo 259.º do Código dos Contratos Públicos,"","",,,,Não aplicável.,Não aplicável.,FALSE
"EQUIPAMENTO E MOBILIÁRIO HOSPITALAR PARA VÁRIAS UNIDADES DO ACES ALMADA SEIXAL, DO ACES LISBOA",Concurso público,Aquisição de bens móveis,"33100000-1, Equipamento médico","Administração Regional de Saúde de Lisboa e Vale do Tejo, I. P. (503148776)","Alfraphar - Equipamentos e Produtos Farmacêuticos, Lda. (504223895)","2.207,50 €",05-04-2016,16-03-2016,20 dias,"Portugal, Leiria, Caldas da Rainha",Artigo 259.º do Código dos Contratos Públicos,"","",,,,Não aplicável.,Não aplicável.,FALSE
"EQUIPAMENTO E MOBILIÁRIO HOSPITALAR PARA VÁRIAS UNIDADES DO ACES ALMADA SEIXAL, DO ACES LISBOA",Concurso público,Aquisição de bens móveis,"33100000-1, Equipamento médico","Administração Regional de Saúde de Lisboa e Vale do Tejo, I. P. (503148776)","Speculum,Artigos Medicos Sa (502996323)","829,68 €",05-04-2016,16-03-2016,20 dias,"Portugal, Lisboa, Lisboa",Artigo 259.º do Código dos Contratos Públicos,"","",,,,Não aplicável.,Não aplicável.,FALSE
"EQUIPAMENTO E MOBILIÁRIO HOSPITALAR PARA VÁRIAS UNIDADES DO ACES ALMADA SEIXAL, DO ACES LISBOA",Concurso público,Aquisição de bens móveis,"33100000-1, Equipamento médico","Administração Regional de Saúde de Lisboa e Vale do Tejo, I. P. (503148776)","Filsat - Equipamentos Médico - Científicos, Lda. (506708616)","5.486,00 €",05-04-2016,16-03-2016,20 dias,"Portugal, Lisboa, Lisboa",Artigo 259.º do Código dos Contratos Públicos,"","",,,,Não aplicável.,Não aplicável.,FALSE
"EQUIPAMENTO E MOBILIÁRIO HOSPITALAR PARA VÁRIAS UNIDADES DO ACES ALMADA SEIXAL, DO ACES LISBOA",Concurso público,Aquisição de bens móveis,"33100000-1, Equipamento médico","Administração Regional de Saúde de Lisboa e Vale do Tejo, I. P. (503148776)","Filsat - Equipamentos Médico - Científicos, Lda. (506708616)","1.056,00 €",05-04-2016,16-03-2016,20 dias,"Portugal, Lisboa, Lisboa",Artigo 259.º do Código dos Contratos Públicos,"","",,,,Não aplicável.,Não aplicável.,FALSE
"EQUIPAMENTO E MOBILIÁRIO HOSPITALAR PARA VÁRIAS UNIDADES DO ACES ALMADA SEIXAL, DO ACES LISBOA",Concurso público,Aquisição de bens móveis,"33100000-1, Equipamento médico","Administração Regional de Saúde de Lisboa e Vale do Tejo, I. P. (503148776)","Filsat - Equipamentos Médico - Científicos, Lda. (506708616)","2.440,00 €",05-04-2016,16-03-2016,20 dias,"Portugal, Lisboa, Lisboa",Artigo 259.º do Código dos Contratos Públicos,"","",,,,Não aplicável.,Não aplicável.,FALSE
"Cloreto de Sódio 0,9% p/ Irrigação Fr 100ml e 500ml",Ao abrigo de acordo-quadro (art.º 259.º),Aquisição de bens móveis,"33690000-3, Medicamentos vários","Administração Regional de Saúde de Lisboa e Vale do Tejo, I. P. (503148776)","Labesfal - Laboratórios Almiro, S.A. (501169580)","22.680,00 €",05-04-2016,01-04-2016,274 dias,"Portugal, Lisboa, Lisboa",Artigo 259.º do Código dos Contratos Públicos,"","",,,,1331181,Acordo Quadro para fornecimento de corretivos da volémia e outras soluções estéreis às Instituições e Serviços do Serviço Nacional de Saúde,FALSE
"Cloreto de Sódio 0,9% p/ Irrigação Fr 100ml e 500ml",Ao abrigo de acordo-quadro (art.º 259.º),Aquisição de bens móveis,"33690000-3, Medicamentos vários","Administração Regional de Saúde de Lisboa e Vale do Tejo, I. P. (503148776)","Labesfal - Laboratórios Almiro, S.A. (501169580)","72.972,00 €",05-04-2016,01-04-2016,274 dias,"Portugal, Lisboa, Lisboa",Artigo 259.º do Código dos Contratos Públicos,"","",,,,1331181,Acordo Quadro para fornecimento de corretivos da volémia e outras soluções estéreis às Instituições e Serviços do Serviço Nacional de Saúde,FALSE
"EQUIPAMENTO E MOBILIÁRIO HOSPITALAR PARA VÁRIAS UNIDADES DO ACES ALMADA SEIXAL, DO ACES LISBOA",Concurso público,Aquisição de bens móveis,"33100000-1, Equipamento médico","Administração Regional de Saúde de Lisboa e Vale do Tejo, I. P. (503148776)","Alfraphar - Equipamentos e Produtos Farmacêuticos, Lda. (504223895)","1.150,00 €",05-04-2016,16-03-2016,20 dias,"Portugal, Setúbal, Almada",Artigo 259.º do Código dos Contratos Públicos,"","",,,,Não aplicável.,Não aplicável.,FALSE
"EQUIPAMENTO E MOBILIÁRIO HOSPITALAR PARA VÁRIAS UNIDADES DO ACES ALMADA SEIXAL, DO ACES LISBOA",Concurso público,Aquisição de bens móveis,"33100000-1, Equipamento médico","Administração Regional de Saúde de Lisboa e Vale do Tejo, I. P. (503148776)","Big Laguna - Comércio de Equipamentos de Escritório, Lda. (505543869)","8.830,00 €",05-04-2016,16-03-2016,20 dias,"Portugal, Setúbal, Almada",Artigo 259.º do Código dos Contratos Públicos,"","",,,,Não aplicável.,Não aplicável.,FALSE
AQUISIÇÃO DE EQUIPAMENTO PARA VÁRIAS USF DO ACES ALMADA-SEIXAL.,Concurso público,Aquisição de bens móveis,"33100000-1, Equipamento médico","Administração Regional de Saúde de Lisboa e Vale do Tejo, I. P. (503148776)","PARAMEDICA - EQUIPAMENTOS MÉDICOS, LDA (501393005)","3.145,00 €",04-04-2016,17-03-2016,20 dias,"Portugal, Setúbal, Almada",Artigo 259.º do Código dos Contratos Públicos,"","",,,,Não aplicável.,Não aplicável.,FALSE
AQUISIÇÃO DE EQUIPAMENTO PARA VÁRIAS USF DO ACES ALMADA-SEIXAL.,Concurso público,Aquisição de bens móveis,"33100000-1, Equipamento médico","Administração Regional de Saúde de Lisboa e Vale do Tejo, I. P. (503148776)",MARIA TERESA MARTINS FERNANDES MARQUES (182417328),"4.340,00 €",04-04-2016,17-03-2016,20 dias,"Portugal, Setúbal, Almada",Artigo 259.º do Código dos Contratos Públicos,"","",,,,Não aplicável.,Não aplicável.,FALSE
AQUISIÇÃO DE EQUIPAMENTO PARA VÁRIAS USF DO ACES ALMADA-SEIXAL.,Concurso público,Aquisição de bens móveis,"33100000-1, Equipamento médico","Administração Regional de Saúde de Lisboa e Vale do Tejo, I. P. (503148776)","PARAMEDICA - EQUIPAMENTOS MÉDICOS, LDA (501393005)","13.580,00 €",04-04-2016,10-03-2016,20 dias,"Portugal, Setúbal, Almada",Artigo 259.º do Código dos Contratos Públicos,"","",,,,Não aplicável.,Não aplicável.,FALSE
EQUIPAMENTO PARA USF ABRANTES DO ACES MÉDIO TEJO,Concurso público,Aquisição de bens móveis,"33100000-1, Equipamento médico","Administração Regional de Saúde de Lisboa e Vale do Tejo, I. P. (503148776)","FRISINDE - EQUIPAMENTOS HOTELEIROS, LDA  (502365889)","1.310,00 €",04-04-2016,05-02-2016,20 dias,"Portugal, Santarém, Abrantes",Artigo 259.º do Código dos Contratos Públicos,"","",,,,Não aplicável.,Não aplicável.,FALSE
EQUIPAMENTO PARA USF ABRANTES DO ACES MÉDIO TEJO,Concurso público,Aquisição de bens móveis,"33100000-1, Equipamento médico","Administração Regional de Saúde de Lisboa e Vale do Tejo, I. P. (503148776)","FRISINDE - EQUIPAMENTOS HOTELEIROS, LDA  (502365889)","394,00 €",04-04-2016,03-02-2016,20 dias,"Portugal, Santarém, Abrantes",Artigo 259.º do Código dos Contratos Públicos,"","",,,,Não aplicável.,Não aplicável.,FALSE
EQUIPAMENTO PARA USF ABRANTES DO ACES MÉDIO TEJO,Concurso público,Aquisição de bens móveis,"33100000-1, Equipamento médico","Administração Regional de Saúde de Lisboa e Vale do Tejo, I. P. (503148776)","FILSAT - EQUIPAMENTOS MÉDICO-CIENTÍFICOS, LDA (506708616)","637,60 €",04-04-2016,03-02-2016,20 dias,"Portugal, Santarém, Abrantes",Artigo 259.º do Código dos Contratos Públicos,"","",,,,Não aplicável.,Não aplicável.,FALSE
EQUIPAMENTO PARA USF ABRANTES DO ACES MÉDIO TEJO,Concurso público,Aquisição de bens móveis,"33100000-1, Equipamento médico","Administração Regional de Saúde de Lisboa e Vale do Tejo, I. P. (503148776)","FRISINDE - EQUIPAMENTOS HOTELEIROS, LDA  (502365889)","2.640,00 €",04-04-2016,03-02-2016,20 dias,"Portugal, Santarém, Abrantes",Artigo 259.º do Código dos Contratos Públicos,"","",,,,Não aplicável.,Não aplicável.,FALSE
EQUIPAMENTO PARA USF ABRANTES DO ACES MÉDIO TEJO,Concurso público,Aquisição de bens móveis,"33100000-1, Equipamento médico","Administração Regional de Saúde de Lisboa e Vale do Tejo, I. P. (503148776)","ALPIA2 - NEW CONCEPT, LDA (510105327)","5.713,00 €",04-04-2016,03-02-2016,20 dias,"Portugal, Santarém, Abrantes",Artigo 259.º do Código dos Contratos Públicos,"","",,,,Não aplicável.,Não aplicável.,FALSE
EQUIPAMENTO PARA USF ABRANTES DO ACES MÉDIO TEJO,Concurso público,Aquisição de bens móveis,"33100000-1, Equipamento médico","Administração Regional de Saúde de Lisboa e Vale do Tejo, I. P. (503148776)","PARAMEDICA - EQUIPAMENTOS MÉDICOS, LDA (501393005)","5.667,00 €",04-04-2016,02-02-2016,20 dias,"Portugal, Santarém, Abrantes",Artigo 259.º do Código dos Contratos Públicos,"","",,,,Não aplicável.,Não aplicável.,FALSE
EQUIPAMENTO PARA USF ABRANTES DO ACES MÉDIO TEJO,Concurso público,Aquisição de bens móveis,"33100000-1, Equipamento médico","Administração Regional de Saúde de Lisboa e Vale do Tejo, I. P. (503148776)","SPACE - EQUIPAMENTOS MÉDICOS, LDA (507662407)","1.430,00 €",04-04-2016,03-02-2016,20 dias,"Portugal, Santarém, Abrantes",Artigo 259.º do Código dos Contratos Públicos,"","",,,,Não aplicável.,Não aplicável.,FALSE
EQUIPAMENTO PARA USF ABRANTES DO ACES MÉDIO TEJO,Concurso público,Aquisição de bens móveis,"33100000-1, Equipamento médico","Administração Regional de Saúde de Lisboa e Vale do Tejo, I. P. (503148776)","PARAMEDICA - EQUIPAMENTOS MÉDICOS, LDA (501393005)","5.505,00 €",04-04-2016,02-02-2016,20 dias,"Portugal, Santarém, Abrantes",Artigo 259.º do Código dos Contratos Públicos,"","",,,,Não aplicável.,Não aplicável.,FALSE
EQUIPAMENTO PARA USF ABRANTES DO ACES MÉDIO TEJO,Concurso público,Aquisição de bens móveis,"33100000-1, Equipamento médico","Administração Regional de Saúde de Lisboa e Vale do Tejo, I. P. (503148776)","FILSAT - EQUIPAMENTOS MÉDICO-CIENTÍFICOS, LDA (506708616)","499,50 €",04-04-2016,03-02-2016,20 dias,"Portugal, Santarém, Abrantes",Artigo 259.º do Código dos Contratos Públicos,"","",,,,Não aplicável.,Não aplicável.,FALSE
AQUISIÇÃO DE EQUIPAMENTO PARA O ACES ARCO RIBEIRINHO.,Ajuste Direto Regime Geral,Aquisição de bens móveis,"33100000-1, Equipamento médico","Administração Regional de Saúde de Lisboa e Vale do Tejo, I. P. (503148776)","ALFRAPHAR - EQUIPAMENTOS E PRODUTOS FARMACÊUTICOS, LDA (504223895)","736,00 €",04-04-2016,24-03-2016,20 dias,"Portugal, Setúbal, Moita","Artigo 20.º, n.º 1, alínea a) do Código dos Contratos Públicos","","",,,,Não aplicável.,Não aplicável.,FALSE
Aquisição de 12.000 frascos de Álcool Etílico 70% Fr. 500ml,Ao abrigo de acordo-quadro (art.º 259.º),Aquisição de bens móveis,"33690000-3, Medicamentos vários","Administração Regional de Saúde de Lisboa e Vale do Tejo, I. P. (503148776)","Pmh - Produtos Médicos-Hospitalares, S.A. (502376899)","13.980,00 €",01-04-2016,01-04-2016,274 dias,"Portugal, Lisboa, Lisboa",Artigo 259.º do Código dos Contratos Públicos,"","",,,,178089,"CONCURSO PÚBLICO PARA A CELEBRAÇÃO DE CONTRATOS PÚBLICOS DE APROVISIONAMENTO PARA AQUISIÇÃO DE ANTISSÉPTICOS, DESINFECTANTES E OUTROS ",FALSE
Aquisição de 12.000 unidades de Poliuretano Espuma sem Rebordo 10x10cm,Ajuste Direto Regime Geral,Aquisição de bens móveis,"33690000-3, Medicamentos vários","Administração Regional de Saúde de Lisboa e Vale do Tejo, I. P. (503148776)",B. Braun Medical Lda  (501506543),"10.200,00 €",31-03-2016,31-03-2016,275 dias,"Portugal, Lisboa, Lisboa","Artigo 24.º, n.º 1, alínea c) do Código dos Contratos Públicos","","",,,,Não aplicável.,Não aplicável.,FALSE
"Prestação de serviços médicos com especialidade em psiquiatria para a Unidade de Alcoologia, para o período de 01/042016 a 31/12/2016",Ao abrigo de acordo-quadro (art.º 259.º),Aquisição de serviços,"85100000-0, Serviços de saúde","Administração Regional de Saúde de Lisboa e Vale do Tejo, I. P. (503148776)","Helped - Prestação Serviços Saúde, Lda (506069010)","45.903,60 €",31-03-2016,31-03-2016,275 dias,"Portugal, Lisboa, Lisboa",Artigo 259.º do Código dos Contratos Públicos,"","",,,,1490434,ACORDO QUADRO PARA PRESTAÇÃO DE SERVIÇOS MÉDICOS ÀS INSTITUIÇÕES E SERVIÇOS DO SERVIÇO NACIONAL DE SAÚDE,FALSE
Aquisição de Vacina do BCG,Ajuste Direto Regime Geral,Aquisição de bens móveis,"33651600-4, Vacinas","Administração Regional de Saúde de Lisboa e Vale do Tejo, I. P. (503148776)","JM - Farmacêutica, Lda (503550558)","80.000,00 €",31-03-2016,31-03-2016,275 dias,"Portugal, Lisboa, Lisboa",Artigo 258.º do Código dos Contratos Públicos,"","",,,,Não aplicável.,Não aplicável.,FALSE
Aquisição de 150 ampolas de Glucagom 1mg Pó Sol. Inj. IM IV SC,Ajuste Direto Regime Geral,Aquisição de bens móveis,"33690000-3, Medicamentos vários","Administração Regional de Saúde de Lisboa e Vale do Tejo, I. P. (503148776)",Novo Nordisk Comércio Produtos Farmacêuticos Lda  (501485210),"2.047,50 €",31-03-2016,30-03-2016,276 dias,"Portugal, Lisboa, Lisboa",Artigo 258.º do Código dos Contratos Públicos,"","",,,,Não aplicável.,Não aplicável.,FALSE
Aquisição de 70.000 ampolas de Cloreto de Sódio 9mg/ml Sol. Inj. 10ml IV,Ao abrigo de acordo-quadro (art.º 259.º),Aquisição de bens móveis,"33690000-3, Medicamentos vários","Administração Regional de Saúde de Lisboa e Vale do Tejo, I. P. (503148776)",Labesfal - Laboratórios Almiro S.A. (501169580),"11.186,00 €",31-03-2016,30-03-2016,276 dias,"Portugal, Lisboa, Lisboa",Artigo 259.º do Código dos Contratos Públicos,"","",,,,1331181,Acordo Quadro para fornecimento de corretivos da volémia e outras soluções estéreis às Instituições e Serviços do Serviço Nacional de Saúde,FALSE
Aquisição de vacina Tuberculina,Ajuste Direto Regime Geral,Aquisição de bens móveis,"33651600-4, Vacinas","Administração Regional de Saúde de Lisboa e Vale do Tejo, I. P. (503148776)","JM - Farmacêutica, Lda (503550558)","9.407,00 €",31-03-2016,31-03-2016,275 dias,"Portugal, Lisboa, Lisboa",Artigo 258.º do Código dos Contratos Públicos,"","",,,,Não aplicável.,Não aplicável.,FALSE
