freguesia,acronym,validVotesPercentage,votes,dicofre
"União das freguesias de São Miguel do Pinheiro, São Pedro de Solis e São Sebastião dos Carros",PS,52.65,169,020910
"União das freguesias de São Miguel do Pinheiro, São Pedro de Solis e São Sebastião dos Carros",PCP-PEV,26.48,85,020910
"União das freguesias de São Miguel do Pinheiro, São Pedro de Solis e São Sebastião dos Carros",B.E.,5.3,17,020910
"União das freguesias de São Miguel do Pinheiro, São Pedro de Solis e São Sebastião dos Carros",PPD/PSD,4.36,14,020910
"União das freguesias de São Miguel do Pinheiro, São Pedro de Solis e São Sebastião dos Carros",PCTP/MRPP,3.12,10,020910
"União das freguesias de São Miguel do Pinheiro, São Pedro de Solis e São Sebastião dos Carros",CDS-PP,2.18,7,020910
"União das freguesias de São Miguel do Pinheiro, São Pedro de Solis e São Sebastião dos Carros",PAN,2.18,7,020910
"União das freguesias de São Miguel do Pinheiro, São Pedro de Solis e São Sebastião dos Carros",PPM.PPV/CDC,0.93,3,020910
"União das freguesias de São Miguel do Pinheiro, São Pedro de Solis e São Sebastião dos Carros",A,0.62,2,020910
"União das freguesias de São Miguel do Pinheiro, São Pedro de Solis e São Sebastião dos Carros",IL,0.62,2,020910
"União das freguesias de São Miguel do Pinheiro, São Pedro de Solis e São Sebastião dos Carros",L,0.31,1,020910
"União das freguesias de São Miguel do Pinheiro, São Pedro de Solis e São Sebastião dos Carros",NC,0.31,1,020910
"União das freguesias de São Miguel do Pinheiro, São Pedro de Solis e São Sebastião dos Carros",PDR,0.31,1,020910
"União das freguesias de São Miguel do Pinheiro, São Pedro de Solis e São Sebastião dos Carros",PNR,0.31,1,020910
"União das freguesias de São Miguel do Pinheiro, São Pedro de Solis e São Sebastião dos Carros",PURP,0.31,1,020910
"União das freguesias de São Miguel do Pinheiro, São Pedro de Solis e São Sebastião dos Carros",MAS,0,0,020910
"União das freguesias de São Miguel do Pinheiro, São Pedro de Solis e São Sebastião dos Carros",PTP,0,0,020910
