freguesia,acronym,validVotesPercentage,votes,dicofre
Orvalho,PS,45.03,68,050609
Orvalho,PPD/PSD.CDS-PP,38.41,58,050609
Orvalho,PCP-PEV,4.64,7,050609
Orvalho,B.E.,3.97,6,050609
Orvalho,MPT,3.31,5,050609
Orvalho,L,1.32,2,050609
Orvalho,PPM,1.32,2,050609
Orvalho,MAS,0.66,1,050609
Orvalho,PAN,0.66,1,050609
Orvalho,PND,0.66,1,050609
Orvalho,PCTP/MRPP,0,0,050609
Orvalho,PDA,0,0,050609
Orvalho,PNR,0,0,050609
Orvalho,POUS,0,0,050609
Orvalho,PPV,0,0,050609
Orvalho,PTP,0,0,050609
