Objeto do Contrato,Tipo de Procedimento,Tipo(s) de Contrato,CPVs,Entidade(s) Adjudicante(s),Entidade(s) Adjudicatária(s),Preço Contratual,Data de Publicação,Data de Celebração do Contrato,Prazo de Execução,Local de Execução,Fundamentação,Data de Fecho do Contrato,Preço Total Efetivo,Causas das Alterações ao Prazo,Causas das Alterações ao Preço,Estado,N.º registo do Acordo Quadro,Descrição do Acordo Quadro,Procedimento Centralizado
AQUISIÇÃO DE TECLADOS C/LEITOR DE CARTÕES P/O CHLO,Ajuste Direto Regime Geral,Aquisição de bens móveis,"30000000-9, Máquinas, equipamento e material de escritório e de informática, excepto mobiliário e pacotes de programas (software)","Centro Hospitalar de Lisboa Ocidental, E. P. E. (507618319)","INFORMÁTICA EL CORTE INGLÊS, S.A. (980079659)","7.948,00 €",10-03-2016,09-03-2016,7 dias,"Portugal, Lisboa, Lisboa","Artigo 20.º, n.º 1, alínea a) do Código dos Contratos Públicos","","",,"",,Não aplicável.,Não aplicável.,FALSE
"SERVIÇOS DE MANUTENÇÃO E ASSISTENCIA TECNICA AS INSTALAÇOES E EQUIPAMENTOS NÃO MÉDICOS, SEM PEÇAS, NO CHLO EPE – de janeiro a março 2016",Ajuste Direto Regime Geral,Aquisição de serviços,"50400000-9, Serviços de reparação e manutenção de equipamento médico e de precisão","Centro Hospitalar de Lisboa Ocidental, EPE (CHLO) (507618319)",SUCH (500900469),"47.097,00 €",10-03-2016,25-02-2016,91 dias,"Portugal, Lisboa, Lisboa<BR/>Portugal, Lisboa, Oeiras","Artigo 24.º, n.º 1, alínea c) do Código dos Contratos Públicos","","",,"",,Não aplicável.,Não aplicável.,FALSE
"Aquisição de dois ecógrafos para a Ginecologia/Obstetrícia do CHLO, EPE",Concurso público,Aquisição de bens móveis,"33110000-4, Equipamento de imagiologia para uso médico, dentário e veterinário","Centro Hospitalar de Lisboa Ocidental, E. P. E. (507618319)","General Electric Portuguesa, SA (500357129)","99.500,00 €",08-03-2016,01-03-2016,45 dias,"Portugal, Lisboa, Lisboa","Artigo 20.º, n.º 1, alínea b) do Código dos Contratos Públicos","","",,"",,Não aplicável.,Não aplicável.,FALSE
Aquisição de Gas Natural para o CHPL Ano 2015-(UMC-SG),Concurso público,Aquisição de bens móveis,"09123000-7, Gás natural","Centro Hospitalar Lisboa Norte, E. P. E. (508481287), Centro Hospitalar Psiquiátrico de Lisboa (508338476), Serviço de Intervenção nos Comportamentos Aditivos e nas Dependências (600084884), SUCH - Serviço de Utilização Comum dos Hospitais (500900469), Hospital Santa Maria Maior, E. P. E. (506361381), Direcção-Geral da Saúde (600037100), Instituto Nacional de Saúde Dr. Ricardo Jorge, I. P. (501427511), Instituto Português do Sangue e da Transplantação, I. P. (502423943), Centro Hospitalar e Universitário de Coimbra, E. P. E. (510103448), Centro Hospitalar de Lisboa Ocidental, E. P. E. (507618319), Centro Hospitalar de Trás-os-Montes e Alto Douro, E. P. E. (508100496), Centro Hospitalar do Alto Ave, E. P. E. (508080827), Hospital Distrital de Santarém, E. P. E. (506361462), Hospital do Espírito Santo de Évora, E. P. E. (508085888), Unidade Local de Saúde do Nordeste, E. P. E (509932584), Secretaria-Geral do Ministério da Saúde (600080684), Centro Hospitalar do Algarve, E. P. E. (510745997), Instituto Nacional de Emergência Médica, I. P. (501356126), Centro Hospitalar Porto, E. P. E. (508331471), Centro Hospitalar do Tâmega e Sousa, E. P. E. (508318262), Unidade Local de Saúde da Guarda, E. P. E. (508752000), Centro Hospitalar do Médio Tejo, E. P. E. (506361608), Administração Regional de Saúde do Norte, I. P. (503135593), Unidade Local de Saúde de Castelo Branco, E. P. E. (509309844), Centro Hospitalar de Entre o Douro e Vouga, E.P.E. (508878462), Instituto Português de Oncologia de Lisboa Francisco Gentil, E. P. E. (506361616), Unidade Local de Saúde do Alto Minho, E. P. E. (508786193), Centro Hospitalar do Oeste (510412009), Centro Hospitalar de Setúbal, E. P. E. (507606787), Instituto Português de Oncologia de Coimbra Francisco Gentil, E. P. E. (506361438), Centro Hospitalar do Baixo Vouga, E. P. E (CHBV, E. P. E.) (510123210), Hospital Garcia de Orta, E. P. E. (506361470), Hospital Arcebispo João Crisóstomo (501626123), Hospital de José Luciano de Castro (501613021), Hospital de Magalhães Lemos, E. P. E. (502828790), Centro Hospitalar do Médio Ave, E. P. E. (508093937), Centro Hospitalar de Leiria, E. P. E. (509822932), Centro Hospitalar de Lisboa Central, E. P. E. (508080142), Centro Hospitalar Tondela-Viseu, E. P. E. (509822940), Instituto de Oftalmologia Dr. Gama Pinto (600000052), Centro Hospitalar Cova da Beira, E. P. E. (506361659), Administração Regional de Saúde do Centro, I. P. (503122165), Instituto Português de Oncologia do Porto Francisco Gentil, E. P. E. (506362299), Centro Hospitalar Vila Nova de Gaia - Espinho, E. P. E. (508142156), Administração Regional de Saúde de Lisboa e Vale do Tejo, I. P. (503148776), Hospital Dr. Francisco Zagalo (501510150), Centro Hospitalar Póvoa de Varzim - Vila do Conde, E. P. E. (508741823), Centro Hospitalar de São João, E. P. E. (509821197), Centro Hospitalar Barreiro Montijo, E. P. E. (509186998)","EDP Comercial, S.A (503504564)","579.733,88 €",07-03-2016,30-01-2015,365 dias,"Portugal, Lisboa, Lisboa",Artigo 259.º do Código dos Contratos Públicos,31-12-2015,"525.715,02 €",,Valor corresponde ao Faturado (inferior ao estimado),,Não aplicável.,Não aplicável.,TRUE
AQUISIÇÃO DE SERVIÇOS MÉDICOS ESPECIALISTAS PARA O VMER DURANTE OS MESES DE JANEIRO E FEVEREIRO DE 2016,Ajuste Direto Regime Geral,Aquisição de serviços,"85100000-0, Serviços de saúde","Centro Hospitalar de Lisboa Ocidental, EPE (CHLO) (507618319)","Randstad Clinical - Cuidados de Saúde, Lda (505121247)","27,00 €",07-03-2016,14-01-2016,60 dias,"Portugal, Lisboa, Lisboa","Artigo 24.º, n.º 1, alínea c) do Código dos Contratos Públicos","","",,"",,Não aplicável.,Não aplicável.,FALSE
