Objeto do Contrato,Tipo de Procedimento,Tipo(s) de Contrato,CPVs,Entidade(s) Adjudicante(s),Entidade(s) Adjudicatária(s),Preço Contratual,Data de Publicação,Data de Celebração do Contrato,Prazo de Execução,Local de Execução,Fundamentação,Data de Fecho do Contrato,Preço Total Efetivo,Causas das Alterações ao Prazo,Causas das Alterações ao Preço,Estado,N.º registo do Acordo Quadro,Descrição do Acordo Quadro,Procedimento Centralizado
Aquisição de Medicamentos Retro Virais,Ao abrigo de acordo-quadro (art.º 259.º),Aquisição de bens móveis,"33600000-6, Produtos farmacêuticos","Hospital do Espírito Santo de Évora, E. P. E. (508085888)","Viivhiv (509117961), Roche (500233810), Gilead (503604704), Unilfarma (500293023), Teva (507045491), Bristol Myers Squibb (500048193), Janssen (500189412)","298.845,71 €",09-06-2015,19-03-2015,300 dias,"Portugal, Évora, Évora",Artigo 259.º do Código dos Contratos Públicos,,,,,,461371,CP 2012/40 - MEDICAMENTOS ANTI-RETROVIRAIS,FALSE
Aquisição de Nutrição Parentérica,Ao abrigo de acordo-quadro (art.º 259.º),Aquisição de bens móveis,"33692200-9, Produtos para nutrição parenteral","Hospital do Espírito Santo de Évora, E. P. E. (508085888)","Baxter (503347345), B Braun Medical (501506543), Fresenius Kabi (504293753)","23.463,45 €",09-06-2015,20-05-2015,220 dias,"Portugal, Évora, Évora",Artigo 259.º do Código dos Contratos Públicos,,,,,,457058,"CONCURSO PÚBLICO PARA A CELEBRAÇÃO DE CONTRATOS PÚBLICOS DE APROVISIONAMENTO PARA A ÁREA DA SAÚDE, COM VISTA AO FORNECIMENTO DE MEDICAMENTOS PARA NUTRIÇÃO PARENTÉRICA, ÀS INSTITUIÇÕES E SERVIÇOS DO SERVIÇO NACIONAL DE SAÚDE",FALSE
Aquisição de Estimulantes de Eritropoiese,Ao abrigo de acordo-quadro (art.º 259.º),Aquisição de bens móveis,"33690000-3, Medicamentos vários","Hospital do Espírito Santo de Évora, E. P. E. (508085888)","Roche (500233810), Hospira (502918098)","160.261,20 €",09-06-2015,21-01-2015,340 dias,"Portugal, Évora, Évora",Artigo 259.º do Código dos Contratos Públicos,,,,,,463788,CP 2012/11 - Estimulantes da Eritropoiese,FALSE
Aquisição de medicamentos,Ao abrigo de acordo-quadro (art.º 259.º),Aquisição de bens móveis,"33690000-3, Medicamentos vários","Hospital do Espírito Santo de Évora, E. P. E. (508085888)","Ipsen (502609800), Fresenius Kabi (504293753)","169.674,90 €",09-06-2015,28-01-2015,335 dias,"Portugal, Évora, Évora",Artigo 259.º do Código dos Contratos Públicos,,,,,,461370,"CP 2012/44 - MEDICAMENTOS ANALGÉSICOS, ANTIPIRÉTICOS E ANTIDEPRESSIVOS",FALSE
Aquisição de Derivados do Plasma,Ao abrigo de acordo-quadro (art.º 259.º),Aquisição de bens móveis,"33141520-1, Derivados do plasma","Hospital do Espírito Santo de Évora, E. P. E. (508085888)","OCTAPHARMA - PROD FARMACEUTICO (502820780), BAXTER MEDICO FARMACEUTICA LDA (503347345), CSL BEHRING, LDA (503047201)","398.575,60 €",08-06-2015,28-01-2015,300 dias,"Portugal, Évora, Évora",Artigo 259.º do Código dos Contratos Públicos,,,,,,1423488,ACORDO QUADRO PARA FORNECIMENTO DE DERIVADOS DO PLASMA HUMANO ÀS INSTITUIÇÕES E SERVIÇOS DO SERVIÇO NACIONAL DE SAÚDE CP 2015/9,FALSE
Aquisição de gases medicinais,Ao abrigo de acordo-quadro (art.º 259.º),Aquisição de bens móveis,"24100000-5, Gases",Hospital do Espírito Santo de Évora E.P.E. (508085888),Air Liquide Medicinal (501576436),"453.500,00 €",08-06-2015,06-11-2014,730 dias,"Portugal, Évora, Évora",Artigo 259.º do Código dos Contratos Públicos,,,,,,1306526,ACORDO QUADRO PARA FORNECIMENTO DE GASES MEDICINAIS CONSIDERADOS DISPOSITIVOS MÉDICOS ÀS INSTITUIÇÕES E SERVIÇOS DO SERVIÇO NACIONAL DE SAÚDE,FALSE
Aquisição de MCDT na área da Radiologia,Ajuste Direto Regime Geral,Aquisição de serviços,"85150000-5, Serviços de imagiologia médica",Hospital do Espírito Santo de Évora E.P.E. (508085888),"Clínica Coração do Alentejo (502376457), Clínica Diagnóstico por Imagem (502830654)","185.752,10 €",08-06-2015,12-03-2015,300 dias,"Portugal, Évora, Évora<BR/>Portugal","Artigo 20.º, n.º 1, alínea a) do Código dos Contratos Públicos",,,,,,Não aplicável.,Não aplicável.,FALSE
