freguesia,acronym,validVotesPercentage,votes,dicofre
Castelo Melhor,PPD/PSD.CDS-PP,56.98,49,091402
Castelo Melhor,PS,31.4,27,091402
Castelo Melhor,PCP-PEV,4.65,4,091402
Castelo Melhor,MPT,2.33,2,091402
Castelo Melhor,PND,2.33,2,091402
Castelo Melhor,PAN,1.16,1,091402
Castelo Melhor,PCTP/MRPP,1.16,1,091402
Castelo Melhor,B.E.,0,0,091402
Castelo Melhor,L,0,0,091402
Castelo Melhor,MAS,0,0,091402
Castelo Melhor,PDA,0,0,091402
Castelo Melhor,PNR,0,0,091402
Castelo Melhor,POUS,0,0,091402
Castelo Melhor,PPM,0,0,091402
Castelo Melhor,PPV,0,0,091402
Castelo Melhor,PTP,0,0,091402
