Objeto do Contrato,Tipo de Procedimento,Tipo(s) de Contrato,CPVs,Entidade(s) Adjudicante(s),Entidade(s) Adjudicatária(s),Preço Contratual,Data de Publicação,Data de Celebração do Contrato,Prazo de Execução,Local de Execução,Fundamentação,Data de Fecho do Contrato,Preço Total Efetivo,Causas das Alterações ao Prazo,Causas das Alterações ao Preço,Estado,N.º registo do Acordo Quadro,Descrição do Acordo Quadro,Procedimento Centralizado
0168E16- SIGIC,Ajuste Direto Regime Geral,Aquisição de serviços,"85100000-0, Serviços de saúde","Centro Hospitalar de Leiria, E. P. E. (509822932)","HOSPITAL DISTRITAL FIGUEIRA FOZ,  E.P.E (506361527)","11.257,20 €",25-01-2017,10-03-2016,365 dias,"Portugal, Leiria, Leiria","Artigo 20.º, n.º 1, alínea a) do Código dos Contratos Públicos",31-12-2016,"11.257,20 €",,,,Não aplicável.,Não aplicável.,FALSE
Consultas de especialidades,Ajuste Direto Regime Geral,Aquisição de serviços,"85000000-9, Serviços de saúde e acção social",Centro de Medicina de Reabilitação da Região Centro - Rovisco Pais (503767336),HDFF (506361527),"23.234,78 €",02-11-2015,16-01-2014,365 dias,"Portugal, Coimbra, Cantanhede","Artigo 26.º, n.º 1, alínea a) do Código dos Contratos Públicos",31-12-2014,"23.234,78 €",,,,Não aplicável.,Não aplicável.,FALSE
Exames medicos,Ajuste Direto Regime Geral,Aquisição de serviços,"85000000-9, Serviços de saúde e acção social",Centro de Medicina de Reabilitação da Região Centro - Rovisco Pais (503767336),HDFF (506361527),"5.460,83 €",02-11-2015,31-12-2014,365 dias,"Portugal, Coimbra, Cantanhede","Artigo 26.º, n.º 1, alínea a) do Código dos Contratos Públicos",31-12-2014,"5.460,83 €",,,,Não aplicável.,Não aplicável.,FALSE
serviços prestados pelo Hospital da Figueira da Foz,Ajuste Direto Regime Geral,Aquisição de serviços,"85000000-9, Serviços de saúde e acção social",Centro de Medicina de Reabilitação da Região Centro - Rovisco Pais (503767336),Hospital Figueira da Foz (506361527),"29.347,44 €",26-10-2015,03-01-2014,60 dias,"Portugal, Coimbra, Cantanhede","Artigo 26.º, n.º 1, alínea a) do Código dos Contratos Públicos",31-12-2014,"29.347,44 €",,,,Não aplicável.,Não aplicável.,FALSE
