Objeto do Contrato,Tipo de Procedimento,Tipo(s) de Contrato,CPVs,Entidade(s) Adjudicante(s),Entidade(s) Adjudicatária(s),Preço Contratual,Data de Publicação,Data de Celebração do Contrato,Prazo de Execução,Local de Execução,Fundamentação,Data de Fecho do Contrato,Preço Total Efetivo,Causas das Alterações ao Prazo,Causas das Alterações ao Preço,Estado,N.º registo do Acordo Quadro,Descrição do Acordo Quadro,Procedimento Centralizado
Aquisição de Mobiliário,Ajuste Direto Regime Geral,Aquisição de bens móveis,"39000000-2, Mobiliário (incl. de escritório), acessórios, aparelhos domésticos (excl. iluminação) e produtos de limpeza","Unidade Local de Saúde do Baixo Alentejo, E. P. E. (508754275)",Luís M. S. Canhão (156880334),"33.529,77 €",13-06-2013,21-12-2012,180 dias,"Portugal, Beja, Beja","Artigo 20.º, n.º 1, alínea a) do Código dos Contratos Públicos","","",,"",,Não aplicável.,Não aplicável.,
Aquisição de mobiliário hospitalar,Ajuste Direto Regime Geral,Aquisição de bens móveis,"39000000-2, Mobiliário (incl. de escritório), acessórios, aparelhos domésticos (excl. iluminação) e produtos de limpeza","Unidade Local de Saúde do Baixo Alentejo, E. P. E. (508754275)",Mundinter (500199906),"30.690,20 €",12-06-2013,21-12-2012,180 dias,"Portugal, Beja, Beja","Artigo 20.º, n.º 1, alínea a) do Código dos Contratos Públicos",21-12-2012,"30.940,20 €",,Proposta mais vantajosa,,Não aplicável.,Não aplicável.,
