Objeto do Contrato,Tipo de Procedimento,Tipo(s) de Contrato,CPVs,Entidade(s) Adjudicante(s),Entidade(s) Adjudicatária(s),Preço Contratual,Data de Publicação,Data de Celebração do Contrato,Prazo de Execução,Local de Execução,Fundamentação,Data de Fecho do Contrato,Preço Total Efetivo,Causas das Alterações ao Prazo,Causas das Alterações ao Preço,Estado,N.º registo do Acordo Quadro,Descrição do Acordo Quadro,Procedimento Centralizado
4S0033/2018 SERV MED NÃO ESPECIALISTAS P ANO 2018,Ajuste Direto Regime Geral,Aquisição de serviços,"85100000-0, Serviços de saúde","Centro Hospitalar Barreiro Montijo, E. P. E. (509186998)","Alexandru Caraman Unipessoal, Lda (513822526)","24.960,00 €",06-06-2018,14-02-2018,365 dias,"Portugal, Setúbal, Barreiro","Artigo 24.º, n.º 1, alínea a) do Código dos Contratos Públicos",31-12-2018,"12.224,00 €",,Consumo efetivo inferior ao estimado,,Não aplicável.,Não aplicável.,FALSE
Serviços Médicos Urgência Pediátrica,Ajuste Direto Regime Geral,Aquisição de serviços,"85000000-9, Serviços de saúde e acção social","Centro Hospitalar de Setúbal, E. P. E. (507606787)","Alexandru Caraman Unipessoal, Lda (513822526)","31.200,00 €",02-02-2018,08-01-2018,365 dias,"Portugal, Setúbal, Setúbal","Artigo 20.º, n.º 1, alínea a) do Código dos Contratos Públicos","","",,"",,Não aplicável.,Não aplicável.,FALSE
4S0027/2017 SERV MED NÃO ESPECIALISTAS P URG. PEDIÁTRICA,Ajuste Direto Regime Geral,Aquisição de serviços,"85100000-0, Serviços de saúde","Centro Hospitalar Barreiro Montijo, E. P. E. (509186998)",Alexandru Caraman Lda (513822526),"12.480,00 €",27-10-2017,13-02-2017,365 dias,"Portugal, Setúbal, Barreiro","Artigo 20.º, n.º 1, alínea a) do Código dos Contratos Públicos",31-12-2017,"17.990,00 €",,Consumo efetivo superior ao estimado,,Não aplicável.,Não aplicável.,FALSE
Serviços médicos Triagem SUG ano 2017,Ajuste Direto Regime Geral,Aquisição de serviços,"85000000-9, Serviços de saúde e acção social","Centro Hospitalar de Setúbal, E. P. E. (507606787)",Alexandru Caraman Lda (513822526),"28.800,00 €",10-03-2017,08-02-2017,365 dias,"Portugal, Setúbal, Setúbal","Artigo 20.º, n.º 1, alínea a) do Código dos Contratos Públicos","","",,"",,Não aplicável.,Não aplicável.,FALSE
4S0036/2016 SERV MED - NÃO ESPECIALISTAS PARA A URG. PEDIÁTRICA PARA ANO 2016,Ajuste Direto Regime Geral,Aquisição de serviços,"79625000-1, Serviços de fornecimento de pessoal médico","Centro Hospitalar Barreiro Montijo, E. P. E. (509186998)","Alexandru Caraman, Unipessoal, Lda. (513822526)","22.560,00 €",14-02-2017,10-03-2016,334 dias,"Portugal, Setúbal, Barreiro","Artigo 21.º, n.º 1, alínea a) do Código dos Contratos Públicos",31-12-2016,"20.380,00 €",,Consumo efetivo inferior ao inicialmente estimado,,Não aplicável.,Não aplicável.,FALSE
