Objeto do Contrato,Tipo de Procedimento,Tipo(s) de Contrato,CPVs,Entidade(s) Adjudicante(s),Entidade(s) Adjudicatária(s),Preço Contratual,Data de Publicação,Data de Celebração do Contrato,Prazo de Execução,Local de Execução,Fundamentação,Data de Fecho do Contrato,Preço Total Efetivo,Causas das Alterações ao Prazo,Causas das Alterações ao Preço,Estado,N.º registo do Acordo Quadro,Descrição do Acordo Quadro,Procedimento Centralizado
Consultoria no âmbito da gestão e acompanhamento de projetos financiados ao abrigo de Portugal 2020,Ajuste Direto Regime Geral,Aquisição de serviços,"79400000-8, Serviços de consultoria em matéria comercial e de gestão e serviços conexos","Centro Hospitalar Póvoa de Varzim - Vila do Conde, E. P. E. (508741823)","O.S.S. - ONE SYSTEM SAFE, LDA (513872442)","6.800,00 €",09-02-2017,01-07-2016,154 dias,"Portugal, Porto, Póvoa de Varzim","Artigo 20.º, n.º 1, alínea a) do Código dos Contratos Públicos",,,,,,Não aplicável.,Não aplicável.,FALSE
Prestação de serviços de assessoria de comunicação para o ano de 2016,Ajuste Direto Regime Geral,Aquisição de serviços,"79000000-4, Serviços a empresas: direito, comercialização, consultoria, recrutamento, impressão e segurança","Centro Hospitalar Póvoa de Varzim - Vila do Conde, E. P. E. (508741823)","CONNECT GENERATION-COMUNICAÇÃO E IMAGEM, LDA (509408800)","17.100,00 €",03-02-2017,12-01-2016,366 dias,"Portugal, Porto, Póvoa de Varzim","Artigo 24.º, n.º 1, alínea e) do Código dos Contratos Públicos",,,,,,Não aplicável.,Não aplicável.,FALSE
