freguesia,acronym,validVotesPercentage,votes,dicofre
União das freguesias de Cantanhede e Pocariça,PPD/PSD.CDS-PP,35.72,804,060220
União das freguesias de Cantanhede e Pocariça,PS,30.52,687,060220
União das freguesias de Cantanhede e Pocariça,MPT,9.24,208,060220
União das freguesias de Cantanhede e Pocariça,PCP-PEV,8,180,060220
União das freguesias de Cantanhede e Pocariça,B.E.,6.04,136,060220
União das freguesias de Cantanhede e Pocariça,L,2.75,62,060220
União das freguesias de Cantanhede e Pocariça,PAN,2.13,48,060220
União das freguesias de Cantanhede e Pocariça,PCTP/MRPP,1.29,29,060220
União das freguesias de Cantanhede e Pocariça,PND,0.93,21,060220
União das freguesias de Cantanhede e Pocariça,PTP,0.8,18,060220
União das freguesias de Cantanhede e Pocariça,PNR,0.71,16,060220
União das freguesias de Cantanhede e Pocariça,PPV,0.67,15,060220
União das freguesias de Cantanhede e Pocariça,MAS,0.58,13,060220
União das freguesias de Cantanhede e Pocariça,PPM,0.49,11,060220
União das freguesias de Cantanhede e Pocariça,POUS,0.09,2,060220
União das freguesias de Cantanhede e Pocariça,PDA,0.04,1,060220
