Objeto do Contrato,Tipo de Procedimento,Tipo(s) de Contrato,CPVs,Entidade(s) Adjudicante(s),Entidade(s) Adjudicatária(s),Preço Contratual,Data de Publicação,Data de Celebração do Contrato,Prazo de Execução,Local de Execução,Fundamentação,Data de Fecho do Contrato,Preço Total Efetivo,Causas das Alterações ao Prazo,Causas das Alterações ao Preço,Estado,N.º registo do Acordo Quadro,Descrição do Acordo Quadro,Procedimento Centralizado
Aquisição de Serviços de Fiscalização da Empreitada de Ampliação da Unidade de Saúde Familiar de Samora Correia,Consulta Prévia,Aquisição de serviços,"71520000-9, Serviços de supervisão da construção",Adm.Reg.de Saúde de Lisboa e Vale do Tejo (ARSLVT) (503148776),DDN-Gestão Coordenação e Fiscalização de Obras Públicas e Privadas LDA (504009346),"37.360,00 €",18-01-2019,27-12-2018,240 dias,Portugal,"Artigo 20.º, n.º 1, alínea c) do Código dos Contratos Públicos",,,,,,Não aplicável.,Não aplicável.,FALSE
Empreitada de ampliação da Unidade de Saúde Familiar de Samora Correia,Concurso público,Empreitadas de obras públicas,"45113000-2, Obras no local",Adm.Reg.de Saúde de Lisboa e Vale do Tejo (ARSLVT) (503148776),"Tanagra - Empreiteiros, S.A. (500278679)","647.226,96 €",18-01-2019,21-06-2018,210 dias,Portugal,"Artigo 19.º, alínea a) do Código dos Contratos Públicos",,,,,,Não aplicável.,Não aplicável.,FALSE
AQUISIÇÃO DE SERVIÇOS DE MANUTENÇÃO DOS SISTEMAS SGCIM E HS-SGICM-L INSTALADOS NAS ENTIDADES DO MINISTÉRIO DA SAÚDE PARA 2018,Ajuste Direto Regime Geral,Aquisição de serviços,"72500000-0, Serviços relacionados com a informática",Adm.Reg.de Saúde de Lisboa e Vale do Tejo (ARSLVT) (503148776),"GLINTT - Healthcare Solutions, S.A. (502479418)","19.911,25 €",17-01-2019,25-06-2018,189 dias,Portugal,"Artigo 20.º, n.º 1, alínea d) do Código dos Contratos Públicos",,,,,,Não aplicável.,Não aplicável.,TRUE
"Consulta Prévia para a Aquisição de contrato de suporte e manutenção para os equipamentos ativos de rede da Administração Regional de Saúde de Lisboa e Vale do Tejo, IP.",Consulta Prévia,Aquisição de serviços,"50312000-5, Manutenção e reparação de equipamento informático",Adm.Reg.de Saúde de Lisboa e Vale do Tejo (ARSLVT) (503148776),"informática El Corte Inglés,SA (980079659)","10.916,51 €",17-01-2019,12-09-2018,110 dias,Portugal,"Artigo 20.º, n.º 1, alínea c) do Código dos Contratos Públicos",,,,,,Não aplicável.,Não aplicável.,TRUE
"Aquisição de Serviços de Manutenção e Assistência de Dados (inclui alarmística) da Administração Regional de Saúde de Lisboa e Vale do Tejo,I.P.",Ajuste Direto Regime Geral,Aquisição de serviços,"72500000-0, Serviços relacionados com a informática",Adm.Reg.de Saúde de Lisboa e Vale do Tejo (ARSLVT) (503148776),"informática El Corte Inglés,SA (980079659)","14.500,00 €",17-01-2019,19-04-2018,256 dias,Portugal,"Artigo 20.º, n.º 1, alínea d) do Código dos Contratos Públicos",,,,,,Não aplicável.,Não aplicável.,TRUE
"AQUISIÇÃO DE SERVIÇOS DE MANUTENÇÃO DO SOFTWARE MAXPRO INSTALADO NA ADMINISTRAÇÃO REGIONAL DE SAÚDE DE LISBOA E VALE DO TEJO, IP",Ajuste Direto Regime Geral,Aquisição de serviços,"72500000-0, Serviços relacionados com a informática",Adm.Reg.de Saúde de Lisboa e Vale do Tejo (ARSLVT) (503148776),Sisqual - Emp. de Inv. e Desemv de Sist. Inf. SA (502772298),"9.788,75 €",17-01-2019,11-07-2018,173 dias,Portugal,"Artigo 24.º, n.º 1, alínea e), subalínea ii) do Código dos Contratos Públicos",,,,,,Não aplicável.,Não aplicável.,TRUE
"Aquisição de serviços de manutenção – Smartdocs V3 para o ano de 2018 para a Administração Regional de Saúde de Lisboa e Vale do Tejo, I.P. (ARSLVT)",Consulta Prévia,Aquisição de serviços,"72500000-0, Serviços relacionados com a informática",Adm.Reg.de Saúde de Lisboa e Vale do Tejo (ARSLVT) (503148776),"Fujitsu Technology Solutions, Lda. (500646791)","6.874,46 €",17-01-2019,26-07-2018,158 dias,Portugal,"Artigo 20.º, n.º 1, alínea c) do Código dos Contratos Públicos",,,,,,Não aplicável.,Não aplicável.,TRUE
"Aquisição de Intervenção nas Centrais Telefonicas do ACES Cascais da Administração Regional de Saúde de Lisboa e Vale Do Tejo, IP",Consulta Prévia,Aquisição de serviços,"50330000-7, Serviços de manutenção de equipamento para telecomunicações",Adm.Reg.de Saúde de Lisboa e Vale do Tejo (ARSLVT) (503148776),"NPROVIT-INFORMATICA E SERV.UNIPESSOAL,LDA. (513980369)","7.415,60 €",17-01-2019,20-07-2018,30 dias,Portugal,"Artigo 20.º, n.º 1, alínea c) do Código dos Contratos Públicos",,,,,,Não aplicável.,Não aplicável.,TRUE
"Concurso Público para Aquisição de Equipamento para o Programa de Rastreios da Administração Regional de Saúde de Lisboa e Vale Do Tejo, I.P.",Concurso público,Aquisição de bens móveis,"30200000-1, Equipamento e material informático",Adm.Reg.de Saúde de Lisboa e Vale do Tejo (ARSLVT) (503148776),Burótica (501178503),"95.617,50 €",17-01-2019,02-10-2018,60 dias,Portugal,"Artigo 20.º, n.º 1, alínea a) do Código dos Contratos Públicos",,,,,,Não aplicável.,Não aplicável.,TRUE
"AQUISIÇÃO DE SERVIÇOS PARA O SOFTWARE DE CONTROLO DE ASSIDUIDADE - SISQUAL PARA A ADMINISTRAÇÃO REGIONAL DE SAÚDE DE LISBOA E VALE DO TEJO, IP",Ajuste Direto Regime Geral,Aquisição de serviços,"72263000-6, Serviços de implementação de software",Adm.Reg.de Saúde de Lisboa e Vale do Tejo (ARSLVT) (503148776),Sisqual - Emp. de Inv. e Desemv de Sist. Inf. SA (502772298),"95.490,00 €",17-01-2019,12-09-2018,110 dias,Portugal,"Artigo 24.º, n.º 1, alínea e), subalínea ii) do Código dos Contratos Públicos",,,,,,Não aplicável.,Não aplicável.,TRUE
Aquisição de Serviço de inventariação e avaliação dos equipamentos gerais instalados no Hospital de Cascais,Concurso público,Aquisição de serviços,"98390000-3, Outros serviços","Administração Regional de Saúde de Lisboa e Vale do Tejo, I. P. (503148776)","Pricewaterhousecoopers - MFAS Management, Finance & Accouting Services, Lda. (500479194)","16.999,00 €",16-01-2019,10-12-2018,22 dias,"Portugal, Lisboa, Cascais",Artigo 155.º do Código dos Contratos Públicos,,,,,,Não aplicável.,Não aplicável.,FALSE
Aquisição de reforço de backup,Ajuste Direto Regime Geral,Aquisição de bens móveis,"30236000-2, Equipamento informático diverso",Adm.Reg.de Saúde de Lisboa e Vale do Tejo (ARSLVT) (503148776),"Fujitsu Technology Solutions, Lda. (500646791)","74.872,35 €",11-01-2019,04-10-2018,85 dias,Portugal,"Artigo 24.º, n.º 1, alínea e), subalínea ii) do Código dos Contratos Públicos",,,,,,Não aplicável.,Não aplicável.,FALSE
