Objeto do Contrato,Tipo de Procedimento,Tipo(s) de Contrato,CPVs,Entidade(s) Adjudicante(s),Entidade(s) Adjudicatária(s),Preço Contratual,Data de Publicação,Data de Celebração do Contrato,Prazo de Execução,Local de Execução,Fundamentação,Data de Fecho do Contrato,Preço Total Efetivo,Causas das Alterações ao Prazo,Causas das Alterações ao Preço,Estado,N.º registo do Acordo Quadro,Descrição do Acordo Quadro,Procedimento Centralizado
02/AD.18.66 – Material de Fixação Externa,Ajuste Direto Regime Geral,Aquisição de bens móveis,"33140000-3, Material médico de consumo","Centro Hospitalar do Tâmega e Sousa, E. P. E. (508318262)","STRYKER PORTUGAL - PRODUTOS MEDICOS, UNIPESSOAL,LDA. (504594214)","17.648,00 €",10-08-2018,12-04-2018,35 dias,"Portugal, Porto, Penafiel","Artigo 20.º, n.º 1, alínea d) do Código dos Contratos Públicos",,,,,,Não aplicável.,Não aplicável.,FALSE
07/CP.17.138 - Aquisição de Sistema de Anestesia para Bloco Operatório,Concurso público,Aquisição de bens móveis,"33100000-1, Equipamento médico","Centro Hospitalar do Tâmega e Sousa, E.P.E. (508318262)",General Electric Portuguesa (500357129),"75.000,00 €",10-08-2018,23-05-2018,91 dias,"Portugal, Porto, Penafiel","Artigo 20.º, n.º 1, alínea b) do Código dos Contratos Públicos",,,,,,Não aplicável.,Não aplicável.,FALSE
07/CP.17.432 - Aquisição de Mamógrafo Digital,Concurso público,Aquisição de bens móveis,"33111650-2, Aparelhos para mamografia","Centro Hospitalar do Tâmega e Sousa, E. P. E. (508318262)",FUJIFILM EUROPE GMBH (980456517),"180.000,00 €",10-08-2018,04-07-2018,422 dias,"Portugal, Porto, Penafiel","Artigo 20.º, n.º 1, alínea b) do Código dos Contratos Públicos",,,,,,Não aplicável.,Não aplicável.,FALSE
"08/AD.17.260 - Contratação de meios complementares de diagnóstico e terapêutica na área do estudo do sono a realizar aos doentes do Centro Hospitalar do Tâmega e Sousa, E.P.E.",Ajuste Direto Regime Geral,Aquisição de serviços,"85145000-7, Serviços prestados por laboratórios médicos","Centro Hospitalar do Tâmega e Sousa, E. P. E. (508318262)","Lusiadas, SA (505962403)","27.150,00 €",10-08-2018,31-01-2018,365 dias,"Portugal, Porto, Penafiel","Artigo 20.º, n.º 1, alínea a) do Código dos Contratos Públicos",,,,,,Não aplicável.,Não aplicável.,FALSE
02/AD.17.239 - Aquisição de material de laboratório,Ajuste Direto Regime Geral,Aquisição de bens móveis,"33100000-1, Equipamento médico","Centro Hospitalar do Tâmega e Sousa, E. P. E. (508318262)",Menarini diagnosticos Lda. (502610069),"1.881,60 €",08-08-2018,07-02-2018,365 dias,"Portugal, Porto, Penafiel","Artigo 20.º, n.º 1, alínea a) do Código dos Contratos Públicos",,,,,,Não aplicável.,Não aplicável.,FALSE
02/AD.17.239 - Aquisição de material de laboratório,Ajuste Direto Regime Geral,Aquisição de bens móveis,"33100000-1, Equipamento médico","Centro Hospitalar do Tâmega e Sousa, E. P. E. (508318262)",anastacio saldanha (505804441),"12,80 €",08-08-2018,07-02-2018,365 dias,"Portugal, Porto, Penafiel","Artigo 20.º, n.º 1, alínea a) do Código dos Contratos Públicos",,,,,,Não aplicável.,Não aplicável.,FALSE
02/AD.17.239 - Aquisição de material de laboratório,Ajuste Direto Regime Geral,Aquisição de bens móveis,"33100000-1, Equipamento médico","Centro Hospitalar do Tâmega e Sousa, E. P. E. (508318262)","Z-MED EQUIPAMENTOS MEDICOS E HOSPITALARES, LDA (508531535)","92,20 €",08-08-2018,07-02-2018,365 dias,"Portugal, Porto, Penafiel","Artigo 20.º, n.º 1, alínea a) do Código dos Contratos Públicos",,,,,,Não aplicável.,Não aplicável.,FALSE
02/AD.17.239 - Aquisição de material de laboratório,Ajuste Direto Regime Geral,Aquisição de bens móveis,"33100000-1, Equipamento médico","Centro Hospitalar do Tâmega e Sousa, E. P. E. (508318262)","CSPSAUDE - Centro de Serviços Partilhados, SA (508440246)","1.875,00 €",08-08-2018,07-02-2018,365 dias,"Portugal, Porto, Penafiel","Artigo 20.º, n.º 1, alínea a) do Código dos Contratos Públicos",,,,,,Não aplicável.,Não aplicável.,FALSE
02/AD.17.239 - Aquisição de material de laboratório,Ajuste Direto Regime Geral,Aquisição de bens móveis,"33100000-1, Equipamento médico","Centro Hospitalar do Tâmega e Sousa, E. P. E. (508318262)",VACUETTE PORTUGAL SA (505348470),"2.897,17 €",08-08-2018,02-02-2018,365 dias,"Portugal, Porto, Penafiel","Artigo 20.º, n.º 1, alínea a) do Código dos Contratos Públicos",,,,,,Não aplicável.,Não aplicável.,FALSE
02/AD.17.239 - Aquisição de material de laboratório,Ajuste Direto Regime Geral,Aquisição de bens móveis,"33100000-1, Equipamento médico","Centro Hospitalar do Tâmega e Sousa, E. P. E. (508318262)","AZOLAB - COMÉRCIO MATERIAL LABORATORIAL, LDA. (506332918)","3.222,50 €",08-08-2018,02-02-2018,365 dias,"Portugal, Porto, Penafiel","Artigo 20.º, n.º 1, alínea a) do Código dos Contratos Públicos",,,,,,Não aplicável.,Não aplicável.,FALSE
02/AD.17.239 - Aquisição de material de laboratório,Ajuste Direto Regime Geral,Aquisição de bens móveis,"33100000-1, Equipamento médico","Centro Hospitalar do Tâmega e Sousa, E. P. E. (508318262)","ESTERIPLAST - PRODUTOS PARA AREA DE SAUDE, LDA (502020776)","2.972,35 €",08-08-2018,02-02-2018,365 dias,"Portugal, Porto, Penafiel","Artigo 20.º, n.º 1, alínea a) do Código dos Contratos Públicos",,,,,,Não aplicável.,Não aplicável.,FALSE
02/AD.17.242 - Aquisição de material de consumo de ORL,Ajuste Direto Regime Geral,Aquisição de bens móveis,"33100000-1, Equipamento médico","Centro Hospitalar do Tâmega e Sousa, E.P.E. (508318262)","Olympus Ibéria, S.A.U.  (980474710)","775,68 €",08-08-2018,28-02-2018,365 dias,"Portugal, Porto, Amarante<BR/>Portugal, Porto, Porto","Artigo 20.º, n.º 1, alínea a) do Código dos Contratos Públicos",,,,,,Não aplicável.,Não aplicável.,FALSE
02/AD.17.242 - Aquisição de material de consumo de ORL,Ajuste Direto Regime Geral,Aquisição de bens móveis,"33100000-1, Equipamento médico","Centro Hospitalar do Tâmega e Sousa, E.P.E. (508318262)",ATOS MEDICAL SPAAIN SL-SUCURSAL EM PORTUGAL (980435978),"4.462,50 €",08-08-2018,28-02-2018,365 dias,"Portugal, Porto, Amarante<BR/>Portugal, Porto, Penafiel","Artigo 20.º, n.º 1, alínea a) do Código dos Contratos Públicos",,,,,,Não aplicável.,Não aplicável.,FALSE
02/AD.17.242 - Aquisição de material de consumo de ORL,Ajuste Direto Regime Geral,Aquisição de bens móveis,"33100000-1, Equipamento médico","Centro Hospitalar do Tâmega e Sousa, E.P.E. (508318262)","Overpharma - Produtos Médicos Farmacêuticos, Lda. (505792362)","1.026,00 €",08-08-2018,28-02-2018,365 dias,"Portugal, Porto, Amarante<BR/>Portugal, Porto, Penafiel","Artigo 20.º, n.º 1, alínea a) do Código dos Contratos Públicos",,,,,,Não aplicável.,Não aplicável.,FALSE
02/AD.17.242 - Aquisição de material de consumo de ORL,Ajuste Direto Regime Geral,Aquisição de bens móveis,"33100000-1, Equipamento médico","Centro Hospitalar do Tâmega e Sousa, E.P.E. (508318262)","Oftaldata - Produtos Oftalmologia, Lda (504887459)","4.778,70 €",08-08-2018,28-02-2018,365 dias,"Portugal, Porto, Amarante<BR/>Portugal, Porto, Penafiel","Artigo 20.º, n.º 1, alínea a) do Código dos Contratos Públicos",,,,,,Não aplicável.,Não aplicável.,FALSE
02/AD.17.242 - Aquisição de material  de consumo de ORL,Ajuste Direto Regime Geral,Aquisição de bens móveis,"33100000-1, Equipamento médico","Centro Hospitalar do Tâmega e Sousa, E.P.E. (508318262)","EUROCASMEDICA - PRODUTOS HOSPITALARES , S.A. (503322105)","889,00 €",08-08-2018,28-02-2018,365 dias,"Portugal, Porto, Amarante<BR/>Portugal, Porto, Penafiel","Artigo 20.º, n.º 1, alínea a) do Código dos Contratos Públicos",,,,,,Não aplicável.,Não aplicável.,FALSE
02/AD.17.242 - Aquisição de material de consumo de ORL,Ajuste Direto Regime Geral,Aquisição de bens móveis,"33100000-1, Equipamento médico","Centro Hospitalar do Tâmega e Sousa, E.P.E. (508318262)","AVIQUIMICA- IMPORTAÇÃO E MANUFACTURAS, LDA (500039720)","360,00 €",08-08-2018,28-02-2018,365 dias,"Portugal, Porto, Amarante<BR/>Portugal, Porto, Penafiel","Artigo 20.º, n.º 1, alínea a) do Código dos Contratos Públicos",,,,,,Não aplicável.,Não aplicável.,FALSE
02/AD.17.242 - Aquisição de material de consumo de ORL,Ajuste Direto Regime Geral,Aquisição de bens móveis,"33100000-1, Equipamento médico","Centro Hospitalar do Tâmega e Sousa, E.P.E. (508318262)","MEDTRONIC PORTUGAL, LDA (504223933)","4.556,50 €",08-08-2018,02-02-2018,365 dias,"Portugal, Porto, Penafiel<BR/>Portugal, Porto, Amarante","Artigo 20.º, n.º 1, alínea a) do Código dos Contratos Públicos",,,,,,Não aplicável.,Não aplicável.,FALSE
02/AD.17.232 - Aquisição de Consumíveis de Oftalmologia,Ajuste Direto Regime Geral,Aquisição de bens móveis,"33100000-1, Equipamento médico","Centro Hospitalar do Tâmega e Sousa, E.P.E. (508318262)","Overpharma - Prod. Médicos, Lda (505792362)","2.697,20 €",08-08-2018,04-05-2018,365 dias,"Portugal, Porto, Amarante<BR/>Portugal, Porto, Penafiel","Artigo 20.º, n.º 1, alínea a) do Código dos Contratos Públicos",,,,,,Não aplicável.,Não aplicável.,FALSE
02/AD.17.232 - Aquisição de Consumíveis de Oftalmologia,Ajuste Direto Regime Geral,Aquisição de bens móveis,"33100000-1, Equipamento médico","Centro Hospitalar do Tâmega e Sousa, E.P.E. (508318262)","Oftaldata - Produtos Oftalmologia, Lda (504887459)","1.662,00 €",07-08-2018,04-05-2018,365 dias,"Portugal, Porto, Amarante<BR/>Portugal, Porto, Penafiel","Artigo 20.º, n.º 1, alínea a) do Código dos Contratos Públicos",,,,,,Não aplicável.,Não aplicável.,FALSE
02/AD.17.232 - Aquisição de Consumíveis de Oftalmologia,Ajuste Direto Regime Geral,Aquisição de bens móveis,"33100000-1, Equipamento médico","Centro Hospitalar do Tâmega e Sousa, E.P.E. (508318262)","NEOLIFE WIZARD,SA (513635882)","538,20 €",07-08-2018,04-05-2018,365 dias,"Portugal, Porto, Amarante<BR/>Portugal, Porto, Penafiel","Artigo 20.º, n.º 1, alínea a) do Código dos Contratos Públicos",,,,,,Não aplicável.,Não aplicável.,FALSE
02/AD.17.232 - Aquisição de Consumíveis de Oftalmologia,Ajuste Direto Regime Geral,Aquisição de bens móveis,"33100000-1, Equipamento médico","Centro Hospitalar do Tâmega e Sousa, E.P.E. (508318262)",JOSÉ COTTA - EQUIP. MÉDICO (500155739),"614,00 €",07-08-2018,04-05-2018,365 dias,"Portugal, Porto, Amarante<BR/>Portugal, Porto, Penafiel","Artigo 20.º, n.º 1, alínea a) do Código dos Contratos Públicos",,,,,,Não aplicável.,Não aplicável.,FALSE
02/AD.17.232 - Aquisição de Consumíveis de Oftalmologia,Ajuste Direto Regime Geral,Aquisição de bens móveis,"33100000-1, Equipamento médico","Centro Hospitalar do Tâmega e Sousa, E.P.E. (508318262)","BAUSCH & LOMB, SA (980218764)","4.961,00 €",07-08-2018,04-05-2018,365 dias,"Portugal, Porto, Penafiel<BR/>Portugal, Porto, Amarante","Artigo 20.º, n.º 1, alínea a) do Código dos Contratos Públicos",,,,,,Não aplicável.,Não aplicável.,FALSE
"02/AD.17.232 - Aquisição de Consumíveis de Oftalmologia para o Centro Hospitalar do Tâmega e Sousa, .E.P.E.",Ajuste Direto Regime Geral,Aquisição de bens móveis,"33100000-1, Equipamento médico","Centro Hospitalar do Tâmega e Sousa, E.P.E. (508318262)","Alcon Portugal, Lda. (501251685)","260,00 €",07-08-2018,04-04-2018,365 dias,"Portugal, Porto, Amarante<BR/>Portugal, Porto, Penafiel","Artigo 20.º, n.º 1, alínea a) do Código dos Contratos Públicos",,,,,,Não aplicável.,Não aplicável.,FALSE
"08/AD.17.325 - Serviços de assistência técnica para avaliação do Sistema AVAC e Gases Anestésicos e Controlo Microbiológico ao Centro Hospitalar Tâmega e Sousa, E.P.E.",Ajuste Direto Regime Geral,Aquisição de serviços,"90700000-4, Serviços ambientais","Centro Hospitalar do Tâmega e Sousa, E.P.E. (508318262)","DPM-ANALISES DE AGUAS,SOLOS,AR EALIMENTOS, LDA (503322342)","11.386,00 €",07-08-2018,20-06-2018,366 dias,"Portugal, Porto, Penafiel<BR/>Portugal, Porto, Amarante","Artigo 20.º, n.º 1, alínea a) do Código dos Contratos Públicos",,,,,,Não aplicável.,Não aplicável.,FALSE
Aquisição de Serviços de Suporte para Infraestrutura do DataCenter,Ajuste Direto Regime Geral,Aquisição de serviços,"72600000-6, Serviços de consultoria e assistência informáticas","Centro Hospitalar do Tâmega e Sousa, E. P. E. (508318262)","GONKSYS, S.A. (510874169)","45.787,50 €",03-08-2018,23-02-2018,312 dias,"Portugal, Porto, Penafiel","Artigo 24.º, n.º 1, alínea a) do Código dos Contratos Públicos",,,,,,Não aplicável.,Não aplicável.,FALSE
"Serviço de manutenção a veículos multimarca do Centro Hospitalar do Tâmega e Sousa, E.P.E.",Ajuste Direto Regime Geral,Aquisição de serviços,"50111110-0, Serviços de assistência a frotas de veículos","Centro Hospitalar do Tâmega e Sousa, E. P. E. (508318262)","AUTO 1ºDEZEMBRO, LDA (503046710)","25.000,00 €",02-08-2018,15-02-2018,328 dias,"Portugal, Porto, Amarante<BR/>Portugal, Porto, Penafiel","Artigo 20.º, n.º 1, alínea a) do Código dos Contratos Públicos",,,,,,Não aplicável.,Não aplicável.,FALSE
"Aquisição de programas de controlo de Qualidade Externos para o Centro Hospitalar do Tâmega e Sousa, E.P.E.",Ajuste Direto Regime Geral,Aquisição de serviços,"71700000-5, Serviços de controlo e monitorização","Centro Hospitalar do Tâmega e Sousa, E.P.E. (508318262)","Instituto Nacional de Saúde Doutor Ricardo Jorge, I. P. (501427511)","811,80 €",02-08-2018,01-01-2018,365 dias,"Portugal, Porto, Penafiel","Artigo 20.º, n.º 1, alínea a) do Código dos Contratos Públicos",,,,,,Não aplicável.,Não aplicável.,FALSE
" Aquisição de programas de controlo de Qualidade Externos para o Centro Hospitalar do Tâmega e Sousa, E.P.E.",Ajuste Direto Regime Geral,Aquisição de serviços,"71700000-5, Serviços de controlo e monitorização","Centro Hospitalar do Tâmega e Sousa, E.P.E. (508318262)",IRLANDOX (502515619),"3.502,20 €",02-08-2018,01-01-2018,365 dias,"Portugal, Porto, Penafiel","Artigo 20.º, n.º 1, alínea a) do Código dos Contratos Públicos",,,,,,Não aplicável.,Não aplicável.,FALSE
"Aquisição de programas de controlo de Qualidade Externos para o Centro Hospitalar do Tâmega e Sousa, E.P.E.",Ajuste Direto Regime Geral,Aquisição de serviços,"71700000-5, Serviços de controlo e monitorização","Centro Hospitalar do Tâmega e Sousa, E.P.E. (508318262)","Biognóstica, Lda. (504441256)","22.423,00 €",02-08-2018,01-01-2018,365 dias,"Portugal, Porto, Penafiel","Artigo 20.º, n.º 1, alínea a) do Código dos Contratos Públicos",,,,,,Não aplicável.,Não aplicável.,FALSE
Aquisição de Diversos Filtros,Ajuste Direto Regime Geral,Aquisição de bens móveis,"42514310-8, Filtros de ar","Centro Hospitalar do Tâmega e Sousa, E. P. E. (508318262)",Sófiltro (João Manuel Lopes Folgado da Silva) (198254997),"1.479,98 €",02-08-2018,12-04-2018,264 dias,"Portugal, Porto, Penafiel<BR/>Portugal, Porto, Amarante","Artigo 20.º, n.º 1, alínea a) do Código dos Contratos Públicos",,,,,,Não aplicável.,Não aplicável.,FALSE
Aquisição de Diversos Filtros,Ajuste Direto Regime Geral,Aquisição de bens móveis,"42514310-8, Filtros de ar","Centro Hospitalar do Tâmega e Sousa, E. P. E. (508318262)","Optar Filtros, Lda. (514325313)","6.489,50 €",02-08-2018,12-04-2018,264 dias,"Portugal, Porto, Amarante<BR/>Portugal, Porto, Penafiel","Artigo 20.º, n.º 1, alínea a) do Código dos Contratos Públicos",,,,,,Não aplicável.,Não aplicável.,FALSE
Aquisição de Diversos Filtros,Ajuste Direto Regime Geral,Aquisição de bens móveis,"42514310-8, Filtros de ar","Centro Hospitalar do Tâmega e Sousa, E. P. E. (508318262)",IBERCONCEPT LDA (507212738),"199,05 €",02-08-2018,12-04-2018,264 dias,"Portugal, Porto, Penafiel<BR/>Portugal, Porto, Amarante","Artigo 20.º, n.º 1, alínea a) do Código dos Contratos Públicos",,,,,,Não aplicável.,Não aplicável.,FALSE
Aquisição de Diversos Filtros,Ajuste Direto Regime Geral,Aquisição de bens móveis,"42514310-8, Filtros de ar","Centro Hospitalar do Tâmega e Sousa, E. P. E. (508318262)",Filterwin (510204023),"4.550,47 €",02-08-2018,12-04-2018,264 dias,"Portugal, Porto, Amarante<BR/>Portugal, Porto, Penafiel","Artigo 20.º, n.º 1, alínea a) do Código dos Contratos Públicos",,,,,,Não aplicável.,Não aplicável.,FALSE
Aquisição de Diversos Filtros,Ajuste Direto Regime Geral,Aquisição de bens móveis,"42514310-8, Filtros de ar","Centro Hospitalar do Tâmega e Sousa, E. P. E. (508318262)","C.M.L.- Comércio e Equipamentos Industriais, Lda (514242655)","938,00 €",02-08-2018,12-04-2018,264 dias,"Portugal, Porto, Amarante<BR/>Portugal, Porto, Penafiel","Artigo 20.º, n.º 1, alínea a) do Código dos Contratos Públicos",,,,,,Não aplicável.,Não aplicável.,FALSE
