freguesia,acronym,validVotesPercentage,votes,dicofre
União das freguesias de São Jorge e Ermelo,PS,39.71,81,160161
União das freguesias de São Jorge e Ermelo,PPD/PSD,39.22,80,160161
União das freguesias de São Jorge e Ermelo,CDS-PP,9.31,19,160161
União das freguesias de São Jorge e Ermelo,B.E.,2.94,6,160161
União das freguesias de São Jorge e Ermelo,PAN,1.96,4,160161
União das freguesias de São Jorge e Ermelo,PDR,1.96,4,160161
União das freguesias de São Jorge e Ermelo,NC,0.98,2,160161
União das freguesias de São Jorge e Ermelo,PCTP/MRPP,0.98,2,160161
União das freguesias de São Jorge e Ermelo,PNR,0.98,2,160161
União das freguesias de São Jorge e Ermelo,PURP,0.98,2,160161
União das freguesias de São Jorge e Ermelo,MAS,0.49,1,160161
União das freguesias de São Jorge e Ermelo,PTP,0.49,1,160161
União das freguesias de São Jorge e Ermelo,A,0,0,160161
União das freguesias de São Jorge e Ermelo,IL,0,0,160161
União das freguesias de São Jorge e Ermelo,L,0,0,160161
União das freguesias de São Jorge e Ermelo,PCP-PEV,0,0,160161
União das freguesias de São Jorge e Ermelo,PPM.PPV/CDC,0,0,160161
