freguesia,acronym,validVotesPercentage,votes,dicofre
União das freguesias de Venda do Pinheiro e Santo Estêvão das Galés,PS,32.75,1079,110922
União das freguesias de Venda do Pinheiro e Santo Estêvão das Galés,PPD/PSD,23.13,762,110922
União das freguesias de Venda do Pinheiro e Santo Estêvão das Galés,B.E.,9.47,312,110922
União das freguesias de Venda do Pinheiro e Santo Estêvão das Galés,PAN,9.04,298,110922
União das freguesias de Venda do Pinheiro e Santo Estêvão das Galés,CDS-PP,6.34,209,110922
União das freguesias de Venda do Pinheiro e Santo Estêvão das Galés,PCP-PEV,6.28,207,110922
União das freguesias de Venda do Pinheiro e Santo Estêvão das Galés,PPM.PPV/CDC,3.16,104,110922
União das freguesias de Venda do Pinheiro e Santo Estêvão das Galés,A,2.85,94,110922
União das freguesias de Venda do Pinheiro e Santo Estêvão das Galés,L,2.34,77,110922
União das freguesias de Venda do Pinheiro e Santo Estêvão das Galés,NC,1.21,40,110922
União das freguesias de Venda do Pinheiro e Santo Estêvão das Galés,PNR,0.73,24,110922
União das freguesias de Venda do Pinheiro e Santo Estêvão das Galés,IL,0.7,23,110922
União das freguesias de Venda do Pinheiro e Santo Estêvão das Galés,PDR,0.7,23,110922
União das freguesias de Venda do Pinheiro e Santo Estêvão das Galés,PCTP/MRPP,0.67,22,110922
União das freguesias de Venda do Pinheiro e Santo Estêvão das Galés,PURP,0.27,9,110922
União das freguesias de Venda do Pinheiro e Santo Estêvão das Galés,PTP,0.21,7,110922
União das freguesias de Venda do Pinheiro e Santo Estêvão das Galés,MAS,0.15,5,110922
