freguesia,acronym,validVotesPercentage,votes,dicofre
Lorvão,PS,41.16,410,061304
Lorvão,PPD/PSD.CDS-PP,30.32,302,061304
Lorvão,PCP-PEV,14.46,144,061304
Lorvão,MPT,5.92,59,061304
Lorvão,PCTP/MRPP,2.11,21,061304
Lorvão,B.E.,1.91,19,061304
Lorvão,PAN,1.1,11,061304
Lorvão,PND,0.9,9,061304
Lorvão,L,0.8,8,061304
Lorvão,PTP,0.4,4,061304
Lorvão,MAS,0.2,2,061304
Lorvão,PDA,0.2,2,061304
Lorvão,PPM,0.2,2,061304
Lorvão,PNR,0.1,1,061304
Lorvão,POUS,0.1,1,061304
Lorvão,PPV,0.1,1,061304
