freguesia,acronym,validVotesPercentage,votes,dicofre
Valbom/Bogalhal,PPD/PSD,46.15,36,091031
Valbom/Bogalhal,PS,32.05,25,091031
Valbom/Bogalhal,CDS-PP,8.97,7,091031
Valbom/Bogalhal,B.E.,7.69,6,091031
Valbom/Bogalhal,A,1.28,1,091031
Valbom/Bogalhal,L,1.28,1,091031
Valbom/Bogalhal,PAN,1.28,1,091031
Valbom/Bogalhal,PPM.PPV/CDC,1.28,1,091031
Valbom/Bogalhal,IL,0,0,091031
Valbom/Bogalhal,MAS,0,0,091031
Valbom/Bogalhal,NC,0,0,091031
Valbom/Bogalhal,PCP-PEV,0,0,091031
Valbom/Bogalhal,PCTP/MRPP,0,0,091031
Valbom/Bogalhal,PDR,0,0,091031
Valbom/Bogalhal,PNR,0,0,091031
Valbom/Bogalhal,PTP,0,0,091031
Valbom/Bogalhal,PURP,0,0,091031
