Objeto do Contrato,Tipo de Procedimento,Tipo(s) de Contrato,CPVs,Entidade(s) Adjudicante(s),Entidade(s) Adjudicatária(s),Preço Contratual,Data de Publicação,Data de Celebração do Contrato,Prazo de Execução,Local de Execução,Fundamentação,Data de Fecho do Contrato,Preço Total Efetivo,Causas das Alterações ao Prazo,Causas das Alterações ao Preço,Estado,N.º registo do Acordo Quadro,Descrição do Acordo Quadro,Procedimento Centralizado
LENALIDOMIDA 10MG CAPS,Ajuste Direto Regime Geral,Aquisição de bens móveis,"24000000-4, Produtos químicos","Centro Hospitalar Tondela-Viseu, E. P. E. (509822940)","CELGENE SOCIEDADE UNIP, LDA (507791690)","18.749,20 €",18-11-2013,24-10-2013,1 dias,"Portugal, Viseu, Viseu","Artigo 22.º, n.º 2 do Código dos Contratos Públicos",,,,,,Não aplicável.,Não aplicável.,
ABIRATERONA 250MG COMP,Ajuste Direto Regime Geral,Aquisição de bens móveis,"24000000-4, Produtos químicos","Centro Hospitalar Tondela-Viseu, E. P. E. (509822940)",ABIRATERONA 250MG COMP (500189412),"53.011,20 €",15-11-2013,28-10-2013,1 dias,"Portugal, Viseu, Viseu","Artigo 24.º, n.º 1, alínea e) do Código dos Contratos Públicos",,,,,,Não aplicável.,Não aplicável.,
LENALIDOMIDA 10MG CAPS,Ajuste Direto Regime Geral,Aquisição de bens móveis,"24000000-4, Produtos químicos","Centro Hospitalar Tondela-Viseu, E. P. E. (509822940)","CELGENE SOCIEDADE UNIP., LDA (507791690)","14.061,90 €",15-11-2013,24-10-2013,1 dias,"Portugal, Viseu, Viseu","Artigo 24.º, n.º 1, alínea e) do Código dos Contratos Públicos",,,,,,Não aplicável.,Não aplicável.,
"ANFOTERICINA B 50MG/12,5ML LIPOSOMICA INJ AMP",Ajuste Direto Regime Geral,Aquisição de bens móveis,"24000000-4, Produtos químicos","Centro Hospitalar Tondela-Viseu, E. P. E. (509822940)","GILEAD SCIENCES, LDA (503604704)","13.006,10 €",15-11-2013,09-10-2013,1 dias,"Portugal, Viseu, Viseu","Artigo 24.º, n.º 1, alínea e) do Código dos Contratos Públicos",,,,,,Não aplicável.,Não aplicável.,
VIDEO-UTERORRENOSCOPIO,Ajuste Direto Regime Geral,Aquisição de bens móveis,"33000000-0, Equipamento médico, medicamentos e produtos para cuidados pessoais","Centro Hospitalar Tondela-Viseu, E. P. E. (509822940)",OLYMPUS IBERIA S.A.U. (980474710),"21.300,00 €",12-11-2013,08-11-2013,1 dias,"Portugal, Viseu, Viseu","Artigo 20.º, n.º 1, alínea a) do Código dos Contratos Públicos",,,,,,Não aplicável.,Não aplicável.,
Reagentes p/ ImunoHemoterapia (Esgotados no CP/0126/2013),Ajuste Direto Regime Geral,Aquisição de bens móveis,"33000000-0, Equipamento médico, medicamentos e produtos para cuidados pessoais","Centro Hospitalar Tondela-Viseu, E. P. E. (509822940)","DIAMED PORTUGUESA DIAGNÓSTICA, SA (501675809)","5.620,40 €",11-11-2013,23-10-2013,1 dias,"Portugal, Viseu, Viseu","Artigo 24.º, n.º 1, alínea c) do Código dos Contratos Públicos",,,,,,Não aplicável.,Não aplicável.,
