freguesia,acronym,validVotesPercentage,votes,dicofre
Ribeira Chã,PS,57.14,48,420105
Ribeira Chã,PPD/PSD.CDS-PP,34.52,29,420105
Ribeira Chã,PAN,2.38,2,420105
Ribeira Chã,PCTP/MRPP,2.38,2,420105
Ribeira Chã,MAS,1.19,1,420105
Ribeira Chã,PCP-PEV,1.19,1,420105
Ribeira Chã,PNR,1.19,1,420105
Ribeira Chã,B.E.,0,0,420105
Ribeira Chã,L,0,0,420105
Ribeira Chã,MPT,0,0,420105
Ribeira Chã,PDA,0,0,420105
Ribeira Chã,PND,0,0,420105
Ribeira Chã,POUS,0,0,420105
Ribeira Chã,PPM,0,0,420105
Ribeira Chã,PPV,0,0,420105
Ribeira Chã,PTP,0,0,420105
