freguesia,acronym,validVotesPercentage,votes,dicofre
Luz,PS,36.51,207,080703
Luz,B.E.,15.34,87,080703
Luz,PPD/PSD,12.7,72,080703
Luz,PCP-PEV,9.17,52,080703
Luz,PAN,7.23,41,080703
Luz,CDS-PP,7.05,40,080703
Luz,A,2.29,13,080703
Luz,PPM.PPV/CDC,2.29,13,080703
Luz,L,1.76,10,080703
Luz,PNR,1.76,10,080703
Luz,PCTP/MRPP,1.06,6,080703
Luz,NC,0.88,5,080703
Luz,IL,0.71,4,080703
Luz,PDR,0.53,3,080703
Luz,PTP,0.53,3,080703
Luz,MAS,0.18,1,080703
Luz,PURP,0,0,080703
