freguesia,acronym,validVotesPercentage,votes,dicofre
"União das freguesias de Torres Novas (Santa Maria, Salvador e Santiago)",PS,33.71,828,141920
"União das freguesias de Torres Novas (Santa Maria, Salvador e Santiago)",PPD/PSD,20.4,501,141920
"União das freguesias de Torres Novas (Santa Maria, Salvador e Santiago)",B.E.,16.08,395,141920
"União das freguesias de Torres Novas (Santa Maria, Salvador e Santiago)",PCP-PEV,7.33,180,141920
"União das freguesias de Torres Novas (Santa Maria, Salvador e Santiago)",CDS-PP,7.13,175,141920
"União das freguesias de Torres Novas (Santa Maria, Salvador e Santiago)",PAN,4.6,113,141920
"União das freguesias de Torres Novas (Santa Maria, Salvador e Santiago)",A,2.81,69,141920
"União das freguesias de Torres Novas (Santa Maria, Salvador e Santiago)",PPM.PPV/CDC,2.36,58,141920
"União das freguesias de Torres Novas (Santa Maria, Salvador e Santiago)",L,1.63,40,141920
"União das freguesias de Torres Novas (Santa Maria, Salvador e Santiago)",NC,1.18,29,141920
"União das freguesias de Torres Novas (Santa Maria, Salvador e Santiago)",IL,0.86,21,141920
"União das freguesias de Torres Novas (Santa Maria, Salvador e Santiago)",PCTP/MRPP,0.53,13,141920
"União das freguesias de Torres Novas (Santa Maria, Salvador e Santiago)",PDR,0.41,10,141920
"União das freguesias de Torres Novas (Santa Maria, Salvador e Santiago)",MAS,0.33,8,141920
"União das freguesias de Torres Novas (Santa Maria, Salvador e Santiago)",PNR,0.33,8,141920
"União das freguesias de Torres Novas (Santa Maria, Salvador e Santiago)",PURP,0.2,5,141920
"União das freguesias de Torres Novas (Santa Maria, Salvador e Santiago)",PTP,0.12,3,141920
