Objeto do Contrato,Tipo de Procedimento,Tipo(s) de Contrato,CPVs,Entidade(s) Adjudicante(s),Entidade(s) Adjudicatária(s),Preço Contratual,Data de Publicação,Data de Celebração do Contrato,Prazo de Execução,Local de Execução,Fundamentação,Data de Fecho do Contrato,Preço Total Efetivo,Causas das Alterações ao Prazo,Causas das Alterações ao Preço,Estado,N.º registo do Acordo Quadro,Descrição do Acordo Quadro,Procedimento Centralizado
Prestação de Serviços de Médicos na Especialidade de Otorrinolaringologia - Abr a Dez 17,Ajuste Direto Regime Geral,Aquisição de serviços,"85100000-0, Serviços de saúde","Unidade Local de Saúde do Norte Alentejano, E. P. E. (508094461)","Génese Dinâmica - Serviços Médicos, Lda. (510315186)","79.242,07 €",11-08-2017,18-07-2017,275 dias,"Portugal, Portalegre, Portalegre","Artigo 27.º, n.º 1, alínea a) do Código dos Contratos Públicos","","",,"",,Não aplicável.,Não aplicável.,FALSE
"51001517-P259-2017-AQUISIÇÃO DE MEDICAMENTOS DESENCADEADA PELA SPMS,EPE NO ÂMBITO DO DESPACHO 1571/b 2016 -  H101",Ao abrigo de acordo-quadro (art.º 259.º),Aquisição de bens móveis,"33000000-0, Equipamento médico, medicamentos e produtos para cuidados pessoais","Unidade Local de Saúde do Norte Alentejano, E. P. E. (508094461)",MEDAC SUCURSAL EM PORTUGAL (980369959),"891,00 €",10-08-2017,08-08-2017,180 dias,"Portugal, Portalegre, Elvas<BR/>Portugal, Portalegre, Portalegre",Artigo 259.º do Código dos Contratos Públicos,31-12-2017,"891,00 €",,"",,1771819,CP 2015/6 - Acordo quadro para o fornecimento de Medicamentos do Foro Oncológico,FALSE
"51001517-P259-2017-AQUISIÇÃO DE MEDICAMENTOS DESENCADEADA PELA SPMS,EPE NO ÂMBITO DO DESPACHO 1571/b 2016 -  C227, C228.",Ao abrigo de acordo-quadro (art.º 259.º),Aquisição de bens móveis,"33000000-0, Equipamento médico, medicamentos e produtos para cuidados pessoais","Unidade Local de Saúde do Norte Alentejano, E. P. E. (508094461)","ACCORD HEALTHCARE, UNIPESSOAL LDA (508622263)","480,96 €",10-08-2017,08-08-2017,180 dias,"Portugal, Portalegre, Portalegre<BR/>Portugal, Portalegre, Elvas",Artigo 259.º do Código dos Contratos Públicos,31-12-2017,"34.450,00 €",,Não foram adquiridas todas as quantidades estimadas.,,1771819,CP 2015/6 - Acordo quadro para o fornecimento de Medicamentos do Foro Oncológico,FALSE
"51001517-P259-2017-AQUISIÇÃO DE MEDICAMENTOS DESENVADEADA PELA SPMS,EPE NO ÂMBITO DO DESPACHO 1571/b 2016 -  C52; C53.",Ao abrigo de acordo-quadro (art.º 259.º),Aquisição de bens móveis,"33000000-0, Equipamento médico, medicamentos e produtos para cuidados pessoais","Unidade Local de Saúde do Norte Alentejano, E. P. E. (508094461)","FRESENIUS KABI PHARMA PORTUGAL,LDA (504293753)","811,80 €",10-08-2017,08-08-2017,180 dias,"Portugal, Portalegre, Elvas<BR/>Portugal, Portalegre, Portalegre",Artigo 259.º do Código dos Contratos Públicos,"","",,"",,1771819,CP 2015/6 - Acordo quadro para o fornecimento de Medicamentos do Foro Oncológico,FALSE
"51001517-P259-2017-AQUISIÇÃO DE MEDICAMENTOS DESENVADEADA PELA SPMS,EPE NO ÂMBITO DO DESPACHO 1571/b 2016 -  B218; B320; F178",Ao abrigo de acordo-quadro (art.º 259.º),Aquisição de bens móveis,"33000000-0, Equipamento médico, medicamentos e produtos para cuidados pessoais","Unidade Local de Saúde do Norte Alentejano, E. P. E. (508094461)","TEVA PHARMA, PROD. FARMAC., LDA. (507045491)","654,84 €",10-08-2017,08-08-2017,180 dias,"Portugal, Portalegre, Portalegre<BR/>Portugal, Portalegre, Elvas",Artigo 259.º do Código dos Contratos Públicos,31-12-2017,"629,60 €",,Não foram adquiridas todas as quantidades estimadas.,,1771819,CP 2015/6 - Acordo quadro para o fornecimento de Medicamentos do Foro Oncológico,FALSE
"51001417 - P259-AC-2017- 117 - AQUISIÇÃO DE MEDICAMENTOS DESENCADEADA PELA SPMS,EPE NO ÂMBITO DO DESPACHO 1571/B 2016 -  D209 - DOXORRUBICINA",Ao abrigo de acordo-quadro (art.º 259.º),Aquisição de bens móveis,"33000000-0, Equipamento médico, medicamentos e produtos para cuidados pessoais","Unidade Local de Saúde do Norte Alentejano, E. P. E. (508094461)",MEDAC SUCURSAL EM PORTUGAL (980369959),"480,00 €",10-08-2017,08-08-2017,180 dias,"Portugal, Portalegre, Elvas<BR/>Portugal, Portalegre, Portalegre",Artigo 259.º do Código dos Contratos Públicos,31-12-2017,"45,00 €",,Não foi adquirido a totalidade estimada.,,1771819,CP 2015/6 - Acordo quadro para o fornecimento de Medicamentos do Foro Oncológico,FALSE
Prestação de Serviços na Especialidade de Urologia (abr a dez),Ajuste Direto Regime Geral,Aquisição de serviços,"85100000-0, Serviços de saúde","Unidade Local de Saúde do Norte Alentejano, E. P. E. (508094461)","Serviços Clinicos Mashanova e Martins, Lda (503444111)","89.386,44 €",08-08-2017,18-07-2017,275 dias,"Portugal, Portalegre, Portalegre","Artigo 27.º, n.º 1, alínea a) do Código dos Contratos Públicos","","",,"",,Não aplicável.,Não aplicável.,FALSE
Prestação de Serviços na Especialidade de Cardiologia (abr a dez),Ajuste Direto Regime Geral,Aquisição de serviços,"85100000-0, Serviços de saúde","Unidade Local de Saúde do Norte Alentejano, E. P. E. (508094461)","C.E.R.I.R.P. - Centro de Electrocardiologia e Reabilitação de Insuficientes Respiratórios de Portugal, Lda (513044043)","72.529,79 €",08-08-2017,18-07-2017,275 dias,"Portugal, Portalegre, Portalegre","Artigo 24.º, n.º 1, alínea c) do Código dos Contratos Públicos","","",,"",,Não aplicável.,Não aplicável.,FALSE
Prestação de Serviços na Especialidade de Medicina Interna (jun a dez),Ajuste Direto Regime Geral,Aquisição de serviços,"85100000-0, Serviços de saúde","Unidade Local de Saúde do Norte Alentejano, E. P. E. (508094461)","Medipeople-Soluções de Saúde e Educação, Lda. (508543436)","57.456,00 €",08-08-2017,28-07-2017,214 dias,"Portugal, Portalegre, Portalegre","Artigo 20.º, n.º 1, alínea a) do Código dos Contratos Públicos","","",,"",,Não aplicável.,Não aplicável.,FALSE
"Aquisição de Mobiliário Hospital para Vários Serviços da ULSNA, EPE",Concurso público,Aquisição de bens móveis,"39100000-3, Mobiliário","Unidade Local de Saúde do Norte Alentejano, E. P. E. (508094461)",Alfraphar (504223895),"12.474,40 €",08-08-2017,28-07-2017,30 dias,"Portugal, Portalegre, Portalegre","Artigo 20.º, n.º 1, alínea b) do Código dos Contratos Públicos","","",,"",,Não aplicável.,Não aplicável.,FALSE
Prestação de Serviços de Médicos no Serviço de Urgência Básica ( jul a dez 17),Ajuste Direto Regime Geral,Aquisição de serviços,"85100000-0, Serviços de saúde","Unidade Local de Saúde do Norte Alentejano, E. P. E. (508094461)","Honorismédica, Lda (509799191)","103.662,00 €",04-08-2017,19-07-2017,184 dias,"Portugal, Portalegre, Portalegre","Artigo 27.º, n.º 1, alínea a) do Código dos Contratos Públicos","","",,"",,Não aplicável.,Não aplicável.,FALSE
Contrato - Prestação de Serviços de Médicos na Especialidade de Oftalmologia ( jul a dez 17),Ajuste Direto Regime Geral,Aquisição de serviços,"85100000-0, Serviços de saúde","Unidade Local de Saúde do Norte Alentejano, E. P. E. (508094461)","MARTIN, MARTINEZ, SABUGAL & SPENCER, ACE (513489029)","214.725,78 €",04-08-2017,17-07-2017,184 dias,"Portugal, Portalegre, Portalegre","Artigo 27.º, n.º 1, alínea a) do Código dos Contratos Públicos","","",,"",,Não aplicável.,Não aplicável.,FALSE
Prestação de Serviços de Médicos na Especialidade de Cirurgia Geral ( mai a dez 17),Ajuste Direto Regime Geral,Aquisição de serviços,"85100000-0, Serviços de saúde","Unidade Local de Saúde do Norte Alentejano, E. P. E. (508094461)","ROTINA VARIÁVEL, LDA. (513419420)","58.240,00 €",04-08-2017,18-07-2017,245 dias,"Portugal, Portalegre, Portalegre","Artigo 24.º, n.º 1, alínea c) do Código dos Contratos Públicos","","",,"",,Não aplicável.,Não aplicável.,FALSE
Prestação de Serviços Médicos na Especialidade de Pediatria (mai a dez 17),Ajuste Direto Regime Geral,Aquisição de serviços,"85100000-0, Serviços de saúde","Unidade Local de Saúde do Norte Alentejano, E. P. E. (508094461)","Consultório de Pediatria Eugénia Capela, Lda (504212842)","66.560,00 €",03-08-2017,18-06-2017,245 dias,"Portugal, Portalegre, Portalegre","Artigo 24.º, n.º 1, alínea c) do Código dos Contratos Públicos","","",,"",,Não aplicável.,Não aplicável.,FALSE
Prestação de Serviços Médicos na Especialidade de Cirurgia Geral (mai a dez 17),Ajuste Direto Regime Geral,Aquisição de serviços,"85100000-0, Serviços de saúde","Unidade Local de Saúde do Norte Alentejano, E. P. E. (508094461)",GONZALO BECERRIL (283545690),"58.240,00 €",03-08-2017,18-07-2017,245 dias,"Portugal, Portalegre, Portalegre","Artigo 24.º, n.º 1, alínea c) do Código dos Contratos Públicos","","",,"",,Não aplicável.,Não aplicável.,FALSE
Prestação de Serviços de Médicos na Especialidade de Psiquiatria - Jun - Dez 2017,Ajuste Direto Regime Geral,Aquisição de serviços,"85000000-9, Serviços de saúde e acção social","Unidade Local de Saúde do Norte Alentejano, E. P. E. (508094461)",MEDIPEOPLE- LDA (508543436),"33.643,49 €",03-08-2017,18-07-2017,214 dias,"Portugal, Portalegre, Portalegre","Artigo 20.º, n.º 1, alínea a) do Código dos Contratos Públicos","","",,"",,Não aplicável.,Não aplicável.,FALSE
Prestação de Serviços Médicos na Especialidade de Medicina Interna - maio 2017,Ajuste Direto Regime Geral,Aquisição de serviços,"85100000-0, Serviços de saúde","Unidade Local de Saúde do Norte Alentejano, E. P. E. (508094461)",MEDIPEOPLE- LDA (508543436),"12.083,00 €",03-08-2017,18-07-2017,31 dias,"Portugal, Portalegre, Portalegre","Artigo 20.º, n.º 1, alínea a) do Código dos Contratos Públicos","","",,"",,Não aplicável.,Não aplicável.,FALSE
Prestação de Serviços Médicos na Especialidade de Anestesiologia ( Junho a Dezembro ),Ajuste Direto Regime Geral,Aquisição de serviços,"85100000-0, Serviços de saúde","Unidade Local de Saúde do Norte Alentejano, E. P. E. (508094461)",Maria Jesus Figuero Maynair (08844177X),"27.300,00 €",02-08-2017,19-07-2017,214 dias,"Portugal, Portalegre, Elvas","Artigo 24.º, n.º 1, alínea c) do Código dos Contratos Públicos","","",,"",,Não aplicável.,Não aplicável.,FALSE
