freguesia,acronym,validVotesPercentage,votes,dicofre
Covelas,PS,44.81,69,030906
Covelas,PPD/PSD.CDS-PP,32.47,50,030906
Covelas,PCP-PEV,7.79,12,030906
Covelas,MPT,6.49,10,030906
Covelas,PCTP/MRPP,3.25,5,030906
Covelas,B.E.,1.95,3,030906
Covelas,L,1.3,2,030906
Covelas,PAN,0.65,1,030906
Covelas,POUS,0.65,1,030906
Covelas,PPV,0.65,1,030906
Covelas,MAS,0,0,030906
Covelas,PDA,0,0,030906
Covelas,PND,0,0,030906
Covelas,PNR,0,0,030906
Covelas,PPM,0,0,030906
Covelas,PTP,0,0,030906
