Objeto do Contrato,Tipo de Procedimento,Tipo(s) de Contrato,CPVs,Entidade(s) Adjudicante(s),Entidade(s) Adjudicatária(s),Preço Contratual,Data de Publicação,Data de Celebração do Contrato,Prazo de Execução,Local de Execução,Fundamentação,Data de Fecho do Contrato,Preço Total Efetivo,Causas das Alterações ao Prazo,Causas das Alterações ao Preço,Estado,N.º registo do Acordo Quadro,Descrição do Acordo Quadro,Procedimento Centralizado
"Contratualização do Corporate Site License Agreement (CSLA), para aplicações Intergraph do SIADEM",Ajuste Direto Regime Geral,Aquisição de serviços,"72000000-5, Serviços de TI: consultoria, desenvolvimento de software, Internet e apoio","Instituto Nacional de Emergência Médica, I. P. (501356126)","Intergraph (Portugal) – Sistemas de Computação Gráfica, S.A. (502679468)","262.970,42 €",26-03-2018,09-03-2018,365 dias,"Portugal, Portugal Continental","Artigo 24.º, n.º 1, alínea e), subalínea ii) do Código dos Contratos Públicos",,,,,,Não aplicável.,Não aplicável.,FALSE
"Fornecimento de combustíveis rodoviários para o INEM, I.P.",Concurso público,Aquisição de bens móveis,"09000000-3, Produtos petrolíferos, combustíveis, electricidade e outras fontes de energia","Instituto Nacional de Emergência Médica, I. P. (501356126)","Petróleos de Portugal - Petrogal, S.A. (500697370)","881.363,50 €",23-03-2018,01-03-2018,306 dias,"Portugal, Portugal Continental","Artigo 20.º, n.º 1, alínea b) do Código dos Contratos Públicos",,,,,,Não aplicável.,Não aplicável.,TRUE
