freguesia,acronym,validVotesPercentage,votes,dicofre
União das freguesias de Espariz e Sinde,PS,47.14,140,061618
União das freguesias de Espariz e Sinde,PPD/PSD.CDS-PP,31.99,95,061618
União das freguesias de Espariz e Sinde,MPT,9.09,27,061618
União das freguesias de Espariz e Sinde,PCP-PEV,5.05,15,061618
União das freguesias de Espariz e Sinde,B.E.,1.35,4,061618
União das freguesias de Espariz e Sinde,MAS,1.35,4,061618
União das freguesias de Espariz e Sinde,PCTP/MRPP,1.35,4,061618
União das freguesias de Espariz e Sinde,L,0.67,2,061618
União das freguesias de Espariz e Sinde,PND,0.67,2,061618
União das freguesias de Espariz e Sinde,PPM,0.67,2,061618
União das freguesias de Espariz e Sinde,PAN,0.34,1,061618
União das freguesias de Espariz e Sinde,PNR,0.34,1,061618
União das freguesias de Espariz e Sinde,PDA,0,0,061618
União das freguesias de Espariz e Sinde,POUS,0,0,061618
União das freguesias de Espariz e Sinde,PPV,0,0,061618
União das freguesias de Espariz e Sinde,PTP,0,0,061618
