freguesia,acronym,validVotesPercentage,votes,dicofre
Gafanha da Nazaré,PPD/PSD.CDS-PP,38.84,1350,011006
Gafanha da Nazaré,PS,24.68,858,011006
Gafanha da Nazaré,MPT,12.37,430,011006
Gafanha da Nazaré,PCP-PEV,7.83,272,011006
Gafanha da Nazaré,B.E.,6.13,213,011006
Gafanha da Nazaré,L,2.19,76,011006
Gafanha da Nazaré,PAN,2.07,72,011006
Gafanha da Nazaré,PCTP/MRPP,1.24,43,011006
Gafanha da Nazaré,PTP,1.09,38,011006
Gafanha da Nazaré,PND,0.78,27,011006
Gafanha da Nazaré,PNR,0.78,27,011006
Gafanha da Nazaré,PPM,0.69,24,011006
Gafanha da Nazaré,MAS,0.58,20,011006
Gafanha da Nazaré,PPV,0.52,18,011006
Gafanha da Nazaré,PDA,0.14,5,011006
Gafanha da Nazaré,POUS,0.09,3,011006
