Objeto do Contrato,Tipo de Procedimento,Tipo(s) de Contrato,CPVs,Entidade(s) Adjudicante(s),Entidade(s) Adjudicatária(s),Preço Contratual,Data de Publicação,Data de Celebração do Contrato,Prazo de Execução,Local de Execução,Fundamentação,Data de Fecho do Contrato,Preço Total Efetivo,Causas das Alterações ao Prazo,Causas das Alterações ao Preço,Estado,N.º registo do Acordo Quadro,Descrição do Acordo Quadro,Procedimento Centralizado
Aquisição de serviços de alojamento para  quatro bastidores,Ajuste Direto Regime Geral,Outros Tipos (Concessão de exploração de bens do domínio público),"72810000-1, Serviços de auditoria informática","SPMS - Serviços Partilhados do Ministério da Saúde, E. P. E. (509540716)","Claranet Portugal, Telecomunicaçãoes, S.A. (503412031)","50.000,00 €",05-12-2016,14-11-2016,46 dias,Portugal,"Artigo 20.º, n.º 1, alínea a) do Código dos Contratos Públicos",31-12-2016,"50.000,00 €",,,,Não aplicável.,Não aplicável.,FALSE
Aquisição de mobiliário,Ajuste Direto Regime Geral,Aquisição de bens móveis,"39000000-2, Mobiliário (incl. de escritório), acessórios, aparelhos domésticos (excl. iluminação) e produtos de limpeza","SPMS - Serviços Partilhados do Ministerio da Saude, E.P.E. (509540716)","Leite Gonçalves & Gonçalves, Lda (502613998)","68.122,00 €",05-12-2016,10-11-2016,60 dias,Portugal,"Artigo 20.º, n.º 1, alínea a) do Código dos Contratos Públicos",31-12-2016,"68.122,00 €",,,,Não aplicável.,Não aplicável.,FALSE
Aquisição de serviços de desenvolvimento de base de dados,Ajuste Direto Regime Geral,Aquisição de serviços,"72320000-4, Serviços relacionados com bases de dados","SPMS - Serviços Partilhados do Ministerio da Saude, E.P.E. (509540716)","Vortal - Comércio Eletrónico, Consultadoria e Multimédia, S.A. (505141019)","9.900,00 €",05-12-2016,26-10-2016,65 dias,Portugal,"Artigo 20.º, n.º 1, alínea a) do Código dos Contratos Públicos",31-12-2016,"9.900,00 €",,,,Não aplicável.,Não aplicável.,FALSE
Aquisição de serviços de outsourcing da infraestrutura FHS,Ajuste Direto Regime Geral,Outros Tipos (Concessão de exploração de bens do domínio público),"72514300-4, Serviços de gestão de instalações para manutenção de sistemas informáticos","SPMS- Serviços Partilhados do M. da Saúde, E.P.E. (509540716)","Inok Consulting, SA (506245454)","34.999,20 €",05-12-2016,08-11-2016,52 dias,Portugal,"Artigo 20.º, n.º 1, alínea a) do Código dos Contratos Públicos",31-12-2016,"34.999,20 €",,,,Não aplicável.,Não aplicável.,FALSE
Aquisição de serviços de manutenção de equipamento ORACLE,Concurso público,Aquisição de serviços,"72267000-4, Serviços de manutenção e reparação de software","SPMS - Serviços Partilhados do Ministério da Saúde, E. P. E. (509540716)","NORMÁTICA - Serviços de Informática e Organização, S.A (501782230)","325.732,00 €",05-12-2016,17-11-2016,286 dias,Portugal,"Artigo 21.º, n.º 1, alínea b) do Código dos Contratos Públicos",31-08-2017,"325.732,00 €",,,,Não aplicável.,Não aplicável.,FALSE
Aquisição de serviços para apoio à àrea da comunicação e relações públicas,Concurso público,Aquisição de serviços,"79400000-8, Serviços de consultoria em matéria comercial e de gestão e serviços conexos","SPMS - Serviços Partilhados do Ministério da Saúde, E. P. E. (509540716)","Solidnetworks Business Consulting, Lda. (508991579)","79.371,20 €",05-12-2016,25-10-2016,365 dias,Portugal,"Artigo 21.º, n.º 1, alínea b) do Código dos Contratos Públicos","","",,,,Não aplicável.,Não aplicável.,FALSE
Aquisição de serviços de parametrização do módulo de agregação de necessidades,Ajuste Direto Regime Geral,Aquisição de serviços,"79420000-4, Serviços relacionados com a gestão","SPMS - Serviços Partilhados do Ministerio da Saude, E.P.E. (509540716)","Vortal - Comércio Eletrónico, Consultadoria e Multimédia, S.A. (505141019)","24.990,00 €",05-12-2016,07-11-2016,60 dias,Portugal,"Artigo 20.º, n.º 1, alínea a) do Código dos Contratos Públicos",31-12-2016,"24.990,00 €",,,,Não aplicável.,Não aplicável.,FALSE
Aquisição de serviços de Apoio ao Programa de Gestão de Competências do eSIS,Ajuste Direto Regime Geral,Aquisição de serviços,"72500000-0, Serviços relacionados com a informática","SPMS- Serviços Partilhados do M. da Saúde, E.P.E. (509540716)",FINDMORE (508823617),"9.600,00 €",05-12-2016,07-11-2016,90 dias,Portugal,"Artigo 20.º, n.º 1, alínea a) do Código dos Contratos Públicos","","",,,,Não aplicável.,Não aplicável.,FALSE
Aquisição de serviços de assessoria jurídica especializada para patrocínio judicial em representação da SPMS,Ajuste Direto Regime Geral,Aquisição de serviços,"79111000-5, Serviços de assessoria jurídica","SPMS - Serviços Partilhados do Ministério da Saúde, E. P. E. (509540716)",SÉRVULO & ASSOCIADOS - Sociedade de (504344285),"10.000,00 €",05-12-2016,11-11-2016,81 dias,Portugal,"Artigo 24.º, n.º 1, alínea e) do Código dos Contratos Públicos",31-12-2016,"10.000,00 €",,,,Não aplicável.,Não aplicável.,FALSE
Aquisição serviços de consultadoria e apoio técnico para a Infraestrutura do projeto SONHO V2,Ajuste Direto Regime Geral,Aquisição de serviços,"72250000-2, Serviços de sistemas e de apoio","SPMS- Serviços Partilhados do M. da Saúde, E.P.E. (509540716)","ORAMIX SISTEMAS INFORMAÇÃO, S.A. (504448382)","61.200,00 €",05-12-2016,02-11-2016,90 dias,Portugal,"Artigo 20.º, n.º 1, alínea a) do Código dos Contratos Públicos",08-02-2017,"61.200,00 €",,,,Não aplicável.,Não aplicável.,FALSE
Aquisição de serviços de Higiene e Limpeza para as instalações da SPMS,Ao abrigo de acordo-quadro (art.º 259.º),Aquisição de serviços,"90910000-9, Serviços de limpeza","SPMS- Serviços Partilhados do M. da Saúde, E.P.E. (509540716)",CLECE SA (513789995),"99.598,16 €",05-12-2016,31-10-2016,365 dias,Portugal,Artigo 259.º do Código dos Contratos Públicos,01-11-2017,"99.598,16 €",,,,614429,Acordo quadro para higiene e limpeza,FALSE
