freguesia,acronym,validVotesPercentage,votes,dicofre
Moreira de Rei,PS,63.82,97,091312
Moreira de Rei,PPD/PSD.CDS-PP,32.24,49,091312
Moreira de Rei,MPT,1.97,3,091312
Moreira de Rei,B.E.,0.66,1,091312
Moreira de Rei,PPM,0.66,1,091312
Moreira de Rei,PPV,0.66,1,091312
Moreira de Rei,L,0,0,091312
Moreira de Rei,MAS,0,0,091312
Moreira de Rei,PAN,0,0,091312
Moreira de Rei,PCP-PEV,0,0,091312
Moreira de Rei,PCTP/MRPP,0,0,091312
Moreira de Rei,PDA,0,0,091312
Moreira de Rei,PND,0,0,091312
Moreira de Rei,PNR,0,0,091312
Moreira de Rei,POUS,0,0,091312
Moreira de Rei,PTP,0,0,091312
