freguesia,acronym,validVotesPercentage,votes,dicofre
Meãs do Campo,PS,42.52,179,061006
Meãs do Campo,PPD/PSD.CDS-PP,30.88,130,061006
Meãs do Campo,MPT,8.55,36,061006
Meãs do Campo,PCP-PEV,8.55,36,061006
Meãs do Campo,B.E.,3.33,14,061006
Meãs do Campo,PCTP/MRPP,2.14,9,061006
Meãs do Campo,PND,0.95,4,061006
Meãs do Campo,PTP,0.71,3,061006
Meãs do Campo,L,0.48,2,061006
Meãs do Campo,PAN,0.48,2,061006
Meãs do Campo,PDA,0.48,2,061006
Meãs do Campo,PNR,0.48,2,061006
Meãs do Campo,MAS,0.24,1,061006
Meãs do Campo,POUS,0.24,1,061006
Meãs do Campo,PPM,0,0,061006
Meãs do Campo,PPV,0,0,061006
