Objeto do Contrato,Tipo de Procedimento,Tipo(s) de Contrato,CPVs,Entidade(s) Adjudicante(s),Entidade(s) Adjudicatária(s),Preço Contratual,Data de Publicação,Data de Celebração do Contrato,Prazo de Execução,Local de Execução,Fundamentação,Data de Fecho do Contrato,Preço Total Efetivo,Causas das Alterações ao Prazo,Causas das Alterações ao Preço,Estado,N.º registo do Acordo Quadro,Descrição do Acordo Quadro,Procedimento Centralizado
"Prestação de Serviços para Manutenção dos Espaços Verdes no HDFF, EPE",Ajuste Direto Regime Geral,Aquisição de serviços,"77310000-6, Serviços de plantação e manutenção de áreas verdes","Hospital Distrital da Figueira da Foz, EPE (506361527)",Biocombo (509230695),"4.320,00 €",28-12-2016,01-10-2015,365 dias,"Portugal, Coimbra, Figueira da Foz","Artigo 20.º, n.º 1, alínea a) do Código dos Contratos Públicos",,,,,,Não aplicável.,Não aplicável.,FALSE
"Avaliação de imóveis afetos ao HDFF, EPE ",Ajuste Direto Regime Geral,Aquisição de serviços,"70100000-2, Serviços imobiliários relacionados com bens imóveis próprios","HOSPITAL DISTRITAL FIGUEIRA FOZ, EPE (506361527)","CPU - CONSULTORES DE AVALIAÇÃO, LDA (502827505)","1.900,00 €",28-12-2016,27-05-2016,30 dias,"Portugal, Coimbra, Figueira da Foz","Artigo 20.º, n.º 1, alínea a) do Código dos Contratos Públicos",,,,,,Não aplicável.,Não aplicável.,FALSE
Aquisição de histeroscópios,Ajuste Direto Regime Geral,Aquisição de bens móveis,"33100000-1, Equipamento médico","Hospital Distrital Figueira da Foz, E.P.E. (506361527)","OLYMPUS IBERIA, S.A.U. (980474710)","5.000,00 €",28-12-2016,06-10-2016,365 dias,"Portugal, Coimbra, Figueira da Foz","Artigo 20.º, n.º 1, alínea a) do Código dos Contratos Públicos",,,,,,Não aplicável.,Não aplicável.,FALSE
