freguesia,acronym,validVotesPercentage,votes,dicofre
Mentrestido,PS,39.33,35,161009
Mentrestido,PPD/PSD,28.09,25,161009
Mentrestido,CDS-PP,11.24,10,161009
Mentrestido,B.E.,7.87,7,161009
Mentrestido,PAN,4.49,4,161009
Mentrestido,NC,2.25,2,161009
Mentrestido,PCTP/MRPP,2.25,2,161009
Mentrestido,A,1.12,1,161009
Mentrestido,IL,1.12,1,161009
Mentrestido,L,1.12,1,161009
Mentrestido,PNR,1.12,1,161009
Mentrestido,MAS,0,0,161009
Mentrestido,PCP-PEV,0,0,161009
Mentrestido,PDR,0,0,161009
Mentrestido,PPM.PPV/CDC,0,0,161009
Mentrestido,PTP,0,0,161009
Mentrestido,PURP,0,0,161009
