Objeto do Contrato,Tipo de Procedimento,Tipo(s) de Contrato,CPVs,Entidade(s) Adjudicante(s),Entidade(s) Adjudicatária(s),Preço Contratual,Data de Publicação,Data de Celebração do Contrato,Prazo de Execução,Local de Execução,Fundamentação,Data de Fecho do Contrato,Preço Total Efetivo,Causas das Alterações ao Prazo,Causas das Alterações ao Preço,Estado,N.º registo do Acordo Quadro,Descrição do Acordo Quadro,Procedimento Centralizado
Aquisição de gases medicinais até maio 2016,Ajuste Direto Regime Geral,Aquisição de bens móveis,"33000000-0, Equipamento médico, medicamentos e produtos para cuidados pessoais","Unidade Local de Saúde do Norte Alentejano, E. P. E. (508094461)",Air Liquide (501576436),"117.391,23 €",19-02-2016,03-02-2016,160 dias,"Portugal, Portalegre","Artigo 24.º, n.º 1, alínea e) do Código dos Contratos Públicos","","",,,,Não aplicável.,Não aplicável.,FALSE
Aquisição Material Drogaria P/ Armazéns HDJMG e HSLE 2016,Ajuste Direto Regime Geral,Aquisição de bens móveis,"44000000-0, Estruturas e materiais de construção; produtos auxiliares de construção (excepto aparelhos eléctricos)","Unidade Local de Saúde do Norte Alentejano, E. P. E. (508094461)",Grilo (502536284),"5.702,85 €",18-02-2016,16-02-2016,365 dias,"Portugal, Portalegre, Portalegre","Artigo 20.º, n.º 1, alínea a) do Código dos Contratos Públicos","","",,,,Não aplicável.,Não aplicável.,FALSE
"Aquisição de Sacos e Cintas de Plástico, para a ULASNA, EPE ano 2016",Ajuste Direto Regime Geral,Aquisição de bens móveis,"19520000-7, Produtos de plástico","Unidade Local de Saúde do N. Alentejano,EPE(ULSNA) (508094461)",MANUEL DE SOUSA LOPES SA (500181110),"1.294,50 €",18-02-2016,15-12-2015,365 dias,"Portugal, Portalegre","Artigo 20.º, n.º 1, alínea a) do Código dos Contratos Públicos",18-02-2016,"1.294,50 €",,,,Não aplicável.,Não aplicável.,FALSE
"Aquisição de Sacos e Cintas de Plástico, para a ULSNA, EPE ano 2016",Ajuste Direto Regime Geral,Aquisição de bens móveis,"19520000-7, Produtos de plástico","Unidade Local de Saúde do N. Alentejano,EPE(ULSNA) (508094461)",PLASTICOLORES TRANSFORMACAO MATERIAS PLASTICAS (504183346),"34.815,00 €",18-02-2016,15-12-2015,365 dias,"Portugal, Portalegre","Artigo 20.º, n.º 1, alínea a) do Código dos Contratos Públicos",18-02-2016,"34.815,00 €",,,,Não aplicável.,Não aplicável.,FALSE
"Aquisição de diversos modelos e impressos, para a ULSNA, EPE - Ano 2016",Ajuste Direto Regime Geral,Aquisição de bens móveis,"22900000-9, Material impresso diverso","Unidade Local de Saúde do Norte Alentejano, E. P. E. (508094461)","ENVELOPRINTER, LDA (508469830)","5.418,97 €",18-02-2016,20-01-2016,365 dias,"Portugal, Portalegre","Artigo 20.º, n.º 1, alínea a) do Código dos Contratos Públicos",18-02-2016,"5.418,97 €",,,,Não aplicável.,Não aplicável.,FALSE
Medicamentos,Ajuste Direto Regime Geral,Aquisição de bens móveis,"33000000-0, Equipamento médico, medicamentos e produtos para cuidados pessoais","Unidade Local de Saúde do Norte Alentejano, E. P. E. (508094461)","SANOFI- PRODUTOS FARMACÊUTICOS,LDA. (500134960)","5.367,02 €",17-02-2016,02-02-2016,30 dias,"Portugal, Portalegre, Portalegre<BR/>Portugal, Portalegre, Elvas","Artigo 20.º, n.º 1, alínea a) do Código dos Contratos Públicos","","",,,,Não aplicável.,Não aplicável.,FALSE
Medicamentos,Ajuste Direto Regime Geral,Aquisição de bens móveis,"33000000-0, Equipamento médico, medicamentos e produtos para cuidados pessoais","Unidade Local de Saúde do Norte Alentejano, E. P. E. (508094461)","NOVARTIS FARMA-PROD.FARMACÊUTICOS,SA. (500063524)","8.760,84 €",17-02-2016,02-02-2016,30 dias,"Portugal, Portalegre, Portalegre<BR/>Portugal, Portalegre, Elvas","Artigo 20.º, n.º 1, alínea a) do Código dos Contratos Públicos",02-02-2016,"8.760,84 €",,,,Não aplicável.,Não aplicável.,FALSE
Medicamentos,Ajuste Direto Regime Geral,Aquisição de bens móveis,"33000000-0, Equipamento médico, medicamentos e produtos para cuidados pessoais","Unidade Local de Saúde do Norte Alentejano, E. P. E. (508094461)",MERCK SHARP DOHME (500191360),"6.247,16 €",17-02-2016,02-02-2016,30 dias,"Portugal, Portalegre, Elvas<BR/>Portugal, Portalegre, Portalegre","Artigo 20.º, n.º 1, alínea a) do Código dos Contratos Públicos",02-02-2016,"6.247,16 €",,,,Não aplicável.,Não aplicável.,FALSE
"Prestação de Serviços Médicos na Especialidade de Medicina Interna, na ULSNA, EPE (Janeiro a Maio de 2016)",Ajuste Direto Regime Geral,Aquisição de serviços,"85100000-0, Serviços de saúde","Unidade Local de Saúde do Norte Alentejano, E. P. E. (508094461)",Luis Manuel Barrena Santana (274980827),"35.100,00 €",11-02-2016,22-01-2016,152 dias,"Portugal, Portalegre, Portalegre","Artigo 24.º, n.º 1, alínea a) do Código dos Contratos Públicos",22-01-2016,"35.100,00 €",,,,Não aplicável.,Não aplicável.,FALSE
"Prestação de Serviços Médicos na triagem Pediátrica do HDJMG, na ULSNA, EPE (Janeiro e Fevereiro de 2016)",Ajuste Direto Regime Geral,Aquisição de serviços,"85100000-0, Serviços de saúde","Unidade Local de Saúde do Norte Alentejano, E. P. E. (508094461)","Zamudio, Ariza e Gonzalez Lda (513071229)","24.000,00 €",11-02-2016,20-01-2016,60 dias,"Portugal, Portalegre, Portalegre","Artigo 24.º, n.º 1, alínea c) do Código dos Contratos Públicos",20-01-2016,"24.000,00 €",,,,Não aplicável.,Não aplicável.,FALSE
"AQUISIÇÃO DE ANALISES CLINICAS AO EXTERIOR PARA A ULSNA,EPE",Concurso público,Aquisição de serviços,"85100000-0, Serviços de saúde","Unidade Local de Saúde do Norte Alentejano, E. P. E. (508094461)","Dr Joaquim Chaves, Laboratorio de Analises Clinicas (500753636)","78.200,27 €",11-02-2016,26-01-2016,365 dias,"Portugal, Portalegre","Artigo 20.º, n.º 1, alínea b) do Código dos Contratos Públicos","","",,,,Não aplicável.,Não aplicável.,FALSE
"Prestação de Serviços Médicos na Especialidade de Medicina no Trabalho na ULSNA, EPE",Concurso público,Aquisição de serviços,"85100000-0, Serviços de saúde","Unidade Local de Saúde do Norte Alentejano, E. P. E. (508094461)","PONLUFI, Lda. (502465000)","45.465,00 €",11-02-2016,04-02-2016,306 dias,"Portugal, Portalegre, Portalegre","Artigo 20.º, n.º 1, alínea b) do Código dos Contratos Públicos",11-02-2016,"45.465,00 €",,,,Não aplicável.,Não aplicável.,FALSE
"Prestação de Serviços Médicos na Unidade de Cuidados Paliativos na ULSNA, EPE",Concurso público,Aquisição de serviços,"85100000-0, Serviços de saúde","Unidade Local de Saúde do Norte Alentejano, E. P. E. (508094461)","PONLUFI, Lda. (502465000)","70.146,00 €",11-02-2016,04-02-2016,306 dias,"Portugal, Portalegre, Portalegre","Artigo 20.º, n.º 1, alínea b) do Código dos Contratos Públicos",11-02-2016,"70.146,00 €",,,,Não aplicável.,Não aplicável.,FALSE
