freguesia,acronym,validVotesPercentage,votes,dicofre
Santa Cruz da Graciosa,PS,57.48,196,440104
Santa Cruz da Graciosa,PPD/PSD.CDS-PP,27.57,94,440104
Santa Cruz da Graciosa,MPT,4.69,16,440104
Santa Cruz da Graciosa,B.E.,2.05,7,440104
Santa Cruz da Graciosa,PCP-PEV,2.05,7,440104
Santa Cruz da Graciosa,L,1.76,6,440104
Santa Cruz da Graciosa,PCTP/MRPP,1.47,5,440104
Santa Cruz da Graciosa,PDA,1.17,4,440104
Santa Cruz da Graciosa,PND,0.59,2,440104
Santa Cruz da Graciosa,PTP,0.59,2,440104
Santa Cruz da Graciosa,MAS,0.29,1,440104
Santa Cruz da Graciosa,PAN,0.29,1,440104
Santa Cruz da Graciosa,PNR,0,0,440104
Santa Cruz da Graciosa,POUS,0,0,440104
Santa Cruz da Graciosa,PPM,0,0,440104
Santa Cruz da Graciosa,PPV,0,0,440104
