Objeto do Contrato,Tipo de Procedimento,Tipo(s) de Contrato,CPVs,Entidade(s) Adjudicante(s),Entidade(s) Adjudicatária(s),Preço Contratual,Data de Publicação,Data de Celebração do Contrato,Prazo de Execução,Local de Execução,Fundamentação,Data de Fecho do Contrato,Preço Total Efetivo,Causas das Alterações ao Prazo,Causas das Alterações ao Preço,Estado,N.º registo do Acordo Quadro,Descrição do Acordo Quadro,Procedimento Centralizado
90022616 - AD para Aquisição de Reagentes,Ajuste Direto Regime Geral,Aquisição de bens móveis,"33696000-5, Reagentes e meios de contraste","Centro Hospitalar Vila Nova de Gaia - Espinho, E. P. E. (508142156)","Siemens Health Care Diagnostics, Unip., Lda (507925173)","3.000,00 €",08-01-2016,08-01-2016,90 dias,"Portugal, Porto, Vila Nova de Gaia","Artigo 24.º, n.º 1, alínea c) do Código dos Contratos Públicos",,,,,,Não aplicável.,Não aplicável.,FALSE
90022516 - AD para Aquisição de Reagente (Sistema de Cal Sodada para Ventilador),Ajuste Direto Regime Geral,Aquisição de bens móveis,"33696000-5, Reagentes e meios de contraste","Centro Hospitalar Vila Nova de Gaia - Espinho, E. P. E. (508142156)","Drager Portugal, Lda (508771323)","2.700,00 €",08-01-2016,08-01-2016,30 dias,"Portugal, Porto, Vila Nova de Gaia","Artigo 24.º, n.º 1, alínea c) do Código dos Contratos Públicos",,,,,,Não aplicável.,Não aplicável.,FALSE
90020916 - AD para Aquisição de Reagentes para Imunohemoterapia,Ajuste Direto Regime Geral,Aquisição de bens móveis,"33696000-5, Reagentes e meios de contraste","Centro Hospitalar Vila Nova de Gaia - Espinho, E. P. E. (508142156)","Quilaban - Quimica Laboratorial Analitica, S.A. (500399670)","17.513,46 €",08-01-2016,08-01-2016,90 dias,"Portugal, Porto, Vila Nova de Gaia","Artigo 24.º, n.º 1, alínea e) do Código dos Contratos Públicos",,,,,,Não aplicável.,Não aplicável.,FALSE
"90020816 - AD para Aquisição de Reagentes, controlos e Calibradores para Equipamento Corelab",Ajuste Direto Regime Geral,Aquisição de bens móveis,"33696000-5, Reagentes e meios de contraste","Centro Hospitalar Vila Nova de Gaia - Espinho, E. P. E. (508142156)","Roche Sistemas de Diagnóstico, Lda (504282921)","49.918,32 €",08-01-2016,08-01-2016,90 dias,"Portugal, Porto, Vila Nova de Gaia","Artigo 24.º, n.º 1, alínea e) do Código dos Contratos Públicos",,,,,,Não aplicável.,Não aplicável.,FALSE
90020716 - AD para Aquisição de Reagentes para Estudo da Coagulação,Ajuste Direto Regime Geral,Aquisição de bens móveis,"33696000-5, Reagentes e meios de contraste","Centro Hospitalar Vila Nova de Gaia - Espinho, E. P. E. (508142156)","Stago Portugal Unipessoal, Lda (509952976)","36.272,48 €",08-01-2016,08-01-2016,90 dias,"Portugal, Porto, Vila Nova de Gaia","Artigo 24.º, n.º 1, alínea e) do Código dos Contratos Públicos",,,,,,Não aplicável.,Não aplicável.,FALSE
90020616 - AD para Aquisição de Reagentes para Estudo da Coagulação,Ajuste Direto Regime Geral,Aquisição de bens móveis,"33696000-5, Reagentes e meios de contraste","Centro Hospitalar Vila Nova de Gaia - Espinho, E. P. E. (508142156)","Stago Portugal Unipessoal, Lda (509952976)","47.995,09 €",08-01-2016,08-01-2016,90 dias,"Portugal, Porto, Vila Nova de Gaia","Artigo 24.º, n.º 1, alínea e) do Código dos Contratos Públicos",,,,,,Não aplicável.,Não aplicável.,FALSE
90020516 - AD para Aquisição de Diversos Reagentes (Stago),Ajuste Direto Regime Geral,Aquisição de bens móveis,"33696000-5, Reagentes e meios de contraste","Centro Hospitalar Vila Nova de Gaia - Espinho, E. P. E. (508142156)","Stago Portugal Unipessoal, Lda (509952976)","39.932,05 €",08-01-2016,08-01-2016,90 dias,"Portugal, Porto, Vila Nova de Gaia","Artigo 24.º, n.º 1, alínea e) do Código dos Contratos Públicos",,,,,,Não aplicável.,Não aplicável.,FALSE
90020416 - AD para Aquisição de Anticorpo Pré-Diluido,Ajuste Direto Regime Geral,Aquisição de bens móveis,"33696000-5, Reagentes e meios de contraste","Centro Hospitalar Vila Nova de Gaia - Espinho, E. P. E. (508142156)","Roche Sistemas de Diagnóstico, Lda (504282921)","29.200,00 €",08-01-2016,08-01-2016,90 dias,"Portugal, Porto, Vila Nova de Gaia","Artigo 24.º, n.º 1, alínea e) do Código dos Contratos Públicos",,,,,,Não aplicável.,Não aplicável.,FALSE
90020316 - AD para Aquisição de Diversos Reagentes,Ajuste Direto Regime Geral,Aquisição de bens móveis,"33696000-5, Reagentes e meios de contraste","Centro Hospitalar Vila Nova de Gaia - Espinho, E. P. E. (508142156)",HORIBA ABX - PORTUGAL (980158583),"25.866,31 €",08-01-2016,08-01-2016,90 dias,"Portugal, Porto, Vila Nova de Gaia","Artigo 24.º, n.º 1, alínea e) do Código dos Contratos Públicos",,,,,,Não aplicável.,Não aplicável.,FALSE
90020216 - AD para Aquisição de Reagente(CAP/CTM HIV),Ajuste Direto Regime Geral,Aquisição de bens móveis,"33696000-5, Reagentes e meios de contraste","Centro Hospitalar Vila Nova de Gaia - Espinho, E. P. E. (508142156)","Roche Sistemas de Diagnóstico, Lda (504282921)","49.039,00 €",08-01-2016,08-01-2016,3 dias,"Portugal, Porto, Vila Nova de Gaia","Artigo 24.º, n.º 1, alínea e) do Código dos Contratos Públicos",,,,,,Não aplicável.,Não aplicável.,FALSE
90020116 - AD para Aquisição de Reagentes Laboratório Quimica Clinica,Ajuste Direto Regime Geral,Aquisição de bens móveis,"33696000-5, Reagentes e meios de contraste","Centro Hospitalar Vila Nova de Gaia - Espinho, E. P. E. (508142156)","Roche Sistemas de Diagnóstico, Lda (504282921)","48.945,00 €",08-01-2016,08-01-2016,90 dias,"Portugal, Porto, Vila Nova de Gaia","Artigo 24.º, n.º 1, alínea e) do Código dos Contratos Públicos",,,,,,Não aplicável.,Não aplicável.,FALSE
Diverso Material clinico (B Braun),Ajuste Direto Regime Geral,Aquisição de bens móveis,"33140000-3, Material médico de consumo","Centro Hospitalar Vila Nova de Gaia - Espinho, E. P. E. (508142156)","B. Braun Medica, Lda (501506543)","27.635,05 €",08-01-2016,08-01-2016,90 dias,"Portugal, Porto, Vila Nova de Gaia","Artigo 24.º, n.º 1, alínea c) do Código dos Contratos Públicos",,,,,,Não aplicável.,Não aplicável.,FALSE
Diverso Material clinico (B Braun),Ajuste Direto Regime Geral,Aquisição de bens móveis,"33140000-3, Material médico de consumo","Centro Hospitalar Vila Nova de Gaia - Espinho, E. P. E. (508142156)","B. Braun Medica, Lda (501506543)","25.413,49 €",08-01-2016,08-01-2016,90 dias,"Portugal, Porto, Vila Nova de Gaia","Artigo 24.º, n.º 1, alínea c) do Código dos Contratos Públicos",,,,,,Não aplicável.,Não aplicável.,FALSE
Material p/ Autoclave,Ajuste Direto Regime Geral,Aquisição de bens móveis,"33191110-9, Autoclaves","Centro Hospitalar Vila Nova de Gaia - Espinho, E. P. E. (508142156)","B. Braun Medica, Lda (501506543)","306,20 €",08-01-2016,08-01-2016,10 dias,"Portugal, Porto, Vila Nova de Gaia","Artigo 24.º, n.º 1, alínea c) do Código dos Contratos Públicos",,,,,,Não aplicável.,Não aplicável.,FALSE
90007616 - AD para Aquisição de Reagente (Xpert MRSA Gen),Ajuste Direto Regime Geral,Aquisição de bens móveis,"33696000-5, Reagentes e meios de contraste","Centro Hospitalar Vila Nova de Gaia - Espinho, E. P. E. (508142156)","Werfen Portugal, Lda (501086110)","35.000,00 €",08-01-2016,07-01-2016,30 dias,"Portugal, Porto, Vila Nova de Gaia","Artigo 24.º, n.º 1, alínea c) do Código dos Contratos Públicos",,,,,,Não aplicável.,Não aplicável.,FALSE
90011616 - AD para Aquisição de Reagentes p/ Quimica Clinica,Ajuste Direto Regime Geral,Aquisição de bens móveis,"33696000-5, Reagentes e meios de contraste","Centro Hospitalar Vila Nova de Gaia - Espinho, E. P. E. (508142156)","Roche Sistemas de Diagnóstico, Lda (504282921)","49.684,70 €",08-01-2016,07-01-2016,90 dias,"Portugal, Porto, Vila Nova de Gaia","Artigo 24.º, n.º 1, alínea e) do Código dos Contratos Públicos",,,,,,Não aplicável.,Não aplicável.,FALSE
90019816 - AD para Aquisição de Reagentes,Ajuste Direto Regime Geral,Aquisição de bens móveis,"33696000-5, Reagentes e meios de contraste","Centro Hospitalar Vila Nova de Gaia - Espinho, E. P. E. (508142156)","ALERE, lDA (502518863)","19.228,00 €",08-01-2016,08-01-2016,90 dias,"Portugal, Porto, Vila Nova de Gaia","Artigo 24.º, n.º 1, alínea e) do Código dos Contratos Públicos",,,,,,Não aplicável.,Não aplicável.,FALSE
"Compressas, ligadura e pranchetas",Ajuste Direto Regime Geral,Aquisição de bens móveis,"33141100-1, Pensos; clipes, suturas, ligaduras","Centro Hospitalar Vila Nova de Gaia - Espinho, E. P. E. (508142156)","Albino Dias de Andrade, Lda (ADA) (500013810)","31.025,70 €",08-01-2016,06-01-2016,60 dias,"Portugal, Porto, Vila Nova de Gaia","Artigo 24.º, n.º 1, alínea c) do Código dos Contratos Públicos",,,,,,Não aplicável.,Não aplicável.,FALSE
90019516 - AD para Aquisição de Reagentes para Sysmex,Ajuste Direto Regime Geral,Aquisição de bens móveis,"33696000-5, Reagentes e meios de contraste","Centro Hospitalar Vila Nova de Gaia - Espinho, E. P. E. (508142156)",Emilio Azevedo Campos S.A. (500094853),"2.189,00 €",08-01-2016,08-01-2016,365 dias,"Portugal, Porto, Vila Nova de Gaia","Artigo 24.º, n.º 1, alínea e) do Código dos Contratos Públicos",,,,,,Não aplicável.,Não aplicável.,FALSE
80019416 - AD para Reparação de Lavador de Aparadeiras,Ajuste Direto Regime Geral,Aquisição de serviços,"50800000-3, Serviços de reparação e manutenção diversos","Centro Hospitalar Vila Nova de Gaia - Espinho, E. P. E. (508142156)","Prohs-Equip. Hospitalar e Serviços Associados, SA (505005468)","150,85 €",08-01-2016,08-01-2016,3 dias,"Portugal, Porto, Vila Nova de Gaia","Artigo 24.º, n.º 1, alínea e) do Código dos Contratos Públicos",,,,,,Não aplicável.,Não aplicável.,FALSE
80019316 - AD para Reparação de Lavador de Aparadeiras,Ajuste Direto Regime Geral,Aquisição de serviços,"50800000-3, Serviços de reparação e manutenção diversos","Centro Hospitalar Vila Nova de Gaia - Espinho, E. P. E. (508142156)","Prohs-Equip. Hospitalar e Serviços Associados, SA (505005468)","213,15 €",08-01-2016,08-01-2016,3 dias,"Portugal, Porto, Vila Nova de Gaia","Artigo 24.º, n.º 1, alínea e) do Código dos Contratos Públicos",,,,,,Não aplicável.,Não aplicável.,FALSE
Material Irrecuperável Diverso,Ajuste Direto Regime Geral,Aquisição de bens móveis,"33141000-0, Material médico não químico descartável e produtos hematológicos","Centro Hospitalar Vila Nova de Gaia - Espinho, E. P. E. (508142156)",Intersurgical Portugal Lda. (503480045),"36.956,95 €",08-01-2016,07-01-2016,90 dias,"Portugal, Porto, Vila Nova de Gaia","Artigo 24.º, n.º 1, alínea c) do Código dos Contratos Públicos",,,,,,Não aplicável.,Não aplicável.,FALSE
80019216 - AD para Reparação de Máquina de Lavar e Desinfetar Arrastadeiras,Ajuste Direto Regime Geral,Aquisição de serviços,"50800000-3, Serviços de reparação e manutenção diversos","Centro Hospitalar Vila Nova de Gaia - Espinho, E. P. E. (508142156)","Prohs-Equip. Hospitalar e Serviços Associados, SA (505005468)","335,40 €",08-01-2016,08-01-2016,3 dias,"Portugal, Porto, Vila Nova de Gaia","Artigo 24.º, n.º 1, alínea e) do Código dos Contratos Públicos",,,,,,Não aplicável.,Não aplicável.,FALSE
80019116 - AD para Reparação de Lavador de Aparadeiras,Ajuste Direto Regime Geral,Aquisição de serviços,"50800000-3, Serviços de reparação e manutenção diversos","Centro Hospitalar Vila Nova de Gaia - Espinho, E. P. E. (508142156)","Prohs-Equip. Hospitalar e Serviços Associados, SA (505005468)","45,00 €",08-01-2016,08-01-2016,3 dias,"Portugal, Porto, Vila Nova de Gaia","Artigo 24.º, n.º 1, alínea e) do Código dos Contratos Públicos",,,,,,Não aplicável.,Não aplicável.,FALSE
Material de Protecção,Ajuste Direto Regime Geral,Aquisição de bens móveis,"33140000-3, Material médico de consumo","Centro Hospitalar Vila Nova de Gaia - Espinho, E. P. E. (508142156)",Factor Plus (502810645),"24.125,40 €",08-01-2016,07-01-2016,90 dias,"Portugal, Porto, Vila Nova de Gaia","Artigo 24.º, n.º 1, alínea c) do Código dos Contratos Públicos",,,,,,Não aplicável.,Não aplicável.,FALSE
Batas Estéreis e Não Estéreis,Ajuste Direto Regime Geral,Aquisição de bens móveis,"33199000-1, Vestuário para pessoal médico","Centro Hospitalar Vila Nova de Gaia - Espinho, E. P. E. (508142156)",Factor Plus (502810645),"26.000,00 €",08-01-2016,07-01-2016,60 dias,"Portugal, Porto, Vila Nova de Gaia","Artigo 24.º, n.º 1, alínea c) do Código dos Contratos Públicos",,,,,,Não aplicável.,Não aplicável.,FALSE
Material de Laboratório,Ajuste Direto Regime Geral,Aquisição de bens móveis,"33141000-0, Material médico não químico descartável e produtos hematológicos","Centro Hospitalar Vila Nova de Gaia - Espinho, E. P. E. (508142156)",VACUETTE PORTUGAL S.A. (505348470),"19.374,80 €",08-01-2016,06-01-2016,90 dias,"Portugal, Porto, Vila Nova de Gaia","Artigo 24.º, n.º 1, alínea c) do Código dos Contratos Públicos",,,,,,Não aplicável.,Não aplicável.,FALSE
Material Irrecuperável Diverso,Ajuste Direto Regime Geral,Aquisição de bens móveis,"33141000-0, Material médico não químico descartável e produtos hematológicos","Centro Hospitalar Vila Nova de Gaia - Espinho, E. P. E. (508142156)","VYGON (PORTUGAL), LDA. (503232785)","28.559,47 €",08-01-2016,06-01-2016,90 dias,"Portugal, Porto, Vila Nova de Gaia","Artigo 24.º, n.º 1, alínea c) do Código dos Contratos Públicos",,,,,,Não aplicável.,Não aplicável.,FALSE
80019016 - AD para Reparação de Tesoura de Potts,Ajuste Direto Regime Geral,Aquisição de serviços,"50400000-9, Serviços de reparação e manutenção de equipamento médico e de precisão","Centro Hospitalar Vila Nova de Gaia - Espinho, E. P. E. (508142156)","B. Braun Medica, Lda (501506543)","70,00 €",07-01-2016,07-01-2016,30 dias,"Portugal, Porto, Vila Nova de Gaia","Artigo 24.º, n.º 1, alínea e) do Código dos Contratos Públicos",,,,,,Não aplicável.,Não aplicável.,FALSE
80018916 - AD para Reparação de Tesoura de Disseção Curva,Ajuste Direto Regime Geral,Aquisição de serviços,"50400000-9, Serviços de reparação e manutenção de equipamento médico e de precisão","Centro Hospitalar Vila Nova de Gaia - Espinho, E. P. E. (508142156)","B. Braun Medica, Lda (501506543)","14,80 €",07-01-2016,07-01-2016,30 dias,"Portugal, Porto, Vila Nova de Gaia","Artigo 24.º, n.º 1, alínea e) do Código dos Contratos Públicos",,,,,,Não aplicável.,Não aplicável.,FALSE
80018816 - AD para Reparação de Tesoura,Ajuste Direto Regime Geral,Aquisição de serviços,"50400000-9, Serviços de reparação e manutenção de equipamento médico e de precisão","Centro Hospitalar Vila Nova de Gaia - Espinho, E. P. E. (508142156)","B. Braun Medica, Lda (501506543)","14,80 €",07-01-2016,07-01-2016,30 dias,"Portugal, Porto, Vila Nova de Gaia","Artigo 24.º, n.º 1, alínea e) do Código dos Contratos Públicos",,,,,,Não aplicável.,Não aplicável.,FALSE
80018716 - AD para Reparação de Tesouras de Disseção Curvas,Ajuste Direto Regime Geral,Aquisição de serviços,"50400000-9, Serviços de reparação e manutenção de equipamento médico e de precisão","Centro Hospitalar Vila Nova de Gaia - Espinho, E. P. E. (508142156)","B. Braun Medica, Lda (501506543)","42,00 €",07-01-2016,07-01-2016,30 dias,"Portugal, Porto, Vila Nova de Gaia","Artigo 24.º, n.º 1, alínea e) do Código dos Contratos Públicos",,,,,,Não aplicável.,Não aplicável.,FALSE
80018616 - AD para Reparação de Faca de Enxerto,Ajuste Direto Regime Geral,Aquisição de serviços,"50400000-9, Serviços de reparação e manutenção de equipamento médico e de precisão","Centro Hospitalar Vila Nova de Gaia - Espinho, E. P. E. (508142156)","B. Braun Medica, Lda (501506543)","223,50 €",07-01-2016,07-01-2016,30 dias,"Portugal, Porto, Vila Nova de Gaia","Artigo 24.º, n.º 1, alínea e) do Código dos Contratos Públicos",,,,,,Não aplicável.,Não aplicável.,FALSE
Material de Tubagem e outros,Ajuste Direto Regime Geral,Aquisição de bens móveis,"44000000-0, Estruturas e materiais de construção; produtos auxiliares de construção (excepto aparelhos eléctricos)","Centro Hospitalar Vila Nova de Gaia - Espinho, E. P. E. (508142156)",A.C. OLIVEIRA (502002140),"4.844,00 €",07-01-2016,07-01-2016,10 dias,"Portugal, Porto, Vila Nova de Gaia","Artigo 24.º, n.º 1, alínea c) do Código dos Contratos Públicos",,,,,,Não aplicável.,Não aplicável.,FALSE
80018516 - AD para Reparação de Controlador,Ajuste Direto Regime Geral,Aquisição de serviços,"50800000-3, Serviços de reparação e manutenção diversos","Centro Hospitalar Vila Nova de Gaia - Espinho, E. P. E. (508142156)","EASYCONTROL, LDA (506354547)","396,00 €",07-01-2016,07-01-2016,3 dias,"Portugal, Porto, Vila Nova de Gaia","Artigo 24.º, n.º 1, alínea e) do Código dos Contratos Públicos",,,,,,Não aplicável.,Não aplicável.,FALSE
Filtro p/ Hotte de Extracção,Ajuste Direto Regime Geral,Aquisição de bens móveis,"42514300-5, Aparelhos de filtragem","Centro Hospitalar Vila Nova de Gaia - Espinho, E. P. E. (508142156)",GARAL (500777314),"437,00 €",07-01-2016,07-01-2016,10 dias,"Portugal, Porto, Vila Nova de Gaia","Artigo 24.º, n.º 1, alínea e) do Código dos Contratos Públicos",,,,,,Não aplicável.,Não aplicável.,FALSE
filtro p/ Aparelho de Laminas,Ajuste Direto Regime Geral,Aquisição de bens móveis,"42514310-8, Filtros de ar","Centro Hospitalar Vila Nova de Gaia - Espinho, E. P. E. (508142156)",GARAL (500777314),"154,50 €",07-01-2016,07-01-2016,10 dias,"Portugal, Porto, Vila Nova de Gaia","Artigo 24.º, n.º 1, alínea e) do Código dos Contratos Públicos",,,,,,Não aplicável.,Não aplicável.,FALSE
80018416 - AD para Reparação de Ventilador Anestesia,Ajuste Direto Regime Geral,Aquisição de serviços,"50400000-9, Serviços de reparação e manutenção de equipamento médico e de precisão","Centro Hospitalar Vila Nova de Gaia - Espinho, E. P. E. (508142156)",IBERDATA (501904921),"233,42 €",07-01-2016,07-01-2016,20 dias,"Portugal, Porto, Vila Nova de Gaia","Artigo 24.º, n.º 1, alínea c) do Código dos Contratos Públicos",,,,,,Não aplicável.,Não aplicável.,FALSE
80018316 - AD para Reparação de Ventilador Pulmonar,Ajuste Direto Regime Geral,Aquisição de serviços,"50400000-9, Serviços de reparação e manutenção de equipamento médico e de precisão","Centro Hospitalar Vila Nova de Gaia - Espinho, E. P. E. (508142156)",Iberdata (501904921),"1.355,30 €",07-01-2016,07-01-2016,30 dias,"Portugal, Porto, Vila Nova de Gaia","Artigo 24.º, n.º 1, alínea e) do Código dos Contratos Públicos",,,,,,Não aplicável.,Não aplicável.,FALSE
80018216 - AD para Reparação de Maca,Ajuste Direto Regime Geral,Aquisição de serviços,"50800000-3, Serviços de reparação e manutenção diversos","Centro Hospitalar Vila Nova de Gaia - Espinho, E. P. E. (508142156)",MUNDINTER (500199906),"472,67 €",07-01-2016,07-01-2016,30 dias,"Portugal, Porto, Vila Nova de Gaia","Artigo 24.º, n.º 1, alínea e) do Código dos Contratos Públicos",,,,,,Não aplicável.,Não aplicável.,FALSE
80018116 - AD para Reparação de Maca,Ajuste Direto Regime Geral,Aquisição de serviços,"50800000-3, Serviços de reparação e manutenção diversos","Centro Hospitalar Vila Nova de Gaia - Espinho, E. P. E. (508142156)",MUNDINTER (500199906),"472,67 €",07-01-2016,07-01-2016,30 dias,"Portugal, Porto, Vila Nova de Gaia","Artigo 24.º, n.º 1, alínea e) do Código dos Contratos Públicos",,,,,,Não aplicável.,Não aplicável.,FALSE
80012916 - AD para Reparação de Mesa de Comando,Ajuste Direto Regime Geral,Aquisição de serviços,"50800000-3, Serviços de reparação e manutenção diversos","Centro Hospitalar Vila Nova de Gaia - Espinho, E. P. E. (508142156)","GRUPO TAPER-Equipamentos de precisão cient., Ldª (506886336)","150,00 €",07-01-2016,07-01-2016,30 dias,"Portugal, Porto, Vila Nova de Gaia","Artigo 24.º, n.º 1, alínea e) do Código dos Contratos Públicos",,,,,,Não aplicável.,Não aplicável.,FALSE
80012816 - AD para Reparação de Punch,Ajuste Direto Regime Geral,Aquisição de serviços,"50400000-9, Serviços de reparação e manutenção de equipamento médico e de precisão","Centro Hospitalar Vila Nova de Gaia - Espinho, E. P. E. (508142156)","B. Braun Medica, Lda (501506543)","431,60 €",07-01-2016,07-01-2016,10 dias,"Portugal, Porto, Vila Nova de Gaia","Artigo 24.º, n.º 1, alínea e) do Código dos Contratos Públicos",,,,,,Não aplicável.,Não aplicável.,FALSE
80012716 - AD para Reparação de Porta Automática,Ajuste Direto Regime Geral,Aquisição de serviços,"50800000-3, Serviços de reparação e manutenção diversos","Centro Hospitalar Vila Nova de Gaia - Espinho, E. P. E. (508142156)","PORTMANU - Portas Automáticas, Lda (Manusa) (509477526)","130,40 €",07-01-2016,07-01-2016,3 dias,"Portugal, Porto, Vila Nova de Gaia","Artigo 24.º, n.º 1, alínea c) do Código dos Contratos Públicos",,,,,,Não aplicável.,Não aplicável.,FALSE
80012616 - AD para Reparação de Endoscópio,Ajuste Direto Regime Geral,Aquisição de serviços,"50400000-9, Serviços de reparação e manutenção de equipamento médico e de precisão","Centro Hospitalar Vila Nova de Gaia - Espinho, E. P. E. (508142156)","OLYMPUS IBÉRIA, S.A.U. - Suc. em Portugal (980474710)","803,96 €",07-01-2016,07-01-2016,20 dias,"Portugal, Porto, Vila Nova de Gaia","Artigo 24.º, n.º 1, alínea e) do Código dos Contratos Públicos",,,,,,Não aplicável.,Não aplicável.,FALSE
80012516 - AD para Reparação de Punch,Ajuste Direto Regime Geral,Aquisição de serviços,"50400000-9, Serviços de reparação e manutenção de equipamento médico e de precisão","Centro Hospitalar Vila Nova de Gaia - Espinho, E. P. E. (508142156)",B Braun Medical (501506543),"215,80 €",07-01-2016,07-01-2016,15 dias,"Portugal, Porto, Vila Nova de Gaia","Artigo 24.º, n.º 1, alínea e) do Código dos Contratos Públicos",,,,,,Não aplicável.,Não aplicável.,FALSE
80012416 - AD para Reparação de Maca,Ajuste Direto Regime Geral,Aquisição de serviços,"50800000-3, Serviços de reparação e manutenção diversos","Centro Hospitalar Vila Nova de Gaia - Espinho, E. P. E. (508142156)",MUNDINTER (500199906),"475,95 €",07-01-2016,07-01-2016,30 dias,"Portugal, Porto, Vila Nova de Gaia","Artigo 24.º, n.º 1, alínea c) do Código dos Contratos Públicos",,,,,,Não aplicável.,Não aplicável.,FALSE
80012316 - AD para Reparação de Maca,Ajuste Direto Regime Geral,Aquisição de serviços,"50800000-3, Serviços de reparação e manutenção diversos","Centro Hospitalar Vila Nova de Gaia - Espinho, E. P. E. (508142156)",MUNDINTER (500199906),"308,42 €",07-01-2016,07-01-2016,30 dias,"Portugal, Porto, Vila Nova de Gaia","Artigo 24.º, n.º 1, alínea e) do Código dos Contratos Públicos",,,,,,Não aplicável.,Não aplicável.,FALSE
80012216 - AD para Manutenção de Aparelho de Crioterapia,Ajuste Direto Regime Geral,Aquisição de serviços,"50000000-5, Serviços de reparação e manutenção","Centro Hospitalar Vila Nova de Gaia - Espinho, E. P. E. (508142156)",OFTALDATA (504887459),"487,00 €",07-01-2016,07-01-2016,3 dias,"Portugal, Porto, Vila Nova de Gaia","Artigo 24.º, n.º 1, alínea e) do Código dos Contratos Públicos",,,,,,Não aplicável.,Não aplicável.,FALSE
80012116 - AD para Reparação de Peça de Mão,Ajuste Direto Regime Geral,Aquisição de serviços,"50800000-3, Serviços de reparação e manutenção diversos","Centro Hospitalar Vila Nova de Gaia - Espinho, E. P. E. (508142156)","B. Braun Medica, Lda (501506543)","598,80 €",07-01-2016,07-01-2016,10 dias,"Portugal, Porto, Vila Nova de Gaia","Artigo 24.º, n.º 1, alínea e) do Código dos Contratos Públicos",,,,,,Não aplicável.,Não aplicável.,FALSE
90012016 - AD para Aquisição de Pesquisa de Drogas de Abuso na Urina 12 Drogas,Ajuste Direto Regime Geral,Aquisição de bens móveis,"33696000-5, Reagentes e meios de contraste","Centro Hospitalar Vila Nova de Gaia - Espinho, E. P. E. (508142156)","Bioportugal - Químico e Farmacêutica, Lda (502380543)","9.240,00 €",07-01-2016,07-01-2016,90 dias,"Portugal, Porto, Vila Nova de Gaia","Artigo 24.º, n.º 1, alínea c) do Código dos Contratos Públicos",,,,,,Não aplicável.,Não aplicável.,FALSE
90011916 - AD para Aquisição de Reagente (Finn Chambers),Ajuste Direto Regime Geral,Aquisição de bens móveis,"33696000-5, Reagentes e meios de contraste","Centro Hospitalar Vila Nova de Gaia - Espinho, E. P. E. (508142156)","DERMIS - Produtos de Saúde, S.A. (507988990)","500,00 €",07-01-2016,07-01-2016,3 dias,"Portugal, Porto, Vila Nova de Gaia","Artigo 24.º, n.º 1, alínea c) do Código dos Contratos Públicos",,,,,,Não aplicável.,Não aplicável.,FALSE
Haloperidol 5 mg/1 ml Sol inj Fr 1 ml IM IV,Ajuste Direto Regime Geral,Aquisição de bens móveis,"33600000-6, Produtos farmacêuticos","Centro Hospitalar Vila Nova de Gaia - Espinho, E. P. E. (508142156)","RATIOPHARM, LDA (502414910)","1.776,00 €",07-01-2016,07-01-2016,60 dias,"Portugal, Porto, Vila Nova de Gaia","Artigo 24.º, n.º 1, alínea e) do Código dos Contratos Públicos",,,,,,Não aplicável.,Não aplicável.,FALSE
Trastuzumab emtansina 100 mg Pó conc sol inj Fr IV,Ajuste Direto Regime Geral,Aquisição de bens móveis,"33600000-6, Produtos farmacêuticos","Centro Hospitalar Vila Nova de Gaia - Espinho, E. P. E. (508142156)","ROCHE Farmacêutica Quimica, Lda (500233810)","5.065,50 €",07-01-2016,07-01-2016,1 dias,"Portugal, Porto, Vila Nova de Gaia","Artigo 24.º, n.º 1, alínea e) do Código dos Contratos Públicos",,,,,,Não aplicável.,Não aplicável.,FALSE
Dolutegravir 50mg comp,Ajuste Direto Regime Geral,Aquisição de bens móveis,"33600000-6, Produtos farmacêuticos","Centro Hospitalar Vila Nova de Gaia - Espinho, E. P. E. (508142156)","VIIV HEALTHCARE, UNIPESSOAL LDA (509117961)","10.560,02 €",07-01-2016,06-01-2016,60 dias,"Portugal, Porto, Vila Nova de Gaia","Artigo 24.º, n.º 1, alínea c) do Código dos Contratos Públicos",,,,,,Não aplicável.,Não aplicável.,FALSE
Isoniazida 50 mg + Pirazinamida 300 mg + Rifampicina 120 mg Comp,Ao abrigo de acordo-quadro (art.º 259.º),Aquisição de bens móveis,"33600000-6, Produtos farmacêuticos","Centro Hospitalar Vila Nova de Gaia - Espinho, E. P. E. (508142156)","Sanofi-Aventis - Prod. Farmacêuticos, Lda (500134960)","62,32 €",07-01-2016,06-01-2016,60 dias,"Portugal, Porto, Vila Nova de Gaia",Artigo 259.º do Código dos Contratos Públicos,,,,,,1326195,ACORDO QUADRO PARA FORNECIMENTO DE MEDICAMENTOS ANTI-INFECIOSOS: EXCETO ANTIVÍRICOS E ANTIFÚNGICOS ÀS INSTITUIÇÕES E SERVIÇOS DO SERVIÇO NACIONAL DE SAÚDE,FALSE
Filtro p/ Pletismógrafo,Ajuste Direto Regime Geral,Aquisição de bens móveis,"42900000-5, Maquinaria diversa genérica ou de finalidade específica","Centro Hospitalar Vila Nova de Gaia - Espinho, E. P. E. (508142156)",Intersurgical Portugal Lda. (503480045),"7.821,00 €",07-01-2016,06-01-2016,365 dias,"Portugal, Porto, Vila Nova de Gaia","Artigo 20.º, n.º 1, alínea a) do Código dos Contratos Públicos",,,,,,Não aplicável.,Não aplicável.,FALSE
Medicamentos com A.U.E à firma Bausch & Lomb,Ajuste Direto Regime Geral,Aquisição de bens móveis,"33600000-6, Produtos farmacêuticos","Centro Hospitalar Vila Nova de Gaia - Espinho, E. P. E. (508142156)",Bausch & Lomb (980218764),"4.030,00 €",07-01-2016,06-01-2016,365 dias,"Portugal, Porto, Vila Nova de Gaia","Artigo 24.º, n.º 1, alínea e) do Código dos Contratos Públicos",,,,,,Não aplicável.,Não aplicável.,FALSE
Medicamentos com A.U.E à firma Ferring,Ajuste Direto Regime Geral,Aquisição de bens móveis,"33600000-6, Produtos farmacêuticos","Centro Hospitalar Vila Nova de Gaia - Espinho, E. P. E. (508142156)",FERRING PRODUTOS FARMACÊUTICOS (502034831),"1.884,00 €",07-01-2016,06-01-2016,365 dias,"Portugal, Porto, Vila Nova de Gaia","Artigo 24.º, n.º 1, alínea e) do Código dos Contratos Públicos",,,,,,Não aplicável.,Não aplicável.,FALSE
8009116 - Prestação de Serviços de Higiene e Limpeza de Áreas Comuns do CHVNG - Serviços adicionais 1º trimestre,Ajuste Direto Regime Geral,Aquisição de serviços,"90910000-9, Serviços de limpeza","Centro Hospitalar Vila Nova de Gaia - Espinho, E. P. E. (508142156)","IBERLIM - Sociedade Técnica de Limpezas, S.A. (503501670)","47.670,00 €",06-01-2016,06-01-2016,90 dias,"Portugal, Porto, Vila Nova de Gaia","Artigo 20.º, n.º 1, alínea a) do Código dos Contratos Públicos",,,,,,Não aplicável.,Não aplicável.,FALSE
90011516 - AD para Aquisição de Meio de Gradientes de Densidade Meio Nidacon e Meio p/ Descongelação de Embriões,Ajuste Direto Regime Geral,Aquisição de bens móveis,"33696000-5, Reagentes e meios de contraste","Centro Hospitalar Vila Nova de Gaia - Espinho, E. P. E. (508142156)","Equipamentos Médico-Biológicos, Lda. (507364457)","3.695,00 €",06-01-2016,06-01-2016,3 dias,"Portugal, Porto, Vila Nova de Gaia","Artigo 24.º, n.º 1, alínea c) do Código dos Contratos Públicos",,,,,,Não aplicável.,Não aplicável.,FALSE
90010816 - AD para Aquisição de Cuvetes p/ Determinação de ACT,Ajuste Direto Regime Geral,Aquisição de bens móveis,"33696000-5, Reagentes e meios de contraste","Centro Hospitalar Vila Nova de Gaia - Espinho, E. P. E. (508142156)",DISPROMEDI -Produtos e Equipamentos Médicos (505684772),"4.050,09 €",06-01-2016,06-01-2016,3 dias,"Portugal, Porto, Vila Nova de Gaia","Artigo 24.º, n.º 1, alínea c) do Código dos Contratos Públicos",,,,,,Não aplicável.,Não aplicável.,FALSE
90010616 - AD para Aquisição de Reagente (Aldoase),Ajuste Direto Regime Geral,Aquisição de bens móveis,"33696000-5, Reagentes e meios de contraste","Centro Hospitalar Vila Nova de Gaia - Espinho, E. P. E. (508142156)","Bioportugal - Químico e Farmacêutica, Lda (502380543)","1.100,00 €",06-01-2016,06-01-2016,3 dias,"Portugal, Porto, Vila Nova de Gaia","Artigo 24.º, n.º 1, alínea c) do Código dos Contratos Públicos",,,,,,Não aplicável.,Não aplicável.,FALSE
Medicamentos com A.U.E à firma IDIS,Ajuste Direto Regime Geral,Aquisição de bens móveis,"33600000-6, Produtos farmacêuticos","Centro Hospitalar Vila Nova de Gaia - Espinho, E. P. E. (508142156)",IDIS Managing World Medicines (700513982),"7.229,00 €",06-01-2016,06-01-2016,365 dias,"Portugal, Porto, Vila Nova de Gaia","Artigo 24.º, n.º 1, alínea e) do Código dos Contratos Públicos",,,,,,Não aplicável.,Não aplicável.,FALSE
Medicamentos com A.U.E à firma Pharmis,Ajuste Direto Regime Geral,Aquisição de bens móveis,"33600000-6, Produtos farmacêuticos","Centro Hospitalar Vila Nova de Gaia - Espinho, E. P. E. (508142156)","PHARMIS BIOFARMACÊUTICA, LDA (502595442)","4.090,00 €",06-01-2016,06-01-2016,365 dias,"Portugal, Porto, Vila Nova de Gaia","Artigo 24.º, n.º 1, alínea e) do Código dos Contratos Públicos",,,,,,Não aplicável.,Não aplicável.,FALSE
Rifampicina 600 mg Pó sol inj,Ajuste Direto Regime Geral,Aquisição de bens móveis,"33600000-6, Produtos farmacêuticos","Centro Hospitalar Vila Nova de Gaia - Espinho, E. P. E. (508142156)","Sanofi-Aventis - Prod. Farmacêuticos, Lda (500134960)","6.549,20 €",06-01-2016,06-01-2016,365 dias,"Portugal, Porto, Vila Nova de Gaia","Artigo 24.º, n.º 1, alínea e) do Código dos Contratos Públicos",,,,,,Não aplicável.,Não aplicável.,FALSE
Labetalol 100mg/20ml Sol inj,Ajuste Direto Regime Geral,Aquisição de bens móveis,"33600000-6, Produtos farmacêuticos","Centro Hospitalar Vila Nova de Gaia - Espinho, E. P. E. (508142156)","Duxpharma Unipessoal, Lda (510803679)","10.095,00 €",06-01-2016,06-01-2016,365 dias,"Portugal, Porto, Vila Nova de Gaia","Artigo 24.º, n.º 1, alínea e) do Código dos Contratos Públicos",,,,,,Não aplicável.,Não aplicável.,FALSE
10010516 - AD para Aquisição de Soro Contra o Veneno da Víbora Europeia Sol inj - AUE512,Ajuste Direto Regime Geral,Aquisição de bens móveis,"33600000-6, Produtos farmacêuticos","Centro Hospitalar Vila Nova de Gaia - Espinho, E. P. E. (508142156)","Sanofi Pasteur MSD, SA (507632796)","1.920,88 €",06-01-2016,06-01-2016,365 dias,"Portugal, Porto, Vila Nova de Gaia","Artigo 24.º, n.º 1, alínea e) do Código dos Contratos Públicos",,,,,,Não aplicável.,Não aplicável.,FALSE
"10010416 - AD para Aquisição de Vários Medicamentos (Stallpharma)-AUE1482, 1503, 1306",Ajuste Direto Regime Geral,Aquisição de bens móveis,"33600000-6, Produtos farmacêuticos","Centro Hospitalar Vila Nova de Gaia - Espinho, E. P. E. (508142156)","STALLPHARMA - Prod. Farm., Lda (503732311)","9.390,00 €",06-01-2016,06-01-2016,365 dias,"Portugal, Porto, Vila Nova de Gaia","Artigo 24.º, n.º 1, alínea e) do Código dos Contratos Públicos",,,,,,Não aplicável.,Não aplicável.,FALSE
Clonazepam 1 mg/ml Sol inj,Ajuste Direto Regime Geral,Aquisição de bens móveis,"33600000-6, Produtos farmacêuticos","Centro Hospitalar Vila Nova de Gaia - Espinho, E. P. E. (508142156)","ROCHE Farmacêutica Quimica, Lda (500233810)","533,60 €",06-01-2016,06-01-2016,365 dias,"Portugal, Porto, Vila Nova de Gaia","Artigo 24.º, n.º 1, alínea e) do Código dos Contratos Públicos",,,,,,Não aplicável.,Não aplicável.,FALSE
"10010316 - AD para Aquisição de Vários Medicamentos (Diater) - A.U.E357,299 e 298 ",Ajuste Direto Regime Geral,Aquisição de bens móveis,"33600000-6, Produtos farmacêuticos","Centro Hospitalar Vila Nova de Gaia - Espinho, E. P. E. (508142156)","Laboratórios Diater, SA (500292051)","5.367,74 €",06-01-2016,06-01-2016,365 dias,"Portugal, Porto, Vila Nova de Gaia","Artigo 24.º, n.º 1, alínea e) do Código dos Contratos Públicos",,,,,,Não aplicável.,Não aplicável.,FALSE
10010216 - AD para Aquisição de Imunoglobulinas - A.U.E358 e 359,Ajuste Direto Regime Geral,Aquisição de bens móveis,"33600000-6, Produtos farmacêuticos","Centro Hospitalar Vila Nova de Gaia - Espinho, E. P. E. (508142156)","SPCare, Especialidades Farmacêuticas, Lda (508284872)","9.367,80 €",06-01-2016,06-01-2016,365 dias,"Portugal, Porto, Vila Nova de Gaia","Artigo 24.º, n.º 1, alínea e) do Código dos Contratos Públicos",,,,,,Não aplicável.,Não aplicável.,FALSE
Material para Neurocirurgia,Ajuste Direto Regime Geral,Aquisição de bens móveis,"33140000-3, Material médico de consumo","Centro Hospitalar Vila Nova de Gaia - Espinho, E. P. E. (508142156)","Overpharma, Lda.  (505792362)","5.000,00 €",06-01-2016,06-01-2016,10 dias,"Portugal, Porto, Vila Nova de Gaia","Artigo 24.º, n.º 1, alínea c) do Código dos Contratos Públicos",,,,,,Não aplicável.,Não aplicável.,FALSE
10009916 - AD para Aquisição de Azul Patenteado V 25mg/ml Sol inj - AUE354,Ajuste Direto Regime Geral,Aquisição de bens móveis,"33600000-6, Produtos farmacêuticos","Centro Hospitalar Vila Nova de Gaia - Espinho, E. P. E. (508142156)",A.MARTINS & FERNANDES S.A. (501172114),"3.200,00 €",05-01-2016,05-01-2016,365 dias,"Portugal, Porto, Vila Nova de Gaia","Artigo 24.º, n.º 1, alínea e) do Código dos Contratos Públicos",,,,,,Não aplicável.,Não aplicável.,FALSE
Vários Medicamentos Wepharma A.U.E.,Ajuste Direto Regime Geral,Aquisição de bens móveis,"33600000-6, Produtos farmacêuticos","Centro Hospitalar Vila Nova de Gaia - Espinho, E. P. E. (508142156)",WEPHARMA LTDWE PHARMA LLC (944893866),"30.401,00 €",05-01-2016,05-01-2016,365 dias,"Portugal, Porto, Vila Nova de Gaia","Artigo 24.º, n.º 1, alínea e) do Código dos Contratos Públicos",,,,,,Não aplicável.,Não aplicável.,FALSE
Vários Medicamentos Merck SA A.U.E.,Ajuste Direto Regime Geral,Aquisição de bens móveis,"33600000-6, Produtos farmacêuticos","Centro Hospitalar Vila Nova de Gaia - Espinho, E. P. E. (508142156)","MERCK, S.A. (500650870)","36.870,00 €",05-01-2016,05-01-2016,365 dias,"Portugal, Porto, Vila Nova de Gaia","Artigo 24.º, n.º 1, alínea e) do Código dos Contratos Públicos",,,,,,Não aplicável.,Não aplicável.,FALSE
20009416 - AD para Aquisição de Valvula Aortica de Introdução p/ Via Percutanea,Ajuste Direto Regime Geral,Aquisição de bens móveis,"33182220-7, Válvulas cardíacas","Centro Hospitalar Vila Nova de Gaia - Espinho, E. P. E. (508142156)",St. Jude Medical Portugal (504180746),"18.000,00 €",05-01-2016,05-01-2016,3 dias,"Portugal, Porto, Vila Nova de Gaia","Artigo 24.º, n.º 1, alínea e) do Código dos Contratos Públicos",,,,,,Não aplicável.,Não aplicável.,FALSE
20009316 - AD para Aquisição de Material para Neurocirurgia,Ajuste Direto Regime Geral,Aquisição de bens móveis,"33140000-3, Material médico de consumo","Centro Hospitalar Vila Nova de Gaia - Espinho, E. P. E. (508142156)","YOURSPINE, Lda (513334408)","1.046,00 €",05-01-2016,05-01-2016,3 dias,"Portugal, Porto, Vila Nova de Gaia","Artigo 24.º, n.º 1, alínea c) do Código dos Contratos Públicos",,,,,,Não aplicável.,Não aplicável.,FALSE
20007916 - AD para Aquisição de Material para Neurocirurgia,Ajuste Direto Regime Geral,Aquisição de bens móveis,"33180000-5, Apoio funcional","Centro Hospitalar Vila Nova de Gaia - Espinho, E. P. E. (508142156)","YOURSPINE, Lda (513334408)","2.700,00 €",05-01-2016,05-01-2016,3 dias,"Portugal, Porto, Vila Nova de Gaia","Artigo 24.º, n.º 1, alínea c) do Código dos Contratos Públicos",,,,,,Não aplicável.,Não aplicável.,FALSE
90007816 - AD para Aquisição de Reagente (Hydrasys 4 IF),Ajuste Direto Regime Geral,Aquisição de bens móveis,"33696000-5, Reagentes e meios de contraste","Centro Hospitalar Vila Nova de Gaia - Espinho, E. P. E. (508142156)","Thermo Fisher Diagnostics, Soc.  (506916243)","23.057,70 €",05-01-2016,05-01-2016,365 dias,"Portugal, Porto, Vila Nova de Gaia","Artigo 24.º, n.º 1, alínea e) do Código dos Contratos Públicos",,,,,,Não aplicável.,Não aplicável.,FALSE
Aquisição de Diverso Material de Esterilização [origem CP 2023515],Concurso público,Aquisição de bens móveis,"33198200-6, Saquetas e invólucros de papel para esterilização","Centro Hospitalar Vila Nova de Gaia - Espinho, E. P. E. (508142156)",PROMEI (506470113),"612,94 €",05-01-2016,05-01-2016,361 dias,"Portugal, Porto, Vila Nova de Gaia","Artigo 20.º, n.º 1, alínea b) do Código dos Contratos Públicos",,,,,,Não aplicável.,Não aplicável.,FALSE
Aquisição de Diverso Material de Esterilização [origem CP 2023515],Concurso público,Aquisição de bens móveis,"33198200-6, Saquetas e invólucros de papel para esterilização","Centro Hospitalar Vila Nova de Gaia - Espinho, E. P. E. (508142156)","3M Portugal, Lda (500193940)","6.317,50 €",05-01-2016,05-01-2016,361 dias,"Portugal, Porto, Vila Nova de Gaia","Artigo 20.º, n.º 1, alínea b) do Código dos Contratos Públicos",,,,,,Não aplicável.,Não aplicável.,FALSE
Aquisição de Diverso Material de Esterilização [origem CP 2023515],Concurso público,Aquisição de bens móveis,"33198200-6, Saquetas e invólucros de papel para esterilização","Centro Hospitalar Vila Nova de Gaia - Espinho, E. P. E. (508142156)","MEDLINE Internacional Portugal Unip., Lda (510533515)","1.105,39 €",05-01-2016,05-01-2016,361 dias,"Portugal, Porto, Vila Nova de Gaia","Artigo 20.º, n.º 1, alínea b) do Código dos Contratos Públicos",,,,,,Não aplicável.,Não aplicável.,FALSE
Aquisição de Diverso Material de Esterilização [origem CP 2023515],Concurso público,Aquisição de bens móveis,"33198200-6, Saquetas e invólucros de papel para esterilização","Centro Hospitalar Vila Nova de Gaia - Espinho, E. P. E. (508142156)","B BRAUN MEDICAL, LDA. (501506543)","400,00 €",05-01-2016,05-01-2016,361 dias,"Portugal, Porto, Vila Nova de Gaia","Artigo 20.º, n.º 1, alínea b) do Código dos Contratos Públicos",,,,,,Não aplicável.,Não aplicável.,FALSE
Aquisição de Diverso Material de Esterilização [origem CP 2023515],Concurso público,Aquisição de bens móveis,"33198200-6, Saquetas e invólucros de papel para esterilização","Centro Hospitalar Vila Nova de Gaia - Espinho, E. P. E. (508142156)","HTMD - High Technology Medical Devices , Lda (507654919)","643,28 €",05-01-2016,05-01-2016,361 dias,"Portugal, Porto, Vila Nova de Gaia","Artigo 20.º, n.º 1, alínea b) do Código dos Contratos Públicos",,,,,,Não aplicável.,Não aplicável.,FALSE
Aquisição de Diverso Material de Esterilização [origem CP 2023515],Concurso público,Aquisição de bens móveis,"33198200-6, Saquetas e invólucros de papel para esterilização","Centro Hospitalar Vila Nova de Gaia - Espinho, E. P. E. (508142156)",HELDER GONÇALVES - Ass. Técnica de Equip. Ldª (503855421),"2.731,00 €",05-01-2016,05-01-2016,361 dias,"Portugal, Porto, Vila Nova de Gaia","Artigo 20.º, n.º 1, alínea b) do Código dos Contratos Públicos",,,,,,Não aplicável.,Não aplicável.,FALSE
Aquisição de Diverso Material de Esterilização [origem CP 2023515],Concurso público,Aquisição de bens móveis,"33198200-6, Saquetas e invólucros de papel para esterilização","Centro Hospitalar Vila Nova de Gaia - Espinho, E. P. E. (508142156)",FACTOR PLUS (502810645),"4.389,16 €",05-01-2016,05-01-2016,361 dias,"Portugal, Porto, Vila Nova de Gaia","Artigo 20.º, n.º 1, alínea b) do Código dos Contratos Públicos",,,,,,Não aplicável.,Não aplicável.,FALSE
Aquisição de Diverso Material de Esterilização [origem CP 2023515],Concurso público,Aquisição de bens móveis,"33198200-6, Saquetas e invólucros de papel para esterilização","Centro Hospitalar Vila Nova de Gaia - Espinho, E. P. E. (508142156)",Eurocasmédica (503322105),"6.034,20 €",05-01-2016,05-01-2016,361 dias,"Portugal, Porto, Vila Nova de Gaia","Artigo 20.º, n.º 1, alínea b) do Código dos Contratos Públicos",,,,,,Não aplicável.,Não aplicável.,FALSE
Aquisição de Diverso Material de Esterilização [origem CP 2023515],Concurso público,Aquisição de bens móveis,"33198200-6, Saquetas e invólucros de papel para esterilização","Centro Hospitalar Vila Nova de Gaia - Espinho, E. P. E. (508142156)",EPJMÉDICA (506820513),"25,56 €",05-01-2016,05-01-2016,361 dias,"Portugal, Porto, Vila Nova de Gaia","Artigo 20.º, n.º 1, alínea b) do Código dos Contratos Públicos",,,,,,Não aplicável.,Não aplicável.,FALSE
Aquisição de Diverso Material de Esterilização [origem CP 2023515],Concurso público,Aquisição de bens móveis,"33198200-6, Saquetas e invólucros de papel para esterilização","Centro Hospitalar Vila Nova de Gaia - Espinho, E. P. E. (508142156)","DOCWORLD, Lda (508592909)","2.122,50 €",05-01-2016,05-01-2016,361 dias,"Portugal, Porto, Vila Nova de Gaia","Artigo 20.º, n.º 1, alínea b) do Código dos Contratos Públicos",,,,,,Não aplicável.,Não aplicável.,FALSE
Aquisição de Diverso Material de Esterilização [origem CP 2023515],Concurso público,Aquisição de bens móveis,"33198200-6, Saquetas e invólucros de papel para esterilização","Centro Hospitalar Vila Nova de Gaia - Espinho, E. P. E. (508142156)","Bastos Viegas, SA (500042772)","583,58 €",05-01-2016,05-01-2016,361 dias,"Portugal, Porto, Vila Nova de Gaia","Artigo 20.º, n.º 1, alínea b) do Código dos Contratos Públicos",,,,,,Não aplicável.,Não aplicável.,FALSE
90007716 - AD para Aquisição de Paineis de Sangue Eritrocitários para 2016,Ajuste Direto Regime Geral,Aquisição de bens móveis,"33696000-5, Reagentes e meios de contraste","Centro Hospitalar Vila Nova de Gaia - Espinho, E. P. E. (508142156)","OCD Clinical Diagnostic Portugal Unipessoal, Lda (513032665)","3.480,00 €",05-01-2016,05-01-2016,365 dias,"Portugal, Porto, Vila Nova de Gaia","Artigo 24.º, n.º 1, alínea e) do Código dos Contratos Públicos",,,,,,Não aplicável.,Não aplicável.,FALSE
90007516 - AD para Aquisição de Zaragatoas c/ Meio de Transporte,Ajuste Direto Regime Geral,Aquisição de bens móveis,"33696000-5, Reagentes e meios de contraste","Centro Hospitalar Vila Nova de Gaia - Espinho, E. P. E. (508142156)","VWR Internacional -Material de Laboratório,Lda. (503842770)","798,00 €",05-01-2016,05-01-2016,90 dias,"Portugal, Porto, Vila Nova de Gaia","Artigo 24.º, n.º 1, alínea e) do Código dos Contratos Públicos",,,,,,Não aplicável.,Não aplicável.,FALSE
Fenilefrina 10 mg/ml sol inj,Ajuste Direto Regime Geral,Aquisição de bens móveis,"33600000-6, Produtos farmacêuticos","Centro Hospitalar Vila Nova de Gaia - Espinho, E. P. E. (508142156)","Duxpharma Unipessoal, Lda (510803679)","8.433,00 €",05-01-2016,05-01-2016,365 dias,"Portugal, Porto, Vila Nova de Gaia","Artigo 24.º, n.º 1, alínea e) do Código dos Contratos Públicos",,,,,,Não aplicável.,Não aplicável.,FALSE
Flecainida 10mg/ml Sol inj Fr 15 ml,Ajuste Direto Regime Geral,Aquisição de bens móveis,"33600000-6, Produtos farmacêuticos","Centro Hospitalar Vila Nova de Gaia - Espinho, E. P. E. (508142156)","MEDA PHARMA - PRODUTOS FARMACÊUTICOS, S.A. (500082090)","420,00 €",05-01-2016,05-01-2016,365 dias,"Portugal, Porto, Vila Nova de Gaia","Artigo 24.º, n.º 1, alínea e) do Código dos Contratos Públicos",,,,,,Não aplicável.,Não aplicável.,FALSE
Isoprenalina 0.2 mg/1 ml Sol inj Fr 1 ml ICardíaca IM IV SC,Ajuste Direto Regime Geral,Aquisição de bens móveis,"33600000-6, Produtos farmacêuticos","Centro Hospitalar Vila Nova de Gaia - Espinho, E. P. E. (508142156)",IDIS Managing World Medicines (700513982),"1.300,00 €",05-01-2016,05-01-2016,365 dias,"Portugal, Porto, Vila Nova de Gaia","Artigo 24.º, n.º 1, alínea e) do Código dos Contratos Públicos",,,,,,Não aplicável.,Não aplicável.,FALSE
8025015 - Prestação de Serviços de Implementação de Sistema de Prova de Entrega,Ajuste Direto Regime Geral,Aquisição de serviços,"72320000-4, Serviços relacionados com bases de dados","Centro Hospitalar Vila Nova de Gaia - Espinho, E. P. E. (508142156)","Burótica - Soc. Estudos e Equip. Autom. Escrit.,SA (501178503)","12.650,00 €",04-01-2016,14-12-2015,365 dias,"Portugal, Porto, Vila Nova de Gaia","Artigo 20.º, n.º 1, alínea a) do Código dos Contratos Públicos",,,,,,Não aplicável.,Não aplicável.,FALSE
Quinina 250 mg/ml Sol Inj Fr 2 ml IM IV,Ajuste Direto Regime Geral,Aquisição de bens móveis,"33600000-6, Produtos farmacêuticos","Centro Hospitalar Vila Nova de Gaia - Espinho, E. P. E. (508142156)","LABESFAL - LABORATÓRIOS ALMIRO, SA (501169580)","1.314,00 €",04-01-2016,04-01-2016,60 dias,"Portugal, Porto, Vila Nova de Gaia","Artigo 24.º, n.º 1, alínea e) do Código dos Contratos Públicos",,,,,,Não aplicável.,Não aplicável.,FALSE
"80007416 - AD para Aquisição de Serviços Juridicos para Apoiar Serviço Juridico do CHVNG/E, EPE ",Ajuste Direto Regime Geral,Aquisição de serviços,"79100000-5, Serviços jurídicos","Centro Hospitalar Vila Nova de Gaia - Espinho, E. P. E. (508142156)",MARÍLIA CLARA VIEIRA SALGADO (233554947),"3.000,00 €",04-01-2016,04-01-2016,90 dias,"Portugal, Porto, Vila Nova de Gaia","Artigo 20.º, n.º 1, alínea a) do Código dos Contratos Públicos",,,,,,Não aplicável.,Não aplicável.,FALSE
Cefepima 1000mg Pó sol inj Fr IM IV (CPA2014/05),Ajuste Direto Regime Geral,Aquisição de bens móveis,"33600000-6, Produtos farmacêuticos","Centro Hospitalar Vila Nova de Gaia - Espinho, E. P. E. (508142156)","Fresenius Medical Care Portugal, S.A. (503070220)","886,00 €",04-01-2016,04-01-2016,30 dias,"Portugal, Porto, Vila Nova de Gaia","Artigo 24.º, n.º 1, alínea c) do Código dos Contratos Públicos",,,,,,Não aplicável.,Não aplicável.,FALSE
Reagentes para o Equipamento Citometro de Fluxo,Ajuste Direto Regime Geral,Aquisição de bens móveis,"33696000-5, Reagentes e meios de contraste","Centro Hospitalar Vila Nova de Gaia - Espinho, E. P. E. (508142156)","Beckman Coulter Portugal Uni., Lda (509035167)","8.903,60 €",04-01-2016,04-01-2016,60 dias,"Portugal, Porto, Vila Nova de Gaia","Artigo 24.º, n.º 1, alínea e) do Código dos Contratos Públicos",,,,,,Não aplicável.,Não aplicável.,FALSE
Nitrato de prata 50 mg Lápis cut  A.U.E. 360,Ajuste Direto Regime Geral,Aquisição de bens móveis,"33600000-6, Produtos farmacêuticos","Centro Hospitalar Vila Nova de Gaia - Espinho, E. P. E. (508142156)","B BRAUN MEDICAL, LDA. (501506543)","992,00 €",04-01-2016,04-01-2016,60 dias,"Portugal, Porto, Vila Nova de Gaia","Artigo 24.º, n.º 1, alínea e) do Código dos Contratos Públicos",,,,,,Não aplicável.,Não aplicável.,FALSE
Diazóxido 25MG Cáps A.U.E. 355,Ajuste Direto Regime Geral,Aquisição de bens móveis,"33600000-6, Produtos farmacêuticos","Centro Hospitalar Vila Nova de Gaia - Espinho, E. P. E. (508142156)",MERCK SHARP & DHOME LDA. (500191360),"298,35 €",04-01-2016,04-01-2016,60 dias,"Portugal, Porto, Vila Nova de Gaia","Artigo 24.º, n.º 1, alínea e) do Código dos Contratos Públicos",,,,,,Não aplicável.,Não aplicável.,FALSE
"Pilocarpina 10mg/0,5ml Col, sol A.U.E 249",Ajuste Direto Regime Geral,Aquisição de bens móveis,"33600000-6, Produtos farmacêuticos","Centro Hospitalar Vila Nova de Gaia - Espinho, E. P. E. (508142156)","Lab. Edol - Prod. Farmacêuticos, SA (507072642)","306,50 €",04-01-2016,04-01-2016,60 dias,"Portugal, Porto, Vila Nova de Gaia","Artigo 24.º, n.º 1, alínea e) do Código dos Contratos Públicos",,,,,,Não aplicável.,Não aplicável.,FALSE
Artigos de Limpeza e Detergentes,Ajuste Direto Regime Geral,Aquisição de bens móveis,"39830000-9, Produtos de limpeza","Centro Hospitalar Vila Nova de Gaia - Espinho, E. P. E. (508142156)","ASC Comércio de Produtos de Higiene, Lda (505495414)","2.632,50 €",04-01-2016,04-01-2016,150 dias,"Portugal, Porto, Vila Nova de Gaia","Artigo 20.º, n.º 1, alínea a) do Código dos Contratos Públicos",,,,,,Não aplicável.,Não aplicável.,FALSE
"Fornecimento de Gases Medicinais ao Centro Hospitalar de Vila Nova de Gaia Espinho, EPE durante o período de 36 meses",Concurso público,Aquisição de bens móveis,"24111500-0, Gases médicos","Centro Hospitalar Vila Nova de Gaia - Espinho, E.P.E. (508142156)","Praxair Portugal Gases, S.A. (501738916)","1.454.854,67 €",04-01-2016,02-06-2014,1096 dias,"Portugal, Porto, Vila Nova de Gaia","Artigo 20.º, n.º 1, alínea b) do Código dos Contratos Públicos",,,,,,Não aplicável.,Não aplicável.,FALSE
Diverso Material de Higiéne e Limpeza,Ajuste Direto Regime Geral,Aquisição de bens móveis,"39830000-9, Produtos de limpeza","Centro Hospitalar Vila Nova de Gaia - Espinho, E. P. E. (508142156)",A.J. OLIVEIRA Ldª (502293748),"13.673,03 €",04-01-2016,04-01-2016,150 dias,"Portugal, Porto, Vila Nova de Gaia","Artigo 20.º, n.º 1, alínea a) do Código dos Contratos Públicos",,,,,,Não aplicável.,Não aplicável.,FALSE
Papel de Cópia A4,Ajuste Direto Regime Geral,Aquisição de bens móveis,"30192700-8, Artigos de papelaria","Centro Hospitalar Vila Nova de Gaia - Espinho, E. P. E. (508142156)","Staples Portugal - Equipamento de Escritório, SA. (503789372)","45.431,67 €",04-01-2016,04-01-2016,150 dias,"Portugal, Porto, Vila Nova de Gaia","Artigo 20.º, n.º 1, alínea a) do Código dos Contratos Públicos",,,,,,Não aplicável.,Não aplicável.,FALSE
40004716 - AD para Aquisição de Lixivia em Pastilhas,Ajuste Direto Regime Geral,Aquisição de bens móveis,"39831000-6, Preparações para lavagem","Centro Hospitalar Vila Nova de Gaia - Espinho, E. P. E. (508142156)",IMPORQUÍMICA - INDUSTRIA PORTUGUESA DE PRODUÇÃO QU (502473274),"1.589,50 €",04-01-2016,04-01-2016,31 dias,"Portugal, Porto, Vila Nova de Gaia","Artigo 20.º, n.º 1, alínea a) do Código dos Contratos Públicos",,,,,,Não aplicável.,Não aplicável.,FALSE
Diversas Etiquetas,Ajuste Direto Regime Geral,Aquisição de bens móveis,"30192000-1, Material de escritório","Centro Hospitalar Vila Nova de Gaia - Espinho, E. P. E. (508142156)",Marcos Azevedo Dias (108701476),"13.255,25 €",04-01-2016,04-01-2016,365 dias,"Portugal, Porto, Vila Nova de Gaia","Artigo 20.º, n.º 1, alínea a) do Código dos Contratos Públicos",,,,,,Não aplicável.,Não aplicável.,FALSE
40004616 - AD para Aquisição de Toalhete Inter-Folha (Ziguezague),Ajuste Direto Regime Geral,Aquisição de bens móveis,"33760000-5, Papel higiénico, lenços, toalhas de mão e guardanapos","Centro Hospitalar Vila Nova de Gaia - Espinho, E. P. E. (508142156)","JOCALU  HIGIENE INDUSTRIAL, LDA (502999900)","74.880,00 €",04-01-2016,04-01-2016,365 dias,"Portugal, Porto, Vila Nova de Gaia","Artigo 20.º, n.º 1, alínea a) do Código dos Contratos Públicos",,,,,,Não aplicável.,Não aplicável.,FALSE
80002816 - AD para Contrato de Manutenção para VMWare e VCenter do CHVNG para o ano 2016,Ajuste Direto Regime Geral,Aquisição de serviços,"72261000-2, Serviços de assistência em matéria de software","Centro Hospitalar Vila Nova de Gaia - Espinho, E. P. E. (508142156)","ATM - SISTEMAS DE INFORMAÇÃO E SERVIÇOS, S.A. (509784267)","6.375,17 €",04-01-2016,04-01-2016,365 dias,"Portugal, Porto, Vila Nova de Gaia","Artigo 20.º, n.º 1, alínea a) do Código dos Contratos Públicos",,,,,,Não aplicável.,Não aplicável.,FALSE
90002216 - AD para Aquisição de Controlos de Qualidade Externos Fevereiro - Patologia,Ajuste Direto Regime Geral,Aquisição de bens móveis,"33696000-5, Reagentes e meios de contraste","Centro Hospitalar Vila Nova de Gaia - Espinho, E. P. E. (508142156)","Biognóstica, Lda. (504441256)","2.423,44 €",04-01-2016,04-01-2016,29 dias,"Portugal, Porto, Vila Nova de Gaia","Artigo 24.º, n.º 1, alínea e) do Código dos Contratos Públicos",,,,,,Não aplicável.,Não aplicável.,FALSE
90002116 - AD para Aquisição de Controlos de Qualidade Externos Janeiro - Patologia,Ajuste Direto Regime Geral,Aquisição de bens móveis,"33696000-5, Reagentes e meios de contraste","Centro Hospitalar Vila Nova de Gaia - Espinho, E. P. E. (508142156)","Biognóstica, Lda. (504441256)","4.285,77 €",04-01-2016,04-01-2016,31 dias,"Portugal, Porto, Vila Nova de Gaia","Artigo 24.º, n.º 1, alínea e) do Código dos Contratos Públicos",,,,,,Não aplicável.,Não aplicável.,FALSE
90002016 - AD para Aquisição de Controlos de Qualidade Externos Fevereiro - Imunohemoterapia,Ajuste Direto Regime Geral,Aquisição de bens móveis,"33696000-5, Reagentes e meios de contraste","Centro Hospitalar Vila Nova de Gaia - Espinho, E. P. E. (508142156)","Biognóstica, Lda. (504441256)","375,81 €",04-01-2016,04-01-2016,29 dias,"Portugal, Porto, Vila Nova de Gaia","Artigo 24.º, n.º 1, alínea e) do Código dos Contratos Públicos",,,,,,Não aplicável.,Não aplicável.,FALSE
Artigos de Papel,Ajuste Direto Regime Geral,Aquisição de bens móveis,"30192700-8, Artigos de papelaria","Centro Hospitalar Vila Nova de Gaia - Espinho, E. P. E. (508142156)","JOCALU  HIGIENE INDUSTRIAL, LDA (502999900)","10.925,00 €",04-01-2016,04-01-2016,60 dias,"Portugal, Porto, Vila Nova de Gaia","Artigo 20.º, n.º 1, alínea a) do Código dos Contratos Públicos",,,,,,Não aplicável.,Não aplicável.,FALSE
90001916 - AD para Aquisição de Controlos de Qualidade Externos Janeiro - Imunohemoterapia,Ajuste Direto Regime Geral,Aquisição de bens móveis,"33696000-5, Reagentes e meios de contraste","Centro Hospitalar Vila Nova de Gaia - Espinho, E. P. E. (508142156)","Biognóstica, Lda. (504441256)","1.728,23 €",04-01-2016,04-01-2016,31 dias,"Portugal, Porto, Vila Nova de Gaia","Artigo 24.º, n.º 1, alínea e) do Código dos Contratos Públicos",,,,,,Não aplicável.,Não aplicável.,FALSE
50001816 - AD para Aquisição de Diversos Impressos para o Ano 2016,Ajuste Direto Regime Geral,Aquisição de bens móveis,"22000000-0, Material impresso e afins","Centro Hospitalar Vila Nova de Gaia - Espinho, E. P. E. (508142156)","MOTA & FERREIRA, LDA (500841608)","38.363,20 €",04-01-2016,04-01-2016,365 dias,"Portugal, Porto, Vila Nova de Gaia","Artigo 20.º, n.º 1, alínea a) do Código dos Contratos Públicos",,,,,,Não aplicável.,Não aplicável.,FALSE
80001316 - AD para Aquisição de Serviços de Manutenção de Conetores HL7 Imagiologia (Nivel 1) para ano 2016,Ajuste Direto Regime Geral,Aquisição de serviços,"72318000-7, Serviços de transmissão de dados","Centro Hospitalar Vila Nova de Gaia - Espinho, E. P. E. (508142156)","GLINTT - Helthcare Solutions, S.A. (502479418)","2.100,00 €",04-01-2016,04-01-2016,365 dias,"Portugal, Porto, Vila Nova de Gaia","Artigo 24.º, n.º 1, alínea e) do Código dos Contratos Públicos",,,,,,Não aplicável.,Não aplicável.,FALSE
80000616 - AD para Manutenção Preventiva a 2 Incubadoras,Ajuste Direto Regime Geral,Aquisição de serviços,"50400000-9, Serviços de reparação e manutenção de equipamento médico e de precisão","Centro Hospitalar Vila Nova de Gaia - Espinho, E. P. E. (508142156)","EMB-EQUIPOS MÉDICO-BIOLÓGICOS SERVICIO TÉCNICO,SL (B-61298469)","1.246,58 €",04-01-2016,04-01-2016,3 dias,"Portugal, Porto, Vila Nova de Gaia","Artigo 24.º, n.º 1, alínea e) do Código dos Contratos Públicos",,,,,,Não aplicável.,Não aplicável.,FALSE
90007316 - AD para Aquisição de Reagentes (Roche Diagnósticos),Ajuste Direto Regime Geral,Aquisição de bens móveis,"33696000-5, Reagentes e meios de contraste","Centro Hospitalar Vila Nova de Gaia - Espinho, E. P. E. (508142156)","Roche Sistemas de Diagnóstico, Lda (504282921)","1.855,19 €",04-01-2016,04-01-2016,3 dias,"Portugal, Porto, Vila Nova de Gaia","Artigo 24.º, n.º 1, alínea e) do Código dos Contratos Públicos",,,,,,Não aplicável.,Não aplicável.,FALSE
10006916 - AD para Aquisição de Dantroleno 20 mg Pó sol inj Fr IV  A.U.E. 351,Ajuste Direto Regime Geral,Aquisição de bens móveis,"33600000-6, Produtos farmacêuticos","Centro Hospitalar Vila Nova de Gaia - Espinho, E. P. E. (508142156)","NORGINE Portugal Farmacêutica Unipessoal, Lda (508676746)","4.080,00 €",04-01-2016,04-01-2016,3 dias,"Portugal, Porto, Vila Nova de Gaia","Artigo 24.º, n.º 1, alínea e) do Código dos Contratos Públicos",,,,,,Não aplicável.,Não aplicável.,FALSE
Material para Neurocirurgia,Ajuste Direto Regime Geral,Aquisição de bens móveis,"33140000-3, Material médico de consumo","Centro Hospitalar Vila Nova de Gaia - Espinho, E. P. E. (508142156)",Johnson & Johnson Medical (500153370),"3.220,00 €",04-01-2016,23-12-2015,10 dias,"Portugal, Porto, Vila Nova de Gaia","Artigo 24.º, n.º 1, alínea c) do Código dos Contratos Públicos",,,,,,Não aplicável.,Não aplicável.,FALSE
Material para Neurocirurgia,Ajuste Direto Regime Geral,Aquisição de bens móveis,"33140000-3, Material médico de consumo","Centro Hospitalar Vila Nova de Gaia - Espinho, E. P. E. (508142156)","YOURSPINE, Lda (513334408)","2.300,00 €",04-01-2016,23-12-2015,10 dias,"Portugal, Porto, Vila Nova de Gaia","Artigo 24.º, n.º 1, alínea c) do Código dos Contratos Públicos",,,,,,Não aplicável.,Não aplicável.,FALSE
10006816 - AD para Aquisição de Estreptomicina 1000 mg Pó sol inj Fr IM IV A.U.E 353,Ajuste Direto Regime Geral,Aquisição de bens móveis,"33600000-6, Produtos farmacêuticos","Centro Hospitalar Vila Nova de Gaia - Espinho, E. P. E. (508142156)","LABESFAL - LABORATÓRIOS ALMIRO, SA (501169580)","455,00 €",04-01-2016,04-01-2016,3 dias,"Portugal, Porto, Vila Nova de Gaia","Artigo 24.º, n.º 1, alínea e) do Código dos Contratos Públicos",,,,,,Não aplicável.,Não aplicável.,FALSE
Material para Neurocirurgia,Ajuste Direto Regime Geral,Aquisição de bens móveis,"33140000-3, Material médico de consumo","Centro Hospitalar Vila Nova de Gaia - Espinho, E. P. E. (508142156)","Overpharma, Lda. (505792362)","3.070,00 €",04-01-2016,23-12-2015,10 dias,"Portugal, Porto, Vila Nova de Gaia","Artigo 24.º, n.º 1, alínea c) do Código dos Contratos Públicos",,,,,,Não aplicável.,Não aplicável.,FALSE
10006716 - AD para Aquisição de TRIAMCINOLONA 20 MG/ML SUSP INJ-A.UE 350,Ajuste Direto Regime Geral,Aquisição de bens móveis,"33600000-6, Produtos farmacêuticos","Centro Hospitalar Vila Nova de Gaia - Espinho, E. P. E. (508142156)",METROPOLITAN PHARMACY (20476090),"1.015,08 €",04-01-2016,04-01-2016,3 dias,"Portugal, Porto, Vila Nova de Gaia","Artigo 24.º, n.º 1, alínea e) do Código dos Contratos Públicos",,,,,,Não aplicável.,Não aplicável.,FALSE
Material para Neurocirurgia,Ajuste Direto Regime Geral,Aquisição de bens móveis,"33140000-3, Material médico de consumo","Centro Hospitalar Vila Nova de Gaia - Espinho, E. P. E. (508142156)","Overpharma, Lda. (505792362)","2.940,00 €",04-01-2016,23-12-2015,10 dias,"Portugal, Porto, Vila Nova de Gaia","Artigo 24.º, n.º 1, alínea c) do Código dos Contratos Públicos",,,,,,Não aplicável.,Não aplicável.,FALSE
Dispositivo de Embolização Vascular,Ajuste Direto Regime Geral,Aquisição de bens móveis,"33140000-3, Material médico de consumo","Centro Hospitalar Vila Nova de Gaia - Espinho, E. P. E. (508142156)",St. Jude Medical Portugal (504180746),"2.990,00 €",04-01-2016,23-12-2015,10 dias,"Portugal, Porto, Vila Nova de Gaia","Artigo 24.º, n.º 1, alínea c) do Código dos Contratos Públicos",,,,,,Não aplicável.,Não aplicável.,FALSE
Protese de Revisão da Anca Cimentada,Ajuste Direto Regime Geral,Aquisição de bens móveis,"33160000-9, Técnicas cirúrgicas","Centro Hospitalar Vila Nova de Gaia - Espinho, E. P. E. (508142156)","Medicinália - Cormédica, Lda (500684324)","175,00 €",04-01-2016,23-12-2015,10 dias,"Portugal, Porto, Vila Nova de Gaia","Artigo 24.º, n.º 1, alínea c) do Código dos Contratos Públicos",,,,,,Não aplicável.,Não aplicável.,FALSE
10006616 - AD para Aquisição de Levocarnitina 1000 mg/ 5 ml sol inj fr 5 ml IM IV A.U.E 356,Ajuste Direto Regime Geral,Aquisição de bens móveis,"33600000-6, Produtos farmacêuticos","Centro Hospitalar Vila Nova de Gaia - Espinho, E. P. E. (508142156)","Lusomedicamenta - Soc. Téc. Farmacêutica, SA (507150473)","60,00 €",04-01-2016,04-01-2016,3 dias,"Portugal, Porto, Vila Nova de Gaia","Artigo 24.º, n.º 1, alínea e) do Código dos Contratos Públicos",,,,,,Não aplicável.,Não aplicável.,FALSE
Material para Embolização,Ajuste Direto Regime Geral,Aquisição de bens móveis,"33100000-1, Equipamento médico","Centro Hospitalar Vila Nova de Gaia - Espinho, E. P. E. (508142156)","SOCIME MEDICAL, LDA. (504453939)","3.385,00 €",04-01-2016,23-12-2015,10 dias,"Portugal, Porto, Vila Nova de Gaia","Artigo 24.º, n.º 1, alínea c) do Código dos Contratos Públicos",,,,,,Não aplicável.,Não aplicável.,FALSE
Pacemaker Biventricular H140,Ajuste Direto Regime Geral,Aquisição de bens móveis,"33182210-4, Estimulador cardíaco (pacemaker)","Centro Hospitalar Vila Nova de Gaia - Espinho, E. P. E. (508142156)",St. Jude Medical Portugal (504180746),"5.150,00 €",04-01-2016,23-12-2015,10 dias,"Portugal, Porto, Vila Nova de Gaia","Artigo 24.º, n.º 1, alínea e) do Código dos Contratos Públicos",,,,,,Não aplicável.,Não aplicável.,FALSE
10006516 - AD para Aquisição de CETOCONAZOL 200 MG COMP,Ajuste Direto Regime Geral,Aquisição de bens móveis,"33600000-6, Produtos farmacêuticos","Centro Hospitalar Vila Nova de Gaia - Espinho, E. P. E. (508142156)",LABORATOIRE HRA PHARMA (67420792582),"1.200,00 €",04-01-2016,04-01-2016,3 dias,"Portugal, Porto, Vila Nova de Gaia","Artigo 24.º, n.º 1, alínea e) do Código dos Contratos Públicos",,,,,,Não aplicável.,Não aplicável.,FALSE
Material Consumível para Vertebroplastia,Ajuste Direto Regime Geral,Aquisição de bens móveis,"33141220-8, Cânulas","Centro Hospitalar Vila Nova de Gaia - Espinho, E. P. E. (508142156)",Johnson & Johnson Medical (500153370),"4.340,00 €",04-01-2016,23-12-2015,10 dias,"Portugal, Porto, Vila Nova de Gaia","Artigo 24.º, n.º 1, alínea c) do Código dos Contratos Públicos",,,,,,Não aplicável.,Não aplicável.,FALSE
20006416 - AD para Aquisição de Diverso Instrumental Cirurgico,Ajuste Direto Regime Geral,Aquisição de bens móveis,"33162000-3, Aparelhos e instrumentos para blocos operatórios","Centro Hospitalar Vila Nova de Gaia - Espinho, E. P. E. (508142156)","B BRAUN MEDICAL, LDA. (501506543)","487,72 €",04-01-2016,04-01-2016,3 dias,"Portugal, Porto, Vila Nova de Gaia","Artigo 24.º, n.º 1, alínea e) do Código dos Contratos Públicos",,,,,,Não aplicável.,Não aplicável.,FALSE
Humidificador de Oxigénio Irrecuperável,Ajuste Direto Regime Geral,Aquisição de bens móveis,"33140000-3, Material médico de consumo","Centro Hospitalar Vila Nova de Gaia - Espinho, E. P. E. (508142156)","Linde Saúde - Sociedade Unipessoal, Lda (500125546)","1.708,50 €",04-01-2016,23-12-2015,10 dias,"Portugal, Porto, Vila Nova de Gaia","Artigo 24.º, n.º 1, alínea c) do Código dos Contratos Públicos",,,,,,Não aplicável.,Não aplicável.,FALSE
80006116 - AD para Reparação da Tubagem de Água Fria,Ajuste Direto Regime Geral,Aquisição de serviços,"50800000-3, Serviços de reparação e manutenção diversos","Centro Hospitalar Vila Nova de Gaia - Espinho, E. P. E. (508142156)","A. C. S. B. Martins, Lda (505814072)","396,35 €",04-01-2016,04-01-2016,3 dias,"Portugal, Porto, Vila Nova de Gaia","Artigo 24.º, n.º 1, alínea c) do Código dos Contratos Públicos",,,,,,Não aplicável.,Não aplicável.,FALSE
80006016 - AD para Reparação da Chiller,Ajuste Direto Regime Geral,Aquisição de serviços,"50800000-3, Serviços de reparação e manutenção diversos","Centro Hospitalar Vila Nova de Gaia - Espinho, E. P. E. (508142156)","A. C. S. B. Martins, Lda (505814072)","194,00 €",04-01-2016,04-01-2016,3 dias,"Portugal, Porto, Vila Nova de Gaia","Artigo 24.º, n.º 1, alínea c) do Código dos Contratos Públicos",,,,,,Não aplicável.,Não aplicável.,FALSE
80005916 - AD para Reparação da Central de Intrusão,Ajuste Direto Regime Geral,Aquisição de serviços,"50413000-3, Serviços de reparação e manutenção de aparelhos de controlo","Centro Hospitalar Vila Nova de Gaia - Espinho, E. P. E. (508142156)","Prestibel - Empresa de Segurança, S.A. (501326456)","85,00 €",04-01-2016,04-01-2016,3 dias,"Portugal, Porto, Vila Nova de Gaia","Artigo 24.º, n.º 1, alínea e) do Código dos Contratos Públicos",,,,,,Não aplicável.,Não aplicável.,FALSE
50005816 - AD para Aquisição de Consumíveis de Informática,Ajuste Direto Regime Geral,Aquisição de bens móveis,"30125100-2, Cartuchos de tinta (toner)","Centro Hospitalar Vila Nova de Gaia - Espinho, E. P. E. (508142156)","QUALIPRINT - Recic. Consum. Informaticos, Lda (505170183)","60.053,00 €",04-01-2016,04-01-2016,365 dias,"Portugal, Porto, Vila Nova de Gaia","Artigo 20.º, n.º 1, alínea a) do Código dos Contratos Públicos",,,,,,Não aplicável.,Não aplicável.,FALSE
Cobertura de Plastico Descartável,Ajuste Direto Regime Geral,Aquisição de bens móveis,"33140000-3, Material médico de consumo","Centro Hospitalar Vila Nova de Gaia - Espinho, E. P. E. (508142156)","NOSBET - Equipamentos, Lda (513514872)","2.396,80 €",04-01-2016,23-12-2015,10 dias,"Portugal, Porto, Vila Nova de Gaia","Artigo 24.º, n.º 1, alínea c) do Código dos Contratos Públicos",,,,,,Não aplicável.,Não aplicável.,FALSE
Tesoura Curva Rotativa c/ Eletrocoagulação,Ajuste Direto Regime Geral,Aquisição de bens móveis,"33100000-1, Equipamento médico","Centro Hospitalar Vila Nova de Gaia - Espinho, E. P. E. (508142156)","CAREWILL, Ldª (507484851)","684,00 €",04-01-2016,23-12-2015,10 dias,"Portugal, Porto, Vila Nova de Gaia","Artigo 24.º, n.º 1, alínea c) do Código dos Contratos Públicos",,,,,,Não aplicável.,Não aplicável.,FALSE
Indicador Biologico p/ Vapor,Ajuste Direto Regime Geral,Aquisição de bens móveis,"33100000-1, Equipamento médico","Centro Hospitalar Vila Nova de Gaia - Espinho, E. P. E. (508142156)","3M Portugal, Lda (500193940)","1.428,00 €",04-01-2016,23-12-2015,10 dias,"Portugal, Porto, Vila Nova de Gaia","Artigo 24.º, n.º 1, alínea c) do Código dos Contratos Públicos",,,,,,Não aplicável.,Não aplicável.,FALSE
Trouxa Proctologia,Ajuste Direto Regime Geral,Aquisição de bens móveis,"33140000-3, Material médico de consumo","Centro Hospitalar Vila Nova de Gaia - Espinho, E. P. E. (508142156)","Oasipor, S.A (502260750)","536,00 €",04-01-2016,23-12-2015,10 dias,"Portugal, Porto, Vila Nova de Gaia","Artigo 24.º, n.º 1, alínea c) do Código dos Contratos Públicos",,,,,,Não aplicável.,Não aplicável.,FALSE
Campo Operatório c/ Oculo,Ajuste Direto Regime Geral,Aquisição de bens móveis,"33140000-3, Material médico de consumo","Centro Hospitalar Vila Nova de Gaia - Espinho, E. P. E. (508142156)",MOLNLYCKE HEALTH CARE (511101066),"462,00 €",04-01-2016,23-12-2015,10 dias,"Portugal, Porto, Vila Nova de Gaia","Artigo 24.º, n.º 1, alínea c) do Código dos Contratos Públicos",,,,,,Não aplicável.,Não aplicável.,FALSE
