Objeto do Contrato,Tipo de Procedimento,Tipo(s) de Contrato,CPVs,Entidade(s) Adjudicante(s),Entidade(s) Adjudicatária(s),Preço Contratual,Data de Publicação,Data de Celebração do Contrato,Prazo de Execução,Local de Execução,Fundamentação,Data de Fecho do Contrato,Preço Total Efetivo,Causas das Alterações ao Prazo,Causas das Alterações ao Preço,Estado,N.º registo do Acordo Quadro,Descrição do Acordo Quadro,Procedimento Centralizado
Aquisição de serviços de vigilância e segurança humana para a Região do Algarve,Ao abrigo de acordo-quadro (art.º 259.º),Aquisição de serviços,"79714000-2, Serviços de vigilância","Administração Regional de Saúde do Algarve, I. P. (503148709), Secretaria-Geral do Ministério da Saúde - SNCP (600080684)","Strong - Segurança, S.A. (503257567)","34.134,10 €",21-01-2016,01-01-2016,366 dias,"Portugal, Faro, Faro",Artigo 259.º do Código dos Contratos Públicos,"","","","",,613183,Acordo quadro para a prestação de serviços de vigilância e segurança,TRUE
Aquisição de fornecimento de refeições confecionadas,Ao abrigo de acordo-quadro (art.º 259.º),Aquisição de serviços,"55520000-1, Serviços de fornecimento de refeições (catering)","Administração Regional de Saúde de Lisboa e Vale do Tejo, I. P. (503148776), Administração Regional de Saúde do Algarve, I. P. (503148709), Administração Regional de Saúde do Norte, I. P. (503135593), Secretaria-Geral do Ministério da Saúde - SNCP (600080684)","Consórcio Gertal S.A. Itau e Socigeste, Lda (500126623)","238.294,17 €",21-01-2016,01-01-2016,366 dias,"Portugal, Faro, Faro",Artigo 259.º do Código dos Contratos Públicos,"","","","",,1125527,Acordo quadro para o fornecimento de refeições confecionadas,TRUE
Aquisição de Produtos de Higiene,Concurso público,Aquisição de bens móveis,"33760000-5, Papel higiénico, lenços, toalhas de mão e guardanapos<BR/>33711900-6, Sabão<BR/>33198000-4, Artigos de papel para uso hospitalar","Administração Regional de Saúde do Algarve, I. P. (503148709)","Servisan - Produtos de Higiene, SA (500246530)","9.819,22 €",20-01-2016,20-01-2016,60 dias,"Portugal, Faro, Faro",Artigo 155.º do Código dos Contratos Públicos,29-02-2016,"9.819,22 €","Os produtos foram todos entregues até à data termino do contrato que era fevereiro de 2016, e os pagamentos de faturas efetuados.",não aplicável,,Não aplicável.,Não aplicável.,FALSE
Prestação de Serviços de Limpeza,Concurso público,Aquisição de serviços,"90910000-9, Serviços de limpeza","Administração Regional de Saúde do Algarve, I. P. (503148709)","Operandus - Limpeza Profissional, Lda (502771496)","83.632,13 €",20-01-2016,19-01-2016,60 dias,"Portugal, Faro, Faro",Artigo 155.º do Código dos Contratos Públicos,21-04-2016,"66.514,00 €",o contrato foi relativo aos meses de janeiro e fevereiro e com o pagamento de todas as faturas deu-se por terminado.,valor das horas de limpeza previstas não foram todas gastas.,,Não aplicável.,Não aplicável.,FALSE
SC/217/2015 - Aquisição de Medicamentos Gerais.10,Ao abrigo de acordo-quadro (art.º 259.º),Aquisição de bens móveis,"33690000-3, Medicamentos vários","Administração Regional de Saúde do Algarve, I. P. (503148709)","Laboratório Medinfar, S.A. (500384045)","21,80 €",20-01-2016,30-12-2015,2 dias,"Portugal, Faro, Faro",Artigo 259.º do Código dos Contratos Públicos,"","","","",,1179911,"CONCURSO PÚBLICO PARA A CELEBRAÇÃO DE CONTRATOS PÚBLICOS DE APROVISIONAMENTO PARA A ÁREA DA SAÚDE, MEDICAMENTOS DO SISTEMA NERVOSO CEREBROSPINAL, EXCETO: ANESTÉSICOS, RELAXANTES MUSCULARES, ANALGÉSICOS, ANTIPIRÉTICOS, ANTIDEPRESSORES E ANTIPSICÓTICOS, ÀS INSTITUIÇÕES E SERVIÇOS DO SERVIÇO NACIONAL DE SAÚDE",FALSE
SC/217/2015 - Aquisição de Medicamentos Gerais.10,Ao abrigo de acordo-quadro (art.º 259.º),Aquisição de bens móveis,"33690000-3, Medicamentos vários","Administração Regional de Saúde do Algarve, I. P. (503148709)","Hospira, Portugal, Lda. (502918098)","181,08 €",20-01-2016,20-11-2015,41 dias,"Portugal, Faro, Faro",Artigo 259.º do Código dos Contratos Públicos,"","","","",,1179911,"CONCURSO PÚBLICO PARA A CELEBRAÇÃO DE CONTRATOS PÚBLICOS DE APROVISIONAMENTO PARA A ÁREA DA SAÚDE, MEDICAMENTOS DO SISTEMA NERVOSO CEREBROSPINAL, EXCETO: ANESTÉSICOS, RELAXANTES MUSCULARES, ANALGÉSICOS, ANTIPIRÉTICOS, ANTIDEPRESSORES E ANTIPSICÓTICOS, ÀS INSTITUIÇÕES E SERVIÇOS DO SERVIÇO NACIONAL DE SAÚDE",FALSE
SC/217/2015 - AQUISIÇÃO DE MEDICAMENTOS GERAIS.10,Ao abrigo de acordo-quadro (art.º 259.º),Aquisição de bens móveis,"33690000-3, Medicamentos vários","Administração Regional de Saúde do Algarve, I. P. (503148709)","Aurovitas - Unipessoal, LDa. (513053239)","392,54 €",19-01-2016,18-11-2015,43 dias,"Portugal, Faro, Faro",Artigo 259.º do Código dos Contratos Públicos,"","","","",,1179911,"CONCURSO PÚBLICO PARA A CELEBRAÇÃO DE CONTRATOS PÚBLICOS DE APROVISIONAMENTO PARA A ÁREA DA SAÚDE, MEDICAMENTOS DO SISTEMA NERVOSO CEREBROSPINAL, EXCETO: ANESTÉSICOS, RELAXANTES MUSCULARES, ANALGÉSICOS, ANTIPIRÉTICOS, ANTIDEPRESSORES E ANTIPSICÓTICOS, ÀS INSTITUIÇÕES E SERVIÇOS DO SERVIÇO NACIONAL DE SAÚDE",FALSE
SC/217/2015 - AQUISIÇÃO DE MEDICAMENTOS GERAIS.10,Ao abrigo de acordo-quadro (art.º 259.º),Aquisição de bens móveis,"33690000-3, Medicamentos vários","Administração Regional de Saúde do Algarve, I. P. (503148709)",Glaxo Smith Kline (500139962),"91,32 €",19-01-2016,10-11-2015,50 dias,"Portugal, Faro, Faro",Artigo 259.º do Código dos Contratos Públicos,"","","","",,1179911,"CONCURSO PÚBLICO PARA A CELEBRAÇÃO DE CONTRATOS PÚBLICOS DE APROVISIONAMENTO PARA A ÁREA DA SAÚDE, MEDICAMENTOS DO SISTEMA NERVOSO CEREBROSPINAL, EXCETO: ANESTÉSICOS, RELAXANTES MUSCULARES, ANALGÉSICOS, ANTIPIRÉTICOS, ANTIDEPRESSORES E ANTIPSICÓTICOS, ÀS INSTITUIÇÕES E SERVIÇOS DO SERVIÇO NACIONAL DE SAÚDE",FALSE
SC/217/2015 - Aquisição de Medicamentos Gerais.10,Ao abrigo de acordo-quadro (art.º 259.º),Aquisição de bens móveis,"33690000-3, Medicamentos vários","Administração Regional de Saúde do Algarve, I. P. (503148709)","Tecnifar, S.A. (500280436)","395,00 €",19-01-2016,02-11-2015,60 dias,"Portugal, Faro, Faro",Artigo 259.º do Código dos Contratos Públicos,"","","","",,1179911,"CONCURSO PÚBLICO PARA A CELEBRAÇÃO DE CONTRATOS PÚBLICOS DE APROVISIONAMENTO PARA A ÁREA DA SAÚDE, MEDICAMENTOS DO SISTEMA NERVOSO CEREBROSPINAL, EXCETO: ANESTÉSICOS, RELAXANTES MUSCULARES, ANALGÉSICOS, ANTIPIRÉTICOS, ANTIDEPRESSORES E ANTIPSICÓTICOS, ÀS INSTITUIÇÕES E SERVIÇOS DO SERVIÇO NACIONAL DE SAÚDE",FALSE
SP/251/2015- PRESTAÇÃO DE SERVIÇOS DE AUDITORIA FINANCEIRAS REFERENTE ÀS CONTAS DO ANO 2014. (Proc. - SPMS- 2015UMC40 - CPA n.º 2014/104),Ao abrigo de acordo-quadro (art.º 259.º),Aquisição de serviços,"79212100-4, Serviços de auditoria financeira","Administração Regional de Saúde do Algarve, I. P. (503148709)","ABC-Azevedo Rodrigues, Batalha, Costa e Assoc., Soc. de Rev. Oficiais de Contas, Lda (503188220)","8.120,00 €",11-01-2016,28-12-2015,60 dias,"Portugal, Faro, Faro",Artigo 259.º do Código dos Contratos Públicos,27-09-2016,"8.120,00 €",3.ª fase - Relatório Final.,"",,1513267,Celebração de AQ para prestação de serviços de auditoria e certificação de SI na área da saúde,FALSE
