Objeto do Contrato,Tipo de Procedimento,Tipo(s) de Contrato,CPVs,Entidade(s) Adjudicante(s),Entidade(s) Adjudicatária(s),Preço Contratual,Data de Publicação,Data de Celebração do Contrato,Prazo de Execução,Local de Execução,Fundamentação,Data de Fecho do Contrato,Preço Total Efetivo,Causas das Alterações ao Prazo,Causas das Alterações ao Preço,Estado,N.º registo do Acordo Quadro,Descrição do Acordo Quadro,Procedimento Centralizado
Aquisição de fornecimento de refeições confecionadas,Ao abrigo de acordo-quadro (art.º 259.º),Aquisição de serviços,"55520000-1, Serviços de fornecimento de refeições (catering)","Secretaria-Geral do Ministério da Saúde - SNCP (600080684), Administração Regional de Saúde do Norte, I. P. (503135593), Administração Regional de Saúde de Lisboa e Vale do Tejo, I. P. (503148776), Administração Regional de Saúde do Algarve, I. P. (503148709)","Consórcio Gertal S.A. Itau e Socigeste, Lda (500126623)","238.294,17 €",21-01-2016,01-01-2016,366 dias,"Portugal, Faro, Faro",Artigo 259.º do Código dos Contratos Públicos,"","",,"",,1125527,Acordo quadro para o fornecimento de refeições confecionadas,TRUE
Aquisição de 1.000.000 Preservativo masculino e 21.000 Preservativo masculino extra-forte lubrificado,Ao abrigo de acordo-quadro (art.º 258.º),Aquisição de bens móveis,"33600000-6, Produtos farmacêuticos","Administração Regional de Saúde do Norte, I. P. (503135593)","Ezequiel Panao Jorge, Lda. (501412727)","32.777,00 €",20-01-2016,25-03-2015,281 dias,"Portugal, Porto, Porto",Artigo 258.º do Código dos Contratos Públicos,09-10-2015,"32.777,00 €",,"",,613817,"CONCURSO PÚBLICO PARA A CELEBRAÇÃO DE CONTRATOS PÚBLICOS DE APROVISIONAMENTO PARA A ÁREA DA SAÚDE, COM VISTA AO FORNECIMENTO DE CONTRACETIVOS ORAIS, PROFILATICOS E MECANICO, ÀS INSTITUIÇÕES E SERVIÇOS DO SERVIÇO NACIONAL DE SAÚDE",FALSE
"Aquisição de 155.000 emb. de Desogestrel 0,15 mg + Etinilestradiol 0,03 mg, Comp. (3/6 CICLOS); 390.000 emb. de Desogestrel 0,15 mg + Etinilestradiol 0,02 mg, Comp (3/6 CICLOS); 500 Levonorgestrel 1,5 mg, Comp.",Ao abrigo de acordo-quadro (art.º 258.º),Aquisição de bens móveis,"33600000-6, Produtos farmacêuticos","Administração Regional de Saúde do Norte, I. P. (503135593)","Logifarma, Logística Farmacêutica, S.A. (503934640)","149.370,00 €",20-01-2016,25-03-2015,281 dias,"Portugal, Porto, Porto",Artigo 258.º do Código dos Contratos Públicos,11-01-2016,"137.890,68 €",,As quantidades tiveram que ser ajustadas ao número de unidades por embalagem.,,613817,"CONCURSO PÚBLICO PARA A CELEBRAÇÃO DE CONTRATOS PÚBLICOS DE APROVISIONAMENTO PARA A ÁREA DA SAÚDE, COM VISTA AO FORNECIMENTO DE CONTRACETIVOS ORAIS, PROFILATICOS E MECANICO, ÀS INSTITUIÇÕES E SERVIÇOS DO SERVIÇO NACIONAL DE SAÚDE",FALSE
"Aquisição de 200.000 emb. de Etinilestradiol 0,02 mg + Levonorgestrel 0,1 mg, Comp. (3/6 CICLOS)",Ao abrigo de acordo-quadro (art.º 258.º),Aquisição de bens móveis,"33600000-6, Produtos farmacêuticos","Administração Regional de Saúde do Norte, I. P. (503135593)","GENERIS FARMACÊUTICA, S.A. (508107997)","310.000,00 €",20-01-2016,01-04-2015,274 dias,"Portugal, Porto, Porto",Artigo 258.º do Código dos Contratos Públicos,24-11-2015,"283.843,20 €",,As quantidades tiveram que ser ajustadas ao número de unidades por embalagem.,,613817,"CONCURSO PÚBLICO PARA A CELEBRAÇÃO DE CONTRATOS PÚBLICOS DE APROVISIONAMENTO PARA A ÁREA DA SAÚDE, COM VISTA AO FORNECIMENTO DE CONTRACETIVOS ORAIS, PROFILATICOS E MECANICO, ÀS INSTITUIÇÕES E SERVIÇOS DO SERVIÇO NACIONAL DE SAÚDE",FALSE
"Aquisição de 1.700 emb. Ciproterona 2 mg + Etinilestradiol 0,035 mg, Comp. (1/3 CICLOS); 23.000 emb. Etinilestradiol 0,03 mg + Levonorgestrel 0,15 mg, Comp. (3/6 CICLOS); 400.000 emb. Etinilestradiol 0,03 mg + Gestodeno 0,075 mg, Comp. (3/6 CICLOS); 1.250.000 emb. Etinilestradiol 0,02 mg + Gestodeno 0,075 mg, Comp. (3/6 CICLOS); 300 sistemas DIU Levonorgestrel 20 mcg/24h.",Ao abrigo de acordo-quadro (art.º 258.º),Aquisição de bens móveis,"33600000-6, Produtos farmacêuticos","Administração Regional de Saúde do Norte, I. P. (503135593)","BAYER PORTUGAL, S.A. (500043256)","767.117,00 €",20-01-2016,01-04-2015,274 dias,"Portugal, Porto, Porto",Artigo 258.º do Código dos Contratos Públicos,28-12-2015,"667.459,26 €",,As quantidades tiveram que ser ajustadas ao número de unidades por embalagem.,,613817,"CONCURSO PÚBLICO PARA A CELEBRAÇÃO DE CONTRATOS PÚBLICOS DE APROVISIONAMENTO PARA A ÁREA DA SAÚDE, COM VISTA AO FORNECIMENTO DE CONTRACETIVOS ORAIS, PROFILATICOS E MECANICO, ÀS INSTITUIÇÕES E SERVIÇOS DO SERVIÇO NACIONAL DE SAÚDE",FALSE
Aquisição de 3.400 implantes subcutâneos de ETONOGESTREL 68mg,Ao abrigo de acordo-quadro (art.º 258.º),Aquisição de bens móveis,"33600000-6, Produtos farmacêuticos","Administração Regional de Saúde do Norte, I. P. (503135593)","MERCK SHARP & DOHME, LDA (500191360)","305.320,00 €",20-01-2016,05-08-2015,148 dias,"Portugal, Porto, Porto",Artigo 258.º do Código dos Contratos Públicos,20-11-2015,"305.320,00 €",,"",,613817,"CONCURSO PÚBLICO PARA A CELEBRAÇÃO DE CONTRATOS PÚBLICOS DE APROVISIONAMENTO PARA A ÁREA DA SAÚDE, COM VISTA AO FORNECIMENTO DE CONTRACETIVOS ORAIS, PROFILATICOS E MECANICO, ÀS INSTITUIÇÕES E SERVIÇOS DO SERVIÇO NACIONAL DE SAÚDE",FALSE
Aquisição de 1.000 seringas de ACETATO MEDROXIPROGESTERONA 150 mg,Ao abrigo de acordo-quadro (art.º 258.º),Aquisição de bens móveis,"33600000-6, Produtos farmacêuticos","Administração Regional de Saúde do Norte, I. P. (503135593)",Laboratório Pfizer (500162166),"1.589,90 €",20-01-2016,07-07-2015,177 dias,"Portugal, Porto, Porto",Artigo 258.º do Código dos Contratos Públicos,30-10-2015,"1.589,90 €",,"",,613817,"CONCURSO PÚBLICO PARA A CELEBRAÇÃO DE CONTRATOS PÚBLICOS DE APROVISIONAMENTO PARA A ÁREA DA SAÚDE, COM VISTA AO FORNECIMENTO DE CONTRACETIVOS ORAIS, PROFILATICOS E MECANICO, ÀS INSTITUIÇÕES E SERVIÇOS DO SERVIÇO NACIONAL DE SAÚDE",FALSE
"Aquisição de 3.400 implantes subcutâneos ETONOGESTREL 68 mg, 300.000 ciclos DESOGESTREL 75 mcg, e 31.000 sistemas de libertação vaginal ETINILESTRADIOL 0,015 mg + ETONOGESTREL 12 mg/24h ",Ao abrigo de acordo-quadro (art.º 258.º),Aquisição de bens móveis,"33600000-6, Produtos farmacêuticos","Administração Regional de Saúde do Norte, I. P. (503135593)","MERCK SHARP & DOHME, LDA (500191360)","1.215.190,00 €",20-01-2016,25-03-2015,281 dias,"Portugal, Porto, Porto",Artigo 258.º do Código dos Contratos Públicos,20-11-2015,"1.215.190,00 €",,"",,613817,"CONCURSO PÚBLICO PARA A CELEBRAÇÃO DE CONTRATOS PÚBLICOS DE APROVISIONAMENTO PARA A ÁREA DA SAÚDE, COM VISTA AO FORNECIMENTO DE CONTRACETIVOS ORAIS, PROFILATICOS E MECANICO, ÀS INSTITUIÇÕES E SERVIÇOS DO SERVIÇO NACIONAL DE SAÚDE",FALSE
"Aquisição de contracetivos orais, profiláticos e mecânicos",Ao abrigo de acordo-quadro (art.º 258.º),Aquisição de bens móveis,"33600000-6, Produtos farmacêuticos","Administração Regional de Saúde do Norte, I. P. (503135593)","Clinifar - Prod. Clín. Farmacêuticos, S.A. (503281115)","14.145,00 €",19-01-2016,25-03-2015,281 dias,"Portugal, Porto, Porto",Artigo 258.º do Código dos Contratos Públicos,09-10-2015,"14.005,00 €",,As quantidades tiveram que ser ajustadas ao número de unidades por embalagem.,,613817,"CONCURSO PÚBLICO PARA A CELEBRAÇÃO DE CONTRATOS PÚBLICOS DE APROVISIONAMENTO PARA A ÁREA DA SAÚDE, COM VISTA AO FORNECIMENTO DE CONTRACETIVOS ORAIS, PROFILATICOS E MECANICO, ÀS INSTITUIÇÕES E SERVIÇOS DO SERVIÇO NACIONAL DE SAÚDE",FALSE
Serviços de reparação de digitalizador de RX,Ajuste Direto Regime Geral,Aquisição de serviços,"50421200-4, Serviços de reparação e manutenção de equipamentos de raios X","Administração Regional de Saúde do Norte, I. P. (503135593)","Multipore - Comércio Internacional, Lda. (501471111)","678,20 €",18-01-2016,22-09-2015,2 dias,"Portugal, Viseu, Cinfães","Artigo 20.º, n.º 1, alínea a) do Código dos Contratos Públicos",22-10-2015,"678,20 €",,"",,Não aplicável.,Não aplicável.,FALSE
Serviços de reparação e de manutenção às grandes UPS's,Ajuste Direto Regime Geral,Aquisição de serviços,"50000000-5, Serviços de reparação e manutenção","Administração Regional de Saúde do Norte, I. P. (503135593)","LCPOWER - Luis Carneiro, S.A. (503074675)","3.072,12 €",18-01-2016,10-12-2015,7 dias,"Portugal, Vila Real, Vila Real<BR/>Portugal, Porto, Porto","Artigo 20.º, n.º 1, alínea a) do Código dos Contratos Públicos",16-12-2015,"3.072,12 €",,"",,Não aplicável.,Não aplicável.,FALSE
Serviços de Manutenção de Equipamentos F5,Ajuste Direto Regime Geral,Aquisição de serviços,"50312000-5, Manutenção e reparação de equipamento informático","Administração Regional de Saúde do Norte, I. P. (503135593)","GFI Portugal - Tecnologias de Informação, SA (502726890)","1.640,00 €",18-01-2016,29-07-2015,120 dias,"Portugal, Porto, Porto","Artigo 20.º, n.º 1, alínea a) do Código dos Contratos Públicos",31-10-2015,"1.640,00 €",,"",,Não aplicável.,Não aplicável.,FALSE
Aquisição de serviços de Vigilância combinados  - serviços de vigilância humana e de ligação a central de receção e de monitorização de alarmes - Unidades DICAD.,Ajuste Direto Regime Geral,Aquisição de serviços,"79714000-2, Serviços de vigilância","Administração Regional de Saúde do Norte, I. P. (503135593)","Prestibel - Empresa de Segurança, S.A. (501326456)","189.345,87 €",14-01-2016,01-07-2014,212 dias,"Portugal, Braga, Braga<BR/>Portugal, Braganca, Bragança<BR/>Portugal, Porto, Porto<BR/>Portugal, Viana do Castelo, Viana do Castelo","Artigo 24.º, n.º 1, alínea c) do Código dos Contratos Públicos",31-07-2015,"189.345,87 €",,"",,Não aplicável.,Não aplicável.,FALSE
"Aquisição de serviços de ligação à Central de Receção e Monitorização de Alarmes (Intrusão e Incêndio) com aluguer de equipamentos e Ronda. para os serviços centrais DSP, Porto Ocidental e Porto Oriental.",Ajuste Direto Regime Geral,Aquisição de serviços,"79711000-1, Serviços de controlo de alarmes","Administração Regional de Saúde do Norte, I. P. (503135593)","Prosegur - Companhia de Segurança, Lda (501290567)","7.488,96 €",14-01-2016,19-12-2014,365 dias,"Portugal, Porto, Porto","Artigo 24.º, n.º 1, alínea e) do Código dos Contratos Públicos",31-12-2015,"7.488,96 €",,"",,Não aplicável.,Não aplicável.,FALSE
Reparação de monitores,Ajuste Direto Regime Geral,Aquisição de serviços,"50312000-5, Manutenção e reparação de equipamento informático","Administração Regional de Saúde do Norte, I. P. (503135593)","NetFlow - Desenvolvimento de Sistemas de informação, Lda (507596137)","860,00 €",13-01-2016,10-12-2015,5 dias,"Portugal, Porto, Porto","Artigo 20.º, n.º 1, alínea a) do Código dos Contratos Públicos",11-12-2015,"860,00 €",,"",,Não aplicável.,Não aplicável.,FALSE
Aquisição de serviço de reparação de fotómetro de chama,Ajuste Direto Regime Geral,Aquisição de serviços,"50400000-9, Serviços de reparação e manutenção de equipamento médico e de precisão","Administração Regional de Saúde do Norte, I. P. (503135593)","Izasa II Scientific Unipessoal, Lda. (513252088)","330,00 €",13-01-2016,12-10-2015,81 dias,"Portugal, Braga, Braga","Artigo 20.º, n.º 1, alínea a) do Código dos Contratos Públicos",13-10-2015,"330,00 €",,"",,Não aplicável.,Não aplicável.,FALSE
Reparação de impressoras,Ajuste Direto Regime Geral,Aquisição de serviços,"50312000-5, Manutenção e reparação de equipamento informático","Administração Regional de Saúde do Norte, I. P. (503135593)","NetFlow - Desenvolvimento de Sistemas Informação, Lda. (507596137)","2.035,00 €",13-01-2016,10-12-2015,7 dias,"Portugal, Porto, Porto","Artigo 20.º, n.º 1, alínea a) do Código dos Contratos Públicos",11-12-2015,"2.035,00 €",,"",,Não aplicável.,Não aplicável.,FALSE
A.P. 2181 - APROV - VR 15006378 - Aquisição de Bens Medicamentos - Aquisição de 6.496 compressas de Claritromicina 500 mg Comp,Ao abrigo de acordo-quadro (art.º 259.º),Aquisição de bens móveis,"33600000-6, Produtos farmacêuticos","Administração Regional de Saúde do Norte, I. P. (503135593)","GENERIS FARMACÊUTICA,SA     (508107997)","1.201,76 €",13-01-2016,27-11-2015,60 dias,"Portugal, Porto, Maia<BR/>Portugal, Vila Real, Vila Real",Artigo 259.º do Código dos Contratos Públicos,30-11-2015,"1.201,76 €",,"",,1326195,ACORDO QUADRO PARA FORNECIMENTO DE MEDICAMENTOS ANTI-INFECIOSOS: EXCETO ANTIVÍRICOS E ANTIFÚNGICOS ÀS INSTITUIÇÕES E SERVIÇOS DO SERVIÇO NACIONAL DE SAÚDE,FALSE
A.P. 2181 - APROV - VR 15006378 - Aquisição de Bens Medicamentos - Aquisição de 3.500 compressas Levofloxacina 500 mg,Ao abrigo de acordo-quadro (art.º 259.º),Aquisição de bens móveis,"33600000-6, Produtos farmacêuticos","Administração Regional de Saúde do Norte, I. P. (503135593)",A.P. 2181 - APROV - VR 15006378 - Aquisição de Bens Medicamentos (507045491),"630,00 €",13-01-2016,27-11-2015,60 dias,"Portugal, Porto, Maia<BR/>Portugal, Vila Real, Vila Real",Artigo 259.º do Código dos Contratos Públicos,03-12-2015,"630,00 €",,"",,1326195,ACORDO QUADRO PARA FORNECIMENTO DE MEDICAMENTOS ANTI-INFECIOSOS: EXCETO ANTIVÍRICOS E ANTIFÚNGICOS ÀS INSTITUIÇÕES E SERVIÇOS DO SERVIÇO NACIONAL DE SAÚDE,FALSE
A.P. 2190 - APRV - VR 15006385 - Aquisição de 1.488 frascos de Solução alcoólica anti-séptica e dermoprotectora 100 mL,Ao abrigo de acordo-quadro (art.º 259.º),Aquisição de bens móveis,"33140000-3, Material médico de consumo","Administração Regional de Saúde do Norte, I. P. (503135593)","VYGON (PORTUGAL), LDA    (503232785)","996,96 €",13-01-2016,01-12-2015,60 dias,"Portugal, Vila Real, Vila Real<BR/>Portugal, Porto, Maia",Artigo 259.º do Código dos Contratos Públicos,02-12-2015,"996,96 €",,"",,549298,"Concurso Público para a celebração de Contratos Publicos de Aprovisionamento para a área da saúde com vista ao fornecimento de Antisepticos, Desinfetantes e Outros, às Instituições e Serviços do Serviço Nacional de Saúde.",FALSE
"Aquisição de 60 unidades de Brometo de Ipratrópio 20 µg/dose, Sol. Pressur. Inal., Recip. Press.",Ao abrigo de acordo-quadro (art.º 258.º),Aquisição de bens móveis,"33600000-6, Produtos farmacêuticos","Administração Regional de Saúde do Norte, I. P. (503135593)","Unifarma - União Internacional de Laboratórios Farmacêuticos, Lda (500293023)","251,40 €",13-01-2016,11-11-2015,64 dias,"Portugal, Porto, Porto<BR/>Portugal, Vila Real, Vila Real",Artigo 258.º do Código dos Contratos Públicos,16-11-2015,"251,40 €",,"",,1638654,CP 2015/12 - Acordo quadro para fornecimento de Medicamentos do Aparelho Respiratório às Instituições e Serviços do Serviço Nacional de Saúde,FALSE
Aquisição de 5 telefones  e terminal interface,Ajuste Direto Regime Geral,Aquisição de bens móveis,"32550000-3, Equipamento telefónico","Administração Regional de Saúde do Norte, I. P. (503135593)","Primacom-Projecto, Inst., Manut., Comunicações, Lda (503114944)","340,00 €",13-01-2016,25-11-2015,7 dias,"Portugal, Aveiro, São João da Madeira","Artigo 20.º, n.º 1, alínea a) do Código dos Contratos Públicos",25-11-2015,"340,00 €",,"",,Não aplicável.,Não aplicável.,FALSE
Serviços de mudança e instalação de central telefónica,Ajuste Direto Regime Geral,Aquisição de serviços,"51300000-5, Serviços de instalação de equipamento para comunicação","Administração Regional de Saúde do Norte, I. P. (503135593)","Primacom-Projecto, Inst. Manut. Comunicações, Lda. (503114944)","1.080,00 €",13-01-2016,09-09-2015,7 dias,"Portugal, Aveiro, São João da Madeira","Artigo 20.º, n.º 1, alínea a) do Código dos Contratos Públicos",25-11-2015,"1.080,00 €",,"",,Não aplicável.,Não aplicável.,FALSE
