freguesia,acronym,validVotesPercentage,votes,dicofre
Sever,PS,44.89,123,171110
Sever,PPD/PSD.CDS-PP,41.24,113,171110
Sever,PCP-PEV,3.28,9,171110
Sever,MPT,2.92,8,171110
Sever,B.E.,2.55,7,171110
Sever,PCTP/MRPP,2.19,6,171110
Sever,PTP,1.46,4,171110
Sever,PAN,0.73,2,171110
Sever,L,0.36,1,171110
Sever,PPM,0.36,1,171110
Sever,MAS,0,0,171110
Sever,PDA,0,0,171110
Sever,PND,0,0,171110
Sever,PNR,0,0,171110
Sever,POUS,0,0,171110
Sever,PPV,0,0,171110
