Objeto do Contrato,Tipo de Procedimento,Tipo(s) de Contrato,CPVs,Entidade(s) Adjudicante(s),Entidade(s) Adjudicatária(s),Preço Contratual,Data de Publicação,Data de Celebração do Contrato,Prazo de Execução,Local de Execução,Fundamentação,Data de Fecho do Contrato,Preço Total Efetivo,Causas das Alterações ao Prazo,Causas das Alterações ao Preço,Estado,N.º registo do Acordo Quadro,Descrição do Acordo Quadro,Procedimento Centralizado
420085/2018 - LENTES P/ FACO,Ajuste Direto Regime Geral,Aquisição de bens móveis,"33731110-7, Lentes intraoculares","Hospital Distrital de Santarém, E. P. E. (506361462)","Abbott Medical Optics Spain, S.L. (980262364)","9.873,00 €",29-08-2018,28-05-2018,90 dias,"Portugal, Santarém, Santarém","Artigo 20.º, n.º 1, alínea d) do Código dos Contratos Públicos",,,,,,Não aplicável.,Não aplicável.,FALSE
Agulhas de Anestesia,Ajuste Direto Regime Geral,Aquisição de bens móveis,"33141321-6, Agulhas de anestesia","Hospital Distrital de Santarém, EPE (506361462)",SFERAMED (509762344),"298,00 €",28-08-2018,18-01-2018,90 dias,"Portugal, Santarém, Santarém","Artigo 20.º, n.º 1, alínea d) do Código dos Contratos Públicos",,,,,,Não aplicável.,Não aplicável.,FALSE
Aquisição de Clips- Bloco Operatório,Ajuste Direto Regime Geral,Aquisição de bens móveis,"33141121-4, Suturas cirúrgicas","Hospital Distrital de Santarém, EPE (506361462)",B. BRAUN (501506543),"2.700,00 €",28-08-2018,15-01-2018,90 dias,"Portugal, Santarém, Santarém","Artigo 20.º, n.º 1, alínea d) do Código dos Contratos Públicos",,,,,,Não aplicável.,Não aplicável.,FALSE
Material Laparoscopia,Ajuste Direto Regime Geral,Aquisição de bens móveis,"33140000-3, Material médico de consumo","Hospital Distrital de Santarém, E. P. E. (506361462)","MEDTRONIC PORTUGAL, LDA (504223933)","9.180,00 €",28-08-2018,25-01-2018,90 dias,"Portugal, Santarém, Santarém","Artigo 20.º, n.º 1, alínea d) do Código dos Contratos Públicos",,,,,,Não aplicável.,Não aplicável.,FALSE
Aquisição Material Laparoscopia,Ajuste Direto Regime Geral,Aquisição de bens móveis,"33140000-3, Material médico de consumo","Hospital Distrital de Santarém, EPE (506361462)",SOCIME MEDICAL (504453939),"3.720,96 €",28-08-2018,18-01-2018,90 dias,"Portugal, Santarém, Santarém","Artigo 20.º, n.º 1, alínea d) do Código dos Contratos Públicos",,,,,,Não aplicável.,Não aplicável.,FALSE
420001/2018 - aquisição de agulhas de biopsia ossea,Ajuste Direto Regime Geral,Aquisição de bens móveis,"33141323-0, Agulhas de biópsia","Hospital Distrital de Santarém, EPE (506361462)",Overpharma (505792362),"578,00 €",28-08-2018,10-01-2018,90 dias,"Portugal, Santarém, Santarém","Artigo 20.º, n.º 1, alínea a) do Código dos Contratos Públicos",,,,,,Não aplicável.,Não aplicável.,FALSE
PRESTAÇÃO SERVIÇOS MANUTENÇÃO EQUIPAMENTO TOSHIBA,Ajuste Direto Regime Geral,Aquisição de serviços,"50000000-5, Serviços de reparação e manutenção","Hospital Distrital de Santarém, E. P. E. (506361462)",CANON MEDICAL SYSTEMS S.A (980023700),"38.000,00 €",28-08-2018,15-06-2018,365 dias,"Portugal, Santarém, Santarém","Artigo 24.º, n.º 1, alínea e), subalínea iii) do Código dos Contratos Públicos",,,,,,Não aplicável.,Não aplicável.,FALSE
120037/2018 - AQUISIÇÃO DE LENTES P/ CIRURGIA DA CATARATA,Concurso público,Aquisição de bens móveis,"33731110-7, Lentes intraoculares","Hospital Distrital de Santarém, EPE (506361462)",JJ Surgical Vision Spain S.L. (980262364),"106.875,00 €",28-08-2018,23-07-2018,243 dias,"Portugal, Santarém, Santarém","Artigo 20.º, n.º 1, alínea a) do Código dos Contratos Públicos",,,,,,Não aplicável.,Não aplicável.,FALSE
120018/2018 - AQUISIÇÃO DE MATERIAL DE OSTEOSSINTESE,Concurso público,Aquisição de bens móveis,"33184100-4, Implantes cirúrgicos","Hospital Distrital de Santarém, E. P. E. (506361462)","EXPOMÉDICA - SOC. EXPORTAÇÃO IMPORTAÇÃO MATERIAL MÉDICO,  (501886621)","16.246,60 €",28-08-2018,19-04-2018,365 dias,"Portugal, Santarém, Santarém","Artigo 20.º, n.º 1, alínea b) do Código dos Contratos Públicos",,,,,,Não aplicável.,Não aplicável.,FALSE
120015/2018 - PROTESES AUDITIVAS,Concurso público,Aquisição de bens móveis,"33185000-0, Próteses auditivas","Hospital Distrital de Santarém, E. P. E. (506361462)",GAES (503134139),"22.422,00 €",28-08-2018,16-03-2018,365 dias,"Portugal, Santarém, Santarém","Artigo 20.º, n.º 1, alínea b) do Código dos Contratos Públicos",,,,,,Não aplicável.,Não aplicável.,FALSE
Concurso publico 190006/2018,Concurso público,Aquisição de serviços,"85000000-9, Serviços de saúde e acção social","Hospital Distrital de Santarém, EPE (506361462)",GFS - SERVIÇOS MÉDICOS DO CORAÇÃO LDA (503918113),"18.850,00 €",28-08-2018,18-07-2018,183 dias,"Portugal, Santarém, Santarém","Artigo 20.º, n.º 1, alínea a) do Código dos Contratos Públicos",,,,,,Não aplicável.,Não aplicável.,FALSE
Concurso publico 190006/2018,Concurso público,Aquisição de serviços,"85000000-9, Serviços de saúde e acção social","Hospital Distrital de Santarém, EPE (506361462)","Ressonância Magnética - Sociedade de Diagnóstico e Investigação, S.A. (501834249)","2.010,00 €",28-08-2018,17-07-2018,183 dias,"Portugal, Santarém, Santarém","Artigo 20.º, n.º 1, alínea a) do Código dos Contratos Públicos",,,,,,Não aplicável.,Não aplicável.,FALSE
Concurso publico 190006/2018,Concurso público,Aquisição de serviços,"85000000-9, Serviços de saúde e acção social","Hospital Distrital de Santarém, EPE (506361462)","Ressonância Magnética - Sociedade de Diagnóstico e Investigação, S.A. (501834249)","1.200,00 €",28-08-2018,17-07-2018,183 dias,"Portugal, Santarém, Santarém","Artigo 20.º, n.º 1, alínea a) do Código dos Contratos Públicos",,,,,,Não aplicável.,Não aplicável.,FALSE
Concurso publico 190006/2018 - PRESTAÇÃO SERVIÇOS MCDT - RM COM ANESTESIA E OUTROS EXAMES,Concurso público,Aquisição de serviços,"85000000-9, Serviços de saúde e acção social","Hospital Distrital de Santarém, EPE (506361462)",DIATON - CENTRO DE TOMOGRAFIA COMPUTORIZADA S.A. (500972974),"7.588,88 €",28-08-2018,17-07-2018,183 dias,"Portugal, Santarém, Santarém","Artigo 20.º, n.º 1, alínea a) do Código dos Contratos Públicos",,,,,,Não aplicável.,Não aplicável.,FALSE
PRESTAÇÃO SERVIÇOS MANUTENÇÃO CENTRAL INCÊNDIOS - 2018,Ajuste Direto Regime Geral,Aquisição de serviços,"50000000-5, Serviços de reparação e manutenção","Hospital Distrital de Santarém, E. P. E. (506361462)",Paralarme-Comércio de Sistemas de Segurança Lda (506272907),"2.693,07 €",27-08-2018,25-08-2018,365 dias,"Portugal, Santarém, Santarém","Artigo 20.º, n.º 1, alínea d) do Código dos Contratos Públicos",,,,,,Não aplicável.,Não aplicável.,FALSE
PRESTAÇÃO SERVIÇOS MCDT - NEUROLOGIA E OUTROS,Ajuste Direto Regime Geral,Aquisição de serviços,"85000000-9, Serviços de saúde e acção social","Hospital Distrital de Santarém, E. P. E. (506361462)","NRD-Núcleo de Rádiodiagnóstico, SA. (501495029)","48.700,00 €",27-08-2018,08-01-2018,357 dias,"Portugal, Santarém, Santarém","Artigo 27.º, n.º 1, alínea i) do Código dos Contratos Públicos",,,,,,Não aplicável.,Não aplicável.,FALSE
120012/2017 - AQUISIÇÃO DE MATERIAL DE GASTRENTEROLOGIA,Concurso público,Aquisição de bens móveis,"33140000-3, Material médico de consumo","Hospital Distrital de Santarém, E. P. E. (506361462)",Fresenius Kabi (504293753),"518,50 €",27-08-2018,01-01-2018,365 dias,"Portugal, Santarém, Santarém","Artigo 20.º, n.º 1, alínea b) do Código dos Contratos Públicos",,,,,,Não aplicável.,Não aplicável.,FALSE
120012/2017 - AQUISIÇÃO DE MATERIAL DE GASTRENTEROLOGIA,Concurso público,Aquisição de bens móveis,"33140000-3, Material médico de consumo","Hospital Distrital de Santarém, E. P. E. (506361462)",Higiplus (507320662),"99,00 €",27-08-2018,01-01-2018,365 dias,"Portugal, Santarém, Santarém","Artigo 20.º, n.º 1, alínea b) do Código dos Contratos Públicos",,,,,,Não aplicável.,Não aplicável.,FALSE
120012/2017 - AQUISIÇÃO MATERIAL GASTRENTEROLOGIA,Concurso público,Aquisição de bens móveis,"33140000-3, Material médico de consumo","Hospital Distrital de Santarém, E. P. E. (506361462)",Teleflex (980249783),"144,60 €",27-08-2018,01-01-2018,365 dias,"Portugal, Santarém, Santarém","Artigo 20.º, n.º 1, alínea b) do Código dos Contratos Públicos",,,,,,Não aplicável.,Não aplicável.,FALSE
120012/2017 - AQUISIÇÃO MATERIAL GASTRENTEROLOGIA,Concurso público,Aquisição de bens móveis,"33140000-3, Material médico de consumo","Hospital Distrital de Santarém, E. P. E. (506361462)",Speculum (502996323),"414,90 €",27-08-2018,01-01-2018,365 dias,"Portugal, Santarém, Santarém","Artigo 20.º, n.º 1, alínea b) do Código dos Contratos Públicos",,,,,,Não aplicável.,Não aplicável.,FALSE
120012/2017 - AQUISIÇÃO MATERIAL GASTRENTEROLOGIA,Concurso público,Aquisição de bens móveis,"33140000-3, Material médico de consumo","Hospital Distrital de Santarém, E. P. E. (506361462)",Aviquimica (500039720),"323,50 €",27-08-2018,01-01-2018,365 dias,"Portugal, Santarém, Santarém","Artigo 20.º, n.º 1, alínea b) do Código dos Contratos Públicos",,,,,,Não aplicável.,Não aplicável.,FALSE
120012/2017 - AQUISIÇÃO MATERIAL GASTRENTEROLOGIA,Concurso público,Aquisição de bens móveis,"33140000-3, Material médico de consumo","Hospital Distrital de Santarém, E. P. E. (506361462)",HR Hospitalar (501895558),"45,00 €",27-08-2018,01-01-2018,365 dias,"Portugal, Santarém, Santarém","Artigo 20.º, n.º 1, alínea b) do Código dos Contratos Públicos",,,,,,Não aplicável.,Não aplicável.,FALSE
120012/2017 - AQUISIÇÃO MATERIAL GASTRENTEROLOGIA,Concurso público,Aquisição de bens móveis,"33140000-3, Material médico de consumo","Hospital Distrital de Santarém, E. P. E. (506361462)",Carewill (507484851),"6.215,50 €",27-08-2018,01-01-2018,365 dias,"Portugal, Santarém, Santarém","Artigo 20.º, n.º 1, alínea b) do Código dos Contratos Públicos",,,,,,Não aplicável.,Não aplicável.,FALSE
120012/2017 - AQUISIÇÃO MATERIAL GASTRENTEROLOGIA,Concurso público,Aquisição de bens móveis,"33140000-3, Material médico de consumo","Hospital Distrital de Santarém, E. P. E. (506361462)",Olympus (980474710),"2.562,00 €",27-08-2018,01-01-2018,365 dias,"Portugal, Santarém, Santarém","Artigo 20.º, n.º 1, alínea b) do Código dos Contratos Públicos",,,,,,Não aplicável.,Não aplicável.,FALSE
120012/2017 - AQUISIÇÃO MATERIAL GASTRENTEROLOGIA,Concurso público,Aquisição de bens móveis,"33140000-3, Material médico de consumo","Hospital Distrital de Santarém, E. P. E. (506361462)",Biosonda (501463313),"12.366,00 €",27-08-2018,30-01-2018,365 dias,"Portugal, Santarém, Santarém","Artigo 20.º, n.º 1, alínea b) do Código dos Contratos Públicos",,,,,,Não aplicável.,Não aplicável.,FALSE
120012/2017 - AQUISIÇÃO MATERIAL GASTRENTEROLOGIA,Concurso público,Aquisição de bens móveis,"33140000-3, Material médico de consumo","Hospital Distrital de Santarém, E. P. E. (506361462)",Boston Scientific (504988964),"6.374,00 €",27-08-2018,01-01-2018,365 dias,"Portugal, Santarém, Santarém","Artigo 20.º, n.º 1, alínea b) do Código dos Contratos Públicos",,,,,,Não aplicável.,Não aplicável.,FALSE
120012/2017 - AQUISIÇÃO MATERIAL GASTRENTEROLOGIA,Concurso público,Aquisição de bens móveis,"33140000-3, Material médico de consumo","Hospital Distrital de Santarém, E. P. E. (506361462)",Alves e Ca. ( Irmãos ) Lda (500310068),"16.943,00 €",27-08-2018,30-01-2018,365 dias,"Portugal, Santarém","Artigo 20.º, n.º 1, alínea b) do Código dos Contratos Públicos",,,,,,Não aplicável.,Não aplicável.,FALSE
220009/2018 - AQUISIÇÃO DE MATERIAL PARA CIRURGIA COLO RETAL,Consulta Prévia,Aquisição de bens móveis,"33140000-3, Material médico de consumo","Hospital Distrital de Santarém, E. P. E. (506361462)",Eurocasmedica (503322105),"1.372,50 €",24-08-2018,21-05-2018,270 dias,"Portugal, Santarém, Santarém","Artigo 20.º, n.º 1, alínea c) do Código dos Contratos Públicos",,,,,,Não aplicável.,Não aplicável.,FALSE
220009/2018 - AQUISIÇÃO DE MATERIAL PARA CIRURGIA COLO RETAL,Consulta Prévia,Aquisição de bens móveis,"33140000-3, Material médico de consumo","Hospital Distrital de Santarém, E. P. E. (506361462)",Applied Medical (980571111),"5.600,00 €",24-08-2018,21-05-2018,270 dias,"Portugal, Santarém, Santarém","Artigo 20.º, n.º 1, alínea c) do Código dos Contratos Públicos",,,,,,Não aplicável.,Não aplicável.,FALSE
220013/2018 - AQUISIÇÃO DE TROUXAS DE PARTO,Consulta Prévia,Aquisição de bens móveis,"33140000-3, Material médico de consumo","Hospital Distrital de Santarém, E. P. E. (506361462)","Speculum, Artigos Médicoa S.A. (502996323)","10.277,50 €",24-08-2018,19-06-2018,270 dias,"Portugal, Santarém, Santarém","Artigo 20.º, n.º 1, alínea c) do Código dos Contratos Públicos",,,,,,Não aplicável.,Não aplicável.,FALSE
220011/2018 - AQUISIÇÃO DE APLICADORES E CLIPS,Consulta Prévia,Aquisição de bens móveis,"33141121-4, Suturas cirúrgicas","Hospital Distrital de Santarém, E. P. E. (506361462)",Socime II (504453939),"4.296,00 €",24-08-2018,24-05-2018,270 dias,"Portugal, Santarém, Santarém","Artigo 20.º, n.º 1, alínea c) do Código dos Contratos Públicos",,,,,,Não aplicável.,Não aplicável.,FALSE
220011/2018 - AQUISIÇÃO DE APLICADORES E CLIPS,Consulta Prévia,Aquisição de bens móveis,"33141121-4, Suturas cirúrgicas","Hospital Distrital de Santarém, E. P. E. (506361462)",Medtronic (504223933),"7.872,00 €",24-08-2018,24-05-2018,270 dias,"Portugal, Santarém, Santarém","Artigo 20.º, n.º 1, alínea c) do Código dos Contratos Públicos",,,,,,Não aplicável.,Não aplicável.,FALSE
220011/2018 - AQUISIÇÃO DE APLICADORES E CLIPS,Consulta Prévia,Aquisição de bens móveis,"33141121-4, Suturas cirúrgicas","Hospital Distrital de Santarém, E. P. E. (506361462)",B.Braun (501506543),"11.520,00 €",24-08-2018,30-05-2018,270 dias,"Portugal, Santarém, Santarém","Artigo 20.º, n.º 1, alínea c) do Código dos Contratos Públicos",,,,,,Não aplicável.,Não aplicável.,FALSE
220008/2018 - MATERIAL DE GASTRENTEROLOGIA,Consulta Prévia,Aquisição de bens móveis,"33140000-3, Material médico de consumo","Hospital Distrital de Santarém, E. P. E. (506361462)",Alves e CA ( irmãos) Lda (500310068),"540,00 €",23-08-2018,13-04-2018,270 dias,"Portugal, Santarém, Santarém","Artigo 20.º, n.º 1, alínea c) do Código dos Contratos Públicos",,,,,,Não aplicável.,Não aplicável.,FALSE
