Objeto do Contrato,Tipo de Procedimento,Tipo(s) de Contrato,CPVs,Entidade(s) Adjudicante(s),Entidade(s) Adjudicatária(s),Preço Contratual,Data de Publicação,Data de Celebração do Contrato,Prazo de Execução,Local de Execução,Fundamentação,Data de Fecho do Contrato,Preço Total Efetivo,Causas das Alterações ao Prazo,Causas das Alterações ao Preço,Estado,N.º registo do Acordo Quadro,Descrição do Acordo Quadro,Procedimento Centralizado
Assistência à aplicação Navision,Ajuste Direto Regime Geral,Aquisição de serviços,"72000000-5, Serviços de TI: consultoria, desenvolvimento de software, Internet e apoio","Instituto Nacional de Emergência Médica, I. P. (501356126)","Meta Estratégica - Soluções Tecnológicas, Ldª (509740782)","4.950,00 €",05-02-2015,31-01-2015,90 dias,"Portugal, Lisboa, Lisboa","Artigo 27.º, n.º 1, alínea f) do Código dos Contratos Públicos",,,,,,Não aplicável.,Não aplicável.,FALSE
Aquisição de macas,Ajuste Direto Regime Geral,Aquisição de bens móveis,"34000000-7, Equipamento e produtos auxiliares de transporte","Instituto Nacional de Emergência Médica, I. P. (501356126)","Auto Ribeiro, Lda. (500434980)","48.859,00 €",05-02-2015,29-01-2015,1 dias,Portugal,"Artigo 20.º, n.º 1, alínea a) do Código dos Contratos Públicos",,,,,,Não aplicável.,Não aplicável.,FALSE
"Aquisição de oxigénio medicinal e ar medicinal, compreendendo o acondicionamento, a embalagem, a carga, transporte e descarga nos locais indicados como locais de consumo.    ",Ajuste Direto Regime Geral,Aquisição de bens móveis,"33000000-0, Equipamento médico, medicamentos e produtos para cuidados pessoais","Instituto Nacional de Emergência Médica, I. P. (501356126)","ACAIL GÁS , S.A.  (503789151)","0,00 €",03-02-2015,29-01-2015,365 dias,"Portugal, Portugal Continental",Artigo 258.º do Código dos Contratos Públicos,,,,,,1381314,Fornecimento de Gases Medicinais.,FALSE
Prestação de serviços combinados de vigilância e segurança humana e de ligação a central de receção e monitorização de alarmes.,Ajuste Direto Regime Geral,Aquisição de serviços,"79000000-4, Serviços a empresas: direito, comercialização, consultoria, recrutamento, impressão e segurança","Instituto Nacional de Emergência Médica, I. P. (501356126)","PRESTIBEL - Empresa de Segurança, S.A. (501326456)","36.617,50 €",02-02-2015,29-01-2015,31 dias,"Portugal, Porto, Vila Nova de Gaia<BR/>Portugal, Lisboa, Lisboa<BR/>Portugal, Coimbra, Coimbra<BR/>Portugal, Porto, Porto","Artigo 24.º, n.º 1, alínea c) do Código dos Contratos Públicos",,,,,,Não aplicável.,Não aplicável.,FALSE
Disponibilização da plataforma eletrónica de contratação.,Ajuste Direto Regime Geral,Aquisição de serviços,"72000000-5, Serviços de TI: consultoria, desenvolvimento de software, Internet e apoio","Instituto Nacional de Emergência Médica, I. P. (501356126)","SAPHETY LEVEL - Trusted Services, S.A. (507957547)","2.430,00 €",02-02-2015,29-01-2015,365 dias,"Portugal, Portugal Continental","Artigo 20.º, n.º 1, alínea a) do Código dos Contratos Públicos",,,,,,Não aplicável.,Não aplicável.,FALSE
"Fornecimento de combustíveis rodoviários em postos de abastecimento público, designadamente, gasolinas e gasóleos, através de cartão eletrónico de abastecimento, para frota de viaturas do INEM, IP.",Ajuste Direto Regime Geral,Aquisição de serviços,"76000000-3, Serviços relacionados com as indústrias do gás e do petróleo","Instituto Nacional de Emergência Médica, I. P. (501356126)","PETRÓLEOS DE PORTUGAL (PETROGAL), S.A. (500697370)","0,00 €",02-02-2015,28-01-2015,31 dias,"Portugal, Portugal Continental","Artigo 27.º, n.º 1, alínea h) do Código dos Contratos Públicos",,,,,,1380526,Aquisição de combustíveis rodoviários - Lote 2 Refª. 2014_UMC_CR,FALSE
"Aquisição de serviços de seguros, de acordo com as condições constantes do caderno de encargos que serviu de base ao concurso público nº 12/00005 e nos termos constantes da proposta da Villas-Boas Corretores Associados de Seguros datada de 16 de dezembro. ",Ajuste Direto Regime Geral,Aquisição de serviços,"66000000-0, Serviços de finanças e seguros","Instituto Nacional de Emergência Médica, I. P. (501356126)","VILLAS-BOAS - Corretores Associados de Seguros, S.A. (500477540)","131.679,49 €",02-02-2015,29-01-2015,59 dias,"Portugal, Portugal Continental","Artigo 27.º, n.º 1, alínea a) do Código dos Contratos Públicos",,,,,,Não aplicável.,Não aplicável.,FALSE
