Objeto do Contrato,Tipo de Procedimento,Tipo(s) de Contrato,CPVs,Entidade(s) Adjudicante(s),Entidade(s) Adjudicatária(s),Preço Contratual,Data de Publicação,Data de Celebração do Contrato,Prazo de Execução,Local de Execução,Fundamentação,Data de Fecho do Contrato,Preço Total Efetivo,Causas das Alterações ao Prazo,Causas das Alterações ao Preço,Estado,N.º registo do Acordo Quadro,Descrição do Acordo Quadro,Procedimento Centralizado
"O contrato tem por objeto a locação de 1 (uma) AERONAVE COMPLEMENTAR (HELICÓPTERO LIGEIRO B), bem como a aquisição dos correspetivos serviços de MANUTENÇÃO e de OPERAÇÃO",Ajuste Direto Regime Geral,Aquisição de serviços,"60000000-8, Serviços de transporte (excl. transporte de resíduos)","Instituto Nacional de Emergência Médica, I. P. (501356126)","BABCOCK Mission Critical Services Portugal, Lda. (503546054)","162.500,00 €",11-04-2018,29-03-2018,30 dias,"Portugal, Portugal Continental","Artigo 24.º, n.º 1, alínea c) do Código dos Contratos Públicos",,,,,,Não aplicável.,Não aplicável.,FALSE
"O presente contrato tem por objeto a prestação de serviços manutenção do sistema informático e da rede existente nos vários edifícios do INEM, I.P., onde estão englobados os serviços de manutenção de servidores, routers, switchs, firewall’s e toda a assistência técnica aplicacional de base para que o serviço funcione 24/7",Consulta Prévia,Aquisição de serviços,"72000000-5, Serviços de TI: consultoria, desenvolvimento de software, Internet e apoio","Instituto Nacional de Emergência Médica, I. P. (501356126)","Integrator – Tecnologias da Informação, SA. (506619290)","28.501,00 €",11-04-2018,12-03-2018,110 dias,"Portugal, Portugal Continental","Artigo 20.º, n.º 1, alínea c) do Código dos Contratos Públicos",,,,,,Não aplicável.,Não aplicável.,FALSE
"O presente contrato tem por objeto a prestação de serviços de assistência técnica e manutenção dos sistemas telefónico do INEM, I.P., que inclui 5 (cinco) servidores com tecnologia VOIP dos CODU do INEM, I.P., de Lisboa, Porto, Coimbra e Faro",Ajuste Direto Regime Geral,Aquisição de serviços,"64000000-6, Serviços postais e de telecomunicações","Instituto Nacional de Emergência Médica, I. P. (501356126)","PAPTI - Soluções Globais de Telecomunicações e Infonmática, S.A. (503280550)","41.609,97 €",05-04-2018,19-03-2018,365 dias,"Portugal, Portugal Continental","Artigo 24.º, n.º 1, alínea e), subalínea ii) do Código dos Contratos Públicos",,,,,,Não aplicável.,Não aplicável.,FALSE
