freguesia,acronym,validVotesPercentage,votes,dicofre
Encarnação,PPD/PSD.CDS-PP,51.16,619,110904
Encarnação,PS,20.33,246,110904
Encarnação,PCP-PEV,6.69,81,110904
Encarnação,MPT,6.61,80,110904
Encarnação,B.E.,3.39,41,110904
Encarnação,PAN,2.48,30,110904
Encarnação,L,1.98,24,110904
Encarnação,PND,1.32,16,110904
Encarnação,PCTP/MRPP,1.16,14,110904
Encarnação,PPV,0.99,12,110904
Encarnação,PTP,0.99,12,110904
Encarnação,PPM,0.91,11,110904
Encarnação,MAS,0.83,10,110904
Encarnação,PNR,0.83,10,110904
Encarnação,PDA,0.25,3,110904
Encarnação,POUS,0.08,1,110904
