freguesia,acronym,validVotesPercentage,votes,dicofre
Panoias de Cima,PS,33.72,58,090728
Panoias de Cima,PPD/PSD,26.74,46,090728
Panoias de Cima,B.E.,12.21,21,090728
Panoias de Cima,CDS-PP,6.98,12,090728
Panoias de Cima,PAN,5.81,10,090728
Panoias de Cima,PCP-PEV,5.23,9,090728
Panoias de Cima,PPM.PPV/CDC,2.33,4,090728
Panoias de Cima,L,1.74,3,090728
Panoias de Cima,A,1.16,2,090728
Panoias de Cima,PCTP/MRPP,1.16,2,090728
Panoias de Cima,IL,0.58,1,090728
Panoias de Cima,NC,0.58,1,090728
Panoias de Cima,PDR,0.58,1,090728
Panoias de Cima,PNR,0.58,1,090728
Panoias de Cima,PURP,0.58,1,090728
Panoias de Cima,MAS,0,0,090728
Panoias de Cima,PTP,0,0,090728
