Objeto do Contrato,Tipo de Procedimento,Tipo(s) de Contrato,CPVs,Entidade(s) Adjudicante(s),Entidade(s) Adjudicatária(s),Preço Contratual,Data de Publicação,Data de Celebração do Contrato,Prazo de Execução,Local de Execução,Fundamentação,Data de Fecho do Contrato,Preço Total Efetivo,Causas das Alterações ao Prazo,Causas das Alterações ao Preço,Estado,N.º registo do Acordo Quadro,Descrição do Acordo Quadro,Procedimento Centralizado
Aquisição de fornecimento e montagem de reclames de fachada para edifícios,Ajuste Direto Regime Geral,Aquisição de bens móveis,"22460000-2, Suportes de publicidade, manuais e catálogos comerciais",Adm.Reg.de Saúde de Lisboa e Vale do Tejo (ARSLVT) (503148776),"Infortipo, Lda (502964472)","10.200,00 €",21-09-2017,18-09-2017,30 dias,"Portugal, Lisboa, Lisboa","Artigo 20.º, n.º 1, alínea a) do Código dos Contratos Públicos",,,,,,Não aplicável.,Não aplicável.,FALSE
"Aquisição de serviços de higiene e limpeza para os serviços da dependência da ARSLVT, IP para o período de 01/08/2017 a 31/10/2017",Ajuste Direto Regime Geral,Aquisição de serviços,"90910000-9, Serviços de limpeza","Administração Regional de Saúde de Lisboa e Vale do Tejo, I. P. (503148776)","Fine Facility Services, Lda (509418627)","1.018.031,61 €",20-09-2017,01-09-2017,92 dias,"Portugal, Lisboa","Artigo 24.º, n.º 1, alínea c) do Código dos Contratos Públicos",,,,,,Não aplicável.,Não aplicável.,FALSE
Aquisição de equipamento médico para USF Fonte Luminosa - Equipamento Diverso,Concurso público,Aquisição de bens móveis,"33100000-1, Equipamento médico","Administração Regional de Saúde de Lisboa e Vale do Tejo, I. P. (503148776)",Bramédica (508560152),"120,65 €",20-09-2017,01-09-2017,20 dias,"Portugal, Lisboa, Lisboa","Artigo 20.º, n.º 1, alínea b) do Código dos Contratos Públicos",,,,,,Não aplicável.,Não aplicável.,FALSE
Aquisição de equipamento para USF Fonte Luminosa - equipamento Médico Grupo III,Concurso público,Aquisição de bens móveis,"33100000-1, Equipamento médico","Administração Regional de Saúde de Lisboa e Vale do Tejo, I. P. (503148776)",Duekipa-Com.Equip.Medico-Hospitalar Lda. (508690102),"3.275,00 €",20-09-2017,01-09-2017,20 dias,"Portugal, Lisboa, Lisboa","Artigo 20.º, n.º 1, alínea b) do Código dos Contratos Públicos",,,,,,Não aplicável.,Não aplicável.,FALSE
Aquisição de equipamento para USF Fonte Luminosa - Equipamento Médico Grupo II,Concurso público,Aquisição de bens móveis,"33100000-1, Equipamento médico","Administração Regional de Saúde de Lisboa e Vale do Tejo, I. P. (503148776)","FILSAT - EQUIPAMENTOS MÉDICO-CIENTÍFICOS, LDA. (506708616)","7.113,00 €",20-09-2017,01-09-2017,20 dias,"Portugal, Lisboa, Lisboa","Artigo 20.º, n.º 1, alínea b) do Código dos Contratos Públicos",,,,,,Não aplicável.,Não aplicável.,FALSE
Aquisição de equipamento para USF Fonte Luminosa - Equipamento Médico Grupo I,Concurso público,Aquisição de bens móveis,"33100000-1, Equipamento médico","Administração Regional de Saúde de Lisboa e Vale do Tejo, I. P. (503148776)",Alfraphar (504223895),"12.985,00 €",20-09-2017,01-09-2017,20 dias,"Portugal, Lisboa, Lisboa","Artigo 20.º, n.º 1, alínea b) do Código dos Contratos Públicos",,,,,,Não aplicável.,Não aplicável.,FALSE
Aquisição de equipamento médico para Aces Oeste Sul - Equipamento Médico Grupo VI,Concurso público,Aquisição de bens móveis,"33100000-1, Equipamento médico","Administração Regional de Saúde de Lisboa e Vale do Tejo, I. P. (503148776)","Z-MED Equipamentos Médicos e Hospitalares, Lda (508531535)","1.800,00 €",19-09-2017,07-09-2017,30 dias,"Portugal, Lisboa, Torres Vedras","Artigo 20.º, n.º 1, alínea b) do Código dos Contratos Públicos",,,,,,Não aplicável.,Não aplicável.,FALSE
Aquisição de Vacina contra Gripe Inativada (V13),Ajuste Direto Regime Geral,Aquisição de bens móveis,"33651600-4, Vacinas","Administração Regional de Saúde de Lisboa e Vale do Tejo, I. P. (503148776)","BGP - Produtcs, Unipessoal, Lda. (513263268)","923.400,00 €",19-09-2017,25-07-2017,100 dias,"Portugal, Lisboa, Lisboa",Artigo 258.º do Código dos Contratos Públicos,,,,,,Não aplicável.,Não aplicável.,FALSE
Aquisição de equipamento médico para Aces Oeste Sul - Equipamento Diverso Grupo III,Concurso público,Aquisição de bens móveis,"33100000-1, Equipamento médico","Administração Regional de Saúde de Lisboa e Vale do Tejo, I. P. (503148776)",Alfraphar (504223895),"2.339,00 €",18-09-2017,07-09-2017,45 dias,"Portugal, Lisboa, Torres Vedras","Artigo 20.º, n.º 1, alínea b) do Código dos Contratos Públicos",,,,,,Não aplicável.,Não aplicável.,FALSE
Aquisição de equipamento médico para Aces Oeste Sul - Equipamento Médico Grupo VII,Concurso público,Aquisição de bens móveis,"33100000-1, Equipamento médico","Administração Regional de Saúde de Lisboa e Vale do Tejo, I. P. (503148776)",Bramédica (508560152),"3.450,00 €",18-09-2017,07-09-2017,45 dias,"Portugal, Lisboa, Torres Vedras","Artigo 20.º, n.º 1, alínea b) do Código dos Contratos Públicos",,,,,,Não aplicável.,Não aplicável.,FALSE
Aquisição de equipamento médico para Aces Oeste Sul - Equipamento Diverso Grupo II,Concurso público,Aquisição de bens móveis,"33100000-1, Equipamento médico","Administração Regional de Saúde de Lisboa e Vale do Tejo, I. P. (503148776)","Ambienti D'Interni Unipessoal, Lda (508369444)","286,00 €",18-09-2017,07-09-2017,45 dias,"Portugal, Lisboa, Torres Vedras","Artigo 20.º, n.º 1, alínea b) do Código dos Contratos Públicos",,,,,,Não aplicável.,Não aplicável.,FALSE
Aquisição de equipamento médico para Aces Oeste Sul - Equipamento Instrumental Grupo II,Concurso público,Aquisição de bens móveis,"33100000-1, Equipamento médico","Administração Regional de Saúde de Lisboa e Vale do Tejo, I. P. (503148776)","EUGENIO PEREIRA, LDA (503989525)","208,98 €",18-09-2017,07-09-2017,45 dias,"Portugal, Lisboa, Torres Vedras","Artigo 20.º, n.º 1, alínea b) do Código dos Contratos Públicos",,,,,,Não aplicável.,Não aplicável.,FALSE
Aquisição de equipamento médico para Aces Oeste Sul - Equipamento Instrumental Grupo I,Concurso público,Aquisição de bens móveis,"33100000-1, Equipamento médico","Administração Regional de Saúde de Lisboa e Vale do Tejo, I. P. (503148776)","Z-MED Equipamentos Médicos e Hospitalares, Lda (508531535)","1.039,50 €",18-09-2017,07-09-2017,45 dias,"Portugal, Lisboa, Torres Vedras","Artigo 20.º, n.º 1, alínea b) do Código dos Contratos Públicos",,,,,,Não aplicável.,Não aplicável.,FALSE
Aquisição de equipamento médico para Aces Oeste Sul - Equipamento Médico Grupo V,Concurso público,Aquisição de bens móveis,"33100000-1, Equipamento médico","Administração Regional de Saúde de Lisboa e Vale do Tejo, I. P. (503148776)",Alfraphar (504223895),"703,00 €",18-09-2017,07-09-2017,45 dias,"Portugal, Lisboa, Torres Vedras","Artigo 20.º, n.º 1, alínea b) do Código dos Contratos Públicos",,,,,,Não aplicável.,Não aplicável.,FALSE
Aquisição de equipamento médico para Aces Oeste Sul - Equipamento Médico Grupo IV,Concurso público,Aquisição de bens móveis,"33100000-1, Equipamento médico","Administração Regional de Saúde de Lisboa e Vale do Tejo, I. P. (503148776)",Bramédica (508560152),"774,00 €",18-09-2017,07-09-2017,45 dias,"Portugal, Lisboa, Torres Vedras","Artigo 20.º, n.º 1, alínea b) do Código dos Contratos Públicos",,,,,,Não aplicável.,Não aplicável.,FALSE
Aquisição de equipamento médico para Aces Oeste Sul - Equipamento Médico Grupo III,Concurso público,Aquisição de bens móveis,"33100000-1, Equipamento médico","Administração Regional de Saúde de Lisboa e Vale do Tejo, I. P. (503148776)",EPJMEDICA-ARTIGOS MED.HOSPITAL (506820513),"690,00 €",18-09-2017,07-09-2017,45 dias,"Portugal, Lisboa, Torres Vedras","Artigo 20.º, n.º 1, alínea b) do Código dos Contratos Públicos",,,,,,Não aplicável.,Não aplicável.,FALSE
Aquisição de equipamento médico para Aces Oeste Sul - Equipamento Médico Grupo II,Concurso público,Aquisição de bens móveis,"33100000-1, Equipamento médico","Administração Regional de Saúde de Lisboa e Vale do Tejo, I. P. (503148776)","PROCLINICA-EQUIPAM.PRODUTOS CLINICOS,LDA (500222665)","1.378,17 €",18-09-2017,07-09-2017,45 dias,"Portugal, Lisboa, Torres Vedras","Artigo 20.º, n.º 1, alínea b) do Código dos Contratos Públicos",,,,,,Não aplicável.,Não aplicável.,FALSE
Aquisição de equipamento médico para o Aces Oeste Sul - Equipamento Diverso Grupo I,Concurso público,Aquisição de bens móveis,"33100000-1, Equipamento médico","Administração Regional de Saúde de Lisboa e Vale do Tejo, I. P. (503148776)","M.M.CUNHA-INST.EQ.CIR.ORTOPEDICOS, LDA (507374843)","842,35 €",18-09-2017,07-09-2017,45 dias,"Portugal, Lisboa, Torres Vedras","Artigo 20.º, n.º 1, alínea b) do Código dos Contratos Públicos",,,,,,Não aplicável.,Não aplicável.,FALSE
"Aquisição de equipamento para Aces Oeste Sul - """"Equipamento Médico Grupo I""""",Concurso público,Aquisição de bens móveis,"33100000-1, Equipamento médico","Administração Regional de Saúde de Lisboa e Vale do Tejo, I. P. (503148776)",Bramédica (508560152),"4.508,00 €",18-09-2017,07-09-2017,45 dias,"Portugal, Lisboa, Torres Vedras","Artigo 20.º, n.º 1, alínea b) do Código dos Contratos Públicos",,,,,,Não aplicável.,Não aplicável.,FALSE
"Equipamento """"Cadeira de Rodas"""" (Aces Médio Tejo)",Ao abrigo de acordo-quadro (art.º 259.º),Aquisição de bens móveis,"33193120-6, Cadeiras de rodas",Adm.Reg.de Saúde de Lisboa e Vale do Tejo (ARSLVT) (503148776),QUILABAN (500399670),"147,26 €",15-09-2017,08-09-2017,3 dias,"Portugal, Santarém, Abrantes",Artigo 259.º do Código dos Contratos Públicos,,,,,,2159355,CP 2016/84 - Acordo quadro para fornecimento de Cadeiras de Rodas para uso em meio hospitalar às Instituições e Serviços do Serviço Nacional de Saúde,FALSE
"Equipamento """"Pele Anti-escara Sintética"""" para USF D. Francisco de Almeida (Aces Médio Tejo)",Ao abrigo de acordo-quadro (art.º 259.º),Aquisição de bens móveis,"33193120-6, Cadeiras de rodas",Adm.Reg.de Saúde de Lisboa e Vale do Tejo (ARSLVT) (503148776),QUILABAN (500399670),"46,80 €",15-09-2017,08-09-2017,3 dias,"Portugal, Santarém, Abrantes",Artigo 259.º do Código dos Contratos Públicos,,,,,,2159355,CP 2016/84 - Acordo quadro para fornecimento de Cadeiras de Rodas para uso em meio hospitalar às Instituições e Serviços do Serviço Nacional de Saúde,FALSE
Aquisição de equipamento médico para a USF Reynaldo dos Santos (Aces Estuário do Tejo),Ajuste Direto Regime Geral,Aquisição de bens móveis,"33100000-1, Equipamento médico",Adm.Reg.de Saúde de Lisboa e Vale do Tejo (ARSLVT) (503148776),"Bacelar & Irmão, Lda. (500532818)","3.812,50 €",12-09-2017,11-09-2017,20 dias,"Portugal, Lisboa, Vila Franca de Xira","Artigo 20.º, n.º 1, alínea a) do Código dos Contratos Públicos",,,,,,Não aplicável.,Não aplicável.,FALSE
Empreitada de remodelação do edifício nº 75 da Av. EUA,Ajuste Direto Regime Geral,Empreitadas de obras públicas,"45113000-2, Obras no local",Adm.Reg.de Saúde de Lisboa e Vale do Tejo (ARSLVT) (503148776),Ramiro & Delgado (501301704),"103.889,00 €",12-09-2017,08-09-2017,45 dias,"Portugal, Lisboa, Lisboa","Artigo 19.º, alínea a) do Código dos Contratos Públicos",,,,,,Não aplicável.,Não aplicável.,FALSE
