Objeto do Contrato,Tipo de Procedimento,Tipo(s) de Contrato,CPVs,Entidade(s) Adjudicante(s),Entidade(s) Adjudicatária(s),Preço Contratual,Data de Publicação,Data de Celebração do Contrato,Prazo de Execução,Local de Execução,Fundamentação,Data de Fecho do Contrato,Preço Total Efetivo,Causas das Alterações ao Prazo,Causas das Alterações ao Preço,Estado,N.º registo do Acordo Quadro,Descrição do Acordo Quadro,Procedimento Centralizado
SERVIÇOS DE APOIO AO LICENCIAMENTO DAS INSTALAÇÕES RADIOLÓGICAS DO CHLO,Ajuste Direto Regime Geral,Aquisição de serviços,"75100000-7, Serviços relacionados com a administração pública","Centro Hospitalar de Lisboa Ocidental, EPE (CHLO) (507618319)",Instituro de Soldadura e Qualidade (500140022),"12.510,00 €",19-10-2016,14-06-2016,40 dias,"Portugal, Lisboa, Lisboa","Artigo 20.º, n.º 1, alínea a) do Código dos Contratos Públicos",,,,,,Não aplicável.,Não aplicável.,FALSE
"AD712606- REPARAÇÃO DO ELEVADOR 13 DO HEM- CHLO, EPE",Ajuste Direto Regime Geral,Aquisição de serviços,"50000000-5, Serviços de reparação e manutenção","Centro Hospitalar de Lisboa Ocidental, E. P. E. (507618319)","Grupnor, Lda (500959579)","8.600,00 €",14-10-2016,10-10-2016,15 dias,"Portugal, Lisboa, Lisboa","Artigo 24.º, n.º 1, alínea e) do Código dos Contratos Públicos",,,,,,Não aplicável.,Não aplicável.,FALSE
Prestação serviços de aluguer permanente de Bipap's para uso em diversos Serviços do CHLO,Ajuste Direto Regime Geral,Aquisição de serviços,"85111700-7, Serviços de oxigenoterapia","Centro Hospitalar de Lisboa Ocidental, EPE (CHLO) (507618319)","Linde Saúde, Lda (500125546)","14.819,00 €",13-10-2016,04-08-2016,365 dias,"Portugal, Lisboa, Lisboa","Artigo 20.º, n.º 1, alínea a) do Código dos Contratos Públicos",,,,,,Não aplicável.,Não aplicável.,FALSE
Fornecimento e Aplicação de Tela Mesh do Pleno  Principal da Sala C do Bloco Operatório do HSFX,Ajuste Direto Regime Geral,Aquisição de serviços,"50000000-5, Serviços de reparação e manutenção","Centro Hospitalar de Lisboa Ocidental, E. P. E. (507618319)","Hepafiltra, Lda (503615072)","9.655,00 €",11-10-2016,06-10-2016,60 dias,"Portugal, Lisboa, Lisboa","Artigo 24.º, n.º 1, alínea e) do Código dos Contratos Públicos",,,,,,Não aplicável.,Não aplicável.,FALSE
