freguesia,acronym,validVotesPercentage,votes,dicofre
Calvaria de Cima,PS,35.58,216,101605
Calvaria de Cima,PPD/PSD,24.71,150,101605
Calvaria de Cima,B.E.,9.72,59,101605
Calvaria de Cima,CDS-PP,7.74,47,101605
Calvaria de Cima,PAN,6.1,37,101605
Calvaria de Cima,PCP-PEV,3.29,20,101605
Calvaria de Cima,A,2.8,17,101605
Calvaria de Cima,NC,1.98,12,101605
Calvaria de Cima,PPM.PPV/CDC,1.81,11,101605
Calvaria de Cima,L,1.65,10,101605
Calvaria de Cima,PCTP/MRPP,1.15,7,101605
Calvaria de Cima,PDR,0.82,5,101605
Calvaria de Cima,IL,0.66,4,101605
Calvaria de Cima,PNR,0.66,4,101605
Calvaria de Cima,PTP,0.49,3,101605
Calvaria de Cima,PURP,0.49,3,101605
Calvaria de Cima,MAS,0.33,2,101605
