Objeto do Contrato,Tipo de Procedimento,Tipo(s) de Contrato,CPVs,Entidade(s) Adjudicante(s),Entidade(s) Adjudicatária(s),Preço Contratual,Data de Publicação,Data de Celebração do Contrato,Prazo de Execução,Local de Execução,Fundamentação,Data de Fecho do Contrato,Preço Total Efetivo,Causas das Alterações ao Prazo,Causas das Alterações ao Preço,Estado,N.º registo do Acordo Quadro,Descrição do Acordo Quadro,Procedimento Centralizado
SC/140/2015 - AQUISIÇÃO DE MEDICAMENTOS GERAIS.7,Ao abrigo de acordo-quadro (art.º 259.º),Aquisição de bens móveis,"33690000-3, Medicamentos vários","Administração Regional de Saúde do Algarve, I. P. (503148709)","FRESENIUS KABI PHARMA PORTUGAL, LDA. (504293753)","671,76 €",28-07-2015,28-07-2015,156 dias,"Portugal, Faro, Faro",Artigo 259.º do Código dos Contratos Públicos,"","","","",,613285,"CONCURSO PÚBLICO PARA A CELEBRAÇÃO DE CONTRATOS PÚBLICOS DE APROVISIONAMENTO PARA A ÁREA DA SAÚDE, COM VISTA AO FORNECIMENTO DE MEDICAMENTOS ANALGÉSICOS, ANTIPIRÉTICOS E ANTIDEPRESSORES, ÀS INSTITUIÇÕES E SERVIÇOS DO SERVIÇO NACIONAL DE SAÚDE",FALSE
SC/140/2015 - AQUISIÇÃO DE MEDICAMENTOS GERAIS.7,Ao abrigo de acordo-quadro (art.º 259.º),Aquisição de bens móveis,"33690000-3, Medicamentos vários","Administração Regional de Saúde do Algarve, I. P. (503148709)","TECNIFAR - INDUSTRIA TÉCNICA FARMACÊUTICA, S.A. (500280436)","812,40 €",28-07-2015,28-07-2015,156 dias,"Portugal, Faro, Faro",Artigo 259.º do Código dos Contratos Públicos,"","","","",,613285,"CONCURSO PÚBLICO PARA A CELEBRAÇÃO DE CONTRATOS PÚBLICOS DE APROVISIONAMENTO PARA A ÁREA DA SAÚDE, COM VISTA AO FORNECIMENTO DE MEDICAMENTOS ANALGÉSICOS, ANTIPIRÉTICOS E ANTIDEPRESSORES, ÀS INSTITUIÇÕES E SERVIÇOS DO SERVIÇO NACIONAL DE SAÚDE",FALSE
SC/124/2015 - Aquisição de Medicamentos Gerais.5,Ao abrigo de acordo-quadro (art.º 259.º),Aquisição de bens móveis,"33690000-3, Medicamentos vários","Administração Regional de Saúde do Algarve, I. P. (503148709)","AUROVITAS - UNIPESSOAL, LDA. (513053239)","434,40 €",28-07-2015,28-07-2015,156 dias,"Portugal, Faro, Faro",Artigo 259.º do Código dos Contratos Públicos,17-12-2015,"164,40 €","",Quantidades Fornecidas,,613285,"CONCURSO PÚBLICO PARA A CELEBRAÇÃO DE CONTRATOS PÚBLICOS DE APROVISIONAMENTO PARA A ÁREA DA SAÚDE, COM VISTA AO FORNECIMENTO DE MEDICAMENTOS ANALGÉSICOS, ANTIPIRÉTICOS E ANTIDEPRESSORES, ÀS INSTITUIÇÕES E SERVIÇOS DO SERVIÇO NACIONAL DE SAÚDE",FALSE
SC/113/2015 - AQUISIÇÃO DE MEDICAMENTOS GERAIS.2,Ao abrigo de acordo-quadro (art.º 259.º),Aquisição de bens móveis,"33690000-3, Medicamentos vários","Administração Regional de Saúde do Algarve, I. P. (503148709)","Laboratórios Pfizer, Lda. (500162166)","7.257,26 €",23-07-2015,23-07-2015,161 dias,"Portugal, Faro, Faro",Artigo 259.º do Código dos Contratos Públicos,02-12-2015,"1.243,34 €","",Quantidades Fornecidas,,611389,"CONCURSO PÚBLICO PARA A CELEBRAÇÃO DE CONTRATOS PÚBLICOS DE APROVISIONAMENTO PARA A ÁREA DA SAÚDE, COM VISTA AO FORNECIMENTO DE MEDICAMENTOS ANTI-INFECIOSOS: EXCETO ANTIVÍRICOS E ANTIFÚNGICOS, ÀS INSTITUIÇÕES E SERVIÇOS DO SERVIÇO NACIONAL DE SAÚDE",FALSE
AD/169/2015 - AQUISIÇÃO DE MEDICAMENTOS DIVERSOS COM AUE,Ajuste Direto Regime Geral,Aquisição de bens móveis,"33690000-3, Medicamentos vários","Administração Regional de Saúde do Algarve, I. P. (503148709)","RB - Produtos Farmacêuticos, Unipessoal, Lda. (510784429)","1.490,00 €",23-07-2015,23-07-2015,161 dias,"Portugal, Faro, Faro","Artigo 20.º, n.º 1, alínea a) do Código dos Contratos Públicos",28-12-2015,"1.490,00 €","","",,Não aplicável.,Não aplicável.,FALSE
AD/169/2015 - AQUISIÇÃO DE MEDICAMENTOS DIVERSOS COM AUE,Ajuste Direto Regime Geral,Aquisição de bens móveis,"33690000-3, Medicamentos vários","Administração Regional de Saúde do Algarve, I. P. (503148709)","Dux Pharma, Unipessoal, Lda. (510803679)","10.393,00 €",23-07-2015,23-07-2015,161 dias,"Portugal, Faro, Faro","Artigo 20.º, n.º 1, alínea a) do Código dos Contratos Públicos",11-12-2015,"6.167,25 €","",Quantidades fornecidas,,Não aplicável.,Não aplicável.,FALSE
SC/140/2015 - AQUISIÇÃO DE MEDICAMENTOS GERAIS.7,Ao abrigo de acordo-quadro (art.º 259.º),Aquisição de bens móveis,"33690000-3, Medicamentos vários","Administração Regional de Saúde do Algarve, I. P. (503148709)","AUROVITAS UNIPESSOAL, LDA. (513053239)","229,80 €",22-07-2015,22-07-2015,162 dias,"Portugal, Faro, Faro",Artigo 259.º do Código dos Contratos Públicos,"","","","",,613285,"CONCURSO PÚBLICO PARA A CELEBRAÇÃO DE CONTRATOS PÚBLICOS DE APROVISIONAMENTO PARA A ÁREA DA SAÚDE, COM VISTA AO FORNECIMENTO DE MEDICAMENTOS ANALGÉSICOS, ANTIPIRÉTICOS E ANTIDEPRESSORES, ÀS INSTITUIÇÕES E SERVIÇOS DO SERVIÇO NACIONAL DE SAÚDE",FALSE
SC/140/2015 - AQUISIÇÃO DE MEDICAMENTOS GERAIS.7,Ao abrigo de acordo-quadro (art.º 259.º),Aquisição de bens móveis,"33690000-3, Medicamentos vários","Administração Regional de Saúde do Algarve, I. P. (503148709)","LABESFAL - LABORATÓRIOS ALMIRO, S.A. (501169580)","3.052,17 €",22-07-2015,22-07-2015,162 dias,"Portugal, Faro, Faro",Artigo 259.º do Código dos Contratos Públicos,"","","","",,613285,"CONCURSO PÚBLICO PARA A CELEBRAÇÃO DE CONTRATOS PÚBLICOS DE APROVISIONAMENTO PARA A ÁREA DA SAÚDE, COM VISTA AO FORNECIMENTO DE MEDICAMENTOS ANALGÉSICOS, ANTIPIRÉTICOS E ANTIDEPRESSORES, ÀS INSTITUIÇÕES E SERVIÇOS DO SERVIÇO NACIONAL DE SAÚDE",FALSE
AD 223/2015 - Prestação de serviços em regime de avença para um técnico na área da gestão,Ajuste Direto Regime Geral,Aquisição de serviços,"79411000-8, Serviços gerais de consultoria em matéria de gestão geral","Administração Regional de Saúde do Algarve, I. P. (503148709)",Guida Catarina Pacheco de Jesus (257750673),"18.021,95 €",22-07-2015,01-07-2015,365 dias,"Portugal, Faro, Faro","Artigo 20.º, n.º 1, alínea a) do Código dos Contratos Públicos","","","","",,Não aplicável.,Não aplicável.,FALSE
AD 207/2015 - Prestação de serviços em regime de avença para um técnico na área da engenharia civil,Ajuste Direto Regime Geral,Aquisição de serviços,"71310000-4, Serviços de consultoria em matéria de engenharia e construção","Administração Regional de Saúde do Algarve, I. P. (503148709)",Eduardo Augusto Correia Rodrigues (202107892),"18.021,95 €",22-07-2015,01-07-2015,365 dias,"Portugal, Faro, Faro","Artigo 20.º, n.º 1, alínea a) do Código dos Contratos Públicos","","","","",,Não aplicável.,Não aplicável.,FALSE
AD 206/2015 - Prestação de serviços em regime de avença para técnico na área da engenharia electrónica e telecomunicações,Ajuste Direto Regime Geral,Aquisição de serviços,"71310000-4, Serviços de consultoria em matéria de engenharia e construção","Administração Regional de Saúde do Algarve, I. P. (503148709)",Rui Miguel Sousa Bernardo (223536580),"18.021,95 €",22-07-2015,01-07-2015,365 dias,"Portugal, Faro, Faro","Artigo 20.º, n.º 1, alínea a) do Código dos Contratos Públicos","","","","",,Não aplicável.,Não aplicável.,FALSE
AD 205/2015 - Prestação de serviços em regime de avença para técnico área de arquitetura para o GIE,Ajuste Direto Regime Geral,Aquisição de serviços,"71600000-4, Serviços técnicos de ensaio, análise e consultoria","Administração Regional de Saúde do Algarve, I. P. (503148709)",Carlos Celestino Arrais Mercês (210047879),"18.021,95 €",22-07-2015,01-07-2015,365 dias,"Portugal, Faro, Faro","Artigo 20.º, n.º 1, alínea a) do Código dos Contratos Públicos","","","","",,Não aplicável.,Não aplicável.,FALSE
AD184/2015-Empreitada de Obras de Conservação e Beneficiação no Centro de Saúde de Lagos,Ajuste Direto Regime Geral,Empreitadas de obras públicas,"45453000-7, Obras de revisão e recuperação","Administração Regional de Saúde do Algarve, I. P. (503148709)","CONSTRUÇÕES EXPRESSO UNIPESSOAL, LDA. (501998179)","137.853,70 €",22-07-2015,17-07-2015,150 dias,"Portugal, Faro, Lagos","Artigo 19.º, alínea a) do Código dos Contratos Públicos","","137.853,70 €","Foi efetuada vistoria para efeitos de receção provisória em 28/12/2015, onde foi dado ao empreiteiro um prazo de 10 dias para correção de trabalhos.","",,Não aplicável.,Não aplicável.,FALSE
SC/114/2015 - AQUISIÇÃO DE IODOPOVIDONA,Ao abrigo de acordo-quadro (art.º 259.º),Aquisição de bens móveis,"33690000-3, Medicamentos vários","Administração Regional de Saúde do Algarve, I. P. (503148709)","MEDA  PHARMA - PRODUTOS FARMACÊUTICOS, S.A. (500082090)","1.192,50 €",21-07-2015,21-07-2015,163 dias,"Portugal, Faro, Faro",Artigo 259.º do Código dos Contratos Públicos,04-12-2015,"1.012,50 €","",Quantidades Fornecidas,,549298,"Concurso Público para a celebração de Contratos Publicos de Aprovisionamento para a área da saúde com vista ao fornecimento de Antisepticos, Desinfetantes e Outros, às Instituições e Serviços do Serviço Nacional de Saúde.",FALSE
