Objeto do Contrato,Tipo de Procedimento,Tipo(s) de Contrato,CPVs,Entidade(s) Adjudicante(s),Entidade(s) Adjudicatária(s),Preço Contratual,Data de Publicação,Data de Celebração do Contrato,Prazo de Execução,Local de Execução,Fundamentação,Data de Fecho do Contrato,Preço Total Efetivo,Causas das Alterações ao Prazo,Causas das Alterações ao Preço,Estado,N.º registo do Acordo Quadro,Descrição do Acordo Quadro,Procedimento Centralizado
Suplementos Hiperproteico Enriq.C/ Arginina e Micronutrient. P/Ulceras Pressao,Ajuste Direto Regime Geral,Aquisição de bens móveis,"33000000-0, Equipamento médico, medicamentos e produtos para cuidados pessoais",Centro Hospitalar Psiquiátrico de Lisboa (CHPL) (508338476),"NUTRICIA ADVANCED MEDICAL NUTRICION, LDA. (507558286)","684,00 €",08-02-2019,04-01-2018,2 dias,"Portugal, Lisboa, Lisboa","Artigo 26.º, n.º 1, alínea e) do Código dos Contratos Públicos",26-11-2018,"684,00 €",,,,Não aplicável.,Não aplicável.,FALSE
"CHPL -  Bisacodilo 10 M,G SUO/ 5MG COMP",Ajuste Direto Regime Geral,Aquisição de bens móveis,"33000000-0, Equipamento médico, medicamentos e produtos para cuidados pessoais",Centro Hospitalar Psiquiátrico de Lisboa (508338476),"SANOFI - PRODUTOS FARMACÊUTICOS, LDA. (500134960)","751,80 €",07-02-2019,14-11-2018,2 dias,"Portugal, Lisboa, Lisboa","Artigo 26.º, n.º 1, alínea e) do Código dos Contratos Públicos",20-11-2018,"751,80 €",,,,Não aplicável.,Não aplicável.,FALSE
"CHPL -  Bisacodilo 10 M,G SUO/ 5MG COMP",Ajuste Direto Regime Geral,Aquisição de bens móveis,"33000000-0, Equipamento médico, medicamentos e produtos para cuidados pessoais",Centro Hospitalar Psiquiátrico de Lisboa (508338476),"SANOFI - PRODUTOS FARMACÊUTICOS, LDA. (500134960)","149,42 €",07-02-2019,14-11-2018,2 dias,"Portugal, Lisboa, Lisboa","Artigo 26.º, n.º 1, alínea e) do Código dos Contratos Públicos",20-11-2018,"149,42 €",,,,Não aplicável.,Não aplicável.,FALSE
CHPL - 51017218 QUETIAPINA 100 E 25 MG COMP,Ajuste Direto Regime Geral,Aquisição de bens móveis,"33000000-0, Equipamento médico, medicamentos e produtos para cuidados pessoais",Centro Hospitalar Psiquiátrico de Lisboa (508338476),GENERIS - FARMACEUTICA SA (508107997),"102,60 €",06-02-2019,14-12-2018,2 dias,"Portugal, Lisboa, Lisboa","Artigo 26.º, n.º 1, alínea e) do Código dos Contratos Públicos",17-12-2018,"102,60 €",,,,Não aplicável.,Não aplicável.,FALSE
CHPL - 51017218 QUETIAPINA 100 E 25 MG COMP,Ajuste Direto Regime Geral,Aquisição de bens móveis,"33000000-0, Equipamento médico, medicamentos e produtos para cuidados pessoais",Centro Hospitalar Psiquiátrico de Lisboa (508338476),"Farmoz - Sociedade Técnico Medicinal, SA (501505334)","390,00 €",06-02-2019,14-12-2018,2 dias,"Portugal, Lisboa, Lisboa","Artigo 26.º, n.º 1, alínea e) do Código dos Contratos Públicos",17-12-2018,"390,00 €",,,,Não aplicável.,Não aplicável.,FALSE
CHPL - 51014518 Atenolol 50 comp/ Enalapril+hidro,Ajuste Direto Regime Geral,Aquisição de bens móveis,"33000000-0, Equipamento médico, medicamentos e produtos para cuidados pessoais",Centro Hospitalar Psiquiátrico de Lisboa (508338476),Ratiopharm (502414910),"19,44 €",06-02-2019,22-10-2018,2 dias,"Portugal, Lisboa, Lisboa","Artigo 26.º, n.º 1, alínea e) do Código dos Contratos Públicos",23-10-2018,"19,44 €",,,,Não aplicável.,Não aplicável.,FALSE
CHPL - 51014518 Atenolol 50 comp/ Enalapril+hidro,Ajuste Direto Regime Geral,Aquisição de bens móveis,"33000000-0, Equipamento médico, medicamentos e produtos para cuidados pessoais",Centro Hospitalar Psiquiátrico de Lisboa (508338476),Ratiopharm (502414910),"9,86 €",06-02-2019,22-10-2018,2 dias,"Portugal, Lisboa, Lisboa","Artigo 26.º, n.º 1, alínea e) do Código dos Contratos Públicos",23-10-2018,"9,86 €",,,,Não aplicável.,Não aplicável.,FALSE
CHPL- 51013418 Trazodona 100 mg comp,Ajuste Direto Regime Geral,Aquisição de bens móveis,"33000000-0, Equipamento médico, medicamentos e produtos para cuidados pessoais",Centro Hospitalar Psiquiátrico de Lisboa (508338476),GENERIS - FARMACEUTICA SA (508107997),"264,60 €",05-02-2019,09-10-2018,2 dias,"Portugal, Lisboa, Lisboa","Artigo 26.º, n.º 1, alínea e) do Código dos Contratos Públicos",15-10-2018,"264,60 €",,,,Não aplicável.,Não aplicável.,FALSE
CHPL - 51013718 Ácido Valproico 7520 mg gran. LM saq,Ajuste Direto Regime Geral,Aquisição de bens móveis,"33000000-0, Equipamento médico, medicamentos e produtos para cuidados pessoais",Centro Hospitalar Psiquiátrico de Lisboa (508338476),"SANOFI - PRODUTOS FARMACÊUTICOS, LDA. (500134960)","729,60 €",05-02-2019,01-10-2018,2 dias,"Portugal, Lisboa, Lisboa","Artigo 26.º, n.º 1, alínea e) do Código dos Contratos Públicos",04-10-2018,"729,60 €",,,,Não aplicável.,Não aplicável.,FALSE
CHPL - 51013818 Timolon 5mg+Dorzolamida 20 mg col,Ajuste Direto Regime Geral,Aquisição de bens móveis,"33000000-0, Equipamento médico, medicamentos e produtos para cuidados pessoais",Centro Hospitalar Psiquiátrico de Lisboa (508338476),"LAB EDOL-PROD FARMACEUTICOS,SA (507072642)","102,81 €",05-02-2019,01-10-2018,2 dias,"Portugal, Lisboa, Lisboa","Artigo 26.º, n.º 1, alínea e) do Código dos Contratos Públicos",04-10-2018,"102,81 €",,,,Não aplicável.,Não aplicável.,FALSE
CHPL - 51014118 Cloranfenicol 10 mg/g pom ift bisn,Ajuste Direto Regime Geral,Aquisição de bens móveis,"33000000-0, Equipamento médico, medicamentos e produtos para cuidados pessoais",Centro Hospitalar Psiquiátrico de Lisboa (508338476),"Davi II, SA (508309450)","45,40 €",05-02-2019,10-10-2018,2 dias,"Portugal, Lisboa, Lisboa","Artigo 26.º, n.º 1, alínea e) do Código dos Contratos Públicos",15-10-2018,"45,40 €",,,,Não aplicável.,Não aplicável.,FALSE
CHPL - 51014218 Oxido zinco 270mg+Oleo Fig Bac 200,Ajuste Direto Regime Geral,Aquisição de bens móveis,"33000000-0, Equipamento médico, medicamentos e produtos para cuidados pessoais",Centro Hospitalar Psiquiátrico de Lisboa (508338476),"SANOFI - PRODUTOS FARMACÊUTICOS, LDA. (500134960)","75,60 €",04-02-2019,09-10-2018,2 dias,"Portugal, Lisboa, Lisboa","Artigo 26.º, n.º 1, alínea e) do Código dos Contratos Públicos",15-10-2018,"75,60 €",,,,Não aplicável.,Não aplicável.,FALSE
CHPL - 51014318 Paroxetina 20 mg comp,Ajuste Direto Regime Geral,Aquisição de bens móveis,"33000000-0, Equipamento médico, medicamentos e produtos para cuidados pessoais",Centro Hospitalar Psiquiátrico de Lisboa (508338476),"Generis Farmacêutica, SA (508107997)","62,50 €",04-02-2019,16-10-2018,2 dias,"Portugal, Lisboa, Lisboa","Artigo 26.º, n.º 1, alínea e) do Código dos Contratos Públicos",18-10-2018,"62,50 €",,,,Não aplicável.,Não aplicável.,FALSE
CHPL - 51014418 Metformina 1000 mg comp,Ajuste Direto Regime Geral,Aquisição de bens móveis,"33000000-0, Equipamento médico, medicamentos e produtos para cuidados pessoais",Centro Hospitalar Psiquiátrico de Lisboa (508338476),"DLA - Farmacêutica, S.A. (503894427)","79,20 €",04-02-2019,16-10-2018,2 dias,"Portugal, Lisboa, Lisboa","Artigo 26.º, n.º 1, alínea e) do Código dos Contratos Públicos",18-10-2018,"79,20 €",,,,Não aplicável.,Não aplicável.,FALSE
CHPL - 51016018 Sertralina 100 mg comp,Ajuste Direto Regime Geral,Aquisição de bens móveis,"33000000-0, Equipamento médico, medicamentos e produtos para cuidados pessoais",Centro Hospitalar Psiquiátrico de Lisboa (508338476),GENERIS FARMACÊUTICA S.A. (508107997),"87,36 €",04-02-2019,06-11-2018,2 dias,"Portugal, Lisboa, Lisboa","Artigo 26.º, n.º 1, alínea e) do Código dos Contratos Públicos",07-11-2018,"87,36 €",,,,Não aplicável.,Não aplicável.,FALSE
CHPL - 51015218 PAPIPERIDONA 6 mg comp LP,Ajuste Direto Regime Geral,Aquisição de bens móveis,"33000000-0, Equipamento médico, medicamentos e produtos para cuidados pessoais",Centro Hospitalar Psiquiátrico de Lisboa (508338476),JANSSEN-CILAG FARMACEUTICA LDA (500189412),"1.521,52 €",01-02-2019,22-10-2018,2 dias,"Portugal, Lisboa, Lisboa","Artigo 26.º, n.º 1, alínea d) do Código dos Contratos Públicos",23-10-2018,"1.521,52 €",,,,Não aplicável.,Não aplicável.,FALSE
CHPL - 51014918 Formoterol 12 mcg po inal caps,Ajuste Direto Regime Geral,Aquisição de bens móveis,"33000000-0, Equipamento médico, medicamentos e produtos para cuidados pessoais",Centro Hospitalar Psiquiátrico de Lisboa (508338476),"GENERIS - FARMACÊUTICA, S.A. (508107997)","48,00 €",01-02-2019,22-10-2018,2 dias,"Portugal, Lisboa, Lisboa","Artigo 26.º, n.º 1, alínea e) do Código dos Contratos Públicos",23-10-2018,"48,00 €",,,,Não aplicável.,Não aplicável.,FALSE
CHPL - 51015018 Macrogol Cl Sodio B Sodio Cl Po,Ajuste Direto Regime Geral,Aquisição de bens móveis,"33000000-0, Equipamento médico, medicamentos e produtos para cuidados pessoais",Centro Hospitalar Psiquiátrico de Lisboa (508338476),MYLAN LDA (502248793),"186,45 €",31-01-2019,22-10-2018,2 dias,"Portugal, Lisboa, Lisboa","Artigo 26.º, n.º 1, alínea e) do Código dos Contratos Públicos",23-10-2018,"186,45 €",,,,Não aplicável.,Não aplicável.,FALSE
CHPL - 51014718 Pregabalina 225 mg caps,Ajuste Direto Regime Geral,Aquisição de bens móveis,"33000000-0, Equipamento médico, medicamentos e produtos para cuidados pessoais",Centro Hospitalar Psiquiátrico de Lisboa (508338476),"GENERIS - FARMACÊUTICA, S.A. (508107997)","126,00 €",31-01-2019,16-10-2018,2 dias,"Portugal, Lisboa, Lisboa","Artigo 26.º, n.º 1, alínea e) do Código dos Contratos Públicos",18-10-2018,"126,00 €",,,,Não aplicável.,Não aplicável.,FALSE
CHPL - 51014618 Insulina Humana 100Ac Inter Canet,Ajuste Direto Regime Geral,Aquisição de bens móveis,"33000000-0, Equipamento médico, medicamentos e produtos para cuidados pessoais",Centro Hospitalar Psiquiátrico de Lisboa (508338476),"SANOFI - PRODUTOS FARMACÊUTICOS, LDA. (500134960)","59,48 €",31-01-2019,19-10-2018,2 dias,"Portugal, Lisboa, Lisboa","Artigo 26.º, n.º 1, alínea e) do Código dos Contratos Públicos",19-10-2018,"59,48 €",,,,Não aplicável.,Não aplicável.,FALSE
CHPL - 51015918 Pregabalina 300 mg caps,Ajuste Direto Regime Geral,Aquisição de bens móveis,"33000000-0, Equipamento médico, medicamentos e produtos para cuidados pessoais",Centro Hospitalar Psiquiátrico de Lisboa (508338476),"PHARMAKERN PORTUGAL, Produtos Farmacêuticos Soc. Unipessoal Lda (507002571)","86,59 €",31-01-2019,06-11-2018,2 dias,"Portugal, Lisboa, Lisboa","Artigo 26.º, n.º 1, alínea e) do Código dos Contratos Públicos",07-11-2018,"86,59 €",,,,Não aplicável.,Não aplicável.,FALSE
CHPL - 51015818 Fostomicina 3000 mg gran saq,Ajuste Direto Regime Geral,Aquisição de bens móveis,"33000000-0, Equipamento médico, medicamentos e produtos para cuidados pessoais",Centro Hospitalar Psiquiátrico de Lisboa (508338476),"GENERIS - FARMACÊUTICA, S.A. (508107997)","64,00 €",31-01-2019,20-11-2018,2 dias,"Portugal, Lisboa, Lisboa","Artigo 26.º, n.º 1, alínea e) do Código dos Contratos Públicos",23-11-2018,"64,00 €",,,,Não aplicável.,Não aplicável.,FALSE
