freguesia,acronym,validVotesPercentage,votes,dicofre
Monsanto,PS,42.27,93,140208
Monsanto,PPD/PSD,19.09,42,140208
Monsanto,B.E.,10,22,140208
Monsanto,PCP-PEV,10,22,140208
Monsanto,CDS-PP,4.09,9,140208
Monsanto,PAN,3.18,7,140208
Monsanto,A,2.73,6,140208
Monsanto,PPM.PPV/CDC,2.73,6,140208
Monsanto,NC,1.82,4,140208
Monsanto,PDR,1.36,3,140208
Monsanto,L,0.91,2,140208
Monsanto,PNR,0.91,2,140208
Monsanto,PCTP/MRPP,0.45,1,140208
Monsanto,PURP,0.45,1,140208
Monsanto,IL,0,0,140208
Monsanto,MAS,0,0,140208
Monsanto,PTP,0,0,140208
