freguesia,acronym,validVotesPercentage,votes,dicofre
Figueira,PPD/PSD.CDS-PP,58.16,57,180509
Figueira,PS,31.63,31,180509
Figueira,PCP-PEV,4.08,4,180509
Figueira,B.E.,2.04,2,180509
Figueira,PCTP/MRPP,2.04,2,180509
Figueira,PPM,1.02,1,180509
Figueira,PTP,1.02,1,180509
Figueira,L,0,0,180509
Figueira,MAS,0,0,180509
Figueira,MPT,0,0,180509
Figueira,PAN,0,0,180509
Figueira,PDA,0,0,180509
Figueira,PND,0,0,180509
Figueira,PNR,0,0,180509
Figueira,POUS,0,0,180509
Figueira,PPV,0,0,180509
