Objeto do Contrato,Tipo de Procedimento,Tipo(s) de Contrato,CPVs,Entidade(s) Adjudicante(s),Entidade(s) Adjudicatária(s),Preço Contratual,Data de Publicação,Data de Celebração do Contrato,Prazo de Execução,Local de Execução,Fundamentação,Data de Fecho do Contrato,Preço Total Efetivo,Causas das Alterações ao Prazo,Causas das Alterações ao Preço,Estado,N.º registo do Acordo Quadro,Descrição do Acordo Quadro,Procedimento Centralizado
"Aquisição de 3 Ópticas 0º Adulto para Serviço de Broncologia do CHSJ, EPE",Ajuste Direto Regime Geral,Aquisição de bens móveis,"33100000-1, Equipamento médico","Centro Hospitalar de São João, E. P. E. (509821197)","Teprel Equipamentos Médicos, SA (502262184)","9.600,00 €",25-06-2015,15-06-2015,60 dias,"Portugal, Porto, Porto","Artigo 20.º, n.º 1, alínea a) do Código dos Contratos Públicos",,,,,,Não aplicável.,Não aplicável.,FALSE
"Fornecimento e Instalação de Equipamento Passivo para Reformulação da Rede Estruturada do Corpo nº 6 do CAM do CHSJ, EPE",Ajuste Direto Regime Geral,Aquisição de bens móveis,"32420000-3, Equipamento de rede","Centro Hospitalar de São João, E. P. E. (509821197)","Guiatel Serviços Telecomunicações, SA (505368102)","7.421,05 €",25-06-2015,05-06-2015,15 dias,"Portugal, Porto, Porto","Artigo 20.º, n.º 1, alínea a) do Código dos Contratos Públicos",,,,,,Não aplicável.,Não aplicável.,FALSE
"Aquisição de 4 Fontes de Luz e Processadores para o Centro de Ecoendoscopia Digestiva do CHSJ, EPE",Ajuste Direto Regime Geral,Aquisição de bens móveis,"33168000-5, Aparelhos para endoscopia e endocirurgia","Centro Hospitalar de São João, E. P. E. (509821197)",Olympus Iberia S.A.U. Sucursal em Portugal (980474710),"68.686,00 €",25-06-2015,25-05-2015,30 dias,"Portugal, Porto, Porto","Artigo 24.º, n.º 1, alínea e) do Código dos Contratos Públicos",,,,,,Não aplicável.,Não aplicável.,FALSE
"Aquisição de 8 Computadores All In One para Secretariado da Administração do CHSJ, EPE",Ajuste Direto Regime Geral,Aquisição de bens móveis,"30213300-8, Computadores de secretária (desktop computers)","Centro Hospitalar de São João, E. P. E. (509821197)",ITEN Solutions Sistemas Informação SA (510728189),"6.698,24 €",25-06-2015,08-06-2015,15 dias,"Portugal, Porto, Porto","Artigo 20.º, n.º 1, alínea a) do Código dos Contratos Públicos",,,,,,Não aplicável.,Não aplicável.,FALSE
"Aquisição de Aspirador Ultrasónico para o CHSJ, EPE",Ajuste Direto Regime Geral,Aquisição de bens móveis,"33162100-4, Aparelhos para blocos operatórios","Centro Hospitalar de São João, E. P. E. (509821197)","Medijope Material Hospitalar, Lda. (503005223)","74.889,70 €",25-06-2015,02-06-2015,20 dias,"Portugal, Porto, Porto","Artigo 20.º, n.º 1, alínea a) do Código dos Contratos Públicos",,,,,,Não aplicável.,Não aplicável.,FALSE
"Empreitada para realização de trabalhos de Beneficiação do Anel Principal de Água junto ao Serviço de Psiquiatria do CHSJ, EPE",Ajuste Direto Regime Geral,Empreitadas de obras públicas,"45113000-2, Obras no local","Centro Hospitalar de São João, E. P. E. (509821197)","Construções Ezequiel Pinho Moreira, Lda. (503320455)","10.300,00 €",25-06-2015,27-05-2015,12 dias,"Portugal, Porto, Porto","Artigo 19.º, alínea a) do Código dos Contratos Públicos",,,,,,Não aplicável.,Não aplicável.,FALSE
"Aquisição de Sistema de Desumidificação para as Salas de Blocos de Parafina do Serviço de Anatomia Patológica do CHSJ, EPE",Ajuste Direto Regime Geral,Aquisição de bens móveis,"42113161-0, Desumidificadores","Centro Hospitalar de São João, E. P. E. (509821197)","Climave Equip. Electromecânicos, Lda. (503926140)","7.962,50 €",25-06-2015,12-06-2015,30 dias,"Portugal, Porto, Porto","Artigo 20.º, n.º 1, alínea a) do Código dos Contratos Públicos",,,,,,Não aplicável.,Não aplicável.,FALSE
"Aquisição de 10 camas e colchões para o Serviço de Traumatologia do CHSJ, EPE",Ajuste Direto Regime Geral,Aquisição de bens móveis,"33192000-2, Mobiliário para fins médicos","Centro Hospitalar de São João, E. P. E. (509821197)","IMO - Indústrias Metalúrgicas, SA (500136939)","12.700,00 €",25-06-2015,04-06-2015,60 dias,"Portugal, Porto, Porto","Artigo 20.º, n.º 1, alínea a) do Código dos Contratos Públicos",,,,,,Não aplicável.,Não aplicável.,FALSE
"Renovação de Serviço de Aluguer de Contentores para o CHSJ, EPE",Ajuste Direto Regime Geral,Aquisição de serviços,"51500000-7, Serviços de instalação de máquinas e equipamento","Centro Hospitalar de São João, E. P. E. (509821197)","Rebigran, Lda. (510891810)","65.774,16 €",25-06-2015,04-05-2015,90 dias,"Portugal, Porto, Porto","Artigo 20.º, n.º 1, alínea a) do Código dos Contratos Públicos",,,,,,Não aplicável.,Não aplicável.,FALSE
"Aquisição de equipamento de rede sem fios para o CAM do CHSJ, EPE",Ajuste Direto Regime Geral,Aquisição de bens móveis,"30200000-1, Equipamento e material informático","Centro Hospitalar de São João, E. P. E. (509821197)","Gonksys, SA (510874169)","9.542,94 €",23-06-2015,15-06-2015,15 dias,"Portugal, Porto, Porto","Artigo 20.º, n.º 1, alínea a) do Código dos Contratos Públicos",,,,,,Não aplicável.,Não aplicável.,FALSE
"Aquisição de duas Ultracongeladoras para o Centro Hospitalar de S. João, EPE",Ajuste Direto Regime Geral,Aquisição de bens móveis,"39711100-0, Frigoríficos e congeladores","Centro Hospitalar de São João, E. P. E. (509821197)","Supplylab, Lda. (508453534)","18.841,20 €",23-06-2015,30-04-2015,25 dias,"Portugal, Porto, Porto","Artigo 20.º, n.º 1, alínea a) do Código dos Contratos Públicos",,,,,,Não aplicável.,Não aplicável.,FALSE
"Empreitada de Beneficiação da Cobertura do Corpo nº 9 do CAM do CHSJ, EPE",Ajuste Direto Regime Geral,Empreitadas de obras públicas,"45113000-2, Obras no local","Centro Hospitalar de São João, E. P. E. (509821197)","Vírgula Métrica Construções, Lda. (513285792)","21.785,88 €",23-06-2015,29-05-2015,30 dias,"Portugal, Porto, Porto","Artigo 19.º, alínea a) do Código dos Contratos Públicos",,,,,,Não aplicável.,Não aplicável.,FALSE
"Empreitada de Remodelação do Laboratório de Metrologia do CHSJ, EPE",Ajuste Direto Regime Geral,Empreitadas de obras públicas,"45113000-2, Obras no local","Centro Hospitalar de São João, E. P. E. (509821197)","Jofilhos - Sociedade de Construções, Lda. (500854386)","22.265,80 €",23-06-2015,12-05-2015,60 dias,"Portugal, Porto, Porto","Artigo 19.º, alínea a) do Código dos Contratos Públicos",,,,,,Não aplicável.,Não aplicável.,FALSE
"Empreitada para Instalação de Sistema de Climatização do Corpo nº 4 do CAM do CHSJ, EPE",Ajuste Direto Regime Geral,Empreitadas de obras públicas,"45113000-2, Obras no local","Centro Hospitalar de São João, E. P. E. (509821197)","Arcotubo, Lda. (503508675)","65.015,00 €",23-06-2015,23-04-2015,70 dias,"Portugal, Porto, Porto","Artigo 19.º, alínea a) do Código dos Contratos Públicos",,,,,,Não aplicável.,Não aplicável.,FALSE
"Aquisição de dois Ecógrafos para o Serviço de Cirurgia Vascular do CHSJ, EPE",Ajuste Direto Regime Geral,Aquisição de bens móveis,"33112000-8, Equipamento de imagiologia por ecos, ultra-sons e doppler","Centro Hospitalar de São João, E. P. E. (509821197)",Philips Portuguesa SA (500216843),"73.000,00 €",23-06-2015,03-06-2015,25 dias,"Portugal, Porto, Porto","Artigo 20.º, n.º 1, alínea a) do Código dos Contratos Públicos",,,,,,Não aplicável.,Não aplicável.,FALSE
Aquisição de Próteses de Hérnia,Ajuste Direto Regime Geral,Aquisição de bens móveis,"33184000-3, Próteses","Centro Hospitalar de São João, E. P. E. (509821197)","Covidien Portugal - Produtos de Saúde, Lda (503413410)","16.820,22 €",23-06-2015,11-06-2015,203 dias,"Portugal, Porto, Porto","Artigo 20.º, n.º 1, alínea a) do Código dos Contratos Públicos",,,,,,Não aplicável.,Não aplicável.,FALSE
