freguesia,acronym,validVotesPercentage,votes,dicofre
"União das freguesias de Torre do Terrenho, Sebadelhe da Serra e Terrenho",PPD/PSD.CDS-PP,55.9,109,091331
"União das freguesias de Torre do Terrenho, Sebadelhe da Serra e Terrenho",PS,30.77,60,091331
"União das freguesias de Torre do Terrenho, Sebadelhe da Serra e Terrenho",PND,3.08,6,091331
"União das freguesias de Torre do Terrenho, Sebadelhe da Serra e Terrenho",PCP-PEV,2.56,5,091331
"União das freguesias de Torre do Terrenho, Sebadelhe da Serra e Terrenho",PCTP/MRPP,2.05,4,091331
"União das freguesias de Torre do Terrenho, Sebadelhe da Serra e Terrenho",L,1.03,2,091331
"União das freguesias de Torre do Terrenho, Sebadelhe da Serra e Terrenho",MPT,1.03,2,091331
"União das freguesias de Torre do Terrenho, Sebadelhe da Serra e Terrenho",PNR,1.03,2,091331
"União das freguesias de Torre do Terrenho, Sebadelhe da Serra e Terrenho",PTP,1.03,2,091331
"União das freguesias de Torre do Terrenho, Sebadelhe da Serra e Terrenho",B.E.,0.51,1,091331
"União das freguesias de Torre do Terrenho, Sebadelhe da Serra e Terrenho",PAN,0.51,1,091331
"União das freguesias de Torre do Terrenho, Sebadelhe da Serra e Terrenho",PPV,0.51,1,091331
"União das freguesias de Torre do Terrenho, Sebadelhe da Serra e Terrenho",MAS,0,0,091331
"União das freguesias de Torre do Terrenho, Sebadelhe da Serra e Terrenho",PDA,0,0,091331
"União das freguesias de Torre do Terrenho, Sebadelhe da Serra e Terrenho",POUS,0,0,091331
"União das freguesias de Torre do Terrenho, Sebadelhe da Serra e Terrenho",PPM,0,0,091331
