Objeto do Contrato,Tipo de Procedimento,Tipo(s) de Contrato,CPVs,Entidade(s) Adjudicante(s),Entidade(s) Adjudicatária(s),Preço Contratual,Data de Publicação,Data de Celebração do Contrato,Prazo de Execução,Local de Execução,Fundamentação,Data de Fecho do Contrato,Preço Total Efetivo,Causas das Alterações ao Prazo,Causas das Alterações ao Preço,Estado,N.º registo do Acordo Quadro,Descrição do Acordo Quadro,Procedimento Centralizado
"DISPOSITIVO BUCAL P APARELHO DE MEDIÇÃO DE ALCOOL NO AR EXPIRADO, USO ÚNICO ",Ajuste Direto Regime Geral,Aquisição de bens móveis,"33000000-0, Equipamento médico, medicamentos e produtos para cuidados pessoais","Administração Regional de Saúde do Alentejo, I. P. (503148768)","Tecniquitel - Sociedade de Equipamentos Técnicos, S.A. (500663300)","150,00 €",11-07-2017,21-10-2015,30 dias,"Portugal, Évora","Artigo 20.º, n.º 1, alínea a) do Código dos Contratos Públicos",31-12-2015,"150,00 €",,"",,Não aplicável.,Não aplicável.,FALSE
SONDA SUCCAO CH   8 C/ CONTROLO DE VACUO SONDA SUCCAO CH 14 C/ CONTROLO DE VACUO PLACAS DE FELTRO ADESIVO PARA ALIVIO DE PRESSÃO (CELLONA) 5 MM TUBO ENDOTRAQUEAL S/ CUFF CH 7.5,Ajuste Direto Regime Geral,Aquisição de bens móveis,"33000000-0, Equipamento médico, medicamentos e produtos para cuidados pessoais","Administração Regional de Saúde do Alentejo, I. P. (503148768)","OVERPHARMA,LDA. (505792362)","89,20 €",11-07-2017,08-07-2015,180 dias,"Portugal, Évora","Artigo 20.º, n.º 1, alínea a) do Código dos Contratos Públicos",31-12-2015,"89,20 €",,"",,Não aplicável.,Não aplicável.,FALSE
"FRASCO, 20ml (plástico)  ",Ajuste Direto Regime Geral,Aquisição de bens móveis,"33000000-0, Equipamento médico, medicamentos e produtos para cuidados pessoais","Administração Regional de Saúde do Alentejo, I. P. (503148768)",MADIL (502907363),"6.510,00 €",11-07-2017,08-06-2015,210 dias,"Portugal, Évora","Artigo 20.º, n.º 1, alínea a) do Código dos Contratos Públicos",31-12-2015,"6.510,00 €",,"",,Não aplicável.,Não aplicável.,FALSE
SONDA SUCCAO CH   6 C/ CONTROLO DE VACUO SONDA SUCCAO CH 10 C/ CONTROLO DE VACUO SONDA SUCCAO CH 18 C/ CONTROLO DE VACUO LENÇOL DESCARTÁVEL 75X210CM TUBO ENDOTRAQUEAL S/ CUFF CH 8 LÂMINAS DE LARINGOSCOPIA CURVA Nº 1,Ajuste Direto Regime Geral,Aquisição de bens móveis,"33000000-0, Equipamento médico, medicamentos e produtos para cuidados pessoais","Administração Regional de Saúde do Alentejo, I. P. (503148768)","H.R. - HOSPITALAR, UNIPESSOAL, LDA. (501895558)","165,70 €",11-07-2017,08-06-2015,210 dias,"Portugal, Évora","Artigo 20.º, n.º 1, alínea a) do Código dos Contratos Públicos",31-12-2015,"165,70 €",,"",,Não aplicável.,Não aplicável.,FALSE
TUBO ENDOTRAQUEAL C/ CUFF CH3,Ajuste Direto Regime Geral,Aquisição de bens móveis,"33000000-0, Equipamento médico, medicamentos e produtos para cuidados pessoais","Administração Regional de Saúde do Alentejo, I. P. (503148768)","Factor-Plus - Produtos Médicos e Hospitalares, Lda (502810645)","298,95 €",11-07-2017,13-11-2015,210 dias,"Portugal, Évora","Artigo 20.º, n.º 1, alínea a) do Código dos Contratos Públicos",31-12-2015,"298,95 €",,"",,Não aplicável.,Não aplicável.,FALSE
"ADESIVO NORMAL 10X2,5 ",Ajuste Direto Regime Geral,Aquisição de bens móveis,"33000000-0, Equipamento médico, medicamentos e produtos para cuidados pessoais","Administração Regional de Saúde do Alentejo, I. P. (503148768)",Ezequiel Panão Jorge (501412727),"316,00 €",11-07-2017,22-09-2015,210 dias,"Portugal, Évora","Artigo 20.º, n.º 1, alínea a) do Código dos Contratos Públicos",31-12-2015,"316,00 €",,"",,Não aplicável.,Não aplicável.,FALSE
ELECTRODOS PARA MONITOR / DESFIBRILHADOR DE USO UNICO,Ajuste Direto Regime Geral,Aquisição de bens móveis,"33000000-0, Equipamento médico, medicamentos e produtos para cuidados pessoais","Administração Regional de Saúde do Alentejo, I. P. (503148768)","COVIDIEN PORTUGAL-PROD. SAÚDE, UNIP., LDA (503413410)","900,00 €",11-07-2017,08-06-2015,210 dias,"Portugal, Évora","Artigo 20.º, n.º 1, alínea a) do Código dos Contratos Públicos",31-12-2015,"900,00 €",,"",,Não aplicável.,Não aplicável.,FALSE
"CAMPO CIRURGICO TECIDO NAO TECIDO SEM ORIFICIO, ESTERILIZADO - 38X45 ",Ajuste Direto Regime Geral,Aquisição de bens móveis,"33000000-0, Equipamento médico, medicamentos e produtos para cuidados pessoais","Administração Regional de Saúde do Alentejo, I. P. (503148768)",BASTOS VIEGAS S A - BESLEASING E FACTORING     (500042772),"275,00 €",11-07-2017,08-07-2015,210 dias,"Portugal, Évora","Artigo 20.º, n.º 1, alínea a) do Código dos Contratos Públicos",31-12-2015,"275,00 €",,"",,Não aplicável.,Não aplicável.,FALSE
TABULEIRO DE POLIURETANO 220X180X41 MM,Ajuste Direto Regime Geral,Aquisição de bens móveis,"33000000-0, Equipamento médico, medicamentos e produtos para cuidados pessoais","Administração Regional de Saúde do Alentejo, I. P. (503148768)",AVIQUIMICA (500039720),"85,40 €",11-07-2017,06-08-2015,210 dias,"Portugal, Évora","Artigo 20.º, n.º 1, alínea a) do Código dos Contratos Públicos",31-12-2015,"85,40 €",,"",,Não aplicável.,Não aplicável.,FALSE
DETERGENTE ENZIMATICO LÍQUIDO - 1 LITRO,Ajuste Direto Regime Geral,Aquisição de bens móveis,"33000000-0, Equipamento médico, medicamentos e produtos para cuidados pessoais","Administração Regional de Saúde do Alentejo, I. P. (503148768)","Franklab Portugal, Lda                (506058654)","1.248,00 €",11-07-2017,08-07-2015,240 dias,"Portugal, Évora","Artigo 20.º, n.º 1, alínea a) do Código dos Contratos Públicos",31-12-2015,"1.248,00 €",,"",,Não aplicável.,Não aplicável.,FALSE
TROLAMINA COMPOSTA - EMULSAO - 100 GR,Ajuste Direto Regime Geral,Aquisição de bens móveis,"33000000-0, Equipamento médico, medicamentos e produtos para cuidados pessoais","Administração Regional de Saúde do Alentejo, I. P. (503148768)","JOHNSON E JOHNSON, LDA (500153370)","2.056,00 €",11-07-2017,29-04-2015,240 dias,"Portugal, Évora","Artigo 20.º, n.º 1, alínea a) do Código dos Contratos Públicos",31-12-2015,"2.084,78 €",,Múltiplo da quantidade de embalagens de fornecimento,,Não aplicável.,Não aplicável.,FALSE
"NITROGLICERINA - COMP 0,5 MG ",Ajuste Direto Regime Geral,Aquisição de bens móveis,"33000000-0, Equipamento médico, medicamentos e produtos para cuidados pessoais","Administração Regional de Saúde do Alentejo, I. P. (503148768)","Quilaban - Quimica Laboratorial Analitica, SA (500399670)","339,48 €",11-07-2017,29-04-2015,240 dias,"Portugal, Évora","Artigo 20.º, n.º 1, alínea a) do Código dos Contratos Públicos",31-12-2015,"339,48 €",,"",,Não aplicável.,Não aplicável.,FALSE
LIDOCAINA - AEROSSOL 10%,Ajuste Direto Regime Geral,Aquisição de bens móveis,"33000000-0, Equipamento médico, medicamentos e produtos para cuidados pessoais","Administração Regional de Saúde do Alentejo, I. P. (503148768)",SIDEFARMA-SOC.IND.EXPANSAO FARMACEUTICA (500717419),"550,00 €",11-07-2017,29-04-2015,240 dias,"Portugal, Évora","Artigo 20.º, n.º 1, alínea a) do Código dos Contratos Públicos",31-12-2015,"550,00 €",,"",,Não aplicável.,Não aplicável.,FALSE
"IG 72.5A/2015 - Aquisição da Vacina Pneumocócica Polissacárida Conjugada de 13 valencias, centralizada na SPMS",Ao abrigo de acordo-quadro (art.º 259.º),Aquisição de bens móveis,"33000000-0, Equipamento médico, medicamentos e produtos para cuidados pessoais","Administração Regional de Saúde do Alentejo, I. P. (503148768)","Pfizer Biofarmacêutica, Sociedade Unipessoal Lda. (513300376)","38.184,55 €",11-07-2017,09-12-2015,30 dias,"Portugal, Évora",Artigo 259.º do Código dos Contratos Públicos,31-12-2015,"38.184,55 €",,"",,610556,"CONCURSO PÚBLICO PARA A CELEBRAÇÃO DE CONTRATOS PÚBLICOS DE APROVISIONAMENTO PARA A ÁREA DA SAÚDE, COM VISTA AO FORNECIMENTO DE VACINAS E TUBERCULINAS, ÀS INSTITUIÇÕES E SERVIÇOS DO SERVIÇO NACIONAL DE SAÚDE",FALSE
Aquisição da Vacina Pneumocócica Polissacárida Conjugada de 13 valencias,Ao abrigo de acordo-quadro (art.º 259.º),Aquisição de bens móveis,"33000000-0, Equipamento médico, medicamentos e produtos para cuidados pessoais","Administração Regional de Saúde do Alentejo, I. P. (503148768)","Pfizer Biofarmacêutica, Sociedade Unipessoal Lda. (513300376)","126.306,26 €",11-07-2017,08-06-2015,180 dias,"Portugal, Évora",Artigo 259.º do Código dos Contratos Públicos,31-12-2015,"126.306,26 €",,"",,610556,"CONCURSO PÚBLICO PARA A CELEBRAÇÃO DE CONTRATOS PÚBLICOS DE APROVISIONAMENTO PARA A ÁREA DA SAÚDE, COM VISTA AO FORNECIMENTO DE VACINAS E TUBERCULINAS, ÀS INSTITUIÇÕES E SERVIÇOS DO SERVIÇO NACIONAL DE SAÚDE",FALSE
Vacina contra o papilomavírus humano,Ao abrigo de acordo-quadro (art.º 258.º),Aquisição de bens móveis,"33000000-0, Equipamento médico, medicamentos e produtos para cuidados pessoais","Administração Regional de Saúde do Alentejo, I. P. (503148768)","Sanofi Pasteur MSD, SA (507632796)","55.000,00 €",11-07-2017,15-04-2015,250 dias,"Portugal, Évora",Artigo 258.º do Código dos Contratos Públicos,31-12-2015,"67.320,00 €",,"Necessidades adicionais, acordo entre as partes.",,613265,"CONCURSO PÚBLICO PARA A CELEBRAÇÃO DE CONTRATOS PÚBLICOS DE APROVISIONAMENTO PARA A ÁREA DA SAÚDE, COM VISTA AO FORNECIMENTO DE VACINAS CONTRA INFECÇÕES POR VÍRUS DO PAPILOMA HUMANO (HPV), ÀS INSTITUIÇÕES E SERVIÇOS DO SERVIÇO NACIONAL DE SAÚDE",FALSE
Imunoglobulina Humana contra o anti-génio D,Ao abrigo de acordo-quadro (art.º 259.º),Aquisição de bens móveis,"33000000-0, Equipamento médico, medicamentos e produtos para cuidados pessoais","Administração Regional de Saúde do Alentejo, I. P. (503148768)",CSL BEHRING                                        (503047201),"4.500,00 €",11-07-2017,10-07-2015,150 dias,"Portugal, Évora",Artigo 259.º do Código dos Contratos Públicos,31-12-2015,"4.500,00 €",,"",,535788,"CONCURSO PÚBLICO PARA A CELEBRAÇÃO DE CONTRATOSPÚBLICOS DE APROVISIONAMENTO PARA A ÁREA DA SAÚDE, COM VISTA AO FORNECIMENTO DE DERIVADOS DO PLASMA HUMANOÀS INSTITUIÇÕES E SERVIÇOS DO SERVIÇO NACIONAL DE SAÚDE",FALSE
Material de Consumo Clínico - Lancetas,Ao abrigo de acordo-quadro (art.º 259.º),Aquisição de bens móveis,"33000000-0, Equipamento médico, medicamentos e produtos para cuidados pessoais","Administração Regional de Saúde do Alentejo, I. P. (503148768)","SARSTEDT, SA (503019461)","271,20 €",11-07-2017,10-12-2015,30 dias,"Portugal, Évora",Artigo 259.º do Código dos Contratos Públicos,31-12-2015,"271,20 €",,"",,611510,"CONCURSO PÚBLICO PARA A CELEBRAÇÃO DE CONTRATOS PÚBLICOS DE APROVISIONAMENTO PARA A ÁREA DA SAÚDE, COM VISTA AO FORNECIMENTO DE MATERIAL DE PREVENÇÃO E DETEÇÃO HIV ÀS INSTITUIÇÕES E SERVIÇOS DO SERVIÇO NACIONAL DE SAÚDE",FALSE
TESTES DE DETECÇÃO NO AR EXPIRADO - ALCOOL TESTES DE DETECÇÃO DE DROGAS NA SALIVA,Ajuste Direto Regime Geral,Aquisição de bens móveis,"33000000-0, Equipamento médico, medicamentos e produtos para cuidados pessoais","Administração Regional de Saúde do Alentejo, I. P. (503148768)","Normax - Fábrica de vidros cientificos, Lda (500203130)","2.892,00 €",11-07-2017,18-05-2015,210 dias,"Portugal, Évora","Artigo 20.º, n.º 1, alínea a) do Código dos Contratos Públicos",31-12-2015,"2.892,00 €",,"",,Não aplicável.,Não aplicável.,FALSE
TESTES DE DETECÇÃO DE DROGAS NA URINA – OPIÁCEOS TESTES DE DETECÇÃO DE DROGAS NA URINA – COCAÍNA TESTES DE DETECÇÃO DE DROGAS NA URINA – METADONA TESTES DE DETECÇÃO DE DROGAS NA URINA – BUPRENORFINA TESTES DE DETECÇÃO DE DROGAS NA URINA – BENZODIAZEPINAS TESTES DE DETECÇÃO DE DROGAS NA URINA – ANFETAMINAS TESTES DE DETECÇÃO DE DROGAS NA URINA – METANFETAMINAS TESTES DE DETECÇÃO DE DROGAS NA URINA – THC TESTES DE DETECÇÃO DE DROGAS NA URINA – ECTASY TESTES DE DETECÇÃO DE DROGAS NA URINA – HCG (GRAVIDEZ),Ajuste Direto Regime Geral,Aquisição de bens móveis,"33000000-0, Equipamento médico, medicamentos e produtos para cuidados pessoais","Administração Regional de Saúde do Alentejo, I. P. (503148768)","Quilaban - Quimica Laboratorial Analitica, SA (500399670)","8.044,68 €",11-07-2017,18-05-2015,210 dias,"Portugal, Évora","Artigo 20.º, n.º 1, alínea a) do Código dos Contratos Públicos",31-12-2015,"8.044,68 €",,"",,Não aplicável.,Não aplicável.,FALSE
Vacinas VHB adulto,Ao abrigo de acordo-quadro (art.º 259.º),Aquisição de bens móveis,"33000000-0, Equipamento médico, medicamentos e produtos para cuidados pessoais","Administração Regional de Saúde do Alentejo, I. P. (503148768)",GlaxoSmithKline - Produtos Farmacêuticos Lda. (500139962),"2.568,00 €",10-07-2017,07-08-2015,30 dias,"Portugal, Évora",Artigo 259.º do Código dos Contratos Públicos,31-12-2015,"2.568,00 €",,"",,610556,"CONCURSO PÚBLICO PARA A CELEBRAÇÃO DE CONTRATOS PÚBLICOS DE APROVISIONAMENTO PARA A ÁREA DA SAÚDE, COM VISTA AO FORNECIMENTO DE VACINAS E TUBERCULINAS, ÀS INSTITUIÇÕES E SERVIÇOS DO SERVIÇO NACIONAL DE SAÚDE",FALSE
"Vacina anti-gripe inativada, para a época 2015/2016",Ao abrigo de acordo-quadro (art.º 259.º),Aquisição de bens móveis,"33000000-0, Equipamento médico, medicamentos e produtos para cuidados pessoais","Administração Regional de Saúde do Alentejo, I. P. (503148768)","Sanofi Pasteur MSD, SA (507632796)","57.587,20 €",10-07-2017,07-08-2015,120 dias,"Portugal, Évora",Artigo 259.º do Código dos Contratos Públicos,31-12-2015,"57.587,20 €",,"",,610556,"CONCURSO PÚBLICO PARA A CELEBRAÇÃO DE CONTRATOS PÚBLICOS DE APROVISIONAMENTO PARA A ÁREA DA SAÚDE, COM VISTA AO FORNECIMENTO DE VACINAS E TUBERCULINAS, ÀS INSTITUIÇÕES E SERVIÇOS DO SERVIÇO NACIONAL DE SAÚDE",FALSE
"LIGADURA COLA ZINCO, 7.5CMx6M ",Ajuste Direto Regime Geral,Aquisição de bens móveis,"33000000-0, Equipamento médico, medicamentos e produtos para cuidados pessoais","Administração Regional de Saúde do Alentejo, I. P. (503148768)","OVERPHARMA,LDA. (505792362)","812,50 €",10-07-2017,26-05-2015,210 dias,"Portugal, Évora","Artigo 20.º, n.º 1, alínea a) do Código dos Contratos Públicos",31-12-2015,"812,50 €",,"",,Não aplicável.,Não aplicável.,FALSE
CLEMASTINA - SOL INJ 1 mg / ml IM / IV - 2 ml,Ajuste Direto Regime Geral,Aquisição de bens móveis,"33000000-0, Equipamento médico, medicamentos e produtos para cuidados pessoais","Administração Regional de Saúde do Alentejo, I. P. (503148768)",GLAXO SMITH KLINE - CONS. HEALTHC                  (500276994),"658,17 €",10-07-2017,28-09-2015,210 dias,"Portugal, Évora","Artigo 20.º, n.º 1, alínea a) do Código dos Contratos Públicos",31-12-2015,"658,17 €",,"",,Não aplicável.,Não aplicável.,FALSE
CLEMASTINA - SOL INJ 1 mg / ml IM / IV - 2 ml,Ajuste Direto Regime Geral,Aquisição de bens móveis,"33000000-0, Equipamento médico, medicamentos e produtos para cuidados pessoais","Administração Regional de Saúde do Alentejo, I. P. (503148768)",NOVARTIS CONSUMER HEALTH-PROD.FARM NUTRI (500268215),"815,76 €",10-07-2017,26-05-2015,210 dias,"Portugal, Évora","Artigo 20.º, n.º 1, alínea a) do Código dos Contratos Públicos",31-12-2015,"815,76 €",,"",,Não aplicável.,Não aplicável.,FALSE
DEXAMETASONA - SOL INJ 5 mg / ml IM / ISINOVIAL / IV - 1 ml,Ajuste Direto Regime Geral,Aquisição de bens móveis,"33000000-0, Equipamento médico, medicamentos e produtos para cuidados pessoais","Administração Regional de Saúde do Alentejo, I. P. (503148768)","BDRPHARMA, LDA (513077332)","1.633,50 €",10-07-2017,26-05-2015,210 dias,"Portugal, Évora","Artigo 20.º, n.º 1, alínea a) do Código dos Contratos Públicos",31-12-2015,"1.633,50 €",,"",,Não aplicável.,Não aplicável.,FALSE
"HIDROGEL + ALGINATO DE SODIO - 15 GR. GAZE IMPREGNADA COM IODOFOROS - COMPRESSAS 9,5X9,5 ",Ao abrigo de acordo-quadro (art.º 259.º),Aquisição de bens móveis,"33000000-0, Equipamento médico, medicamentos e produtos para cuidados pessoais","Administração Regional de Saúde do Alentejo, I. P. (503148768)","Smith & Nephew, Lda. (503552461)","10.532,50 €",10-07-2017,15-06-2015,180 dias,"Portugal, Évora",Artigo 259.º do Código dos Contratos Públicos,31-12-2015,"10.532,50 €",,"",,490160,"CONCURSO PÚBLICO PARA A CELEBRAÇÃO DE CONTRATOS PÚBLICOS DE APROVISIONAMENTO PARA A ÁREA DA SAÚDE, COM VISTA AO FORNECIMENTO DE MATERIAL PENSO DE EFEITO TERAPÊUTICO - ÀS INSTITUIÇÕES E SERVIÇOS DO SERVIÇO NACIONAL DE SAÚDE",FALSE
MATRIZ MODULADORA DA PROTEASE 28CM,Ao abrigo de acordo-quadro (art.º 259.º),Aquisição de bens móveis,"33000000-0, Equipamento médico, medicamentos e produtos para cuidados pessoais","Administração Regional de Saúde do Alentejo, I. P. (503148768)","Smith & Nephew, Lda. (503552461)","1.785,00 €",10-07-2017,15-06-2015,180 dias,"Portugal, Évora",Artigo 259.º do Código dos Contratos Públicos,31-12-2015,"1.785,00 €",,"",,490160,"CONCURSO PÚBLICO PARA A CELEBRAÇÃO DE CONTRATOS PÚBLICOS DE APROVISIONAMENTO PARA A ÁREA DA SAÚDE, COM VISTA AO FORNECIMENTO DE MATERIAL PENSO DE EFEITO TERAPÊUTICO - ÀS INSTITUIÇÕES E SERVIÇOS DO SERVIÇO NACIONAL DE SAÚDE",FALSE
"SUCRALFATO, gel ",Ao abrigo de acordo-quadro (art.º 259.º),Aquisição de bens móveis,"33000000-0, Equipamento médico, medicamentos e produtos para cuidados pessoais","Administração Regional de Saúde do Alentejo, I. P. (503148768)","QUEENLABS-ESPECIALIDADES FARMACEUTICAS, LDA (503984485)","1.220,00 €",10-07-2017,16-11-2015,180 dias,"Portugal, Évora",Artigo 259.º do Código dos Contratos Públicos,31-12-2015,"1.220,00 €",,"",,490160,"CONCURSO PÚBLICO PARA A CELEBRAÇÃO DE CONTRATOS PÚBLICOS DE APROVISIONAMENTO PARA A ÁREA DA SAÚDE, COM VISTA AO FORNECIMENTO DE MATERIAL PENSO DE EFEITO TERAPÊUTICO - ÀS INSTITUIÇÕES E SERVIÇOS DO SERVIÇO NACIONAL DE SAÚDE",FALSE
CARBOXIMETILCELULOSE SODICA - TIRAS (COM PRATA) CARBOXIMETILCELULOSE SODICA - TIRAS CARVAO ACTIVADO C/FIBRAS ALGINATO CA + CARBOXIMETILC. NA 10X10,Ao abrigo de acordo-quadro (art.º 259.º),Aquisição de bens móveis,"33000000-0, Equipamento médico, medicamentos e produtos para cuidados pessoais","Administração Regional de Saúde do Alentejo, I. P. (503148768)","KVTECH PORTUGAL-PRODUTOS MEDICOS,UNIP.LDA. (508671531)","4.829,00 €",10-07-2017,15-06-2015,180 dias,"Portugal, Évora",Artigo 259.º do Código dos Contratos Públicos,31-12-2015,"4.829,00 €",,"",,490160,"CONCURSO PÚBLICO PARA A CELEBRAÇÃO DE CONTRATOS PÚBLICOS DE APROVISIONAMENTO PARA A ÁREA DA SAÚDE, COM VISTA AO FORNECIMENTO DE MATERIAL PENSO DE EFEITO TERAPÊUTICO - ÀS INSTITUIÇÕES E SERVIÇOS DO SERVIÇO NACIONAL DE SAÚDE",FALSE
ALGINATO CALCIO 10X20 GAZE IMPREGNADA COM PARAFINA - COMPRESSA 10X40,Ao abrigo de acordo-quadro (art.º 259.º),Aquisição de bens móveis,"33000000-0, Equipamento médico, medicamentos e produtos para cuidados pessoais","Administração Regional de Saúde do Alentejo, I. P. (503148768)","COVIDIEN PORTUGAL-PROD. SAÚDE, UNIP., LDA (503413410)","3.628,22 €",10-07-2017,15-06-2015,180 dias,"Portugal, Évora",Artigo 259.º do Código dos Contratos Públicos,31-12-2015,"3.628,22 €",,"",,490160,"CONCURSO PÚBLICO PARA A CELEBRAÇÃO DE CONTRATOS PÚBLICOS DE APROVISIONAMENTO PARA A ÁREA DA SAÚDE, COM VISTA AO FORNECIMENTO DE MATERIAL PENSO DE EFEITO TERAPÊUTICO - ÀS INSTITUIÇÕES E SERVIÇOS DO SERVIÇO NACIONAL DE SAÚDE",FALSE
ALGINATO CALCIO C/PRATA S/REBORDO 10X20 ALGINATO CALCIO ESPUMA COM PRATA S/ REBORDO 10X20,Ao abrigo de acordo-quadro (art.º 259.º),Aquisição de bens móveis,"33000000-0, Equipamento médico, medicamentos e produtos para cuidados pessoais","Administração Regional de Saúde do Alentejo, I. P. (503148768)","B. Braun Medical, Lda (501506543)","12.760,00 €",10-07-2017,15-06-2015,180 dias,"Portugal, Évora",Artigo 259.º do Código dos Contratos Públicos,31-12-2015,"12.760,00 €",,"",,490160,"CONCURSO PÚBLICO PARA A CELEBRAÇÃO DE CONTRATOS PÚBLICOS DE APROVISIONAMENTO PARA A ÁREA DA SAÚDE, COM VISTA AO FORNECIMENTO DE MATERIAL PENSO DE EFEITO TERAPÊUTICO - ÀS INSTITUIÇÕES E SERVIÇOS DO SERVIÇO NACIONAL DE SAÚDE",FALSE
"Penso com efeito terapêutico, não incluído no CAPS da SPMS",Ajuste Direto Regime Geral,Aquisição de bens móveis,"33600000-6, Produtos farmacêuticos","Administração Regional de Saúde do Alentejo, I. P. (503148768)","Smith & Nephew, Lda. (503552461)","2.057,00 €",10-07-2017,07-07-2015,180 dias,"Portugal, Évora","Artigo 20.º, n.º 1, alínea a) do Código dos Contratos Públicos",31-12-2015,"2.057,00 €",,"",,Não aplicável.,Não aplicável.,FALSE
PARACETAMOL - INJ 1 g IM / IV,Ao abrigo de acordo-quadro (art.º 259.º),Aquisição de bens móveis,"33000000-0, Equipamento médico, medicamentos e produtos para cuidados pessoais","Administração Regional de Saúde do Alentejo, I. P. (503148768)","FRESENIUS KABI PHARMA PORTUGAL,LDA (504293753)","294,05 €",07-07-2017,26-11-2015,30 dias,"Portugal, Évora",Artigo 259.º do Código dos Contratos Públicos,31-12-2015,"294,05 €",,"",,1394106,CP 2015/64 - Medicamentos Diversos,FALSE
IBUPROFENO - SUSP OR  2% <>0100 mg/5 ml PARACETAMOL - COMP  500 mg,Ao abrigo de acordo-quadro (art.º 259.º),Aquisição de bens móveis,"33000000-0, Equipamento médico, medicamentos e produtos para cuidados pessoais","Administração Regional de Saúde do Alentejo, I. P. (503148768)",PHARMAKERN PORTUGAL (507002571),"65,68 €",07-07-2017,26-11-2015,30 dias,"Portugal, Évora",Artigo 259.º do Código dos Contratos Públicos,31-12-2015,"65,68 €",,"",,1394106,CP 2015/64 - Medicamentos Diversos,FALSE
COMPLEXO B,Ao abrigo de acordo-quadro (art.º 259.º),Aquisição de bens móveis,"33000000-0, Equipamento médico, medicamentos e produtos para cuidados pessoais","Administração Regional de Saúde do Alentejo, I. P. (503148768)","MEDA PHARMA - PRODUTOS FARMACÊUTICOS, S.A. (500082090)","27,93 €",07-07-2017,26-11-2015,30 dias,"Portugal, Évora",Artigo 259.º do Código dos Contratos Públicos,31-12-2015,"27,93 €",,"",,1338581,"Acordo quadro para fornecimento de Medicação antialérgica, medicamentos usados no tratamento de intoxicações, vitaminas e sais minerais e grupo 20.9 - outros produtos às instituições e serviços do serviço nacional de saúde",FALSE
"NALOXONA - INJ 0,4 mg / ml IM / IV / SC",Ao abrigo de acordo-quadro (art.º 259.º),Aquisição de bens móveis,"33000000-0, Equipamento médico, medicamentos e produtos para cuidados pessoais","Administração Regional de Saúde do Alentejo, I. P. (503148768)","HOSPIRA PORTUGAL, LDA. (502918098)","392,40 €",07-07-2017,26-11-2015,30 dias,"Portugal, Évora",Artigo 259.º do Código dos Contratos Públicos,31-12-2015,"392,40 €",,"",,1338581,"Acordo quadro para fornecimento de Medicação antialérgica, medicamentos usados no tratamento de intoxicações, vitaminas e sais minerais e grupo 20.9 - outros produtos às instituições e serviços do serviço nacional de saúde",FALSE
TRAMADOL - SOL INJ 50 mg / ml IM / IV / SC - 2 ml,Ao abrigo de acordo-quadro (art.º 259.º),Aquisição de bens móveis,"33000000-0, Equipamento médico, medicamentos e produtos para cuidados pessoais","Administração Regional de Saúde do Alentejo, I. P. (503148768)","LABESFAL, Laboratório Almiro S.A. (501169580)","58,50 €",07-07-2017,26-11-2015,30 dias,"Portugal, Évora",Artigo 259.º do Código dos Contratos Públicos,31-12-2015,"58,50 €",,"",,613285,"CONCURSO PÚBLICO PARA A CELEBRAÇÃO DE CONTRATOS PÚBLICOS DE APROVISIONAMENTO PARA A ÁREA DA SAÚDE, COM VISTA AO FORNECIMENTO DE MEDICAMENTOS ANALGÉSICOS, ANTIPIRÉTICOS E ANTIDEPRESSORES, ÀS INSTITUIÇÕES E SERVIÇOS DO SERVIÇO NACIONAL DE SAÚDE",FALSE
PARACETAMOL - SUSP ORAL 4% (200 mg<>5 ml),Ao abrigo de acordo-quadro (art.º 259.º),Aquisição de bens móveis,"33000000-0, Equipamento médico, medicamentos e produtos para cuidados pessoais","Administração Regional de Saúde do Alentejo, I. P. (503148768)","Generis Farmacêutica, S.A. (508107997)","42,00 €",07-07-2017,26-11-2015,30 dias,"Portugal, Évora",Artigo 259.º do Código dos Contratos Públicos,31-12-2015,"42,00 €",,"",,613285,"CONCURSO PÚBLICO PARA A CELEBRAÇÃO DE CONTRATOS PÚBLICOS DE APROVISIONAMENTO PARA A ÁREA DA SAÚDE, COM VISTA AO FORNECIMENTO DE MEDICAMENTOS ANALGÉSICOS, ANTIPIRÉTICOS E ANTIDEPRESSORES, ÀS INSTITUIÇÕES E SERVIÇOS DO SERVIÇO NACIONAL DE SAÚDE",FALSE
SOLUCAO ANTI-SEPTICA DE BASE ALCOOLICAETANOL+PROPANOL+DERMOPROTECTOR - 500ML,Ao abrigo de acordo-quadro (art.º 259.º),Aquisição de bens móveis,"33000000-0, Equipamento médico, medicamentos e produtos para cuidados pessoais","Administração Regional de Saúde do Alentejo, I. P. (503148768)","VYGON (PORTUGAL), LDA (503232785)","108,00 €",07-07-2017,09-12-2015,30 dias,"Portugal, Évora",Artigo 259.º do Código dos Contratos Públicos,31-12-2015,"108,00 €",,"",,549298,"Concurso Público para a celebração de Contratos Publicos de Aprovisionamento para a área da saúde com vista ao fornecimento de Antisepticos, Desinfetantes e Outros, às Instituições e Serviços do Serviço Nacional de Saúde.",FALSE
"Antissépticos e Desinfectantes, ao abrigo do AQ 2012/8",Ao abrigo de acordo-quadro (art.º 259.º),Aquisição de bens móveis,"33000000-0, Equipamento médico, medicamentos e produtos para cuidados pessoais","Administração Regional de Saúde do Alentejo, I. P. (503148768)",Proclinica - Equipamentos e Produtos Clinicos Lda  (500222665),"63,36 €",07-07-2017,09-12-2015,30 dias,"Portugal, Évora",Artigo 259.º do Código dos Contratos Públicos,31-12-2015,"63,36 €",,"",,549298,"Concurso Público para a celebração de Contratos Publicos de Aprovisionamento para a área da saúde com vista ao fornecimento de Antisepticos, Desinfetantes e Outros, às Instituições e Serviços do Serviço Nacional de Saúde.",FALSE
ADRENALINA - SOL INJ 1 mg / ml IM / IV / IC - 1 ml FUROSEMIDA - SOL INJ 10 mg / ml IM / IV - 2 ml,Ao abrigo de acordo-quadro (art.º 259.º),Aquisição de bens móveis,"33000000-0, Equipamento médico, medicamentos e produtos para cuidados pessoais","Administração Regional de Saúde do Alentejo, I. P. (503148768)","LABESFAL, Laboratório Almiro S.A. (501169580)","822,20 €",07-07-2017,26-11-2015,30 dias,"Portugal, Évora",Artigo 155.º do Código dos Contratos Públicos,31-12-2015,"822,20 €",,"",,1179915,"CONCURSO PÚBLICO PARA A CELEBRAÇÃO DE CONTRATOS PÚBLICOS DE APROVISIONAMENTO PARA A ÁREA DA SAÚDE, COM VISTA AO FORNECIMENTO DE MEDICAMENTOS DO APARELHO CARDIOVASCULAR, ÀS INSTITUIÇÕES E SERVIÇOS DO SERVIÇO NACIONAL DE SAÚDE",FALSE
AMIODARONA - SOL INJ 50 mg / ml IV - 3 ml,Ao abrigo de acordo-quadro (art.º 259.º),Aquisição de bens móveis,"33000000-0, Equipamento médico, medicamentos e produtos para cuidados pessoais","Administração Regional de Saúde do Alentejo, I. P. (503148768)","Hikma - Farmacêutica Portugal, S.A. (502266791)","56,85 €",07-07-2017,26-11-2015,30 dias,"Portugal, Évora",Artigo 259.º do Código dos Contratos Públicos,31-12-2015,"56,85 €",,"",,1179915,"CONCURSO PÚBLICO PARA A CELEBRAÇÃO DE CONTRATOS PÚBLICOS DE APROVISIONAMENTO PARA A ÁREA DA SAÚDE, COM VISTA AO FORNECIMENTO DE MEDICAMENTOS DO APARELHO CARDIOVASCULAR, ÀS INSTITUIÇÕES E SERVIÇOS DO SERVIÇO NACIONAL DE SAÚDE",FALSE
Medicamentos anestésicos e relaxantes musculares - Lidocaina sol inj 20 mg/ml,Ao abrigo de acordo-quadro (art.º 258.º),Aquisição de bens móveis,"33000000-0, Equipamento médico, medicamentos e produtos para cuidados pessoais","Administração Regional de Saúde do Alentejo, I. P. (503148768)","LABESFAL-LABORATORIOS ALMIRO, SA (501169580)","291,60 €",07-07-2017,02-12-2015,30 dias,"Portugal, Évora",Artigo 258.º do Código dos Contratos Públicos,31-12-2015,"291,60 €",,"",,611371,"CONCURSO PÚBLICO PARA A CELEBRAÇÃO DE CONTRATOS PÚBLICOS DE APROVISIONAMENTO PARA A ÁREA DA SAÚDE, COM VISTA AO FORNECIMENTO DE MEDICAMENTOS ANESTÉSICOS E RELAXANTES MUSCULARES, ÀS INSTITUIÇÕES E SERVIÇOS DO SERVIÇO NACIONAL DE SAÚDE    ",FALSE
"Medicamentos do Sistema Nervoso Central - Metoclopramida, ao abrigo do AQ 2/2014",Ao abrigo de acordo-quadro (art.º 259.º),Aquisição de bens móveis,"33000000-0, Equipamento médico, medicamentos e produtos para cuidados pessoais","Administração Regional de Saúde do Alentejo, I. P. (503148768)","LABESFAL-LABORATORIOS ALMIRO, SA (501169580)","219,70 €",07-07-2017,26-11-2015,30 dias,"Portugal, Évora",Artigo 259.º do Código dos Contratos Públicos,31-12-2015,"219,70 €",,"",,1179911,"CONCURSO PÚBLICO PARA A CELEBRAÇÃO DE CONTRATOS PÚBLICOS DE APROVISIONAMENTO PARA A ÁREA DA SAÚDE, MEDICAMENTOS DO SISTEMA NERVOSO CEREBROSPINAL, EXCETO: ANESTÉSICOS, RELAXANTES MUSCULARES, ANALGÉSICOS, ANTIPIRÉTICOS, ANTIDEPRESSORES E ANTIPSICÓTICOS, ÀS INSTITUIÇÕES E SERVIÇOS DO SERVIÇO NACIONAL DE SAÚDE",FALSE
"Corretivos da Volemia - Cloreto de Sódio 0,9% inj-100 ml, ao abrigo do AQ 3/2014",Ao abrigo de acordo-quadro (art.º 259.º),Aquisição de bens móveis,"33000000-0, Equipamento médico, medicamentos e produtos para cuidados pessoais","Administração Regional de Saúde do Alentejo, I. P. (503148768)","LABESFAL-LABORATORIOS ALMIRO, SA (501169580)","2.098,80 €",07-07-2017,26-11-2015,30 dias,"Portugal, Évora",Artigo 259.º do Código dos Contratos Públicos,31-12-2015,"2.098,80 €",,"",,1331181,Acordo Quadro para fornecimento de corretivos da volémia e outras soluções estéreis às Instituições e Serviços do Serviço Nacional de Saúde,FALSE
"Medicamentos do aparelho respiratório - Salbutamol, ao abrigo do AQ 12/2013",Ao abrigo de acordo-quadro (art.º 259.º),Aquisição de bens móveis,"33000000-0, Equipamento médico, medicamentos e produtos para cuidados pessoais","Administração Regional de Saúde do Alentejo, I. P. (503148768)",GlaxoSmithKline - Produtos Farmacêuticos Lda. (500139962),"181,56 €",07-07-2017,26-11-2015,30 dias,"Portugal, Évora",Artigo 259.º do Código dos Contratos Públicos,31-12-2015,"181,56 €",,"",,613816,"CONCURSO PÚBLICO PARA A CELEBRAÇÃO DE CONTRATOS PÚBLICOS DE APROVISIONAMENTO PARA A ÁREA DA SAÚDE, COM VISTA AO FORNECIMENTO DE MEDICAMENTOS DO APARELHO RESPIRATÓRIO, ÀS INSTITUIÇÕES E SERVIÇOS DO SERVIÇO NACIONAL DE SAÚDE",FALSE
"Medicamentos - Hidrocortisona, ao abrigo do AQ 2015/7",Ao abrigo de acordo-quadro (art.º 259.º),Aquisição de bens móveis,"33000000-0, Equipamento médico, medicamentos e produtos para cuidados pessoais","Administração Regional de Saúde do Alentejo, I. P. (503148768)","GENERIS FARMACEUTICA, SA (508107997)","1.014,00 €",07-07-2017,26-11-2015,30 dias,"Portugal, Évora",Artigo 259.º do Código dos Contratos Públicos,31-12-2015,"1.014,00 €",,"",,1415640,CP 2015/7 - ACORDO QUADRO PARA FORNECIMENTO DE HORMONAS E OUTROS MEDICAMENTOS USADOS NO TRATAMENTO DAS DOENÇAS ENDÓCRINAS ÀS INSTITUIÇÕES E SERVIÇOS DO SERVIÇO NACIONAL DE SAÚDE,FALSE
CONTENTORES PARA OBJECTOS E CORTANTES E PERFURANTES - 1500 cc,Ao abrigo de acordo-quadro (art.º 259.º),Aquisição de bens móveis,"33000000-0, Equipamento médico, medicamentos e produtos para cuidados pessoais","Administração Regional de Saúde do Alentejo, I. P. (503148768)",CLINIFAR SA                                        (503281115),"226,80 €",06-07-2017,10-12-2015,30 dias,"Portugal, Évora",Artigo 259.º do Código dos Contratos Públicos,31-12-2015,"226,80 €",,"",,1341769,"ACORDO QUADRO PARA FORNECIMENTO DE SERINGAS, AGULHAS E CONTENTORES ÀS INSTITUIÇÕES E SERVIÇOS DO SERVIÇO NACIONAL DE SAÚDE PROGRAMA DE CONCURSO",FALSE
CONTENTORES PARA OBJECTOS E CORTANTES E PERFURANTES -  500 cc CONTENTORES PARA OBJECTOS E CORTANTES E PERFURANTES - 5000 CC,Ao abrigo de acordo-quadro (art.º 259.º),Aquisição de bens móveis,"33000000-0, Equipamento médico, medicamentos e produtos para cuidados pessoais","Administração Regional de Saúde do Alentejo, I. P. (503148768)","Ambimed -Gestão ambiental, Ldª (503821934)","376,00 €",06-07-2017,10-12-2015,30 dias,"Portugal, Évora",Artigo 259.º do Código dos Contratos Públicos,31-12-2015,"376,00 €",,"",,1341769,"ACORDO QUADRO PARA FORNECIMENTO DE SERINGAS, AGULHAS E CONTENTORES ÀS INSTITUIÇÕES E SERVIÇOS DO SERVIÇO NACIONAL DE SAÚDE PROGRAMA DE CONCURSO",FALSE
SERINGA IRRECUPERAVEL SEM/ AGULHA -  2 ML,Ao abrigo de acordo-quadro (art.º 259.º),Aquisição de bens móveis,"33000000-0, Equipamento médico, medicamentos e produtos para cuidados pessoais","Administração Regional de Saúde do Alentejo, I. P. (503148768)","NORMAX-FABRICA VIDROS CIENTIFICOS, LDA (500203130)","330,00 €",06-07-2017,10-12-2015,30 dias,"Portugal, Évora",Artigo 259.º do Código dos Contratos Públicos,31-12-2015,"330,00 €",,"",,1341769,"ACORDO QUADRO PARA FORNECIMENTO DE SERINGAS, AGULHAS E CONTENTORES ÀS INSTITUIÇÕES E SERVIÇOS DO SERVIÇO NACIONAL DE SAÚDE PROGRAMA DE CONCURSO",FALSE
AGULHA IRRECUPERAVEL  COM ALHETA - 25 G AGULHA IRRECUPERAVEL 12/5 AGULHA IRRECUPERAVEL  COM ALHETA - 18 G AGULHA IRRECUPERAVEL  COM ALHETA - 23 G,Ao abrigo de acordo-quadro (art.º 259.º),Aquisição de bens móveis,"33000000-0, Equipamento médico, medicamentos e produtos para cuidados pessoais","Administração Regional de Saúde do Alentejo, I. P. (503148768)",OVERPHARMA-PROD.MEDICOS FARMACEUTICOS (505792362),"53,91 €",06-07-2017,10-12-2015,30 dias,"Portugal, Évora",Artigo 259.º do Código dos Contratos Públicos,31-12-2015,"53,91 €",,"",,1341769,"ACORDO QUADRO PARA FORNECIMENTO DE SERINGAS, AGULHAS E CONTENTORES ÀS INSTITUIÇÕES E SERVIÇOS DO SERVIÇO NACIONAL DE SAÚDE PROGRAMA DE CONCURSO",FALSE
ADESIVO CUTANEO LIQUIDO PARA SUTURA,Ao abrigo de acordo-quadro (art.º 259.º),Aquisição de bens móveis,"33000000-0, Equipamento médico, medicamentos e produtos para cuidados pessoais","Administração Regional de Saúde do Alentejo, I. P. (503148768)","B. Braun Medical, Lda. (501506543)","114,00 €",06-07-2017,10-12-2015,30 dias,"Portugal, Évora",Artigo 259.º do Código dos Contratos Públicos,31-12-2015,"114,00 €",,"",,534953,"CONCURSO PÚBLICO PARA A CELEBRAÇÃO DE CONTRATOS PÚBLICOS DE APROVISIONAMENTO PARA A ÁREA DA SAÚDE, COM VISTA AO FORNECIMENTO DE MATERIAL DE PENSO TRADICIONAL/CLASSICO - PARTE 1 - ÀS INSTITUIÇÕES E SERVIÇOS DO SERVIÇO NACIONAL DE SAÚDE  ",FALSE
PENSO RAPIDO SECO 10x36,Ao abrigo de acordo-quadro (art.º 259.º),Aquisição de bens móveis,"33000000-0, Equipamento médico, medicamentos e produtos para cuidados pessoais","Administração Regional de Saúde do Alentejo, I. P. (503148768)","Paul Hartmann, Lda (502271728)","160,00 €",06-07-2017,10-12-2015,30 dias,"Portugal, Évora",Artigo 259.º do Código dos Contratos Públicos,31-12-2015,"160,00 €",,"",,534953,"CONCURSO PÚBLICO PARA A CELEBRAÇÃO DE CONTRATOS PÚBLICOS DE APROVISIONAMENTO PARA A ÁREA DA SAÚDE, COM VISTA AO FORNECIMENTO DE MATERIAL DE PENSO TRADICIONAL/CLASSICO - PARTE 1 - ÀS INSTITUIÇÕES E SERVIÇOS DO SERVIÇO NACIONAL DE SAÚDE  ",FALSE
"PENSO TRANSPARENTE COM COMPRESSA ABSORVENTE  15,5X8,5 ",Ao abrigo de acordo-quadro (art.º 259.º),Aquisição de bens móveis,"33000000-0, Equipamento médico, medicamentos e produtos para cuidados pessoais","Administração Regional de Saúde do Alentejo, I. P. (503148768)","MOLNLYCKE HEALTH CARE-COM.PROD. HOSPITALARES,LDA.  (511101066)","234,00 €",06-07-2017,10-12-2015,30 dias,"Portugal, Évora",Artigo 259.º do Código dos Contratos Públicos,31-12-2015,"234,00 €",,"",,534953,"CONCURSO PÚBLICO PARA A CELEBRAÇÃO DE CONTRATOS PÚBLICOS DE APROVISIONAMENTO PARA A ÁREA DA SAÚDE, COM VISTA AO FORNECIMENTO DE MATERIAL DE PENSO TRADICIONAL/CLASSICO - PARTE 1 - ÀS INSTITUIÇÕES E SERVIÇOS DO SERVIÇO NACIONAL DE SAÚDE  ",FALSE
COMPRESSA GAZE NAO ESTERILIZADA 10X10 COMPRESSA NAO TECIDO ESTERILIZADA 10X10,Ao abrigo de acordo-quadro (art.º 259.º),Aquisição de bens móveis,"33000000-0, Equipamento médico, medicamentos e produtos para cuidados pessoais","Administração Regional de Saúde do Alentejo, I. P. (503148768)",ALBINO DIAS ANDRADE LDA - BESLEASING E FACTORING. (500013810),"2.073,00 €",06-07-2017,10-12-2015,30 dias,"Portugal, Évora",Artigo 259.º do Código dos Contratos Públicos,31-12-2015,"2.073,00 €",,"",,534953,"CONCURSO PÚBLICO PARA A CELEBRAÇÃO DE CONTRATOS PÚBLICOS DE APROVISIONAMENTO PARA A ÁREA DA SAÚDE, COM VISTA AO FORNECIMENTO DE MATERIAL DE PENSO TRADICIONAL/CLASSICO - PARTE 1 - ÀS INSTITUIÇÕES E SERVIÇOS DO SERVIÇO NACIONAL DE SAÚDE  ",FALSE
Cateteres para venopunção,Ao abrigo de acordo-quadro (art.º 259.º),Aquisição de bens móveis,"33000000-0, Equipamento médico, medicamentos e produtos para cuidados pessoais","Administração Regional de Saúde do Alentejo, I. P. (503148768)","SMITHS MEDICAL (PORTUGAL),UNIPESSOAL,LDA (507445937)","2.976,00 €",06-07-2017,10-12-2015,30 dias,"Portugal, Évora",Artigo 259.º do Código dos Contratos Públicos,31-12-2015,"2.976,00 €",,"",,1212278,"CONCURSO PÚBLICO PARA A CELEBRAÇÃO DE CONTRATOS PÚBLICOS DE APROVISIONAMENTO PARA A ÁREA DA SAÚDE, COM VISTA AO FORNECIMENTO DE CATETERES, ÀS INSTITUIÇÕES E SERVIÇOS DO SERVIÇO NACIONAL DE SAÚDE",FALSE
"FLUMAZENILO - INJ 0,1mg / ml IV ",Ao abrigo de acordo-quadro (art.º 259.º),Aquisição de bens móveis,"33000000-0, Equipamento médico, medicamentos e produtos para cuidados pessoais","Administração Regional de Saúde do Alentejo, I. P. (503148768)","Accord Healthcare, Unipessoal, Lda. (508622263)","46,80 €",04-07-2017,24-04-2015,250 dias,"Portugal, Évora",Artigo 259.º do Código dos Contratos Públicos,31-12-2015,"46,80 €",,"",,405999,CONCURSO PÚBLICO PARA A CELEBRAÇÃO DE CONTRATOS PÚBLICOS DE APROVISIONAMENTO PARA AQUISIÇÃO CORRECTIVOS DA VOLÉMIA E OUTRAS SOLUÇÕES ESTÉREIS,FALSE
"CLORETO DE POTASSIO - SOL INJ 7,5% - 10ML GLUCOSE 5% - INJ  500 ml POLIELECTROLITICO - INJ  500 ML POLIELECTROLITICO + GLUCOSE 50 MG / ML - SOL INJ IV - 500 ML BETAMETASONA POM - 1mg / g - 30g AGUA BI DESTILADA E ESTERILIZADA - AMP 5 ML CLORETO DE Na 0,9% - FR BISN IRRIG. 250 ml ",Ao abrigo de acordo-quadro (art.º 259.º),Aquisição de bens móveis,"33000000-0, Equipamento médico, medicamentos e produtos para cuidados pessoais","Administração Regional de Saúde do Alentejo, I. P. (503148768)","OVERPHARMA, PROD. MED. FARMAC., LDA. (505792362)","2.835,60 €",04-07-2017,24-04-2015,250 dias,"Portugal, Évora",Artigo 259.º do Código dos Contratos Públicos,31-12-2015,"2.835,60 €",,"",,405999,CONCURSO PÚBLICO PARA A CELEBRAÇÃO DE CONTRATOS PÚBLICOS DE APROVISIONAMENTO PARA AQUISIÇÃO CORRECTIVOS DA VOLÉMIA E OUTRAS SOLUÇÕES ESTÉREIS,FALSE
PERMETRINA CREME,Ao abrigo de acordo-quadro (art.º 259.º),Aquisição de bens móveis,"33000000-0, Equipamento médico, medicamentos e produtos para cuidados pessoais","Administração Regional de Saúde do Alentejo, I. P. (503148768)","ANGELINI FARMACÊUTICA,LDA. (500583650)","1.247,50 €",04-07-2017,24-04-2015,250 dias,"Portugal, Évora",Artigo 259.º do Código dos Contratos Públicos,31-12-2015,"1.247,50 €",,"",,405999,CONCURSO PÚBLICO PARA A CELEBRAÇÃO DE CONTRATOS PÚBLICOS DE APROVISIONAMENTO PARA AQUISIÇÃO CORRECTIVOS DA VOLÉMIA E OUTRAS SOLUÇÕES ESTÉREIS,FALSE
"OXIDO DE ZINCO - SUSP OLEOSA 50% OXITETRACICLINA - POM OFT 0,5% OXIBUPROCAINA - COL 0,4%",Ao abrigo de acordo-quadro (art.º 259.º),Aquisição de bens móveis,"33000000-0, Equipamento médico, medicamentos e produtos para cuidados pessoais","Administração Regional de Saúde do Alentejo, I. P. (503148768)",Laboratório Edol - Produtos Farmacêuticos S.a (507072642),"490,00 €",04-07-2017,24-04-2015,250 dias,"Portugal, Évora",Artigo 259.º do Código dos Contratos Públicos,31-12-2015,"490,00 €",,"",,405999,CONCURSO PÚBLICO PARA A CELEBRAÇÃO DE CONTRATOS PÚBLICOS DE APROVISIONAMENTO PARA AQUISIÇÃO CORRECTIVOS DA VOLÉMIA E OUTRAS SOLUÇÕES ESTÉREIS,FALSE
"CLORETO DE Na 0,9%- INJ 1000 ml GLUCOSE 5% - INJ  100 ml GLUCOSE 5% - INJ 1000 ml RINGER E LACTATO - INJ  500 ml IMUNOGLOBULINA ANTI-TETANICA INJ 250 UI IM ",Ao abrigo de acordo-quadro (art.º 259.º),Aquisição de bens móveis,"33000000-0, Equipamento médico, medicamentos e produtos para cuidados pessoais","Administração Regional de Saúde do Alentejo, I. P. (503148768)","Grifols Portugal - Produtos Farmacêuticos Hospitalares, Lda. (502041285)","2.137,20 €",04-07-2017,24-04-2015,250 dias,"Portugal, Évora",Artigo 259.º do Código dos Contratos Públicos,31-12-2015,"2.137,20 €",,"",,405999,CONCURSO PÚBLICO PARA A CELEBRAÇÃO DE CONTRATOS PÚBLICOS DE APROVISIONAMENTO PARA AQUISIÇÃO CORRECTIVOS DA VOLÉMIA E OUTRAS SOLUÇÕES ESTÉREIS,FALSE
Iodopovidona sol dérmica 1% 10 ml,Ao abrigo de acordo-quadro (art.º 259.º),Aquisição de bens móveis,"33000000-0, Equipamento médico, medicamentos e produtos para cuidados pessoais","Administração Regional de Saúde do Alentejo, I. P. (503148768)","VYGON (PORTUGAL), LDA (503232785)","25,00 €",04-07-2017,24-04-2015,250 dias,"Portugal, Évora",Artigo 259.º do Código dos Contratos Públicos,31-12-2015,"44,00 €",,Múltiplo de embalagem de fornecimento,,405999,CONCURSO PÚBLICO PARA A CELEBRAÇÃO DE CONTRATOS PÚBLICOS DE APROVISIONAMENTO PARA AQUISIÇÃO CORRECTIVOS DA VOLÉMIA E OUTRAS SOLUÇÕES ESTÉREIS,FALSE
"HIPOCLORITO DE SODIO 0,48 % IODOPOVIDONA - SOL DERMICA 1% - 125 ml SOLUCAO ANTI-SEPTICA DE BASE ALCOOLICAETANOL+PROPANOL+DERMOPROTECTOR - 500ML",Ao abrigo de acordo-quadro (art.º 259.º),Aquisição de bens móveis,"33000000-0, Equipamento médico, medicamentos e produtos para cuidados pessoais","Administração Regional de Saúde do Alentejo, I. P. (503148768)",Proclinica - Equipamentos e Produtos Clinicos Lda  (500222665),"2.359,68 €",04-07-2017,24-04-2015,250 dias,"Portugal, Évora",Artigo 259.º do Código dos Contratos Públicos,31-12-2015,"2.359,68 €",,"",,405999,CONCURSO PÚBLICO PARA A CELEBRAÇÃO DE CONTRATOS PÚBLICOS DE APROVISIONAMENTO PARA AQUISIÇÃO CORRECTIVOS DA VOLÉMIA E OUTRAS SOLUÇÕES ESTÉREIS,FALSE
LANOLINA ANIDRA PURIFICADA - POM 50GR.,Ao abrigo de acordo-quadro (art.º 259.º),Aquisição de bens móveis,"33000000-0, Equipamento médico, medicamentos e produtos para cuidados pessoais","Administração Regional de Saúde do Alentejo, I. P. (503148768)","LABORATORIOS MEDINFAR, S.A.     (500384045)","384,00 €",04-07-2017,24-04-2015,250 dias,"Portugal, Évora",Artigo 259.º do Código dos Contratos Públicos,31-12-2015,"384,00 €",,"",,405999,CONCURSO PÚBLICO PARA A CELEBRAÇÃO DE CONTRATOS PÚBLICOS DE APROVISIONAMENTO PARA AQUISIÇÃO CORRECTIVOS DA VOLÉMIA E OUTRAS SOLUÇÕES ESTÉREIS,FALSE
"CLORETO DE Na 0,9%- INJ   10 ml ",Ao abrigo de acordo-quadro (art.º 259.º),Aquisição de bens móveis,"33000000-0, Equipamento médico, medicamentos e produtos para cuidados pessoais","Administração Regional de Saúde do Alentejo, I. P. (503148768)","Labesfal - Laboratórios Almiro, S.A. (501169580)","993,60 €",04-07-2017,24-04-2015,250 dias,"Portugal, Évora",Artigo 259.º do Código dos Contratos Públicos,31-12-2015,"993,60 €",,"",,405999,CONCURSO PÚBLICO PARA A CELEBRAÇÃO DE CONTRATOS PÚBLICOS DE APROVISIONAMENTO PARA AQUISIÇÃO CORRECTIVOS DA VOLÉMIA E OUTRAS SOLUÇÕES ESTÉREIS,FALSE
"COLAGENASE POMADA 0,6U/G ",Ao abrigo de acordo-quadro (art.º 259.º),Aquisição de bens móveis,"33000000-0, Equipamento médico, medicamentos e produtos para cuidados pessoais","Administração Regional de Saúde do Alentejo, I. P. (503148768)",SMITH + NEPHEW (503552461),"666,26 €",04-07-2017,24-04-2015,250 dias,"Portugal, Évora",Artigo 259.º do Código dos Contratos Públicos,31-12-2015,"666,26 €",,"",,405999,CONCURSO PÚBLICO PARA A CELEBRAÇÃO DE CONTRATOS PÚBLICOS DE APROVISIONAMENTO PARA AQUISIÇÃO CORRECTIVOS DA VOLÉMIA E OUTRAS SOLUÇÕES ESTÉREIS,FALSE
"NALOXONA - INJ 0,4 mg / ml IM / IV / SC ",Ao abrigo de acordo-quadro (art.º 259.º),Aquisição de bens móveis,"33000000-0, Equipamento médico, medicamentos e produtos para cuidados pessoais","Administração Regional de Saúde do Alentejo, I. P. (503148768)","HOSPIRA PORTUGAL, LDA. (502918098)","654,00 €",04-07-2017,24-04-2015,250 dias,"Portugal, Évora",Artigo 259.º do Código dos Contratos Públicos,31-12-2015,"654,00 €",,"",,405999,CONCURSO PÚBLICO PARA A CELEBRAÇÃO DE CONTRATOS PÚBLICOS DE APROVISIONAMENTO PARA AQUISIÇÃO CORRECTIVOS DA VOLÉMIA E OUTRAS SOLUÇÕES ESTÉREIS,FALSE
LANOLINA ANIDRA PURIFICADA 1000 MG C/DOSEADOR,Ao abrigo de acordo-quadro (art.º 259.º),Aquisição de bens móveis,"33000000-0, Equipamento médico, medicamentos e produtos para cuidados pessoais","Administração Regional de Saúde do Alentejo, I. P. (503148768)","Bastos Viegas, S.A. (500042772)","1.134,00 €",04-07-2017,24-04-2015,250 dias,"Portugal, Évora",Artigo 259.º do Código dos Contratos Públicos,31-12-2015,"1.134,00 €",,"",,405999,CONCURSO PÚBLICO PARA A CELEBRAÇÃO DE CONTRATOS PÚBLICOS DE APROVISIONAMENTO PARA AQUISIÇÃO CORRECTIVOS DA VOLÉMIA E OUTRAS SOLUÇÕES ESTÉREIS,FALSE
"GELATINA MODIFICADA - INJ 500 ml SABAO FISIOLOGICO C/ DERMOPROTETOR PH NEUTRO - 500 ml SOLUÇÃO ANTI SEPTICA BASE ALCOOLICA ETANOL+PROPANOL.DERMOPROTECTOR 100 ML CLORETO DE Na 0,9% - FR BISN IRRIG. 100 ml POLIHEXANIDA SOLUÇAO AQUOSA - FRASCOS 340 ml PRONTOSAN POLIHEXANIDA SOLUÇAO AQUOSA - GEL 30 ml - PRONTOSAN ",Ao abrigo de acordo-quadro (art.º 259.º),Aquisição de bens móveis,"33000000-0, Equipamento médico, medicamentos e produtos para cuidados pessoais","Administração Regional de Saúde do Alentejo, I. P. (503148768)",B BRAUN MEDICAL LDA (501506543),"21.644,20 €",04-07-2017,24-04-2015,250 dias,"Portugal, Évora",Artigo 259.º do Código dos Contratos Públicos,31-12-2015,"21.644,20 €",,"",,405999,CONCURSO PÚBLICO PARA A CELEBRAÇÃO DE CONTRATOS PÚBLICOS DE APROVISIONAMENTO PARA AQUISIÇÃO CORRECTIVOS DA VOLÉMIA E OUTRAS SOLUÇÕES ESTÉREIS,FALSE
IODOPOVIDONA - POM 10%,Ao abrigo de acordo-quadro (art.º 259.º),Aquisição de bens móveis,"33000000-0, Equipamento médico, medicamentos e produtos para cuidados pessoais","Administração Regional de Saúde do Alentejo, I. P. (503148768)","MEDA PHARMA - PRODUTOS FARMACÊUTICOS, S.A. (500082090)","900,00 €",04-07-2017,24-04-2015,250 dias,"Portugal, Évora",Artigo 259.º do Código dos Contratos Públicos,31-12-2015,"900,00 €",,"",,405999,CONCURSO PÚBLICO PARA A CELEBRAÇÃO DE CONTRATOS PÚBLICOS DE APROVISIONAMENTO PARA AQUISIÇÃO CORRECTIVOS DA VOLÉMIA E OUTRAS SOLUÇÕES ESTÉREIS,FALSE
