freguesia,acronym,validVotesPercentage,votes,dicofre
Alpiarça,PCP-PEV,45.48,1103,140401
Alpiarça,PS,30.02,728,140401
Alpiarça,PPD/PSD.CDS-PP,11.59,281,140401
Alpiarça,MPT,4.62,112,140401
Alpiarça,B.E.,2.56,62,140401
Alpiarça,PCTP/MRPP,1.65,40,140401
Alpiarça,L,1.24,30,140401
Alpiarça,PAN,1.07,26,140401
Alpiarça,PND,0.45,11,140401
Alpiarça,PTP,0.41,10,140401
Alpiarça,PPM,0.29,7,140401
Alpiarça,MAS,0.21,5,140401
Alpiarça,PNR,0.21,5,140401
Alpiarça,PPV,0.12,3,140401
Alpiarça,PDA,0.08,2,140401
Alpiarça,POUS,0,0,140401
