freguesia,acronym,validVotesPercentage,votes,dicofre
Chão de Couce,PPD/PSD.CDS-PP,54.23,346,100304
Chão de Couce,PS,21.63,138,100304
Chão de Couce,MPT,7.52,48,100304
Chão de Couce,PCP-PEV,5.8,37,100304
Chão de Couce,B.E.,3.45,22,100304
Chão de Couce,PND,1.25,8,100304
Chão de Couce,PAN,1.1,7,100304
Chão de Couce,L,0.94,6,100304
Chão de Couce,MAS,0.94,6,100304
Chão de Couce,PPM,0.78,5,100304
Chão de Couce,PCTP/MRPP,0.63,4,100304
Chão de Couce,PNR,0.63,4,100304
Chão de Couce,PTP,0.63,4,100304
Chão de Couce,PDA,0.16,1,100304
Chão de Couce,POUS,0.16,1,100304
Chão de Couce,PPV,0.16,1,100304
