freguesia,acronym,validVotesPercentage,votes,dicofre
Bouro (Santa Marta),PPD/PSD.CDS-PP,57.63,102,030120
Bouro (Santa Marta),PS,24.29,43,030120
Bouro (Santa Marta),MPT,8.47,15,030120
Bouro (Santa Marta),PCP-PEV,3.39,6,030120
Bouro (Santa Marta),L,1.69,3,030120
Bouro (Santa Marta),PDA,1.13,2,030120
Bouro (Santa Marta),PND,1.13,2,030120
Bouro (Santa Marta),B.E.,0.56,1,030120
Bouro (Santa Marta),PAN,0.56,1,030120
Bouro (Santa Marta),PNR,0.56,1,030120
Bouro (Santa Marta),PPM,0.56,1,030120
Bouro (Santa Marta),MAS,0,0,030120
Bouro (Santa Marta),PCTP/MRPP,0,0,030120
Bouro (Santa Marta),POUS,0,0,030120
Bouro (Santa Marta),PPV,0,0,030120
Bouro (Santa Marta),PTP,0,0,030120
