freguesia,acronym,validVotesPercentage,votes,dicofre
União das freguesias de Souto e Tabaçô,PPD/PSD.CDS-PP,39.44,112,160162
União das freguesias de Souto e Tabaçô,MPT,26.06,74,160162
União das freguesias de Souto e Tabaçô,PS,22.89,65,160162
União das freguesias de Souto e Tabaçô,L,1.76,5,160162
União das freguesias de Souto e Tabaçô,PCP-PEV,1.76,5,160162
União das freguesias de Souto e Tabaçô,PND,1.41,4,160162
União das freguesias de Souto e Tabaçô,PPM,1.41,4,160162
União das freguesias de Souto e Tabaçô,PTP,1.41,4,160162
União das freguesias de Souto e Tabaçô,B.E.,1.06,3,160162
União das freguesias de Souto e Tabaçô,MAS,1.06,3,160162
União das freguesias de Souto e Tabaçô,PNR,1.06,3,160162
União das freguesias de Souto e Tabaçô,PCTP/MRPP,0.35,1,160162
União das freguesias de Souto e Tabaçô,POUS,0.35,1,160162
União das freguesias de Souto e Tabaçô,PAN,0,0,160162
União das freguesias de Souto e Tabaçô,PDA,0,0,160162
União das freguesias de Souto e Tabaçô,PPV,0,0,160162
