freguesia,acronym,validVotesPercentage,votes,dicofre
Salir de Matos,PPD/PSD.CDS-PP,42.77,269,100609
Salir de Matos,PS,27.98,176,100609
Salir de Matos,MPT,8.9,56,100609
Salir de Matos,PCP-PEV,5.56,35,100609
Salir de Matos,B.E.,4.13,26,100609
Salir de Matos,L,2.38,15,100609
Salir de Matos,PAN,2.23,14,100609
Salir de Matos,PCTP/MRPP,1.43,9,100609
Salir de Matos,PNR,0.95,6,100609
Salir de Matos,PTP,0.95,6,100609
Salir de Matos,PND,0.79,5,100609
Salir de Matos,PPV,0.64,4,100609
Salir de Matos,POUS,0.48,3,100609
Salir de Matos,PPM,0.48,3,100609
Salir de Matos,MAS,0.32,2,100609
Salir de Matos,PDA,0,0,100609
