Objeto do Contrato,Tipo de Procedimento,Tipo(s) de Contrato,CPVs,Entidade(s) Adjudicante(s),Entidade(s) Adjudicatária(s),Preço Contratual,Data de Publicação,Data de Celebração do Contrato,Prazo de Execução,Local de Execução,Fundamentação,Data de Fecho do Contrato,Preço Total Efetivo,Causas das Alterações ao Prazo,Causas das Alterações ao Preço,Estado,N.º registo do Acordo Quadro,Descrição do Acordo Quadro,Procedimento Centralizado
Prestação Serviços,Ajuste Direto Regime Geral,Aquisição de serviços,"85000000-9, Serviços de saúde e acção social",Centro Hospitalar Psiquiátrico de Lisboa (508338476),Liliane Sousa Viegas (153384140),"1.133,38 €",09-03-2018,07-03-2017,30 dias,"Portugal, Lisboa, Lisboa","Artigo 24.º, n.º 1, alínea c) do Código dos Contratos Públicos",31-03-2017,"1.133,38 €",,,,Não aplicável.,Não aplicável.,FALSE
Prestação Serviços,Ajuste Direto Regime Geral,Aquisição de serviços,"85000000-9, Serviços de saúde e acção social",Centro Hospitalar Psiquiátrico de Lisboa (508338476),Renata Jorge Ribeiro Cavalheiro Dias (216979170),"364,60 €",09-03-2018,07-03-2017,30 dias,"Portugal, Lisboa, Lisboa","Artigo 24.º, n.º 1, alínea c) do Código dos Contratos Públicos",31-03-2017,"364,60 €",,,,Não aplicável.,Não aplicável.,FALSE
Prestação serviços,Ajuste Direto Regime Geral,Aquisição de serviços,"85000000-9, Serviços de saúde e acção social",Centro Hospitalar Psiquiátrico de Lisboa (508338476),Rita Páscoa de Aguiar (209962925),"265,16 €",09-03-2018,07-03-2017,30 dias,"Portugal, Lisboa, Lisboa","Artigo 24.º, n.º 1, alínea c) do Código dos Contratos Públicos",31-03-2017,"265,16 €",,,,Não aplicável.,Não aplicável.,FALSE
Prestação Serviços,Ajuste Direto Regime Geral,Aquisição de serviços,"85000000-9, Serviços de saúde e acção social",Centro Hospitalar Psiquiátrico de Lisboa (508338476),Liliane Sousa Viegas (153384140),"1.133,38 €",09-03-2018,05-04-2017,30 dias,"Portugal, Lisboa, Lisboa","Artigo 24.º, n.º 1, alínea c) do Código dos Contratos Públicos",30-04-2017,"1.133,38 €",,,,Não aplicável.,Não aplicável.,FALSE
Prestação Serviços,Ajuste Direto Regime Geral,Aquisição de serviços,"85000000-9, Serviços de saúde e acção social",Centro Hospitalar Psiquiátrico de Lisboa (508338476),Rita Páscoa de Aguiar (209962925),"265,16 €",09-03-2018,05-04-2017,30 dias,"Portugal, Lisboa, Lisboa","Artigo 24.º, n.º 1, alínea c) do Código dos Contratos Públicos",30-04-2017,"265,16 €",,,,Não aplicável.,Não aplicável.,FALSE
Prestação Serviços,Ajuste Direto Regime Geral,Aquisição de serviços,"85000000-9, Serviços de saúde e acção social",Centro Hospitalar Psiquiátrico de Lisboa (508338476),Renata Jorge Ribeiro Cavalheiro Dias (216979170),"182,30 €",08-03-2018,28-04-2017,30 dias,"Portugal, Lisboa, Lisboa","Artigo 24.º, n.º 1, alínea c) do Código dos Contratos Públicos",30-04-2017,"182,30 €",,,,Não aplicável.,Não aplicável.,FALSE
Prestação Serviços,Ajuste Direto Regime Geral,Aquisição de serviços,"85000000-9, Serviços de saúde e acção social",Centro Hospitalar Psiquiátrico de Lisboa (508338476),Alceu Carvalho (226251489),"1.356,87 €",08-03-2018,13-11-2017,270 dias,"Portugal, Lisboa, Lisboa","Artigo 20.º, n.º 1, alínea a) do Código dos Contratos Públicos",31-12-2017,"1.356,87 €",,,,Não aplicável.,Não aplicável.,FALSE
Prestação serviços,Ajuste Direto Regime Geral,Aquisição de serviços,"85000000-9, Serviços de saúde e acção social",Centro Hospitalar Psiquiátrico de Lisboa (508338476),Carlos Jorge Mendes Lopes (201737094),"8.982,00 €",08-03-2018,11-04-2017,270 dias,"Portugal, Lisboa, Lisboa","Artigo 20.º, n.º 1, alínea a) do Código dos Contratos Públicos",31-12-2017,"8.982,00 €",,,,Não aplicável.,Não aplicável.,FALSE
Prestação Serviços,Ajuste Direto Regime Geral,Aquisição de serviços,"85000000-9, Serviços de saúde e acção social",Centro Hospitalar Psiquiátrico de Lisboa (508338476),Regina MariaGuerreiro Brito Gomes (169995925),"8.982,00 €",08-03-2018,13-04-2017,270 dias,"Portugal, Lisboa, Lisboa","Artigo 20.º, n.º 1, alínea a) do Código dos Contratos Públicos",31-12-2017,"8.982,00 €",,,,Não aplicável.,Não aplicável.,FALSE
Prestação Serviços,Ajuste Direto Regime Geral,Aquisição de serviços,"85000000-9, Serviços de saúde e acção social",Centro Hospitalar Psiquiátrico de Lisboa (508338476),João Pedro Escoval de Jesus (212885820),"4.171,50 €",08-03-2018,21-04-2017,270 dias,"Portugal, Lisboa, Lisboa","Artigo 20.º, n.º 1, alínea a) do Código dos Contratos Públicos",31-12-2017,"4.171,50 €",,,,Não aplicável.,Não aplicável.,FALSE
Prestação Serviços,Ajuste Direto Regime Geral,Aquisição de serviços,"85000000-9, Serviços de saúde e acção social",Centro Hospitalar Psiquiátrico de Lisboa (508338476),Liliana Andreia Lérias Rodrigues (209340010),"920,00 €",08-03-2018,12-01-2017,30 dias,"Portugal, Lisboa, Lisboa","Artigo 24.º, n.º 1, alínea c) do Código dos Contratos Públicos",31-01-2017,"920,00 €",,,,Não aplicável.,Não aplicável.,FALSE
Prestação Serviços,Ajuste Direto Regime Geral,Aquisição de serviços,"85000000-9, Serviços de saúde e acção social",Centro Hospitalar Psiquiátrico de Lisboa (508338476),Liliana Andreia Lérias Rodrigues (209340010),"1.200,00 €",08-03-2018,21-02-2017,30 dias,"Portugal, Lisboa, Lisboa","Artigo 24.º, n.º 1, alínea c) do Código dos Contratos Públicos",28-02-2017,"1.200,00 €",,,,Não aplicável.,Não aplicável.,FALSE
Prestação Serviços,Ajuste Direto Regime Geral,Aquisição de serviços,"85000000-9, Serviços de saúde e acção social",Centro Hospitalar Psiquiátrico de Lisboa (508338476),Liliana Andreia Lérias Rodrigues (209340010),"1.200,00 €",08-03-2018,07-03-2017,30 dias,"Portugal, Lisboa, Lisboa","Artigo 24.º, n.º 1, alínea c) do Código dos Contratos Públicos",31-03-2017,"1.200,00 €",,,,Não aplicável.,Não aplicável.,FALSE
Prestação Serviços,Ajuste Direto Regime Geral,Aquisição de serviços,"85000000-9, Serviços de saúde e acção social",Centro Hospitalar Psiquiátrico de Lisboa (508338476),Liliana Andreia Lérias Rodrigues (209340010),"10.800,00 €",08-03-2018,11-04-2017,270 dias,"Portugal, Lisboa, Lisboa<BR/>Portugal","Artigo 20.º, n.º 1, alínea a) do Código dos Contratos Públicos",31-12-2017,"10.800,00 €",,,,Não aplicável.,Não aplicável.,FALSE
