Objeto do Contrato,Tipo de Procedimento,Tipo(s) de Contrato,CPVs,Entidade(s) Adjudicante(s),Entidade(s) Adjudicatária(s),Preço Contratual,Data de Publicação,Data de Celebração do Contrato,Prazo de Execução,Local de Execução,Fundamentação,Data de Fecho do Contrato,Preço Total Efetivo,Causas das Alterações ao Prazo,Causas das Alterações ao Preço,Estado,N.º registo do Acordo Quadro,Descrição do Acordo Quadro,Procedimento Centralizado
Serviços de enfermagem,Ajuste Direto Regime Geral,Aquisição de serviços,"85000000-9, Serviços de saúde e acção social","Administração Regional de Saúde do Centro, I. P. (503122165)",Tiago Filipe Pereira da Silva (217905684),"14.653,20 €",11-12-2017,10-01-2017,356 dias,"Portugal, Coimbra, Coimbra","Artigo 20.º, n.º 1, alínea a) do Código dos Contratos Públicos",30-09-2017,"10.989,90 €",rescisão do contrato por parte do prestador,rescisão do contrato,,Não aplicável.,Não aplicável.,FALSE
Serviços de enfermagem,Ajuste Direto Regime Geral,Aquisição de serviços,"85000000-9, Serviços de saúde e acção social","Administração Regional de Saúde do Centro, I. P. (503122165)",Suzi Isabel Rodriues Corgas (231945310),"16.746,48 €",11-12-2017,09-02-2017,357 dias,"Portugal, Viseu","Artigo 20.º, n.º 1, alínea a) do Código dos Contratos Públicos",31-12-2017,"16.484,41 €","",Realização de número de horas em número inferior ao contratado.,,Não aplicável.,Não aplicável.,FALSE
Serviços de enfermagem,Ajuste Direto Regime Geral,Aquisição de serviços,"85000000-9, Serviços de saúde e acção social","Administração Regional de Saúde do Centro, I. P. (503122165)",Patricia Alexandra Constança Morais (237881993),"16.746,48 €",11-12-2017,06-01-2017,365 dias,"Portugal, Viseu","Artigo 20.º, n.º 1, alínea a) do Código dos Contratos Públicos",31-12-2017,"15.691,93 €","",Realização de número de horas em número inferior ao contratado.,,Não aplicável.,Não aplicável.,FALSE
Serviços de enfermagem,Ajuste Direto Regime Geral,Aquisição de serviços,"85000000-9, Serviços de saúde e acção social","Administração Regional de Saúde do Centro, I. P. (503122165)",António José Tereso da Silva (193064723),"16.746,48 €",11-12-2017,30-12-2016,365 dias,"Portugal, Leiria","Artigo 20.º, n.º 1, alínea a) do Código dos Contratos Públicos",31-12-2017,"16.416,39 €","",Realização de numero inferior de horas face ao contratado.,,Não aplicável.,Não aplicável.,FALSE
Serviços de enfermagem,Ajuste Direto Regime Geral,Aquisição de serviços,"85000000-9, Serviços de saúde e acção social","Administração Regional de Saúde do Centro, I. P. (503122165)",Ana Margarida Pala Mendes (223365807),"16.746,48 €",11-12-2017,01-01-2017,365 dias,"Portugal, Leiria","Artigo 20.º, n.º 1, alínea a) do Código dos Contratos Públicos",31-12-2017,"16.432,49 €","",Realização de número inferior de horas face ao contrato,,Não aplicável.,Não aplicável.,FALSE
Serviços de enfermagem,Ajuste Direto Regime Geral,Aquisição de serviços,"85000000-9, Serviços de saúde e acção social","Administração Regional de Saúde do Centro, I. P. (503122165)",Ana Sofia Matos Soares (217590969),"16.746,48 €",11-12-2017,01-01-2017,365 dias,"Portugal, Leiria","Artigo 20.º, n.º 1, alínea a) do Código dos Contratos Públicos",31-12-2017,"15.732,06 €","",Realização de número inferior de horas face ao contrato.,,Não aplicável.,Não aplicável.,FALSE
Serviços de enfermagem,Ajuste Direto Regime Geral,Aquisição de serviços,"85000000-9, Serviços de saúde e acção social","Administração Regional de Saúde do Centro, I. P. (503122165)",Ana Sofia Carreira (254263054),"16.746,48 €",11-12-2017,01-01-2017,365 dias,"Portugal, Leiria","Artigo 20.º, n.º 1, alínea a) do Código dos Contratos Públicos",31-12-2017,"12.401,52 €","",Realização de horas em número inferior face ao contratado.,,Não aplicável.,Não aplicável.,FALSE
Serviços de enfermagem,Ajuste Direto Regime Geral,Aquisição de serviços,"85000000-9, Serviços de saúde e acção social","Administração Regional de Saúde do Centro, I. P. (503122165)",Joana dos Santos Domingos (236563734),"16.746,48 €",11-12-2017,01-01-2017,365 dias,"Portugal, Leiria","Artigo 20.º, n.º 1, alínea a) do Código dos Contratos Públicos",31-12-2017,"16.300,55 €","",Realização de número de horas inferior ao contratado.,,Não aplicável.,Não aplicável.,FALSE
Serviços de enfermagem,Ajuste Direto Regime Geral,Aquisição de serviços,"85000000-9, Serviços de saúde e acção social","Administração Regional de Saúde do Centro, I. P. (503122165)",Joana Leitão da Silva Malho (251453324),"16.746,48 €",11-12-2017,01-01-2017,365 dias,"Portugal, Leiria","Artigo 20.º, n.º 1, alínea a) do Código dos Contratos Públicos",31-12-2017,"15.575,50 €","",Realização de horas em número inferior ao contratado.,,Não aplicável.,Não aplicável.,FALSE
Serviços de enfermagem,Ajuste Direto Regime Geral,Aquisição de serviços,"85000000-9, Serviços de saúde e acção social","Administração Regional de Saúde do Centro, I. P. (503122165)",Rita Quélia Chaveiro Romão Carreira Panaca (215823842),"16.746,48 €",11-12-2017,01-01-2017,365 dias,"Portugal, Leiria","Artigo 20.º, n.º 1, alínea a) do Código dos Contratos Públicos",31-12-2017,"16.071,08 €","",Realização de horas em número inferior ao contratado.,,Não aplicável.,Não aplicável.,FALSE
Serviços de enfermagem,Ajuste Direto Regime Geral,Aquisição de serviços,"85000000-9, Serviços de saúde e acção social","Administração Regional de Saúde do Centro, I. P. (503122165)",Mafalda Mariana Correia Santos (248945742),"16.746,48 €",11-12-2017,01-01-2017,365 dias,"Portugal, Leiria","Artigo 20.º, n.º 1, alínea a) do Código dos Contratos Públicos",31-12-2017,"15.868,92 €","",Realização de numero inferior de horas face ao contratado.,,Não aplicável.,Não aplicável.,FALSE
Serviços de enfermagem,Ajuste Direto Regime Geral,Aquisição de serviços,"85000000-9, Serviços de saúde e acção social","Administração Regional de Saúde do Centro, I. P. (503122165)",Rute André Malagueta Ferreira (267428383),"16.746,48 €",11-12-2017,01-01-2017,365 dias,"Portugal, Leiria","Artigo 20.º, n.º 1, alínea a) do Código dos Contratos Públicos",31-12-2017,"16.512,99 €","",Realização de horas em número inferior ao contratado.,,Não aplicável.,Não aplicável.,FALSE
Serviços de enfermagem,Ajuste Direto Regime Geral,Aquisição de serviços,"85000000-9, Serviços de saúde e acção social","Administração Regional de Saúde do Centro, I. P. (503122165)",Rita Silva Domingues (215176405),"16.746,48 €",11-12-2017,01-01-2017,365 dias,"Portugal, Leiria","Artigo 20.º, n.º 1, alínea a) do Código dos Contratos Públicos",31-12-2017,"16.360,03 €","",Realização de número de horas em número inferior ao contratado.,,Não aplicável.,Não aplicável.,FALSE
Serviços de enfermagem,Ajuste Direto Regime Geral,Aquisição de serviços,"85000000-9, Serviços de saúde e acção social","Administração Regional de Saúde do Centro, I. P. (503122165)",Sara Rodrigues Carreira (223917940),"16.746,48 €",11-12-2017,01-01-2017,365 dias,"Portugal, Leiria","Artigo 20.º, n.º 1, alínea a) do Código dos Contratos Públicos",31-12-2017,"16.384,19 €","",Realização de número de horas em número inferior ao contratado.,,Não aplicável.,Não aplicável.,FALSE
Serviços de enfermagem,Ajuste Direto Regime Geral,Aquisição de serviços,"85000000-9, Serviços de saúde e acção social","Administração Regional de Saúde do Centro, I. P. (503122165)",Sara Margarida Ferreira Dias (241290961),"16.746,48 €",11-12-2017,01-01-2017,365 dias,"Portugal, Leiria","Artigo 20.º, n.º 1, alínea a) do Código dos Contratos Públicos",31-12-2017,"16.488,85 €","",Realização de horas em nome inferior face ao contratado.,,Não aplicável.,Não aplicável.,FALSE
Serviços de enfermagem,Ajuste Direto Regime Geral,Aquisição de serviços,"85000000-9, Serviços de saúde e acção social","Administração Regional de Saúde do Centro, I. P. (503122165)",Daniel Pedro Martins Lopes (219989877),"14.653,20 €",11-12-2017,30-12-2016,365 dias,"Portugal, Coimbra, Coimbra","Artigo 20.º, n.º 1, alínea a) do Código dos Contratos Públicos",20-11-2017,"13.432,11 €",rescisão por parte do prestador,rescisão do contrato,,Não aplicável.,Não aplicável.,FALSE
Serviços de enfermagem,Ajuste Direto Regime Geral,Aquisição de serviços,"85000000-9, Serviços de saúde e acção social","Administração Regional de Saúde do Centro, I. P. (503122165)",Andreia Liliana Marques Abade (235514977),"14.653,20 €",11-12-2017,05-01-2017,361 dias,"Portugal, Coimbra, Coimbra","Artigo 20.º, n.º 1, alínea a) do Código dos Contratos Públicos",31-12-2017,"14.653,20 €","","",,Não aplicável.,Não aplicável.,FALSE
Processo 17100117-Aquisição de reagentes,Ajuste Direto Regime Geral,Aquisição de bens móveis,"33000000-0, Equipamento médico, medicamentos e produtos para cuidados pessoais","Administração Regional de Saúde do Centro, I. P. (503122165)","ALERE, LDA. (502518863)","1.560,00 €",11-12-2017,28-03-2017,360 dias,"Portugal, Coimbra, Coimbra","Artigo 20.º, n.º 1, alínea a) do Código dos Contratos Públicos",04-12-2017,"1.560,00 €","","",,Não aplicável.,Não aplicável.,FALSE
Processo 17100117-Aquisição de reagentes,Ajuste Direto Regime Geral,Aquisição de bens móveis,"33000000-0, Equipamento médico, medicamentos e produtos para cuidados pessoais","Administração Regional de Saúde do Centro, I. P. (503122165)","Quilaban- Química Laboratorial Analítica, SA (500399670)","446,04 €",11-12-2017,28-03-2017,360 dias,"Portugal, Coimbra, Coimbra","Artigo 20.º, n.º 1, alínea a) do Código dos Contratos Públicos",04-12-2017,"446,04 €","","",,Não aplicável.,Não aplicável.,FALSE
PROCESSO 17100118-Aquisição de reagentes,Ajuste Direto Regime Geral,Aquisição de bens móveis,"33600000-6, Produtos farmacêuticos","Administração Regional de Saúde do Centro,IP(ARSC) (503122165)",MED TRUST PORTUGAL  (510862993),"15.761,45 €",11-12-2017,03-04-2017,360 dias,"Portugal, Coimbra, Coimbra","Artigo 20.º, n.º 1, alínea a) do Código dos Contratos Públicos",02-11-2017,"15.761,45 €","","",,Não aplicável.,Não aplicável.,FALSE
Aquisição de reagentes,Ajuste Direto Regime Geral,Aquisição de bens móveis,"33600000-6, Produtos farmacêuticos","Administração Regional de Saúde do Centro,IP(ARSC) (503122165)","Iberlab & Imunoreage, Lda. (503406694)","9.410,00 €",11-12-2017,03-04-2017,360 dias,"Portugal, Coimbra, Coimbra","Artigo 20.º, n.º 1, alínea a) do Código dos Contratos Públicos",02-11-2017,"9.410,00 €","","",,Não aplicável.,Não aplicável.,FALSE
processo 17100121-Aquisição de ligadura de zinco,Ajuste Direto Regime Geral,Aquisição de bens móveis,"33700000-7, Produtos para cuidados pessoais","Administração Regional de Saúde do Centro,IP(ARSC) (503122165)","Paul Hartmann, Lda (502271728)","25.500,00 €",11-12-2017,09-05-2017,360 dias,"Portugal, Coimbra, Coimbra","Artigo 20.º, n.º 1, alínea a) do Código dos Contratos Públicos",02-11-2017,"25.500,00 €","","",,Não aplicável.,Não aplicável.,FALSE
Aquisição de isoniazida,Ajuste Direto Regime Geral,Aquisição de bens móveis,"33690000-3, Medicamentos vários","Administração Regional de Saúde do Centro, I. P. (503122165)","Dux Pharma, Unipessoal Lda  (510803679)","14.492,25 €",07-12-2017,27-03-2017,360 dias,"Portugal, Coimbra, Coimbra","Artigo 24.º, n.º 1, alínea e) do Código dos Contratos Públicos",04-12-2017,"14.492,25 €","","",,Não aplicável.,Não aplicável.,FALSE
processo 17100120-aquisição de prednisolona,Ajuste Direto Regime Geral,Aquisição de bens móveis,"33690000-3, Medicamentos vários","Administração Regional de Saúde do Centro, I. P. (503122165)","ANGELINI FARMACÊUTICA, LDA. (500583650)","26.200,00 €",07-12-2017,31-03-2017,360 dias,"Portugal, Coimbra, Coimbra","Artigo 24.º, n.º 1, alínea e) do Código dos Contratos Públicos",04-12-2017,"26.200,00 €","","",,Não aplicável.,Não aplicável.,FALSE
PROCESSO 17200511-Aquisição de ligaduras,Ajuste Direto Regime Geral,Aquisição de bens móveis,"33140000-3, Material médico de consumo","Administração Regional de Saúde do Centro,IP(ARSC) (503122165)",ANASTÁCIO SALDANHA UNIPESSOAL LDA (505804441),"12.288,00 €",07-12-2017,07-08-2017,180 dias,"Portugal, Coimbra, Coimbra","Artigo 20.º, n.º 1, alínea a) do Código dos Contratos Públicos",07-12-2017,"12.288,00 €","","",,Não aplicável.,Não aplicável.,FALSE
Consumíveis de impressão,Ajuste Direto Regime Geral,Aquisição de bens móveis,"30100000-0, Máquinas, equipamento e material de escritório, excepto computadores, impressoras e mobiliário","Administração Regional de Saúde do Centro,IP(ARSC) (503122165)","ECOREUTIL-Consúmiveis de Informática, Unipessoal Ld.ª (504466852)","63,00 €",06-12-2017,06-12-2017,4 dias,"Portugal, Distrito não determinado, Concelho não determinado","Artigo 20.º, n.º 1, alínea a) do Código dos Contratos Públicos",12-12-2017,"63,00 €","","",,Não aplicável.,Não aplicável.,FALSE
Consumíveis de impressão,Ajuste Direto Regime Geral,Aquisição de bens móveis,"30100000-0, Máquinas, equipamento e material de escritório, excepto computadores, impressoras e mobiliário","Administração Regional de Saúde do Centro,IP(ARSC) (503122165)","TOPTONER-Reciclagem e Comercialização de Consumíveis Informáticos, Lda. (504242644)","17.698,45 €",06-12-2017,19-10-2017,10 dias,"Portugal, Distrito não determinado, Concelho não determinado","Artigo 20.º, n.º 1, alínea a) do Código dos Contratos Públicos",18-12-2017,"17.698,45 €","","",,Não aplicável.,Não aplicável.,FALSE
Aquisição de sacos de plástico para reposição de stock,Ajuste Direto Regime Geral,Aquisição de bens móveis,"19640000-4, Sacos de polietileno para recolha de lixo e resíduos","Administração Regional de Saúde do Centro,IP(ARSC) (503122165)","Plasticolors, Lda. (504183346)","39.030,07 €",06-12-2017,09-05-2017,365 dias,"Portugal, Coimbra, Coimbra","Artigo 20.º, n.º 1, alínea a) do Código dos Contratos Públicos",06-12-2017,"39.030,07 €","","",,Não aplicável.,Não aplicável.,FALSE
