Objeto do Contrato,Tipo de Procedimento,Tipo(s) de Contrato,CPVs,Entidade(s) Adjudicante(s),Entidade(s) Adjudicatária(s),Preço Contratual,Data de Publicação,Data de Celebração do Contrato,Prazo de Execução,Local de Execução,Fundamentação,Data de Fecho do Contrato,Preço Total Efetivo,Causas das Alterações ao Prazo,Causas das Alterações ao Preço,Estado,N.º registo do Acordo Quadro,Descrição do Acordo Quadro,Procedimento Centralizado
AD509-2017ESTIMULANTES DA ERITROPIESE,Ao abrigo de acordo-quadro (art.º 259.º),Aquisição de bens móveis,"33600000-6, Produtos farmacêuticos","Instituto Português de Oncologia de Lisboa Francisco Gentil, E. P. E. (506361616)","JANSSEN CILÇAG FARMACEUTICA, LDA (500189412)","5.393,28 €",09-03-2017,07-03-2017,365 dias,"Portugal, Lisboa, Lisboa",Artigo 259.º do Código dos Contratos Públicos,,,,,,1348990,Acordo quadro para fornecimento de Estimulantes da Eritropoiese às instituições e serviços do serviço nacional de saúde,FALSE
AD181-2017-MEDICAMENTOS EXCLUSIVOS,Ajuste Direto Regime Geral,Aquisição de bens móveis,"33600000-6, Produtos farmacêuticos","Instituto Português de Oncologia de Lisboa Francisco Gentil, E. P. E. (506361616)",NOVARTIS FARMA PRODUTOS FARMACEUTICOS SA (500063524),"78.384,04 €",09-03-2017,17-01-2017,365 dias,"Portugal, Lisboa, Lisboa","Artigo 24.º, n.º 1, alínea e) do Código dos Contratos Públicos",,,,,,Não aplicável.,Não aplicável.,FALSE
AD430-2017 LEVOTIROXINA 200 MG INJ,Ajuste Direto Regime Geral,Aquisição de bens móveis,"33600000-6, Produtos farmacêuticos","Instituto Português de Oncologia de Lisboa Francisco Gentil, E. P. E. (506361616)",DUXPHARMA UNIPESSOAL LDA (510803679),"8.191,00 €",09-03-2017,06-03-2017,365 dias,"Portugal, Lisboa, Lisboa","Artigo 20.º, n.º 1, alínea a) do Código dos Contratos Públicos",,,,,,Não aplicável.,Não aplicável.,FALSE
AD515-2017Fibrogenio humano + albumina,Ao abrigo de acordo-quadro (art.º 259.º),Aquisição de bens móveis,"33600000-6, Produtos farmacêuticos","Instituto Português de Oncologia de Lisboa Francisco Gentil, E. P. E. (506361616)",CSL BEHRING Unipessoal Lda (503047201),"240.000,00 €",08-03-2017,24-02-2017,365 dias,"Portugal, Lisboa, Lisboa",Artigo 259.º do Código dos Contratos Públicos,,,,,,1423488,ACORDO QUADRO PARA FORNECIMENTO DE DERIVADOS DO PLASMA HUMANO ÀS INSTITUIÇÕES E SERVIÇOS DO SERVIÇO NACIONAL DE SAÚDE CP 2015/9,FALSE
AD131-2017FORNECIMENTO DE IMPLANTES PROSTÁTICOS,Ajuste Direto Regime Geral,Aquisição de serviços<br/>Aquisição de bens móveis,"33600000-6, Produtos farmacêuticos","Instituto Português de Oncologia de Lisboa Francisco Gentil, E. P. E. (506361616)",C.R. BARD PORTUGAL-Produtos e artigos médicose farmacêuticos lda (502438274),"70.000,00 €",08-03-2017,16-02-2017,365 dias,"Portugal, Lisboa, Lisboa","Artigo 20.º, n.º 1, alínea a) do Código dos Contratos Públicos",,,,,,Não aplicável.,Não aplicável.,FALSE
AD155-2017-PRETAÇÃO DE SERVIÇOS DE COMUNICAÇÕES MOVEIS,Ajuste Direto Regime Geral,Aquisição de serviços,"64200000-8, Serviços de telecomunicações","Instituto Português de Oncologia de Lisboa Francisco Gentil, E. P. E. (506361616)","MEO-SERVIÇOS DE COMUNICAÇÕES RE MULTIMÉDIA, S.A. (502600268)","59.196,34 €",07-03-2017,10-02-2017,365 dias,"Portugal, Lisboa, Lisboa","Artigo 24.º, n.º 1, alínea e) do Código dos Contratos Públicos",,,,,,Não aplicável.,Não aplicável.,FALSE
AD895-2017BEVACIZUMAB 100 MG E 400 MG INJ,Ao abrigo de acordo-quadro (art.º 259.º),Aquisição de bens móveis,"33600000-6, Produtos farmacêuticos","Instituto Português de Oncologia de Lisboa Francisco Gentil, E. P. E. (506361616)","ROCHE FARMACEUTICA QUIMICA, LDA (500233810)","31.162,75 €",07-03-2017,27-02-2017,365 dias,"Portugal, Lisboa, Lisboa",Artigo 259.º do Código dos Contratos Públicos,,,,,,1771819,CP 2015/6 - Acordo quadro para o fornecimento de Medicamentos do Foro Oncológico,FALSE
AD742-2017SERVIÇOS DE MANUTENÇÃO E ASSISTENCIA TÉCNICA AO PACS,Ajuste Direto Regime Geral,Aquisição de serviços,"72000000-5, Serviços de TI: consultoria, desenvolvimento de software, Internet e apoio","Instituto Português de Oncologia de Lisboa Francisco Gentil, E. P. E. (506361616)",ART CES UNIPESSOAL LDA (513270396),"58.050,00 €",06-03-2017,15-02-2017,365 dias,"Portugal, Lisboa, Lisboa","Artigo 24.º, n.º 1, alínea e) do Código dos Contratos Públicos",,,,,,Não aplicável.,Não aplicável.,FALSE
AD213-2017CAT SOFTWARE ENSEMBLE DEEPSEE,Ajuste Direto Regime Geral,Aquisição de serviços,"72500000-0, Serviços relacionados com a informática","Instituto Português de Oncologia de Lisboa Francisco Gentil, E. P. E. (506361616)","INFO LAU-Prestação  de serviços de informática bancária unipessoal, lda (506294196)","24.975,00 €",06-03-2017,15-02-2017,365 dias,"Portugal, Lisboa, Lisboa","Artigo 24.º, n.º 1, alínea e) do Código dos Contratos Públicos",,,,,,Não aplicável.,Não aplicável.,FALSE
CP-902017-FORNECIMWENTO E DISTRIBUIÇÃO DE BENS E SERVIÇOS ALIMENTAÇÃO DE DOENTES ACOMPANHANTES E COLABORADORES DO IPO,Concurso público,Aquisição de serviços,"55322000-3, Serviços de confecção de refeições","Instituto Português de Oncologia de Lisboa Francisco Gentil, E. P. E. (506361616)","GERTAL-COMPANHIA GERAL DE RESTAURANTES E ALIMENTAÇÃO, S.A. (500126623)","1.380.792,96 €",03-03-2017,11-01-2017,365 dias,"Portugal, Lisboa, Lisboa","Artigo 20.º, n.º 1, alínea b) do Código dos Contratos Públicos",,,,,,Não aplicável.,Não aplicável.,FALSE
AD629-2017SERVIÇOS DE MANUTENÇÃO CORRECTIVA E EVOLUTIVA DOS SISTEMAS CLINIDATA,Ajuste Direto Regime Geral,Aquisição de serviços,"72000000-5, Serviços de TI: consultoria, desenvolvimento de software, Internet e apoio","Instituto Português de Oncologia de Lisboa Francisco Gentil, E. P. E. (506361616)",MAXDATA SOFTWARE  SOFTWARE S.A. (502250259),"35.788,68 €",03-03-2017,17-02-2017,365 dias,"Portugal, Lisboa, Lisboa","Artigo 24.º, n.º 1, alínea e) do Código dos Contratos Públicos",,,,,,Não aplicável.,Não aplicável.,FALSE
AD895-2017LENALIDOMIDA 15 MG CP,Ajuste Direto Regime Geral,Aquisição de bens móveis,"33600000-6, Produtos farmacêuticos","Instituto Português de Oncologia de Lisboa Francisco Gentil, E. P. E. (506361616)","CELGENE SOCIEDADE UNIPESSOAL, LDA (507791690)","49.246,70 €",03-03-2017,24-02-2017,365 dias,"Portugal, Lisboa, Lisboa","Artigo 24.º, n.º 1, alínea c) do Código dos Contratos Públicos",,,,,,Não aplicável.,Não aplicável.,FALSE
AD478-2017VITAMINA A+D+OXIDO ZINCO POM,Ao abrigo de acordo-quadro (art.º 259.º),Aquisição de bens móveis,"33600000-6, Produtos farmacêuticos","Instituto Português de Oncologia de Lisboa Francisco Gentil, E. P. E. (506361616)","LAB MEDINFAR-PRODUTOS FARMACEUTICOS, S.A. (500384045)","110,24 €",03-03-2017,20-02-2017,365 dias,"Portugal, Lisboa, Lisboa",Artigo 259.º do Código dos Contratos Públicos,,,,,,1513257,Acordo quadro para fornecimento de Medicamentos diversos II   às Instituições e Serviços do Serviço Nacional de Saúde,FALSE
