Objeto do Contrato,Tipo de Procedimento,Tipo(s) de Contrato,CPVs,Entidade(s) Adjudicante(s),Entidade(s) Adjudicatária(s),Preço Contratual,Data de Publicação,Data de Celebração do Contrato,Prazo de Execução,Local de Execução,Fundamentação,Data de Fecho do Contrato,Preço Total Efetivo,Causas das Alterações ao Prazo,Causas das Alterações ao Preço,Estado,N.º registo do Acordo Quadro,Descrição do Acordo Quadro,Procedimento Centralizado
Aquisição de hardware para Datacenter e serviços conexos de instalação e suporte para a SPMS - Lote 1 - Unidades de armazenamento,Concurso público,Aquisição de bens móveis,"32420000-3, Equipamento de rede","SPMS - Serviços Partilhados do Ministério da Saúde, E. P. E. (509540716)",Informantem (503670693),"75.374,00 €",11-10-2018,27-09-2018,94 dias,Portugal,"Artigo 20.º, n.º 1, alínea a) do Código dos Contratos Públicos",,,,,,Não aplicável.,Não aplicável.,FALSE
Convite ao abrigo de acordo-quadro - Serviços de manutenção evolutiva do SICSP para implementação do Despacho n.º 1174-A/2017,Ao abrigo de acordo-quadro (art.º 259.º),Aquisição de serviços,"72500000-0, Serviços relacionados com a informática","SPMS - Serviços Partilhados do Ministério da Saúde, E. P. E. (509540716)","ITEN SOLUTIONS – SISTEMAS DE INFORMAÇÃO, S.A. (510728189)","114.048,00 €",10-10-2018,24-09-2018,547 dias,Portugal,Artigo 259.º do Código dos Contratos Públicos,,,,,,1423482,CELEBRAÇÃO DE ACORDO QUADRO PARA PRESTAÇÃO DE SERVIÇOS TIC E INTEROPERABILIDADE NA ÁREA DA SAÚDE,FALSE
Serviços de solução integrada para gestão do ciclo de notificação do SITAM,Ajuste Direto Regime Geral,Aquisição de serviços,"72500000-0, Serviços relacionados com a informática","SPMS - Serviços Partilhados do Ministério da Saúde, E. P. E. (509540716)","CTT – Correios de Portugal, S.A. (500077568)","73.280,75 €",10-10-2018,26-09-2018,365 dias,Portugal,"Artigo 24.º, n.º 1, alínea e), subalínea ii) do Código dos Contratos Públicos",,,,,,Não aplicável.,Não aplicável.,FALSE
Serviços de apoio especializado à DPDO - Lote 2 - Transformação Digital,Concurso público,Aquisição de serviços,"79420000-4, Serviços relacionados com a gestão","SPMS- Serviços Partilhados do M. da Saúde, E.P.E. (509540716)","Pricewaterhousecoopers / Ag - Assessoria de Gestão, Lda. (504193279)","36.300,00 €",10-10-2018,25-09-2018,456 dias,Portugal,"Artigo 20.º, n.º 1, alínea a) do Código dos Contratos Públicos",,,,,,Não aplicável.,Não aplicável.,FALSE
Serviços de apoio especializado à DPDO - Lote 1 - Planeamento e Gestão,Concurso público,Aquisição de serviços,"79420000-4, Serviços relacionados com a gestão","SPMS- Serviços Partilhados do M. da Saúde, E.P.E. (509540716)","Pricewaterhousecoopers / Ag - Assessoria de Gestão, Lda. (504193279)","72.600,00 €",10-10-2018,25-09-2018,456 dias,Portugal,"Artigo 20.º, n.º 1, alínea a) do Código dos Contratos Públicos",,,,,,Não aplicável.,Não aplicável.,FALSE
Convite ao abrigo de acordo-quadro - Serviços de gestão de projeto para a área de coordenação de CSPP (Cuidados de Saúde Primários e de Proximidade) - Lote 2 - Área de Negócio e das Operações,Ao abrigo de acordo-quadro (art.º 259.º),Aquisição de serviços,"72500000-0, Serviços relacionados com a informática","SPMS - Serviços Partilhados do Ministério da Saúde, E. P. E. (509540716)",GFI PORTUGAL - TECNOLOGIAS DE INFORMAÇÃO S.A. (502726890),"57.150,00 €",10-10-2018,18-09-2018,425 dias,Portugal,Artigo 259.º do Código dos Contratos Públicos,,,,,,1423482,CELEBRAÇÃO DE ACORDO QUADRO PARA PRESTAÇÃO DE SERVIÇOS TIC E INTEROPERABILIDADE NA ÁREA DA SAÚDE,FALSE
Convite ao abrigo de acordo-quadro - Serviços de gestão de projeto para a área de coordenação de CSPP (Cuidados de Saúde Primários e de Proximidade) - Lote 1 - Área de Inovação USF Breiner,Ao abrigo de acordo-quadro (art.º 259.º),Aquisição de serviços,"72500000-0, Serviços relacionados com a informática","SPMS - Serviços Partilhados do Ministério da Saúde, E. P. E. (509540716)",GFI PORTUGAL - TECNOLOGIAS DE INFORMAÇÃO S.A. (502726890),"57.150,00 €",09-10-2018,18-09-2018,425 dias,Portugal,Artigo 259.º do Código dos Contratos Públicos,,,,,,1423482,CELEBRAÇÃO DE ACORDO QUADRO PARA PRESTAÇÃO DE SERVIÇOS TIC E INTEROPERABILIDADE NA ÁREA DA SAÚDE,FALSE
Serviços de desenvolvimento de um modelo de custo-efetividade para a TeleSaúde,Ajuste Direto Regime Geral,Aquisição de serviços,"79411000-8, Serviços gerais de consultoria em matéria de gestão geral","SPMS - Serviços Partilhados do Ministério da Saúde, E. P. E. (509540716)",Universidade Nova de Lisboa (501559094),"58.000,00 €",09-10-2018,06-08-2018,183 dias,Portugal,"Artigo 27.º, n.º 1, alínea e) do Código dos Contratos Públicos",,,,,,Não aplicável.,Não aplicável.,FALSE
Serviços de outsourcing - exploração e gestão - da Rede Informática da Saúde (RIS),Ajuste Direto Regime Geral,Aquisição de serviços,"72500000-0, Serviços relacionados com a informática","SPMS- Serviços Partilhados do M. da Saúde, E.P.E. (509540716)",NOS (502604751),"360.000,00 €",09-10-2018,25-09-2018,90 dias,Portugal,"Artigo 24.º, n.º 1, alínea e), subalínea ii) do Código dos Contratos Públicos",,,,,,Não aplicável.,Não aplicável.,FALSE
Convite ao abrigo de acordo-quadro - Serviços de manutenção corretiva e evolutiva do Sistema de Informação de Controlo do HIV/SIDA (SI.VIDA),Ao abrigo de acordo-quadro (art.º 259.º),Aquisição de serviços,"72500000-0, Serviços relacionados com a informática","SPMS - Serviços Partilhados do Ministério da Saúde, E. P. E. (509540716)","ALTRANPOR TUGAL, S.A. (504272179)","44.311,68 €",09-10-2018,06-09-2018,365 dias,Portugal,Artigo 259.º do Código dos Contratos Públicos,,,,,,1423482,CELEBRAÇÃO DE ACORDO QUADRO PARA PRESTAÇÃO DE SERVIÇOS TIC E INTEROPERABILIDADE NA ÁREA DA SAÚDE,FALSE
Convite ao abrigo de acordo quadro - Serviços de apoio à Gestão de Fornecedores da Direção de Sistema de Informação da SPMS,Ao abrigo de acordo-quadro (art.º 259.º),Aquisição de serviços,"71317200-5, Serviços de saúde e segurança","SPMS- Serviços Partilhados do M. da Saúde, E.P.E. (509540716)","BIQ - HEALTH SOLUTIONS, LDA (504105337)","39.684,48 €",09-10-2018,07-09-2018,365 dias,Portugal,Artigo 259.º do Código dos Contratos Públicos,,,,,,1950010,Acordo quadro para Prestação de Serviços de Consultadoria na área da Saúde e Segurança   às Instituições e Serviços do Serviço Nacional de Saúde,FALSE
Serviços de informática para apoio a utilizadores locais e regionais - Lote 2 - Consultor sénior,Concurso público,Aquisição de serviços,"71356300-1, Serviços de apoio técnico","SPMS- Serviços Partilhados do M. da Saúde, E.P.E. (509540716)","BABEL IBÉRICA, S.A. (507025229)","38.290,56 €",04-10-2018,18-09-2018,365 dias,Portugal,"Artigo 20.º, n.º 1, alínea a) do Código dos Contratos Públicos",,,,,,Não aplicável.,Não aplicável.,FALSE
"Aquisição de serviços de produção livestreaming e reportagem fotográfica para reuniões e eventos a promover pela SPMS, EPE - Lote 1 - Prestação de- Serviços de Livestreaming",Concurso público,Aquisição de serviços,"79950000-8, Serviços de organização de exposições, feiras e congressos","SPMS- Serviços Partilhados do M. da Saúde, E.P.E. (509540716)","Inovastream, Lda (510610641)","164.800,00 €",04-10-2018,17-09-2018,97 dias,Portugal,"Artigo 20.º, n.º 1, alínea a) do Código dos Contratos Públicos",,,,,,Não aplicável.,Não aplicável.,FALSE
Serviços para implementação de SDK na MySNS carteira eletrónica,Concurso público,Aquisição de serviços,"72500000-0, Serviços relacionados com a informática","SPMS - Serviços Partilhados do Ministério da Saúde, E. P. E. (509540716)","PDM&FC – PROJECTOS DE DESENVOLVIMENTO MANUTENÇÃO FORMAÇÃO E CONSULTADORIA, LDA (502980826)","45.064,80 €",04-10-2018,19-09-2018,105 dias,Portugal,"Artigo 20.º, n.º 1, alínea a) do Código dos Contratos Públicos",,,,,,Não aplicável.,Não aplicável.,FALSE
Serviços especializados para o portal de intranet e site da SPMS - Lote 2 - Serviços para o desenvolvimento de nova versão do site da SPMS,Concurso público,Aquisição de serviços,"72500000-0, Serviços relacionados com a informática","SPMS - Serviços Partilhados do Ministério da Saúde, E. P. E. (509540716)","Newsengage - Media, Conteúdo e Comunidades, SA (506871711)","50.000,01 €",04-10-2018,18-09-2018,365 dias,Portugal,"Artigo 20.º, n.º 1, alínea b) do Código dos Contratos Públicos",,,,,,Não aplicável.,Não aplicável.,FALSE
Serviços especializados para a Unidade de Plataformas de Integração de Cuidados e Serviços do Cidadão e suporte aos profissionais - Lote 2 - Serviços para reforçar a equipa de Plataformas de Integração de Cuidados e Serviços do Cidadão,Concurso público,Aquisição de serviços,"72500000-0, Serviços relacionados com a informática","SPMS- Serviços Partilhados do M. da Saúde, E.P.E. (509540716)",MATCH PROFILER LDA (504642251),"49.408,00 €",04-10-2018,13-09-2018,241 dias,Portugal,"Artigo 20.º, n.º 1, alínea a) do Código dos Contratos Públicos",,,,,,Não aplicável.,Não aplicável.,FALSE
Serviços especializados para a Unidade de Plataformas de Integração de Cuidados e Serviços do Cidadão e suporte aos profissionais - Lote 1 - Serviços de suporte aos profissionais,Concurso público,Aquisição de serviços,"72500000-0, Serviços relacionados com a informática","SPMS- Serviços Partilhados do M. da Saúde, E.P.E. (509540716)","ALTRANPORTUGAL, S. A. (504272179)","50.534,40 €",03-10-2018,13-09-2018,241 dias,Portugal,"Artigo 20.º, n.º 1, alínea a) do Código dos Contratos Públicos",,,,,,Não aplicável.,Não aplicável.,FALSE
Serviços de implementação do rollout hospitalar do Sistema de Gestão de Transporte de Doentes (SGTD),Ajuste Direto Regime Geral,Aquisição de serviços,"72500000-0, Serviços relacionados com a informática","SPMS - Serviços Partilhados do Ministério da Saúde, E. P. E. (509540716)","LINK CONSULTING - TECNOLOGIAS DE INFORMAÇÃO, S.A. (504551221)","87.000,00 €",03-10-2018,29-08-2018,123 dias,Portugal,"Artigo 24.º, n.º 1, alínea e), subalínea ii) do Código dos Contratos Públicos",,,,,,Não aplicável.,Não aplicável.,FALSE
"Serviços de produção livestreaming e reportagem fotográfica para reuniões e eventos a promover pela SPMS, EPE - Lote 2 - Serviços de Reportagem fotográfica",Concurso público,Aquisição de serviços,"79950000-8, Serviços de organização de exposições, feiras e congressos","SPMS- Serviços Partilhados do M. da Saúde, E.P.E. (509540716)","AUDIORENT – ALUGUER E VENDA DE EQUIPAMENTO AUDIOVISUAIS, LDA. (508245800)","37.800,00 €",03-10-2018,04-09-2018,110 dias,Portugal,"Artigo 20.º, n.º 1, alínea a) do Código dos Contratos Públicos",,,,,,Não aplicável.,Não aplicável.,FALSE
Convite ao abrigo de acordo-quadro - Serviços especializados no âmbito do SClínico Hospitalar - Lote 5 - Serviços de manutenção de integrações no âmbito do SClínico Hospitalar,Ao abrigo de acordo-quadro (art.º 259.º),Aquisição de serviços,"72500000-0, Serviços relacionados com a informática","SPMS - Serviços Partilhados do Ministério da Saúde, E. P. E. (509540716)","ALTRANPORTUGAL, S. A. (504272179)","39.280,00 €",03-10-2018,06-09-2018,109 dias,Portugal,Artigo 259.º do Código dos Contratos Públicos,,,,,,1423482,CELEBRAÇÃO DE ACORDO QUADRO PARA PRESTAÇÃO DE SERVIÇOS TIC E INTEROPERABILIDADE NA ÁREA DA SAÚDE,FALSE
Convite ao abrigo de acordo-quadro - Serviços especializados no âmbito do SClínico Hospitalar - Lote 4 - Serviços de manutenção corretiva e operações no âmbito do SClínico Hospitalar,Ao abrigo de acordo-quadro (art.º 259.º),Aquisição de serviços,"72500000-0, Serviços relacionados com a informática","SPMS - Serviços Partilhados do Ministério da Saúde, E. P. E. (509540716)","ALTRANPORTUGAL, S. A. (504272179)","59.040,00 €",03-10-2018,06-09-2018,109 dias,Portugal,Artigo 259.º do Código dos Contratos Públicos,,,,,,1423482,CELEBRAÇÃO DE ACORDO QUADRO PARA PRESTAÇÃO DE SERVIÇOS TIC E INTEROPERABILIDADE NA ÁREA DA SAÚDE,FALSE
Convite ao abrigo de acordo-quadro - Serviços especializados no âmbito do SClínico Hospitalar - Lote 2 - Serviços de desenvolvimento aplicacional de perfis e módulos de apoio a programas de saúde no âmbito do SClínico Hospitalar,Ao abrigo de acordo-quadro (art.º 259.º),Aquisição de serviços,"72500000-0, Serviços relacionados com a informática","SPMS - Serviços Partilhados do Ministério da Saúde, E. P. E. (509540716)","ALTRANPORTUGAL, S. A. (504272179)","72.000,00 €",03-10-2018,06-09-2018,109 dias,Portugal,Artigo 259.º do Código dos Contratos Públicos,,,,,,1423482,CELEBRAÇÃO DE ACORDO QUADRO PARA PRESTAÇÃO DE SERVIÇOS TIC E INTEROPERABILIDADE NA ÁREA DA SAÚDE,FALSE
Aquisição de serviços de PAAS de operação e administração de sistemas e alojamento de infraestrutura de hardware em datacenter para a SPMS,Concurso público,Aquisição de serviços,"72514000-1, Serviços de gestão de instalações informáticas","SPMS- Serviços Partilhados do M. da Saúde, E.P.E. (509540716)","Claranet Portugal, S.A (503412031)","73.980,00 €",03-10-2018,07-09-2018,180 dias,Portugal,"Artigo 20.º, n.º 1, alínea b) do Código dos Contratos Públicos",,,,,,Não aplicável.,Não aplicável.,FALSE
Serviços de apoio e operação para os Serviços Partilhados Financeiros,Concurso público,Aquisição de serviços,"79420000-4, Serviços relacionados com a gestão","SPMS- Serviços Partilhados do M. da Saúde, E.P.E. (509540716)",Daily Spin  (509697887),"195.860,00 €",03-10-2018,05-09-2018,116 dias,Portugal,"Artigo 20.º, n.º 1, alínea b) do Código dos Contratos Públicos",,,,,,Não aplicável.,Não aplicável.,FALSE
Serviços para desenvolvimento evolutivo do Sistema de Informação Geográfica em Saúde,Concurso público,Aquisição de serviços,"72500000-0, Serviços relacionados com a informática","SPMS- Serviços Partilhados do M. da Saúde, E.P.E. (509540716)",GeoSense (506434931),"76.496,64 €",03-10-2018,28-08-2018,365 dias,Portugal,"Artigo 20.º, n.º 1, alínea b) do Código dos Contratos Públicos",,,,,,Não aplicável.,Não aplicável.,FALSE
Convite ao abrigo de acordo-quadro - Serviços especializados no âmbito do SClínico Hospitalar - Lote 1 - Serviços de desenvolvimento de integrações e apoio à equipa de interoperabilidade no âmbito do SClínico Hospitalar,Ao abrigo de acordo-quadro (art.º 259.º),Aquisição de serviços,"72500000-0, Serviços relacionados com a informática","SPMS - Serviços Partilhados do Ministério da Saúde, E. P. E. (509540716)","ALTRANPORTUGAL, S. A. (504272179)","75.240,00 €",03-10-2018,06-09-2018,109 dias,Portugal,Artigo 259.º do Código dos Contratos Públicos,,,,,,1423482,CELEBRAÇÃO DE ACORDO QUADRO PARA PRESTAÇÃO DE SERVIÇOS TIC E INTEROPERABILIDADE NA ÁREA DA SAÚDE,FALSE
Serviços de manutenção e suporte da plataforma de autenticação e gestão de identidades do SNS,Concurso público,Aquisição de serviços,"72500000-0, Serviços relacionados com a informática","SPMS- Serviços Partilhados do M. da Saúde, E.P.E. (509540716)","Cloudcomputing.pt, Lda. (509381219)","76.321,60 €",02-10-2018,07-09-2018,365 dias,Portugal,"Artigo 20.º, n.º 1, alínea a) do Código dos Contratos Públicos",,,,,,Não aplicável.,Não aplicável.,FALSE
Convite ao abrigo de acordo-quadro - Serviços de testing para o projeto exames sem papel,Ao abrigo de acordo-quadro (art.º 259.º),Aquisição de serviços,"72500000-0, Serviços relacionados com a informática","SPMS - Serviços Partilhados do Ministério da Saúde, E. P. E. (509540716)","Altranportugal, S.A. (504272179)","47.937,28 €",02-10-2018,29-08-2018,117 dias,Portugal,Artigo 259.º do Código dos Contratos Públicos,,,,,,1423482,CELEBRAÇÃO DE ACORDO QUADRO PARA PRESTAÇÃO DE SERVIÇOS TIC E INTEROPERABILIDADE NA ÁREA DA SAÚDE,FALSE
Serviços de gestão de projeto para o Projeto dos Rastreios,Ajuste Direto Regime Geral,Aquisição de serviços,"72500000-0, Serviços relacionados com a informática","SPMS- Serviços Partilhados do M. da Saúde, E.P.E. (509540716)",Guiatel - Serviços de Telecomunicações SA (505368102),"19.488,00 €",02-10-2018,14-09-2018,180 dias,Portugal,"Artigo 20.º, n.º 1, alínea d) do Código dos Contratos Públicos",,,,,,Não aplicável.,Não aplicável.,FALSE
Aquisição de espaço expositivo na Conferência Websummit,Ajuste Direto Regime Geral,Aquisição de bens móveis,"39154100-7, Stands de exposição","SPMS - Serviços Partilhados do Ministério da Saúde, E. P. E. (509540716)","Connected Intelligence, Ltd. (IE3240796QH)","75.000,00 €",02-10-2018,13-09-2018,55 dias,Portugal,"Artigo 24.º, n.º 1, alínea e), subalínea iii) do Código dos Contratos Públicos",,,,,,Não aplicável.,Não aplicável.,FALSE
Aquisição de licenciamento Power BI Premium e serviços conexos para a SPMS,Concurso público,Aquisição de bens móveis,"48100000-9, Pacote de software para sectores específicos","SPMS- Serviços Partilhados do M. da Saúde, E.P.E. (509540716)","Iten Solutions - Sistemas de Informação, SA (510728189)","176.518,32 €",01-10-2018,20-06-2018,486 dias,Portugal,"Artigo 20.º, n.º 1, alínea a) do Código dos Contratos Públicos",,,,,,Não aplicável.,Não aplicável.,FALSE
