Objeto do Contrato,Tipo de Procedimento,Tipo(s) de Contrato,CPVs,Entidade(s) Adjudicante(s),Entidade(s) Adjudicatária(s),Preço Contratual,Data de Publicação,Data de Celebração do Contrato,Prazo de Execução,Local de Execução,Fundamentação,Data de Fecho do Contrato,Preço Total Efetivo,Causas das Alterações ao Prazo,Causas das Alterações ao Preço,Estado,N.º registo do Acordo Quadro,Descrição do Acordo Quadro,Procedimento Centralizado
"Prestação de Serviços Médicos na área da Triagem Geral, (horas) 37000217",Ajuste Direto Regime Geral,Aquisição de serviços,"85100000-0, Serviços de saúde","Centro Hospitalar do Médio Tejo, E. P. E. (506361608)","GENIUMSANA, SERVIÇOS MEDICOS E ENGENHARIA, LDA (510174892)","31.000,00 €",20-06-2017,16-12-2016,365 dias,"Portugal, Santarém, Torres Novas","Artigo 20.º, n.º 1, alínea a) do Código dos Contratos Públicos",,,,,,Não aplicável.,Não aplicável.,FALSE
Prestação de Serviços Médicos na Área da Triagem Geral - 37008416 (horas - 01/03 a 02/04/2016),Ajuste Direto Regime Geral,Aquisição de serviços,"85100000-0, Serviços de saúde","Centro Hospitalar do Médio Tejo, E. P. E. (506361608)","GENIUMSANA- SERVIÇOS MÉDICOS E ENGENHARIA, LDA (510174892)","78.750,00 €",06-10-2016,14-07-2016,30 dias,"Portugal, Santarém, Torres Novas","Artigo 24.º, n.º 1, alínea c) do Código dos Contratos Públicos",,,,,,Não aplicável.,Não aplicável.,FALSE
PRESTAÇAO DE SERVIÇOS MEDICOS-IMUNOHEMOTERAPIA- 37008816 (horas),Ajuste Direto Regime Geral,Aquisição de serviços,"85100000-0, Serviços de saúde","Centro Hospitalar do Médio Tejo, E. P. E. (506361608)","GENIUMSANA-SERVIÇOS MEDICOS E ENGENHARIA, LDA (510174892)","35.200,00 €",16-08-2016,16-05-2016,240 dias,"Portugal, Santarém, Torres Novas","Artigo 20.º, n.º 1, alínea a) do Código dos Contratos Públicos",,,,,,Não aplicável.,Não aplicável.,FALSE
Serviços Médicos de Imagiologia,Ajuste Direto Regime Geral,Aquisição de serviços,"85100000-0, Serviços de saúde","Centro Hospitalar do Médio Tejo, E. P. E. (506361608)","Geniumsana - Serviços Médicos e Engenharia, Lda (510174892)","9.640,00 €",22-04-2016,14-04-2016,31 dias,"Portugal, Santarém, Torres Novas","Artigo 20.º, n.º 1, alínea a) do Código dos Contratos Públicos",,,,,,Não aplicável.,Não aplicável.,FALSE
Contrato de aquisição de serviços médicos para a Triagem Geral da Unidade de Abrantes e de Tomar,Ajuste Direto Regime Geral,Aquisição de serviços,"85100000-0, Serviços de saúde","Centro Hospitalar do Médio Tejo, E.P.E. (CHMT) (506361608)","Geniumsana - Serviços Médicos e Engenharia, Lda. (510174892)","146.000,00 €",04-03-2016,05-02-2016,60 dias,"Portugal, Santarém, Abrantes<BR/>Portugal, Santarém, Tomar","Artigo 24.º, n.º 1, alínea c) do Código dos Contratos Públicos",,,,,,Não aplicável.,Não aplicável.,FALSE
Aquisição de Serviços Médicos para 2016 - Triagem Geral para a Unidade de Abrantes e de Tomar,Ajuste Direto Regime Geral,Aquisição de serviços,"85100000-0, Serviços de saúde","Centro Hospitalar do Médio Tejo, E.P.E. (CHMT) (506361608)","Geniumsana - Serviços Médicos e Engenharia, Lda. (510174892)","876.000,00 €",04-03-2016,18-02-2016,365 dias,"Portugal, Santarém, Tomar<BR/>Portugal, Santarém, Abrantes","Artigo 27.º, n.º 1, alínea a) do Código dos Contratos Públicos",,,,,,Não aplicável.,Não aplicável.,FALSE
