Objeto do Contrato,Tipo de Procedimento,Tipo(s) de Contrato,CPVs,Entidade(s) Adjudicante(s),Entidade(s) Adjudicatária(s),Preço Contratual,Data de Publicação,Data de Celebração do Contrato,Prazo de Execução,Local de Execução,Fundamentação,Data de Fecho do Contrato,Preço Total Efetivo,Causas das Alterações ao Prazo,Causas das Alterações ao Preço,Estado,N.º registo do Acordo Quadro,Descrição do Acordo Quadro,Procedimento Centralizado
Serviços Médicos Ginecologia/Obstetrícia,Ajuste Direto Regime Geral,Aquisição de serviços,"85121210-8, Serviços de ginecologia ou obstetrícia","Centro Hospitalar do Algarve, E. P. E. (510745997)","Sucesso 24 Horas, Sa (507328310)","69.840,00 €",21-11-2014,20-10-2014,180 dias,"Portugal, Faro, Faro<BR/>Portugal, Faro, Portimão","Artigo 20.º, n.º 1, alínea a) do Código dos Contratos Públicos",31-12-2014,"68.340,00 €",,"O valor inicial do Contrato teve por base as necessidades estimadas para o período de 1 Janeiro de 2014 a 30 Junho de 2014, o valor final reflecte as necessidades efectivas.",,Não aplicável.,Não aplicável.,FALSE
Material Materno-Infantil,Concurso público,Aquisição de bens móveis,"33140000-3, Material médico de consumo","Centro Hospitalar do Algarve, E. P. E. (510745997)","HR  HOSPITALAR, LDA (501895558), ENDOTÉCNICA - Soluções Hospitalares  (503818348), VYGON (PORTUGAL),LDA. (503232785), SARSTEDT TECNOL.DE LABORATORIO, LDA (503019461), MUNDINTER,S.A. (500199906), 3M Portugal, Lda. (500193940), AVIQUIMICA IMPORT E MANUFATURA (500039720), JOHNSON & JOHNSON PROD.PROF. (500153370), SPECULUM-ARTIGOS MEDICOS,S.A (502996323), COVIDIEN PORTUGAL - PRODUTOS  DE SAUDE, UNIPESSOAL, LDA. (503413410), B. BRAUN MEDICAL,LDA. (501506543), INTERSURGICAL PORTUGAL,LDA. (503480045), BASTOS VIEGAS,SA (500042772), FILSAT EQUIPAMENTOS MÉDICO-CIENTIFICOS, LDA (506708616), PAUL HARTMANN, LDA. (502271728), BACELAR EQUIPAMENTOS MEDICOS (500532818)","38.543,23 €",20-11-2014,28-10-2014,60 dias,"Portugal, Faro, Portimão<BR/>Portugal, Faro, Faro<BR/>Portugal, Faro, Lagos","Artigo 20.º, n.º 1, alínea b) do Código dos Contratos Públicos","","",,"",,Não aplicável.,Não aplicável.,FALSE
74283414 - Diverso Material Hoteleiro,Ajuste Direto Regime Geral,Aquisição de bens móveis,"44410000-7, Artigos para casa-de-banho e cozinha","Centro Hospitalar do Algarve, E. P. E. (510745997)","JBSHIGI, Lda. (513110461)","63,06 €",19-11-2014,11-09-2014,105 dias,"Portugal, Faro, Faro<BR/>Portugal, Faro, Portimão<BR/>Portugal, Faro, Lagos","Artigo 20.º, n.º 1, alínea a) do Código dos Contratos Públicos","","",,"",,Não aplicável.,Não aplicável.,FALSE
74283414 - Diverso Material Hoteleiro,Ajuste Direto Regime Geral,Aquisição de bens móveis,"44423000-1, Artigos diversos","Centro Hospitalar do Algarve, E. P. E. (510745997)",COMERCIAL FERROLAR (137452373),"87,81 €",19-11-2014,11-09-2014,105 dias,"Portugal, Faro, Faro<BR/>Portugal, Faro, Lagos<BR/>Portugal, Faro, Portimão","Artigo 20.º, n.º 1, alínea a) do Código dos Contratos Públicos","","",,"",,Não aplicável.,Não aplicável.,FALSE
Processo  71/3197/2014 - Gasemetrias,Ajuste Direto Regime Geral,Aquisição de bens móveis,"33696000-5, Reagentes e meios de contraste","Centro Hospitalar do Algarve, E. P. E. (510745997)",Radiometer (980201667),"6.837,81 €",15-11-2014,08-10-2014,30 dias,"Portugal, Faro, Faro","Artigo 20.º, n.º 1, alínea a) do Código dos Contratos Públicos",08-10-2014,"6.837,81 €",,"",,Não aplicável.,Não aplicável.,FALSE
Processo  71/3318/2014 - Reagentes hemoculturas,Ajuste Direto Regime Geral,Aquisição de bens móveis,"33696000-5, Reagentes e meios de contraste","Centro Hospitalar do Algarve, E. P. E. (510745997)",Biomerieux (501524177),"8.880,00 €",15-11-2014,15-10-2014,30 dias,"Portugal, Faro, Faro","Artigo 20.º, n.º 1, alínea a) do Código dos Contratos Públicos",15-10-2014,"8.880,00 €",,"",,Não aplicável.,Não aplicável.,FALSE
Processo  61/3272/2014 - Piridoxina,Ajuste Direto Regime Geral,Aquisição de bens móveis,"33690000-3, Medicamentos vários","Centro Hospitalar do Algarve, E. P. E. (510745997)",Labesfal (501169580),"1.475,52 €",15-11-2014,21-10-2014,90 dias,"Portugal, Faro, Faro","Artigo 24.º, n.º 1, alínea e) do Código dos Contratos Públicos",21-10-2014,"1.475,52 €",,"",,Não aplicável.,Não aplicável.,FALSE
Processo  61/3249/2014 - Octreotido,Ajuste Direto Regime Geral,Aquisição de bens móveis,"33690000-3, Medicamentos vários","Centro Hospitalar do Algarve, E. P. E. (510745997)",Novartis (500063524),"6.349,02 €",15-11-2014,08-10-2014,90 dias,"Portugal, Faro, Faro","Artigo 24.º, n.º 1, alínea e) do Código dos Contratos Públicos",08-10-2014,"6.349,02 €",,"",,Não aplicável.,Não aplicável.,FALSE
Processo  71/3240/2014 - Reagentes Hematologia,Ajuste Direto Regime Geral,Aquisição de bens móveis,"33696000-5, Reagentes e meios de contraste","Centro Hospitalar do Algarve, E. P. E. (510745997)",Beckman coulter (509035167),"9.713,65 €",15-11-2014,21-10-2014,30 dias,"Portugal, Faro, Faro","Artigo 20.º, n.º 1, alínea a) do Código dos Contratos Públicos",21-10-2014,"9.713,65 €",,"",,Não aplicável.,Não aplicável.,FALSE
Processo  31/3216/2014 - Noradrenalina,Ao abrigo de acordo-quadro (art.º 258.º),Aquisição de bens móveis,"33690000-3, Medicamentos vários","Centro Hospitalar do Algarve, E. P. E. (510745997)",Labesfal (501169580),"266,19 €",15-11-2014,13-10-2014,90 dias,"Portugal, Faro, Faro","Artigo 26.º, n.º 1, alínea e) do Código dos Contratos Públicos",13-10-2014,"266,19 €",,"",,513025,"CONCURSO PÚBLICO PARA A CELEBRAÇÃO DE CONTRATOS PÚBLICOS DE APROVISIONAMENTO PARA A ÁREA DA SAÚDE, COM VISTA AO FORNECIMENTO DE MEDICAMENTOS DE CONSUMO GERAL  (FFOSI)- APARELHO CARDIOVASCULAR., ÀS INSTITUIÇÕES E SERVIÇOS DO SERVIÇO NACIONAL DE SAÚDE",FALSE
Processo  31/2867/2014 - Pemetrexedo 500 mg,Ao abrigo de acordo-quadro (art.º 258.º),Locação de bens móveis,"33690000-3, Medicamentos vários","Centro Hospitalar do Algarve, E. P. E. (510745997)",Lilly (500165602),"263.871,00 €",15-11-2014,21-10-2014,120 dias,"Portugal, Faro, Faro","Artigo 26.º, n.º 1, alínea e) do Código dos Contratos Públicos",21-10-2014,"263.871,00 €",,"",,1119467,"CONCURSO PÚBLICO PARA A CELEBRAÇÃO DE CONTRATOS PÚBLICOS DE APROVISIONAMENTO PARA A ÁREA DA SAÚDE, COM VISTA AO FORNECIMENTO DE MEDICAMENTOS DO FORO ONCOLÓGICO, ÀS INSTITUIÇÕES E SERVIÇOS DO SERVIÇO NACIONAL DE SAÚDE",FALSE
Processo  31/3220/2014 - Doxurrubicina e ustecinumab,Ao abrigo de acordo-quadro (art.º 258.º),Locação de bens móveis,"33690000-3, Medicamentos vários","Centro Hospitalar do Algarve, E. P. E. (510745997)",Janssen cilag (500189412),"87.071,32 €",15-11-2014,13-10-2014,90 dias,"Portugal, Faro, Faro","Artigo 26.º, n.º 1, alínea e) do Código dos Contratos Públicos",13-10-2014,"87.071,32 €",,"",,1119467,"CONCURSO PÚBLICO PARA A CELEBRAÇÃO DE CONTRATOS PÚBLICOS DE APROVISIONAMENTO PARA A ÁREA DA SAÚDE, COM VISTA AO FORNECIMENTO DE MEDICAMENTOS DO FORO ONCOLÓGICO, ÀS INSTITUIÇÕES E SERVIÇOS DO SERVIÇO NACIONAL DE SAÚDE",FALSE
Processo  31/3218/2014 - Fibrinogenio Humano,Ao abrigo de acordo-quadro (art.º 258.º),Aquisição de bens móveis,"33690000-3, Medicamentos vários","Centro Hospitalar do Algarve, E. P. E. (510745997)",Takeda (502801204),"2.800,00 €",15-11-2014,13-10-2014,90 dias,"Portugal, Faro, Faro","Artigo 26.º, n.º 1, alínea e) do Código dos Contratos Públicos",13-10-2014,"2.800,00 €",,"",,535788,"CONCURSO PÚBLICO PARA A CELEBRAÇÃO DE CONTRATOSPÚBLICOS DE APROVISIONAMENTO PARA A ÁREA DA SAÚDE, COM VISTA AO FORNECIMENTO DE DERIVADOS DO PLASMA HUMANOÀS INSTITUIÇÕES E SERVIÇOS DO SERVIÇO NACIONAL DE SAÚDE",FALSE
Processo  31/3219/2014 - Lenezolida 600 mg,Ao abrigo de acordo-quadro (art.º 258.º),Aquisição de bens móveis,"33690000-3, Medicamentos vários","Centro Hospitalar do Algarve, E. P. E. (510745997)",Lab.Pfizer (500162166),"46.191,20 €",15-11-2014,13-10-2014,90 dias,"Portugal, Faro, Faro","Artigo 26.º, n.º 1, alínea e) do Código dos Contratos Públicos",13-10-2014,"46.191,20 €",,"",,611389,"CONCURSO PÚBLICO PARA A CELEBRAÇÃO DE CONTRATOS PÚBLICOS DE APROVISIONAMENTO PARA A ÁREA DA SAÚDE, COM VISTA AO FORNECIMENTO DE MEDICAMENTOS ANTI-INFECIOSOS: EXCETO ANTIVÍRICOS E ANTIFÚNGICOS, ÀS INSTITUIÇÕES E SERVIÇOS DO SERVIÇO NACIONAL DE SAÚDE",FALSE
Processo  31/3237/2014 - Everolimus 5 mg,Ao abrigo de acordo-quadro (art.º 258.º),Locação de bens móveis,"33690000-3, Medicamentos vários","Centro Hospitalar do Algarve, E. P. E. (510745997)",Novartis (500063524),"6.850,02 €",15-11-2014,21-10-2014,90 dias,"Portugal, Faro, Faro","Artigo 26.º, n.º 1, alínea e) do Código dos Contratos Públicos",21-10-2014,"6.850,02 €",,"",,1119467,"CONCURSO PÚBLICO PARA A CELEBRAÇÃO DE CONTRATOS PÚBLICOS DE APROVISIONAMENTO PARA A ÁREA DA SAÚDE, COM VISTA AO FORNECIMENTO DE MEDICAMENTOS DO FORO ONCOLÓGICO, ÀS INSTITUIÇÕES E SERVIÇOS DO SERVIÇO NACIONAL DE SAÚDE",FALSE
Processo n.º 31/1657/2014,Ao abrigo de acordo-quadro (art.º 258.º),Aquisição de bens móveis,"33690000-3, Medicamentos vários","Centro Hospitalar do Algarve, E. P. E. (510745997)",sanofi (500134960),"1.164.291,84 €",14-11-2014,24-04-2014,180 dias,"Portugal, Faro, Faro","Artigo 26.º, n.º 1, alínea e) do Código dos Contratos Públicos",24-04-2014,"1.164.291,84 €",,"",,602067,"ONCURSO PÚBLICO PARA A CELEBRAÇÃO DE CONTRATOS PÚBLICOS DE APROVISIONAMENTO PARA A ÁREA DA SAÚDE, COM VISTA AO FORNECIMENTO DE MEDICAMENTOS DE CONSUMO GERAL - MEDICAÇÃO ANTIALÉRGICA, MEDICAMENTOS USADOS NO TRATAMENTO DE INTOXICAÇÕES, VITAMINAS E SAIS MINERAIS  E GRUPO 20.9 - OUTROS PRODUTOS, ÀS INSTITUIÇÕES E SERVIÇOS DO SERVIÇO NACIONAL DE SAÚDE",FALSE
Processo n.º 31/2557/2014,Ao abrigo de acordo-quadro (art.º 258.º),Aquisição de bens móveis,"33690000-3, Medicamentos vários","Centro Hospitalar do Algarve, E. P. E. (510745997)",gilead (503604704),"269.158,05 €",14-11-2014,24-07-2014,30 dias,"Portugal, Faro, Faro","Artigo 26.º, n.º 1, alínea e) do Código dos Contratos Públicos",24-07-2014,"269.158,05 €",,"",,1120578,"CONCURSO PÚBLICO PARA A CELEBRAÇÃO DE CONTRATOS PÚBLICOS DE APROVISIONAMENTO PARA A ÁREA DA SAÚDE, COM VISTA AO FORNECIMENTO DE MEDICAMENTOS ANTI-RETROVIRAIS, ÀS INSTITUIÇÕES E SERVIÇOS DO SERVIÇO NACIONAL DE SAÚDE  ",FALSE
Processo n.º 31/2199/2014,Ao abrigo de acordo-quadro (art.º 258.º),Aquisição de bens móveis,"33690000-3, Medicamentos vários","Centro Hospitalar do Algarve, E. P. E. (510745997)",gilead (503604704),"3.249.971,84 €",14-11-2014,04-07-2014,180 dias,"Portugal, Faro, Faro","Artigo 26.º, n.º 1, alínea e) do Código dos Contratos Públicos",04-07-2014,"3.249.971,84 €",,"",,1120578,"CONCURSO PÚBLICO PARA A CELEBRAÇÃO DE CONTRATOS PÚBLICOS DE APROVISIONAMENTO PARA A ÁREA DA SAÚDE, COM VISTA AO FORNECIMENTO DE MEDICAMENTOS ANTI-RETROVIRAIS, ÀS INSTITUIÇÕES E SERVIÇOS DO SERVIÇO NACIONAL DE SAÚDE  ",FALSE
75/3445/14  - Material Administrativo,Ajuste Direto Regime Geral,Aquisição de bens móveis,"30192000-1, Material de escritório","Centro Hospitalar do Algarve, E. P. E. (510745997)",FARCOPIA (501077227),"201,94 €",13-11-2014,06-11-2014,55 dias,"Portugal, Faro, Lagos<BR/>Portugal, Faro, Faro<BR/>Portugal, Faro, Portimão","Artigo 20.º, n.º 1, alínea a) do Código dos Contratos Públicos","","",,"",,Não aplicável.,Não aplicável.,FALSE
75/3445/14  - Material Administrativo,Ajuste Direto Regime Geral,Aquisição de bens móveis,"30192000-1, Material de escritório","Centro Hospitalar do Algarve, E. P. E. (510745997)",OLMAR.FERNADO G.OLIVEIRA & CA. (500440263),"30,00 €",13-11-2014,06-11-2014,55 dias,"Portugal, Faro, Faro<BR/>Portugal, Faro, Lagos<BR/>Portugal, Faro, Portimão","Artigo 20.º, n.º 1, alínea a) do Código dos Contratos Públicos","","",,"",,Não aplicável.,Não aplicável.,FALSE
76/3396/2014 - Material de Conservação,Ajuste Direto Regime Geral,Aquisição de bens móveis,"44423000-1, Artigos diversos","Centro Hospitalar do Algarve, E. P. E. (510745997)","ULTRAPOSTA - STAND PECAS ACESSORIOS UNIPESSOAL, LDA (509697135)","65,00 €",13-11-2014,28-10-2014,15 dias,"Portugal, Faro, Portimão<BR/>Portugal, Faro, Lagos<BR/>Portugal, Faro, Faro","Artigo 20.º, n.º 1, alínea a) do Código dos Contratos Públicos","","",,"",,Não aplicável.,Não aplicável.,FALSE
76/3396/2014 - Material de Conservação,Ajuste Direto Regime Geral,Aquisição de bens móveis,"31440000-2, Baterias","Centro Hospitalar do Algarve, E. P. E. (510745997)","PHYSIO PORTUGALSALES,UNIPESSOAL, LDA. (510137946)","2.590,00 €",13-11-2014,28-10-2014,15 dias,"Portugal, Faro, Faro<BR/>Portugal, Faro, Portimão<BR/>Portugal, Faro, Lagos","Artigo 20.º, n.º 1, alínea a) do Código dos Contratos Públicos","","",,"",,Não aplicável.,Não aplicável.,FALSE
75/3224/14 - Material Administrativo,Ajuste Direto Regime Geral,Aquisição de bens móveis,"30000000-9, Máquinas, equipamento e material de escritório e de informática, excepto mobiliário e pacotes de programas (software)","Centro Hospitalar do Algarve, E. P. E. (510745997)","XESEQUIPA, LDA (502787392)","512,49 €",13-11-2014,21-10-2014,72 dias,"Portugal, Faro, Portimão<BR/>Portugal, Faro, Faro<BR/>Portugal, Faro, Lagos","Artigo 20.º, n.º 1, alínea a) do Código dos Contratos Públicos","","",,"",,Não aplicável.,Não aplicável.,FALSE
75/3224/14 - Material Administrativo,Ajuste Direto Regime Geral,Aquisição de bens móveis,"30000000-9, Máquinas, equipamento e material de escritório e de informática, excepto mobiliário e pacotes de programas (software)","Centro Hospitalar do Algarve, E. P. E. (510745997)",PAPELARIA E LIVRARIA SAGRES (501212973),"264,77 €",13-11-2014,21-10-2014,72 dias,"Portugal, Faro, Portimão<BR/>Portugal, Faro, Lagos<BR/>Portugal, Faro, Faro","Artigo 20.º, n.º 1, alínea a) do Código dos Contratos Públicos","","",,"",,Não aplicável.,Não aplicável.,FALSE
75/3224/14 - Material Administrativo,Ajuste Direto Regime Geral,Aquisição de bens móveis,"30000000-9, Máquinas, equipamento e material de escritório e de informática, excepto mobiliário e pacotes de programas (software)","Centro Hospitalar do Algarve, E. P. E. (510745997)",OLMAR.FERNADO G.OLIVEIRA & CA. (500440263),"28,21 €",13-11-2014,21-10-2014,72 dias,"Portugal, Faro, Portimão<BR/>Portugal, Faro, Lagos<BR/>Portugal, Faro, Faro","Artigo 20.º, n.º 1, alínea a) do Código dos Contratos Públicos","","",,"",,Não aplicável.,Não aplicável.,FALSE
75/3224/14 - Material Administrativo,Ajuste Direto Regime Geral,Aquisição de bens móveis,"30000000-9, Máquinas, equipamento e material de escritório e de informática, excepto mobiliário e pacotes de programas (software)","Centro Hospitalar do Algarve, E. P. E. (510745997)","PRN INFORMÁTICA, LDA (504100327)","502,00 €",13-11-2014,21-10-2014,72 dias,"Portugal, Faro, Lagos<BR/>Portugal, Faro, Faro<BR/>Portugal, Faro, Portimão","Artigo 20.º, n.º 1, alínea a) do Código dos Contratos Públicos","","",,"",,Não aplicável.,Não aplicável.,FALSE
Monitor Desfibrilhador ( 77/3292/14),Ajuste Direto Regime Geral,Aquisição de bens móveis,"33100000-1, Equipamento médico","Centro Hospitalar do Algarve, E. P. E. (510745997)",Dimorasept  (510258786),"7.125,00 €",13-11-2014,20-10-2014,30 dias,"Portugal, Faro, Faro","Artigo 20.º, n.º 1, alínea a) do Código dos Contratos Públicos","","",,"",,Não aplicável.,Não aplicável.,FALSE
Maquina Misturas ( 773425/14),Ajuste Direto Regime Geral,Aquisição de bens móveis,"33100000-1, Equipamento médico","Centro Hospitalar do Algarve, E. P. E. (510745997)",B.Braun Medical Lda  (501506543),"6.300,00 €",13-11-2014,07-11-2014,10 dias,"Portugal, Faro, Faro","Artigo 20.º, n.º 1, alínea a) do Código dos Contratos Públicos","","",,"",,Não aplicável.,Não aplicável.,FALSE
Equipa Oftalmologia ( 77/3312/14 ),Ajuste Direto Regime Geral,Aquisição de bens móveis,"33100000-1, Equipamento médico","Centro Hospitalar do Algarve, E. P. E. (510745997)",Grupo Taper  (506886336),"13.472,39 €",13-11-2014,22-10-2014,30 dias,"Portugal, Faro, Faro","Artigo 20.º, n.º 1, alínea a) do Código dos Contratos Públicos","","",,"",,Não aplicável.,Não aplicável.,FALSE
Ventiladores ( 77325114),Ajuste Direto Regime Geral,Aquisição de bens móveis,"33100000-1, Equipamento médico","Centro Hospitalar do Algarve, E. P. E. (510745997)",Pulmocor  (501402578),"35.250,00 €",13-11-2014,04-11-2014,10 dias,"Portugal, Faro, Faro","Artigo 20.º, n.º 1, alínea a) do Código dos Contratos Públicos","","",,"",,Não aplicável.,Não aplicável.,FALSE
Produtos Quimicos,Ajuste Direto Regime Geral,Aquisição de bens móveis,"24000000-4, Produtos químicos","Centro Hospitalar do Algarve, E. P. E. (510745997)","Watercare, Tratamento de Águas, Lda. (506550672)","522,00 €",11-11-2014,06-02-2014,330 dias,"Portugal, Faro, Lagos<BR/>Portugal, Faro, Faro<BR/>Portugal, Faro, Portimão","Artigo 20.º, n.º 1, alínea a) do Código dos Contratos Públicos","","",,"",,Não aplicável.,Não aplicável.,FALSE
Produtos Quimicos,Ajuste Direto Regime Geral,Aquisição de bens móveis,"24000000-4, Produtos químicos","Centro Hospitalar do Algarve, E. P. E. (510745997)","PETROLUSA, LDA. (500396264)","2.910,00 €",11-11-2014,06-02-2014,330 dias,"Portugal, Faro, Portimão<BR/>Portugal, Faro, Faro","Artigo 20.º, n.º 1, alínea a) do Código dos Contratos Públicos","","",,"",,Não aplicável.,Não aplicável.,FALSE
Produtos Quimicos,Ajuste Direto Regime Geral,Aquisição de bens móveis,"24000000-4, Produtos químicos","Centro Hospitalar do Algarve, E. P. E. (510745997)",ENKROTT GESTAO TRATAM.AGUAS S. (500103461),"1.512,00 €",11-11-2014,06-02-2014,330 dias,"Portugal, Faro, Portimão<BR/>Portugal, Faro, Lagos<BR/>Portugal, Faro, Faro","Artigo 20.º, n.º 1, alínea a) do Código dos Contratos Públicos","","",,"",,Não aplicável.,Não aplicável.,FALSE
Produtos Quimicos,Ajuste Direto Regime Geral,Aquisição de bens móveis,"24000000-4, Produtos químicos","Centro Hospitalar do Algarve, E. P. E. (510745997)","HANNA INSTRUMENTS PORTUGAL, LDA. (502540141)","558,00 €",11-11-2014,06-02-2014,330 dias,"Portugal, Faro, Faro<BR/>Portugal, Faro, Portimão<BR/>Portugal, Faro, Lagos","Artigo 20.º, n.º 1, alínea a) do Código dos Contratos Públicos","","",,"",,Não aplicável.,Não aplicável.,FALSE
67/3276/14 - Reparação de Pinça de Calculos Ureterais e de Condutor de Luz,Ajuste Direto Regime Geral,Aquisição de serviços,"50421000-2, Serviços de reparação e manutenção de equipamento médico","Centro Hospitalar do Algarve, E. P. E. (510745997)","TEPREL-EQUIPAMENTOS MEDICOS, LDA. (502262184)","661,05 €",11-11-2014,10-10-2014,30 dias,"Portugal, Faro, Faro<BR/>Portugal, Faro, Portimão","Artigo 20.º, n.º 1, alínea a) do Código dos Contratos Públicos","","",,"",,Não aplicável.,Não aplicável.,FALSE
Serviços médicos de Anestesiologia,Ajuste Direto Regime Geral,Aquisição de serviços,"85121200-5, Serviços de medicina especializada","Centro Hospitalar do Algarve, E. P. E. (510745997)","Sonho Branco, Lda (508663342)","17.280,00 €",11-11-2014,03-11-2014,90 dias,"Portugal, Faro, Faro<BR/>Portugal, Faro, Portimão","Artigo 20.º, n.º 1, alínea a) do Código dos Contratos Públicos",31-12-2014,"12.960,00 €",,"O valor inicial do Contrato teve por base as necessidades estimadas para o período de 1 Outubro de 2014 a 31 Dezembro de 2014, o valor final reflecte as necessidades efectivas.",,Não aplicável.,Não aplicável.,FALSE
