freguesia,acronym,validVotesPercentage,votes,dicofre
União das freguesias de Santa Eufémia e Boa Vista,PPD/PSD.CDS-PP,64.28,781,100939
União das freguesias de Santa Eufémia e Boa Vista,PS,13.91,169,100939
União das freguesias de Santa Eufémia e Boa Vista,MPT,5.1,62,100939
União das freguesias de Santa Eufémia e Boa Vista,B.E.,3.54,43,100939
União das freguesias de Santa Eufémia e Boa Vista,PCP-PEV,3.54,43,100939
União das freguesias de Santa Eufémia e Boa Vista,PAN,2.39,29,100939
União das freguesias de Santa Eufémia e Boa Vista,L,2.3,28,100939
União das freguesias de Santa Eufémia e Boa Vista,PND,1.4,17,100939
União das freguesias de Santa Eufémia e Boa Vista,PPV,1.15,14,100939
União das freguesias de Santa Eufémia e Boa Vista,PPM,0.66,8,100939
União das freguesias de Santa Eufémia e Boa Vista,PNR,0.58,7,100939
União das freguesias de Santa Eufémia e Boa Vista,PCTP/MRPP,0.49,6,100939
União das freguesias de Santa Eufémia e Boa Vista,PTP,0.25,3,100939
União das freguesias de Santa Eufémia e Boa Vista,MAS,0.16,2,100939
União das freguesias de Santa Eufémia e Boa Vista,PDA,0.16,2,100939
União das freguesias de Santa Eufémia e Boa Vista,POUS,0.08,1,100939
