Objeto do Contrato,Tipo de Procedimento,Tipo(s) de Contrato,CPVs,Entidade(s) Adjudicante(s),Entidade(s) Adjudicatária(s),Preço Contratual,Data de Publicação,Data de Celebração do Contrato,Prazo de Execução,Local de Execução,Fundamentação,Data de Fecho do Contrato,Preço Total Efetivo,Causas das Alterações ao Prazo,Causas das Alterações ao Preço,Estado,N.º registo do Acordo Quadro,Descrição do Acordo Quadro,Procedimento Centralizado
Regularização de agrafador endosc.,Ajuste Direto Regime Geral,Aquisição de bens móveis,"33140000-3, Material médico de consumo","Centro Hospitalar Lisboa Norte, E. P. E. (508481287)",COVIDIEN PORTUGAL  (504223933),"13.860,00 €",21-09-2017,21-09-2017,1 dias,"Portugal, Lisboa, Lisboa","Artigo 20.º, n.º 1, alínea a) do Código dos Contratos Públicos",,,,,,Não aplicável.,Não aplicável.,FALSE
Aquisição de eletrodos bipolares,Ajuste Direto Regime Geral,Aquisição de bens móveis,"33190000-8, Dispositivos e produtos médicos variados","Centro Hospitalar Lisboa Norte, E. P. E. (508481287)",JOHNSON & JOHNSON (500153370),"9.367,20 €",21-09-2017,21-09-2017,1 dias,"Portugal, Lisboa, Lisboa","Artigo 20.º, n.º 1, alínea a) do Código dos Contratos Públicos",,,,,,Não aplicável.,Não aplicável.,FALSE
Aquisição de rapid point 500 cassete medida 400 T,Ajuste Direto Regime Geral,Aquisição de bens móveis,"33696000-5, Reagentes e meios de contraste","Centro Hospitalar Lisboa Norte, E. P. E. (508481287)","SIEMENS HEALTHCARE DIAGNOSTICS, LDA (507925173)","9.503,36 €",21-09-2017,21-09-2017,1 dias,"Portugal, Lisboa, Lisboa","Artigo 24.º, n.º 1, alínea e) do Código dos Contratos Públicos",,,,,,Não aplicável.,Não aplicável.,FALSE
Aquisição de sapropterina 100 mg comp.,Ajuste Direto Regime Geral,Aquisição de bens móveis,"33690000-3, Medicamentos vários","Centro Hospitalar Lisboa Norte, E. P. E. (508481287)",LOGIFARMA - LOGISTICA FARMACÊUTICA S.A.            (503934640),"54.776,55 €",21-09-2017,07-09-2017,1 dias,"Portugal, Lisboa, Lisboa","Artigo 24.º, n.º 1, alínea e) do Código dos Contratos Públicos",,,,,,Não aplicável.,Não aplicável.,FALSE
Aquisição de reagentes,Ajuste Direto Regime Geral,Aquisição de bens móveis,"33696000-5, Reagentes e meios de contraste","Centro Hospitalar Lisboa Norte, E. P. E. (508481287)",AGA - ALCOOL E GENEROS ALIMENTARES SA              (500727457),"337,50 €",20-09-2017,20-09-2017,1 dias,"Portugal, Lisboa, Lisboa","Artigo 20.º, n.º 1, alínea a) do Código dos Contratos Públicos",,,,,,Não aplicável.,Não aplicável.,FALSE
Aquisição de oxido nitrico,Ajuste Direto Regime Geral,Aquisição de bens móveis,"33690000-3, Medicamentos vários","Centro Hospitalar Lisboa Norte, E. P. E. (508481287)",AIR LIQUIDE MEDICINAL S.A. (501576436),"8.400,00 €",20-09-2017,20-09-2017,1 dias,"Portugal, Lisboa, Lisboa","Artigo 24.º, n.º 1, alínea e) do Código dos Contratos Públicos",,,,,,Não aplicável.,Não aplicável.,FALSE
Aquisição de lenalidomida capsulas 5 mg,Ajuste Direto Regime Geral,Aquisição de bens móveis,"33690000-3, Medicamentos vários","Centro Hospitalar Lisboa Norte, E. P. E. (508481287)",CELGENE SOCIEDADE UNIPESSOAL (507791690),"35.623,43 €",20-09-2017,12-04-2017,1 dias,"Portugal, Lisboa, Lisboa","Artigo 24.º, n.º 1, alínea e) do Código dos Contratos Públicos",,,,,,Não aplicável.,Não aplicável.,FALSE
Aquisição de fator VIII recombinante 500 UI (octog alfa),Ajuste Direto Regime Geral,Aquisição de bens móveis,"33690000-3, Medicamentos vários","Centro Hospitalar Lisboa Norte, E. P. E. (508481287)","Baxalta Portugal, Unipessoal, Lda (513252193)","56.084,40 €",20-09-2017,20-09-2017,1 dias,"Portugal, Lisboa, Lisboa","Artigo 24.º, n.º 1, alínea e) do Código dos Contratos Públicos",,,,,,Não aplicável.,Não aplicável.,FALSE
Aquisição de uma sonda de ecógrafo para o Serviço de Imagiologia Geral I - MCDT's - Radiologia ¿ Centra.l,Ajuste Direto Regime Geral,Aquisição de bens móveis,"33141641-5, Sondas","Centro Hospitalar Lisboa Norte, E. P. E. (508481287)",Toshiba Medical SA (980023700),"5.900,00 €",19-09-2017,19-09-2017,30 dias,"Portugal, Lisboa, Lisboa","Artigo 24.º, n.º 1, alínea e) do Código dos Contratos Públicos",,,,,,Não aplicável.,Não aplicável.,FALSE
Aquisição de 11 (onze) medidores de pressão de cuff para o Serviço de Medicina Intensiva.,Ajuste Direto Regime Geral,Aquisição de serviços,"72410000-7, Serviços de fornecimento","Centro Hospitalar Lisboa Norte, E. P. E. (508481287)",Medtronic (504223933),"1.155,00 €",19-09-2017,19-09-2017,2 dias,"Portugal, Lisboa, Lisboa","Artigo 20.º, n.º 1, alínea a) do Código dos Contratos Públicos",,,,,,Não aplicável.,Não aplicável.,FALSE
Aquisição de consumiveis para cirurgia de distonia,Ajuste Direto Regime Geral,Aquisição de bens móveis,"33140000-3, Material médico de consumo","CENTRO HOSPITALAR LISBOA NORTE, EPE (508481287)",Medtronic (504223933),"19.000,00 €",19-09-2017,19-09-2017,1 dias,"Portugal, Lisboa, Lisboa","Artigo 24.º, n.º 1, alínea e) do Código dos Contratos Públicos",,,,,,Não aplicável.,Não aplicável.,FALSE
Aquisição de armações + filtros de luz + sistema de ampliação,Ajuste Direto Regime Geral,Aquisição de serviços,"85000000-9, Serviços de saúde e acção social","CENTRO HOSPITALAR LISBOA NORTE, EPE (508481287)","Hemicare-Comércio Rep.Material e Equip.Médicos, Lda (506517080)","600,00 €",19-09-2017,19-09-2017,1 dias,"Portugal, Lisboa, Lisboa","Artigo 20.º, n.º 1, alínea a) do Código dos Contratos Públicos",,,,,,Não aplicável.,Não aplicável.,FALSE
Aquisição de armações + filtros de luz + sistema de ampliação,Ajuste Direto Regime Geral,Aquisição de serviços,"85000000-9, Serviços de saúde e acção social","CENTRO HOSPITALAR LISBOA NORTE, EPE (508481287)","Optocentro, Lda. (501472070)","274,69 €",19-09-2017,19-09-2017,30 dias,"Portugal, Lisboa, Lisboa","Artigo 20.º, n.º 1, alínea a) do Código dos Contratos Públicos",,,,,,Não aplicável.,Não aplicável.,FALSE
Aquisição de filtros de luz + armações + sistema de ampliação,Ajuste Direto Regime Geral,Aquisição de serviços,"85000000-9, Serviços de saúde e acção social","Centro Hospitalar Lisboa Norte, E. P. E. (508481287)","Hemicare-Comércio Rep.Material e Equip.Médicos, Lda (506517080)","600,00 €",19-09-2017,19-09-2017,1 dias,"Portugal, Lisboa, Lisboa","Artigo 20.º, n.º 1, alínea a) do Código dos Contratos Públicos",,,,,,Não aplicável.,Não aplicável.,FALSE
Aquisição de filtros de luz + armações + sistema de ampliação,Ajuste Direto Regime Geral,Aquisição de serviços,"85000000-9, Serviços de saúde e acção social","Centro Hospitalar Lisboa Norte, E. P. E. (508481287)","Optocentro, Lda. (501472070)","105,69 €",19-09-2017,19-09-2017,30 dias,"Portugal, Lisboa, Lisboa","Artigo 20.º, n.º 1, alínea a) do Código dos Contratos Públicos",,,,,,Não aplicável.,Não aplicável.,FALSE
Aquisição de linezolide sol. inj. 2 mg/ml saco 300 ml,Ajuste Direto Regime Geral,Aquisição de bens móveis,"33690000-3, Medicamentos vários","Centro Hospitalar Lisboa Norte, E. P. E. (508481287)","Generis Farmacêutica, S.A. (508107997)","5.760,00 €",19-09-2017,19-09-2017,1 dias,"Portugal, Lisboa, Lisboa","Artigo 24.º, n.º 1, alínea e) do Código dos Contratos Públicos",,,,,,Não aplicável.,Não aplicável.,FALSE
Aquisição de serviços de reparação de um broncovideoscópio para o Serviço de Pneumologia - MCDT's - Unidade de Pneumologia de Intervenção - CHLN - HPV.,Ajuste Direto Regime Geral,Aquisição de serviços,"50420000-5, Serviços de reparação e manutenção de equipamento médico e cirúrgico","CENTRO HOSPITALAR LISBOA NORTE, EPE (508481287)","Endotécnica, Material Cirurgico, Lda (503818348)","5.590,00 €",19-09-2017,19-09-2017,30 dias,"Portugal, Lisboa, Lisboa","Artigo 20.º, n.º 1, alínea a) do Código dos Contratos Públicos",,,,,,Não aplicável.,Não aplicável.,FALSE
"Aquisição de equipamentos para o Serviço de Urgência Central, suportes, teclados e ratos laváveis. ",Ajuste Direto Regime Geral,Aquisição de bens móveis,"33162000-3, Aparelhos e instrumentos para blocos operatórios","Centro Hospitalar Lisboa Norte, E. P. E. (508481287)",Suport It (510523536),"8.359,48 €",19-09-2017,19-09-2017,60 dias,"Portugal, Lisboa, Lisboa","Artigo 20.º, n.º 1, alínea a) do Código dos Contratos Públicos",,,,,,Não aplicável.,Não aplicável.,FALSE
Reparação de porta de entrada do Serviço de Gestão Técnico Farmacêutica - Unidade de Gestão de Medicamentos e Outros Produtos Farmacêuticos - CHLN - HPV.,Ajuste Direto Regime Geral,Empreitadas de obras públicas,"45453000-7, Obras de revisão e recuperação","Centro Hospitalar Lisboa Norte, E. P. E. (508481287)",Francisco J. V. Marques (128779799),"15,00 €",19-09-2017,19-09-2017,1 dias,"Portugal, Lisboa, Lisboa","Artigo 19.º, alínea a) do Código dos Contratos Públicos",,,,,,Não aplicável.,Não aplicável.,FALSE
Reparação de porta do Serviço Pneumologia II  Unidade de Insuficiência Respiratória  HPV.,Ajuste Direto Regime Geral,Empreitadas de obras públicas,"45453000-7, Obras de revisão e recuperação","Centro Hospitalar Lisboa Norte, E. P. E. (508481287)",Francisco J. V. Marques (128779799),"109,00 €",19-09-2017,19-09-2017,1 dias,"Portugal, Lisboa, Lisboa","Artigo 19.º, alínea a) do Código dos Contratos Públicos",,,,,,Não aplicável.,Não aplicável.,FALSE
Fornecimento e montagem de quatro estores para o Serviço de Pneumologia - MCDT's - Unidade de Pneumologia de Intervenção - CHLN - HPV.,Ajuste Direto Regime Geral,Empreitadas de obras públicas,"45421143-8, Instalação de estores","Centro Hospitalar Lisboa Norte, E. P. E. (508481287)",Francisco J. V. Marques (128779799),"690,00 €",19-09-2017,19-09-2017,5 dias,"Portugal, Lisboa, Lisboa","Artigo 19.º, alínea a) do Código dos Contratos Públicos",,,,,,Não aplicável.,Não aplicável.,FALSE
Aquisição de válvula aórtica s/ sutura 23 mm,Ajuste Direto Regime Geral,Aquisição de bens móveis,"33190000-8, Dispositivos e produtos médicos variados","Centro Hospitalar Lisboa Norte, E. P. E. (508481287)","EDWARDS LIFESCIENCES (PORT.), LDA (508014832)","5.900,00 €",19-09-2017,19-09-2017,2 dias,"Portugal, Lisboa, Lisboa","Artigo 24.º, n.º 1, alínea e) do Código dos Contratos Públicos",,,,,,Não aplicável.,Não aplicável.,FALSE
Aquisição de ABL 800 solução lavagem 600 ml,Ajuste Direto Regime Geral,Aquisição de bens móveis,"33696000-5, Reagentes e meios de contraste","Centro Hospitalar Lisboa Norte, E. P. E. (508481287)","RADIOMETER IBÉRICA, S.L. (980201667)","15.796,80 €",18-09-2017,08-09-2017,1 dias,"Portugal, Lisboa, Lisboa","Artigo 24.º, n.º 1, alínea e) do Código dos Contratos Públicos",,,,,,Não aplicável.,Não aplicável.,FALSE
Aquisição de vaselina líquida p/ fins farmacêuticos,Ajuste Direto Regime Geral,Aquisição de bens móveis,"33680000-0, Artigos de farmácia","Centro Hospitalar Lisboa Norte, E. P. E. (508481287)","PROCLINICA-EQUIPAM.PRODUTOS CLINICOS,LDA (500222665)","174,00 €",18-09-2017,18-09-2017,1 dias,"Portugal, Lisboa, Lisboa","Artigo 20.º, n.º 1, alínea a) do Código dos Contratos Públicos",,,,,,Não aplicável.,Não aplicável.,FALSE
"Aquisição de glutationa reduzida 0,9321 mg/ml sol. cons.",Ajuste Direto Regime Geral,Aquisição de bens móveis,"33690000-3, Medicamentos vários","Centro Hospitalar Lisboa Norte, E. P. E. (508481287)",Institut Georges Lopez (429526973),"6.368,00 €",18-09-2017,18-09-2017,1 dias,"Portugal, Lisboa, Lisboa","Artigo 24.º, n.º 1, alínea e) do Código dos Contratos Públicos",,,,,,Não aplicável.,Não aplicável.,FALSE
Aquisição de ABL  Flex cartucho soluções,Ajuste Direto Regime Geral,Aquisição de bens móveis,"33696000-5, Reagentes e meios de contraste","Centro Hospitalar Lisboa Norte, E. P. E. (508481287)","RADIOMETER IBÉRICA, S.L. (980201667)","9.135,00 €",18-09-2017,18-09-2017,1 dias,"Portugal, Lisboa, Lisboa","Artigo 24.º, n.º 1, alínea e) do Código dos Contratos Públicos",,,,,,Não aplicável.,Não aplicável.,FALSE
Aquisição de epoetina inj. 30.000 UI,Ajuste Direto Regime Geral,Aquisição de bens móveis,"33690000-3, Medicamentos vários","Centro Hospitalar Lisboa Norte, E. P. E. (508481287)","Roche Farmacêutica Quimica, Lda. (500233810)","17.808,00 €",15-09-2017,29-08-2017,1 dias,"Portugal, Lisboa, Lisboa","Artigo 24.º, n.º 1, alínea e) do Código dos Contratos Públicos",,,,,,Não aplicável.,Não aplicável.,FALSE
Aquisição de trastuzumab emtansina 100 mj inj.,Ajuste Direto Regime Geral,Aquisição de bens móveis,"33690000-3, Medicamentos vários","Centro Hospitalar Lisboa Norte, E. P. E. (508481287)","Roche Farmacêutica Quimica, Lda. (500233810)","30.393,00 €",15-09-2017,10-08-2017,1 dias,"Portugal, Lisboa, Lisboa","Artigo 24.º, n.º 1, alínea e) do Código dos Contratos Públicos",,,,,,Não aplicável.,Não aplicável.,FALSE
Aquisição de verde de indocinina 25 mg inj.,Ajuste Direto Regime Geral,Aquisição de bens móveis,"33690000-3, Medicamentos vários","Centro Hospitalar Lisboa Norte, E. P. E. (508481287)",Clinifar (503281115),"6.745,00 €",15-09-2017,15-09-2017,1 dias,"Portugal, Lisboa, Lisboa","Artigo 24.º, n.º 1, alínea e) do Código dos Contratos Públicos",,,,,,Não aplicável.,Não aplicável.,FALSE
Aquisição de afatinib 40 mg comp.,Ajuste Direto Regime Geral,Aquisição de bens móveis,"33690000-3, Medicamentos vários","Centro Hospitalar Lisboa Norte, E. P. E. (508481287)",UNILFARMA - UNIAO INTERN. LAB. S FARMACEUTICOS     (500293023),"5.217,90 €",15-09-2017,15-09-2017,2 dias,"Portugal, Lisboa, Lisboa","Artigo 24.º, n.º 1, alínea e) do Código dos Contratos Públicos",,,,,,Não aplicável.,Não aplicável.,FALSE
Aquisição de CDI BIV (CRT-D),Ajuste Direto Regime Geral,Aquisição de bens móveis,"33182100-0, Desfibrilhador","Centro Hospitalar Lisboa Norte, E. P. E. (508481287)","Medtronic Portugal, Lda (504223933)","13.308,00 €",15-09-2017,15-09-2017,1 dias,"Portugal, Lisboa, Lisboa","Artigo 24.º, n.º 1, alínea e) do Código dos Contratos Públicos",,,,,,Não aplicável.,Não aplicável.,FALSE
Aquisição de CDI BIV,Ajuste Direto Regime Geral,Aquisição de bens móveis,"33182100-0, Desfibrilhador","Centro Hospitalar Lisboa Norte, E. P. E. (508481287)","Medtronic Portugal, Lda (504223933)","13.308,00 €",15-09-2017,15-09-2017,1 dias,"Portugal, Lisboa, Lisboa","Artigo 24.º, n.º 1, alínea e) do Código dos Contratos Públicos",,,,,,Não aplicável.,Não aplicável.,FALSE
" Aquisição de stents e microcateteres vasculares diversores de fluxo para terapêutica  de aneurismas cerebrais, durante o ano de 2017",Concurso público,Aquisição de bens móveis,"33111730-7, Material para angioplastia","Centro Hospitalar Lisboa Norte, E. P. E. (508481287)","CATETER PRODUTOS MEDICOS HOSPITALARES,LD (502914319)","50.800,00 €",15-09-2017,08-09-2017,114 dias,"Portugal, Lisboa, Lisboa","Artigo 20.º, n.º 1, alínea b) do Código dos Contratos Públicos",,,,,,Não aplicável.,Não aplicável.,FALSE
Aquisição de penso ade est. hipo trans. comp. imp. M. 8 x15,Ajuste Direto Regime Geral,Aquisição de bens móveis,"33140000-3, Material médico de consumo","Centro Hospitalar Lisboa Norte, E. P. E. (508481287)","DIMOR LUSITANA, LDA (500730741)","226,50 €",15-09-2017,15-09-2017,1 dias,"Portugal, Lisboa, Lisboa","Artigo 24.º, n.º 1, alínea c) do Código dos Contratos Públicos",,,,,,Não aplicável.,Não aplicável.,FALSE
"Aquisição de 1350 discos SSD para atualização de equipamentos do CHLN, E.P.E.",Ajuste Direto Regime Geral,Aquisição de bens móveis,"30233130-1, Unidades de memória em discos magnéticos","Centro Hospitalar Lisboa Norte, E. P. E. (508481287)","VTT.Link - Serviços de Informática e Telecomunicações Unipessoal, Lda. (508888018)","65.745,00 €",15-09-2017,14-09-2017,30 dias,"Portugal, Lisboa, Lisboa","Artigo 20.º, n.º 1, alínea a) do Código dos Contratos Públicos",,,,,,Não aplicável.,Não aplicável.,FALSE
Aquisição de rapid lab 1200 controlo,Ajuste Direto Regime Geral,Aquisição de bens móveis,"33696000-5, Reagentes e meios de contraste","Centro Hospitalar Lisboa Norte, E. P. E. (508481287)","SIEMENS HEALTHCARE DIAGNOSTICS, LDA (507925173)","7.833,20 €",15-09-2017,15-09-2017,2 dias,"Portugal, Lisboa, Lisboa","Artigo 24.º, n.º 1, alínea e) do Código dos Contratos Públicos",,,,,,Não aplicável.,Não aplicável.,FALSE
Empreitada para Execução da Obra de Fornecimento e Montagem de 3 Estores Interiores para o Serviço dos Orgãos Sociais - Conselho de Administração - CHLN - HSM,Ajuste Direto Regime Geral,Empreitadas de obras públicas,"45421143-8, Instalação de estores","CENTRO HOSPITALAR LISBOA NORTE, EPE (508481287)","Firmovidro - Alumínios e Estores, Lda (507540018)","445,00 €",15-09-2017,15-09-2017,7 dias,"Portugal, Lisboa, Lisboa","Artigo 19.º, alínea a) do Código dos Contratos Públicos",,,,,,Não aplicável.,Não aplicável.,FALSE
Aquisição de imunoglobulina 50 mg/ml so. inj. fr. 200 ml,Ajuste Direto Regime Geral,Aquisição de bens móveis,"33651520-9, Imunoglobulinas","Centro Hospitalar Lisboa Norte, E. P. E. (508481287)",OCTAPHARMA - PRODUTOS FARMACEUTICOS                (502820780),"12.231,00 €",15-09-2017,12-09-2017,2 dias,"Portugal, Lisboa, Lisboa","Artigo 24.º, n.º 1, alínea e) do Código dos Contratos Públicos",,,,,,Não aplicável.,Não aplicável.,FALSE
"Aquisição de plerixafor inj. 20 mg/ml amp. 1,2 ml",Ajuste Direto Regime Geral,Aquisição de bens móveis,"33690000-3, Medicamentos vários","Centro Hospitalar Lisboa Norte, E. P. E. (508481287)","SANOFI- PRODUTOS FARMACÊUTICOS,LDA.                (500134960)","66.047,16 €",15-09-2017,06-09-2017,1 dias,"Portugal, Lisboa, Lisboa","Artigo 24.º, n.º 1, alínea e) do Código dos Contratos Públicos",,,,,,Não aplicável.,Não aplicável.,FALSE
Aquisição de prótese auditiva (produtos de apoio),Ajuste Direto Regime Geral,Aquisição de serviços,"85000000-9, Serviços de saúde e acção social","Centro Hospitalar Lisboa Norte, E. P. E. (508481287)",GAES (503134139),"480,00 €",14-09-2017,14-09-2017,5 dias,"Portugal, Lisboa, Lisboa","Artigo 20.º, n.º 1, alínea a) do Código dos Contratos Públicos",,,,,,Não aplicável.,Não aplicável.,FALSE
Aquisição de prótese auditiva (produtos de apoio),Ajuste Direto Regime Geral,Aquisição de serviços,"85000000-9, Serviços de saúde e acção social","Centro Hospitalar Lisboa Norte, E. P. E. (508481287)",GAES (503134139),"240,00 €",14-09-2017,14-09-2017,5 dias,"Portugal, Lisboa, Lisboa","Artigo 20.º, n.º 1, alínea a) do Código dos Contratos Públicos",,,,,,Não aplicável.,Não aplicável.,FALSE
Aquisição de andarilho (produtos de apoio),Ajuste Direto Regime Geral,Aquisição de serviços,"85000000-9, Serviços de saúde e acção social","Centro Hospitalar Lisboa Norte, E. P. E. (508481287)",Ortopedia Moderna Lda (500481300),"133,31 €",14-09-2017,14-09-2017,20 dias,"Portugal, Lisboa, Lisboa","Artigo 20.º, n.º 1, alínea a) do Código dos Contratos Públicos",,,,,,Não aplicável.,Não aplicável.,FALSE
Aquisição de cadeira de rodas (produtos de apoio),Ajuste Direto Regime Geral,Aquisição de serviços,"85000000-9, Serviços de saúde e acção social","Centro Hospitalar Lisboa Norte, E. P. E. (508481287)",Ortopedia Moderna Lda (500481300),"2.234,99 €",14-09-2017,14-09-2017,20 dias,"Portugal, Lisboa, Lisboa","Artigo 20.º, n.º 1, alínea a) do Código dos Contratos Públicos",,,,,,Não aplicável.,Não aplicável.,FALSE
Subscrição de serviços de manutenção tipo gold ao core de rede para o ano de 2017,Ajuste Direto Regime Geral,Aquisição de serviços,"72510000-3, Serviços de gestão relacionados com a informática","Centro Hospitalar Lisboa Norte, E. P. E. (508481287)","CILNET - Comunicações E Projectos Especiais, S.A. (505267772)","6.788,19 €",14-09-2017,14-09-2017,365 dias,"Portugal, Lisboa, Lisboa","Artigo 20.º, n.º 1, alínea a) do Código dos Contratos Públicos",,,,,,Não aplicável.,Não aplicável.,FALSE
Empreitada para execução da obra de fornecimento e montagem de uma central de incêndio no Serviço de Cirurgia Plástica - Internamento - Unidade de Queimados,Ajuste Direto Regime Geral,Empreitadas de obras públicas,"45312100-8, Instalação de sistemas de alarme contra incêndio","Centro Hospitalar Lisboa Norte, EPE (508481287)","Paulo Jesus Costa Unipessoal, Lda (510167780)","4.990,19 €",14-09-2017,14-09-2017,20 dias,"Portugal, Lisboa, Lisboa","Artigo 19.º, alínea a) do Código dos Contratos Públicos",,,,,,Não aplicável.,Não aplicável.,FALSE
"Aquisição de 277 suportes de chão para sacos de drenagem para diversos serviços do Centro Hospitalar Lisboa Norte, E.P.E.",Ajuste Direto Regime Geral,Locação de bens móveis,"33192320-1, Suportes para sacos de urina","CENTRO HOSPITALAR LISBOA NORTE, EPE (508481287)","EUGENIO PEREIRA, LDA (503989525)","7.617,50 €",14-09-2017,14-09-2017,30 dias,"Portugal, Lisboa, Lisboa","Artigo 20.º, n.º 1, alínea a) do Código dos Contratos Públicos",,,,,,Não aplicável.,Não aplicável.,FALSE
Aquisição de infliximab 100 mg sol. inj.,Ajuste Direto Regime Geral,Aquisição de bens móveis,"33632100-0, Anti-inflamatórios e anti-reumatismais","Centro Hospitalar Lisboa Norte, E. P. E. (508481287)","Merck Sharp & Dhome, Lda (500191360)","194.250,00 €",14-09-2017,08-09-2017,100 dias,"Portugal, Lisboa, Lisboa","Artigo 24.º, n.º 1, alínea e) do Código dos Contratos Públicos",,,,,,Não aplicável.,Não aplicável.,FALSE
Aquisição de medicamentos,Ajuste Direto Regime Geral,Aquisição de bens móveis,"33690000-3, Medicamentos vários","Centro Hospitalar Lisboa Norte, E. P. E. (508481287)","Pfizer Biofarmacêutica, Sociedade Unipessoal, Lda. (513300376)","68.705,00 €",14-09-2017,04-09-2017,96 dias,"Portugal, Lisboa, Lisboa","Artigo 24.º, n.º 1, alínea e) do Código dos Contratos Públicos",,,,,,Não aplicável.,Não aplicável.,FALSE
Aquisição de imunoglobulina200 mg/ml sol. inj. sc. fr. 1,Ajuste Direto Regime Geral,Aquisição de bens móveis,"33690000-3, Medicamentos vários","Centro Hospitalar Lisboa Norte, E. P. E. (508481287)","CSL BEHRING, LDA. (503047201)","10.564,35 €",14-09-2017,10-08-2017,1 dias,"Portugal, Lisboa, Lisboa","Artigo 24.º, n.º 1, alínea e) do Código dos Contratos Públicos",,,,,,Não aplicável.,Não aplicável.,FALSE
Aquisição de desinfetante hidroalcoolico de mãos 500,Ajuste Direto Regime Geral,Aquisição de bens móveis,"33691000-0, Produtos antiparasitários, insecticidas e repelentes","Centro Hospitalar Lisboa Norte, E. P. E. (508481287)","AIR LIQUIDE MEDICINAL,S.A. (501576436)","11.730,60 €",14-09-2017,12-09-2017,2 dias,"Portugal, Lisboa, Lisboa","Artigo 24.º, n.º 1, alínea e) do Código dos Contratos Públicos",,,,,,Não aplicável.,Não aplicável.,FALSE
Aquisição de cânula femora venosa,Ajuste Direto Regime Geral,Aquisição de bens móveis,"33190000-8, Dispositivos e produtos médicos variados","Centro Hospitalar Lisboa Norte, E. P. E. (508481287)","LUSOPALEX, LDA (503531588)","5.280,00 €",14-09-2017,14-09-2017,2 dias,"Portugal, Lisboa, Lisboa","Artigo 20.º, n.º 1, alínea a) do Código dos Contratos Públicos",,,,,,Não aplicável.,Não aplicável.,FALSE
Empreitada para Execução da Obra de Instalação de um Sistema de Video-Porteiro para a Fundação Ronald Mcdonald no Piso 01 - CHLN - HSM,Ajuste Direto Regime Geral,Empreitadas de obras públicas,"45113000-2, Obras no local","Centro Hospitalar Lisboa Norte, E. P. E. (508481287)","Paulo Jesus Costa Unipessoal, Lda (510167780)","339,96 €",14-09-2017,14-09-2017,2 dias,"Portugal, Lisboa, Lisboa","Artigo 19.º, alínea a) do Código dos Contratos Públicos",,,,,,Não aplicável.,Não aplicável.,FALSE
Aquisição de gelatina modificada sol. inj. frs. 500 ml,Ajuste Direto Regime Geral,Aquisição de bens móveis,"33690000-3, Medicamentos vários","Centro Hospitalar Lisboa Norte, E. P. E. (508481287)","LABESFAL-LAB. ALMIRO, SA.                          (501169580)","23.880,00 €",14-09-2017,06-09-2017,116 dias,"Portugal, Lisboa, Lisboa","Artigo 20.º, n.º 1, alínea a) do Código dos Contratos Públicos",,,,,,Não aplicável.,Não aplicável.,FALSE
"Aquisição de stents e microcateteres vasculares diversores de fluxo para terapêutica  de aneurismas cerebrais, durante o ano de 2017",Concurso público,Aquisição de bens móveis,"33111730-7, Material para angioplastia","Centro Hospitalar Lisboa Norte, E. P. E. (508481287)","MEDTRONIC PORTUGAL, LDA (504223933)","67.890,00 €",14-09-2017,08-09-2017,115 dias,"Portugal, Lisboa, Lisboa","Artigo 20.º, n.º 1, alínea b) do Código dos Contratos Públicos",,,,,,Não aplicável.,Não aplicável.,FALSE
" Aquisição de stents e microcateteres vasculares diversores de fluxo para terapêutica  de aneurismas cerebrais, durante o ano de 2017",Concurso público,Aquisição de bens móveis,"33111730-7, Material para angioplastia","Centro Hospitalar Lisboa Norte, E. P. E. (508481287)",Johnson & Johnson (500153370),"3.060,00 €",14-09-2017,14-09-2017,108 dias,"Portugal, Lisboa, Lisboa","Artigo 20.º, n.º 1, alínea b) do Código dos Contratos Públicos",,,,,,Não aplicável.,Não aplicável.,FALSE
Aquisição de imunoglobulina 200 mg/ml sol. inj. sc. fr. 10 ml,Ajuste Direto Regime Geral,Aquisição de bens móveis,"33690000-3, Medicamentos vários","CENTRO HOSPITALAR LISBOA NORTE, EPE (508481287)","CSL  BEHRING, LDA (503047201)","10.564,35 €",14-09-2017,04-09-2017,1 dias,"Portugal, Lisboa, Lisboa","Artigo 24.º, n.º 1, alínea e) do Código dos Contratos Públicos",,,,,,Não aplicável.,Não aplicável.,FALSE
Ajuste Direto n.º 171002334 - Compra centralizada de medicamentos - CPA 2015/6;2016/18 - P259-AC-2017-120,Ao abrigo de acordo-quadro (art.º 259.º),Aquisição de bens móveis,"33690000-3, Medicamentos vários","Centro Hospitalar Lisboa Norte, E. P. E. (508481287)","JANSSEN-CILAG Farmacêutica, Lda. (500189412)","304.134,75 €",13-09-2017,16-08-2017,137 dias,"Portugal, Lisboa, Lisboa",Artigo 259.º do Código dos Contratos Públicos,,,,,,1771819,CP 2015/6 - Acordo quadro para o fornecimento de Medicamentos do Foro Oncológico,FALSE
Aquisição de fator VII recombinante sol. inj. 1 mg,Ajuste Direto Regime Geral,Aquisição de bens móveis,"33690000-3, Medicamentos vários","Centro Hospitalar Lisboa Norte, E. P. E. (508481287)","Novo Nordisk, Lda (501485210)","27.644,15 €",13-09-2017,13-09-2017,1 dias,"Portugal, Lisboa, Lisboa","Artigo 24.º, n.º 1, alínea e) do Código dos Contratos Públicos",,,,,,Não aplicável.,Não aplicável.,FALSE
Aquisição de fator von willbrand 1200 UI c/ fator VI,Ajuste Direto Regime Geral,Aquisição de bens móveis,"33690000-3, Medicamentos vários","Centro Hospitalar Lisboa Norte, E. P. E. (508481287)","CSL  BEHRING, LDA (503047201)","7.647,20 €",13-09-2017,13-09-2017,1 dias,"Portugal, Lisboa, Lisboa","Artigo 24.º, n.º 1, alínea e) do Código dos Contratos Públicos",,,,,,Não aplicável.,Não aplicável.,FALSE
Aquisição de serviços de manutenção aos equipamentos e sistemas de prevenção e combate contra incêndios para o ano de 2017,Ajuste Direto Regime Geral,Aquisição de serviços,"50413200-5, Serviços de reparação e manutenção de equipamento de combate a incêndios","CENTRO HOSPITALAR LISBOA NORTE, EPE (508481287)","SINTIMEX - SOCIEDADE INTERNACIONAL DE IMPORTAÇÕES E EXPORTAÇÕES, LDA (500251118)","1.476,30 €",13-09-2017,13-09-2017,137 dias,"Portugal, Lisboa, Lisboa","Artigo 20.º, n.º 1, alínea a) do Código dos Contratos Públicos",,,,,,Não aplicável.,Não aplicável.,FALSE
Aquisição de HIV teste determinação por PCR 48 T,Ajuste Direto Regime Geral,Aquisição de bens móveis,"33696000-5, Reagentes e meios de contraste","Centro Hospitalar Lisboa Norte, E. P. E. (508481287)","ROCHE SISTEMAS DIAGNOSTICO,LDA (504282921)","42.240,00 €",13-09-2017,12-09-2017,1 dias,"Portugal, Lisboa, Lisboa","Artigo 24.º, n.º 1, alínea e) do Código dos Contratos Públicos",,,,,,Não aplicável.,Não aplicável.,FALSE
Empreitada para execução da obra de fornecimento e colocação de 2 vidros duplos para o Serviço de Pneumologia - Internamento - Geral - CHLN-HPV,Ajuste Direto Regime Geral,Empreitadas de obras públicas,"45441000-0, Colocação de vidros","Centro Hospitalar Lisboa Norte, E. P. E. (508481287)",Francisco J. V. Marques (128779799),"247,00 €",13-09-2017,13-09-2017,1 dias,"Portugal, Lisboa, Lisboa","Artigo 19.º, alínea a) do Código dos Contratos Públicos",,,,,,Não aplicável.,Não aplicável.,FALSE
Aquisição de sistema CDI BIV,Ajuste Direto Regime Geral,Aquisição de bens móveis,"33190000-8, Dispositivos e produtos médicos variados","CENTRO HOSPITALAR LISBOA NORTE, EPE (508481287)",BIOTRONIK PORTUGAL (UNIPESSOAL) LDA (510726941),"15.511,50 €",12-09-2017,12-09-2017,1 dias,"Portugal, Lisboa, Lisboa","Artigo 24.º, n.º 1, alínea e) do Código dos Contratos Públicos",,,,,,Não aplicável.,Não aplicável.,FALSE
Aquisição de sistema CDI BIV (CRT-D),Ajuste Direto Regime Geral,Aquisição de bens móveis,"33190000-8, Dispositivos e produtos médicos variados","Centro Hospitalar Lisboa Norte, E. P. E. (508481287)","BOSTON SCIENTIFIC PORTUGAL-DISP.MEDICOS,LDA. (504988964)","13.308,00 €",12-09-2017,12-09-2017,1 dias,"Portugal, Lisboa, Lisboa","Artigo 24.º, n.º 1, alínea e) do Código dos Contratos Públicos",,,,,,Não aplicável.,Não aplicável.,FALSE
Aquisição de sistema CDI VR,Ajuste Direto Regime Geral,Aquisição de bens móveis,"33190000-8, Dispositivos e produtos médicos variados","Centro Hospitalar Lisboa Norte, E. P. E. (508481287)","LIVANOVA PORTUGAL, LDA. (505514010)","9.550,00 €",12-09-2017,12-09-2017,1 dias,"Portugal, Lisboa, Lisboa","Artigo 24.º, n.º 1, alínea e) do Código dos Contratos Públicos",,,,,,Não aplicável.,Não aplicável.,FALSE
Aquisição de fator VII recombinante sol. inj. 2 mg,Ajuste Direto Regime Geral,Aquisição de bens móveis,"33690000-3, Medicamentos vários","Centro Hospitalar Lisboa Norte, E. P. E. (508481287)","Novo Nordisk, Lda (501485210)","112.210,00 €",12-09-2017,28-06-2017,1 dias,"Portugal, Lisboa, Lisboa","Artigo 20.º, n.º 1, alínea a) do Código dos Contratos Públicos",,,,,,Não aplicável.,Não aplicável.,FALSE
Aquisição de silica clotting time,Ajuste Direto Regime Geral,Aquisição de bens móveis,"33696000-5, Reagentes e meios de contraste","Centro Hospitalar Lisboa Norte, E. P. E. (508481287)","Werfen Portugal, Lda (501086110)","11.400,00 €",12-09-2017,06-09-2017,1 dias,"Portugal, Lisboa, Lisboa","Artigo 24.º, n.º 1, alínea e) do Código dos Contratos Públicos",,,,,,Não aplicável.,Não aplicável.,FALSE
AQUISIÇÃO DE PONATINIB 15 MG COMP,Ajuste Direto Regime Geral,Aquisição de bens móveis,"33652000-5, Antineoplásicos e imunomoduladores","Centro Hospitalar Lisboa Norte, E. P. E. (508481287)","ALLOGA PORTUGAL-ARMAZENAGEM E DISTRIBUICAO FARMACEUTICA,S. UNIPESS LDA (504507230)","80.856,90 €",12-09-2017,21-08-2017,2 dias,"Portugal, Lisboa, Lisboa","Artigo 24.º, n.º 1, alínea e) do Código dos Contratos Públicos",,,,,,Não aplicável.,Não aplicável.,FALSE
Aquisição de reagentes de bacteriologia,Ajuste Direto Regime Geral,Aquisição de bens móveis,"33696000-5, Reagentes e meios de contraste","Centro Hospitalar Lisboa Norte, E. P. E. (508481287)","FISHER SCIENTIFIC, UNIPESSOAL, LDA (506429210)","23.423,45 €",12-09-2017,12-09-2017,117 dias,"Portugal, Lisboa, Lisboa","Artigo 20.º, n.º 1, alínea a) do Código dos Contratos Públicos",,,,,,Não aplicável.,Não aplicável.,FALSE
Aquisição de software de reporting a implementar diretamente na aplicação PACs Sectra,Ajuste Direto Regime Geral,Aquisição de bens móveis,"48100000-9, Pacote de software para sectores específicos","CENTRO HOSPITALAR LISBOA NORTE, EPE (508481287)",ART CES Unipessoal Lda  (513270396),"74.950,00 €",12-09-2017,08-09-2017,30 dias,"Portugal, Lisboa, Lisboa","Artigo 24.º, n.º 1, alínea e) do Código dos Contratos Públicos",,,,,,Não aplicável.,Não aplicável.,FALSE
Aquisição de vitamina A composta pomada bisn.,Ajuste Direto Regime Geral,Aquisição de bens móveis,"33690000-3, Medicamentos vários","Centro Hospitalar Lisboa Norte, E. P. E. (508481287)","LABORATÓRIO MEDINFAR, LDA (500384045)","2.016,00 €",12-09-2017,12-09-2017,1 dias,"Portugal, Lisboa, Lisboa","Artigo 20.º, n.º 1, alínea a) do Código dos Contratos Públicos",,,,,,Não aplicável.,Não aplicável.,FALSE
Aquisição de fator VII recombinante sol. inj. 5 mg,Ajuste Direto Regime Geral,Aquisição de bens móveis,"33690000-3, Medicamentos vários","Centro Hospitalar Lisboa Norte, E. P. E. (508481287)",NOVO NORDISK (501485210),"203.057,40 €",11-09-2017,11-09-2017,1 dias,"Portugal, Lisboa, Lisboa","Artigo 24.º, n.º 1, alínea e) do Código dos Contratos Públicos",,,,,,Não aplicável.,Não aplicável.,FALSE
Aquisição de CDI BIV (CRT-D),Ajuste Direto Regime Geral,Aquisição de bens móveis,"33190000-8, Dispositivos e produtos médicos variados","Centro Hospitalar Lisboa Norte, E. P. E. (508481287)","St. Jude Medical Portugal, Lda. (504180746)","13.308,00 €",11-09-2017,11-09-2017,1 dias,"Portugal, Lisboa, Lisboa","Artigo 24.º, n.º 1, alínea e) do Código dos Contratos Públicos",,,,,,Não aplicável.,Não aplicável.,FALSE
179G002250 - Aquisição de Serviços de Reparação de Microscópio Cirúrgico - Serviço de de Oftalmologia - Bloco Operatório - CHLN - HSM,Ajuste Direto Regime Geral,Aquisição de serviços,"50422000-9, Serviços de reparação e manutenção de equipamento cirúrgico","CENTRO HOSPITALAR LISBOA NORTE, EPE (508481287)","LEICA MICROSSISTEMAS,LDA. (500301921)","7.198,32 €",11-09-2017,11-09-2017,5 dias,"Portugal, Lisboa, Lisboa","Artigo 20.º, n.º 1, alínea a) do Código dos Contratos Públicos",,,,,,Não aplicável.,Não aplicável.,FALSE
CP n.º 172A000024 - Aquisição de microcateteres e microguias cerebrais durante o ano de 2017,Concurso público,Aquisição de bens móveis,"33111730-7, Material para angioplastia","Centro Hospitalar Lisboa Norte, E. P. E. (508481287)","MEDTRONIC PORTUGAL, LDA (504223933)","35.494,50 €",11-09-2017,11-09-2017,114 dias,"Portugal, Lisboa, Lisboa","Artigo 20.º, n.º 1, alínea b) do Código dos Contratos Públicos",,,,,,Não aplicável.,Não aplicável.,FALSE
CP n.º 172A000024 - Aquisição de microcateteres e microguias cerebrais durante o ano de 2017,Concurso público,Aquisição de bens móveis,"33111730-7, Material para angioplastia","Centro Hospitalar Lisboa Norte, E. P. E. (508481287)","MEDICINÁLIA-CORMÉDICA, LDA            (500684324)","23.574,00 €",11-09-2017,11-09-2017,114 dias,"Portugal, Lisboa, Lisboa","Artigo 20.º, n.º 1, alínea b) do Código dos Contratos Públicos",,,,,,Não aplicável.,Não aplicável.,FALSE
CP n.º 172A000024 - Aquisição de microcateteres e microguias cerebrais durante o ano de 2017,Concurso público,Aquisição de bens móveis,"33111730-7, Material para angioplastia","Centro Hospitalar Lisboa Norte, E. P. E. (508481287)",World Médica S.L. (ESB82612599),"12.900,00 €",11-09-2017,11-09-2017,114 dias,"Portugal, Lisboa, Lisboa","Artigo 20.º, n.º 1, alínea b) do Código dos Contratos Públicos",,,,,,Não aplicável.,Não aplicável.,FALSE
"Empreitada para execução de obra de reparação de pré-fabricado, piso 2 do Hospital Santa Maria, CHLN, E.P.E.",Ajuste Direto Regime Geral,Empreitadas de obras públicas,"45259000-7, Reparação e manutenção de instalações","Centro Hospitalar Lisboa Norte, E. P. E. (508481287)","Jofilhos Sociedade de Construções, Lda (500854386)","21.406,29 €",11-09-2017,01-09-2017,30 dias,"Portugal, Lisboa, Lisboa","Artigo 19.º, alínea a) do Código dos Contratos Públicos",,,,,,Não aplicável.,Não aplicável.,FALSE
"CP n.º 172A000025 - Aquisição de espiras e coils para embolização de eneurismas cerebrais, durante o ano de 2017",Concurso público,Aquisição de bens móveis,"33111730-7, Material para angioplastia","Centro Hospitalar Lisboa Norte, E. P. E. (508481287)","MEDICINÁLIA-CORMÉDICA, LDA            (500684324)","40.350,00 €",11-09-2017,08-09-2017,114 dias,"Portugal, Lisboa, Lisboa","Artigo 20.º, n.º 1, alínea b) do Código dos Contratos Públicos",,,,,,Não aplicável.,Não aplicável.,FALSE
"CP n.º 172A000025 - Aquisição de espiras e coils para embolização de eneurismas cerebrais, durante o ano de 2017",Concurso público,Aquisição de bens móveis,"33111730-7, Material para angioplastia","Centro Hospitalar Lisboa Norte, E. P. E. (508481287)",World Médica S.L. (ESB82612599),"16.500,00 €",11-09-2017,08-09-2017,114 dias,"Portugal, Lisboa, Lisboa","Artigo 20.º, n.º 1, alínea b) do Código dos Contratos Públicos",,,,,,Não aplicável.,Não aplicável.,FALSE
"CP n.º 172A000025 - Aquisição de espiras e coils para embolização de eneurismas cerebrais, durante o ano de 2017",Concurso público,Aquisição de bens móveis,"33111730-7, Material para angioplastia","Centro Hospitalar Lisboa Norte, E. P. E. (508481287)",Biomédica (501745459),"21.000,00 €",11-09-2017,08-09-2017,114 dias,"Portugal, Lisboa, Lisboa","Artigo 20.º, n.º 1, alínea b) do Código dos Contratos Públicos",,,,,,Não aplicável.,Não aplicável.,FALSE
"CP n.º 172A000025 - Aquisição de espiras e coils para embolização de eneurismas cerebrais, durante o ano de 2017",Concurso público,Aquisição de bens móveis,"33111730-7, Material para angioplastia","Centro Hospitalar Lisboa Norte, E. P. E. (508481287)",JOHNSON & JOHNSON PROD.PROF. (500153370),"20.175,00 €",11-09-2017,08-09-2017,114 dias,"Portugal, Lisboa, Lisboa","Artigo 20.º, n.º 1, alínea b) do Código dos Contratos Públicos",,,,,,Não aplicável.,Não aplicável.,FALSE
