freguesia,acronym,validVotesPercentage,votes,dicofre
Pega,PPD/PSD.CDS-PP,46.15,30,090729
Pega,PS,29.23,19,090729
Pega,MPT,6.15,4,090729
Pega,MAS,4.62,3,090729
Pega,PCP-PEV,4.62,3,090729
Pega,PND,4.62,3,090729
Pega,L,1.54,1,090729
Pega,PPM,1.54,1,090729
Pega,PTP,1.54,1,090729
Pega,B.E.,0,0,090729
Pega,PAN,0,0,090729
Pega,PCTP/MRPP,0,0,090729
Pega,PDA,0,0,090729
Pega,PNR,0,0,090729
Pega,POUS,0,0,090729
Pega,PPV,0,0,090729
