Objeto do Contrato,Tipo de Procedimento,Tipo(s) de Contrato,CPVs,Entidade(s) Adjudicante(s),Entidade(s) Adjudicatária(s),Preço Contratual,Data de Publicação,Data de Celebração do Contrato,Prazo de Execução,Local de Execução,Fundamentação,Data de Fecho do Contrato,Preço Total Efetivo,Causas das Alterações ao Prazo,Causas das Alterações ao Preço,Estado,N.º registo do Acordo Quadro,Descrição do Acordo Quadro,Procedimento Centralizado
Aquisição de material utilizado em Cirurgia de Ortopedia,Ajuste Direto Regime Geral,Aquisição de bens móveis,"33140000-3, Material médico de consumo","Centro Hospitalar Lisboa Norte, E. P. E. (508481287)",Johnson & Johnson; Lda (500153370),"12.552,11 €",11-10-2018,25-09-2018,1 dias,"Portugal, Lisboa, Lisboa","Artigo 24.º, n.º 1, alínea e), subalínea ii) do Código dos Contratos Públicos",,,,,,Não aplicável.,Não aplicável.,FALSE
Aquisição de citrato de sódio p/ hemofiltração saco,Ajuste Direto Regime Geral,Aquisição de bens móveis,"33690000-3, Medicamentos vários","Centro Hospitalar Lisboa Norte, E. P. E. (508481287)",Baxter (503347345),"5.400,00 €",11-10-2018,11-10-2018,1 dias,"Portugal, Lisboa, Lisboa","Artigo 24.º, n.º 1, alínea e), subalínea ii) do Código dos Contratos Públicos",,,,,,Não aplicável.,Não aplicável.,FALSE
Aquisição de imunoglobulina 100 mg/ml fr. 200 ml (20 g) (provigen),Ajuste Direto Regime Geral,Aquisição de bens móveis,"33690000-3, Medicamentos vários","Centro Hospitalar Lisboa Norte, E. P. E. (508481287)","CSL BEHRING, LDA (503047201)","194.900,00 €",10-10-2018,27-09-2018,95 dias,"Portugal, Lisboa, Lisboa","Artigo 24.º, n.º 1, alínea e), subalínea ii) do Código dos Contratos Públicos",,,,,,Não aplicável.,Não aplicável.,FALSE
Aquisição de alginato de cálcio penso 10x10 cm,Consulta Prévia,Aquisição de bens móveis,"33690000-3, Medicamentos vários","Centro Hospitalar Lisboa Norte, E. P. E. (508481287)","Medtronic Portugal, Lda (504223933)","282,00 €",10-10-2018,10-10-2018,1 dias,"Portugal, Lisboa, Lisboa",Artigo 27.º-A do Código dos Contratos Públicos,,,,,,Não aplicável.,Não aplicável.,FALSE
Aquisição de Hemosil DRVVT Screen,Ajuste Direto Regime Geral,Aquisição de bens móveis,"33696000-5, Reagentes e meios de contraste","Centro Hospitalar Lisboa Norte, E. P. E. (508481287)","WerfenPortugal, Ldª (501086110)","5.100,00 €",10-10-2018,10-10-2018,1 dias,"Portugal, Lisboa, Lisboa","Artigo 24.º, n.º 1, alínea e), subalínea iii) do Código dos Contratos Públicos",,,,,,Não aplicável.,Não aplicável.,FALSE
Aquisição de um desfibrilhador no serviço de Cardiologia II,Consulta Prévia,Aquisição de bens móveis,"33182100-0, Desfibrilhador","Centro Hospitalar Lisboa Norte, E. P. E. (508481287)","IBERDATA  - EQUIPAMENTOS, SA. (501904921)","5.800,00 €",10-10-2018,10-10-2018,71 dias,"Portugal, Lisboa, Lisboa","Artigo 20.º, n.º 1, alínea c) do Código dos Contratos Públicos",,,,,,Não aplicável.,Não aplicável.,FALSE
AT equipamentos de cardio pulmonares Getinge 2018,Ajuste Direto Regime Geral,Aquisição de serviços,"50421000-2, Serviços de reparação e manutenção de equipamento médico","Centro Hospitalar Lisboa Norte, E. P. E. (508481287)","Getinge Group Portugal, Unipessoal, Lda. (506819698)","3.940,68 €",10-10-2018,10-10-2018,71 dias,"Portugal, Lisboa, Lisboa","Artigo 24.º, n.º 1, alínea e), subalínea iii) do Código dos Contratos Públicos",,,,,,Não aplicável.,Não aplicável.,FALSE
Aquisição de budesonido 3 mg caps. LM,Consulta Prévia,Aquisição de bens móveis,"33690000-3, Medicamentos vários","Centro Hospitalar Lisboa Norte, E. P. E. (508481287)","LABORATORIOS VITORIA, SA (500162220)","122,22 €",10-10-2018,10-10-2018,1 dias,"Portugal, Lisboa, Lisboa",Artigo 27.º-A do Código dos Contratos Públicos,,,,,,Não aplicável.,Não aplicável.,FALSE
Aquisição de fibroscópio para a Cirurgia Cárdio torácica - Bloco Operatório,Ajuste Direto Regime Geral,Aquisição de bens móveis,"33100000-1, Equipamento médico","Centro Hospitalar Lisboa Norte, E. P. E. (508481287)",FUJIFILM EUROPE GmbH (980456517),"20.028,56 €",09-10-2018,27-09-2018,60 dias,"Portugal, Lisboa, Lisboa","Artigo 20.º, n.º 1, alínea a) do Código dos Contratos Públicos",,,,,,Não aplicável.,Não aplicável.,FALSE
Aquisição de serviços de reparação de monitor de sinais vitais - Serviço de Cirurgia Plástica - Internamento -Unidade de Queimados,Ajuste Direto Regime Geral,Aquisição de serviços,"50421000-2, Serviços de reparação e manutenção de equipamento médico","Centro Hospitalar Lisboa Norte, E. P. E. (508481287)","SPACE MEDICAL - EQUIPAMENTOS MEDICOS, LDA (507662407)","5.900,00 €",09-10-2018,06-02-2018,30 dias,"Portugal, Lisboa, Lisboa","Artigo 24.º, n.º 1, alínea e), subalínea ii) do Código dos Contratos Públicos",,,,,,Não aplicável.,Não aplicável.,FALSE
Reparação de um ecógrafo,Ajuste Direto Regime Geral,Aquisição de serviços,"50420000-5, Serviços de reparação e manutenção de equipamento médico e cirúrgico","Centro Hospitalar Lisboa Norte, E. P. E. (508481287)","GENERAL ELECTRIC HEALTHCARE PORTUGAL, SOC UNIP LDA (500357129)","6.486,45 €",09-10-2018,07-02-2018,30 dias,"Portugal, Lisboa, Lisboa","Artigo 24.º, n.º 1, alínea e), subalínea ii) do Código dos Contratos Públicos",,,,,,Não aplicável.,Não aplicável.,FALSE
Aquisição de serviços de reparação de equipamentos representados pela Geranswers - Serviço de Imagiologia Geral I - MCDT's - Ressonância Magnética - Geral - CHLN - HSM,Ajuste Direto Regime Geral,Aquisição de serviços,"50421000-2, Serviços de reparação e manutenção de equipamento médico","Centro Hospitalar Lisboa Norte, E. P. E. (508481287)","GERANSWERS UNIPESSOAL, LDA (507683528)","7.010,00 €",09-10-2018,07-02-2018,5 dias,"Portugal, Lisboa, Lisboa","Artigo 24.º, n.º 1, alínea e), subalínea ii) do Código dos Contratos Públicos",,,,,,Não aplicável.,Não aplicável.,FALSE
Aquisição de serviços de manutenção às camas elétricas Mundinter para o ano de 2018,Ajuste Direto Regime Geral,Aquisição de serviços,"50421000-2, Serviços de reparação e manutenção de equipamento médico","Centro Hospitalar Lisboa Norte, E. P. E. (508481287)","MUNDINTER, S.A. (500199906)","47.695,20 €",09-10-2018,02-05-2018,243 dias,"Portugal, Lisboa, Lisboa","Artigo 24.º, n.º 1, alínea e), subalínea iii) do Código dos Contratos Públicos",,,,,,Não aplicável.,Não aplicável.,FALSE
AT tipo gold ao core de rede 2018/2019,Ajuste Direto Regime Geral,Aquisição de serviços,"72510000-3, Serviços de gestão relacionados com a informática","Centro Hospitalar Lisboa Norte, E. P. E. (508481287)","CLINET - Comunicações e Projectos Especiais, S.A. (505267772)","6.783,19 €",08-10-2018,08-10-2018,449 dias,"Portugal, Lisboa, Lisboa","Artigo 20.º, n.º 1, alínea d) do Código dos Contratos Públicos",,,,,,Não aplicável.,Não aplicável.,FALSE
Aquisição de concentrado de factor XIII inj. 1250 UI,Ajuste Direto Regime Geral,Aquisição de bens móveis,"33690000-3, Medicamentos vários","Centro Hospitalar Lisboa Norte, E. P. E. (508481287)","CSL BEHRING, LDA (503047201)","5.421,76 €",08-10-2018,08-10-2018,1 dias,"Portugal, Lisboa, Lisboa","Artigo 24.º, n.º 1, alínea e), subalínea iii) do Código dos Contratos Públicos",,,,,,Não aplicável.,Não aplicável.,FALSE
Aquisição de imunoglobulina 100 mg/ml inj. fr. 100 ml (10g) (privigen),Ajuste Direto Regime Geral,Aquisição de bens móveis,"33651520-9, Imunoglobulinas","Centro Hospitalar Lisboa Norte, E. P. E. (508481287)","CSL BEHRING, LDA (503047201)","163.716,00 €",08-10-2018,30-04-2018,1 dias,"Portugal, Lisboa, Lisboa","Artigo 24.º, n.º 1, alínea e), subalínea ii) do Código dos Contratos Públicos",,,,,,Não aplicável.,Não aplicável.,FALSE
Aquisição de pemetrexedo 500 mg inj. e pemetrexedo 100 mg inj.,Ajuste Direto Regime Geral,Aquisição de bens móveis,"33690000-3, Medicamentos vários","Centro Hospitalar Lisboa Norte, E. P. E. (508481287)","Lilly Portugal - Produtos Farmacêuticos, Lda. (500165602)","81.798,90 €",08-10-2018,29-03-2018,276 dias,"Portugal, Lisboa, Lisboa","Artigo 24.º, n.º 1, alínea e), subalínea ii) do Código dos Contratos Públicos",,,,,,Não aplicável.,Não aplicável.,FALSE
Aquisição de cobimetinib 20 mg comp.,Ajuste Direto Regime Geral,Aquisição de bens móveis,"33690000-3, Medicamentos vários","Centro Hospitalar Lisboa Norte, E. P. E. (508481287)","Roche farmacêutica Química, Lda (500233810)","10.139,85 €",08-10-2018,12-03-2018,294 dias,"Portugal, Lisboa, Lisboa","Artigo 24.º, n.º 1, alínea e), subalínea iii) do Código dos Contratos Públicos",,,,,,Não aplicável.,Não aplicável.,FALSE
Compra centralizada de medicamentos derivados do plasma para o ano de 2018 - AQ SPMS 2017/9 - P259-2018-75,Ao abrigo de acordo-quadro (art.º 259.º),Aquisição de bens móveis,"33690000-3, Medicamentos vários","Centro Hospitalar Lisboa Norte, E. P. E. (508481287)","Octapharma, Produtos Farmacêuticos, Lda. (502820780)","2.362.188,00 €",08-10-2018,08-10-2018,69 dias,"Portugal, Lisboa, Lisboa",Artigo 259.º do Código dos Contratos Públicos,,,,,,2800702,CP 2017/9 - Acordo quadro para fornecimento de Derivados do Plasma Humano às Instituições e Serviços do Serviço Nacional de Saúde,FALSE
Consulta Prévia n.º 182000091  -  Aquisição de Dispositivos de Perfusão Subcutânea de Insulina e respetivos Consumíveis no âmbito do Programa Nacional para a Prevenção e Controlo da Diabetes (PND),Ao abrigo de acordo-quadro (art.º 259.º),Aquisição de bens móveis,"33600000-6, Produtos farmacêuticos","Centro Hospitalar Lisboa Norte, E. P. E. (508481287)","Roche, Lda. (504282921)","151.350,00 €",08-10-2018,31-07-2018,212 dias,Portugal,Artigo 259.º do Código dos Contratos Públicos,,,,,,1442148,ACORDO QUADRO PARA FORNECIMENTO DE BOMBAS DE PERFUSÃO SUBCUTANEA CONTINUA DE INSULINA E RESPETIVOS CONSUMÍVEIS ÀS INSTITUIÇÕES E SERVIÇOS DO SERVIÇO NACIONAL DE SAÚDE. CP 2015/29,TRUE
Consulta Prévia n.º 182000091 - Aquisição de Dispositivos de Perfusão Subcutânea de Insulina e respetivos Consumíveis no âmbito do Programa Nacional para a Prevenção e Controlo da Diabetes (PND) - AQ n.º 2015/29,Ao abrigo de acordo-quadro (art.º 259.º),Aquisição de bens móveis,"33600000-6, Produtos farmacêuticos","Centro Hospitalar Lisboa Norte, E. P. E. (508481287)","Medtronic Portugal, Lda. (504223933)","48.450,00 €",08-10-2018,31-07-2018,153 dias,Portugal,Artigo 259.º do Código dos Contratos Públicos,,,,,,1442148,ACORDO QUADRO PARA FORNECIMENTO DE BOMBAS DE PERFUSÃO SUBCUTANEA CONTINUA DE INSULINA E RESPETIVOS CONSUMÍVEIS ÀS INSTITUIÇÕES E SERVIÇOS DO SERVIÇO NACIONAL DE SAÚDE. CP 2015/29,TRUE
Aquisição de hibridação DNA 4-Lâminas 16 amostras,Ajuste Direto Regime Geral,Aquisição de bens móveis,"33696000-5, Reagentes e meios de contraste","Centro Hospitalar Lisboa Norte, E. P. E. (508481287)","ILC - Instrumentos de Laboratório e Científicos, Lda (500948208)","11.112,00 €",08-10-2018,08-06-2018,176 dias,"Portugal, Lisboa, Lisboa","Artigo 24.º, n.º 1, alínea e), subalínea iii) do Código dos Contratos Públicos",,,,,,Não aplicável.,Não aplicável.,FALSE
Aquisição de fator VII recombinante sol. inj. 2 mg (novoseven),Ajuste Direto Regime Geral,Aquisição de bens móveis,"33690000-3, Medicamentos vários","Centro Hospitalar Lisboa Norte, E. P. E. (508481287)","Novo Nordisk - Comércio de Produtos Farmacêuticos, Lda. (501485210)","89.768,00 €",08-10-2018,21-08-2018,132 dias,"Portugal, Lisboa, Lisboa","Artigo 24.º, n.º 1, alínea e), subalínea iii) do Código dos Contratos Públicos",,,,,,Não aplicável.,Não aplicável.,FALSE
Aquisição de gactor VII recombinante  sol. inj. 2 mg (novoseven),Ajuste Direto Regime Geral,Aquisição de bens móveis,"33690000-3, Medicamentos vários","Centro Hospitalar Lisboa Norte, E. P. E. (508481287)","Novo Nordisk - Comércio de Produtos Farmacêuticos, Lda. (501485210)","112.210,00 €",08-10-2018,21-08-2018,132 dias,"Portugal, Lisboa, Lisboa","Artigo 24.º, n.º 1, alínea e), subalínea iii) do Código dos Contratos Públicos",,,,,,Não aplicável.,Não aplicável.,FALSE
Aquisição de imunoglobulina 100 mg/ml inj. fr. 50 ml,Ajuste Direto Regime Geral,Aquisição de bens móveis,"33690000-3, Medicamentos vários","Centro Hospitalar Lisboa Norte, E. P. E. (508481287)","CSL BEHRING, LDA (503047201)","48.725,00 €",08-10-2018,25-09-2018,97 dias,"Portugal, Lisboa, Lisboa","Artigo 24.º, n.º 1, alínea e), subalínea ii) do Código dos Contratos Públicos",,,,,,Não aplicável.,Não aplicável.,FALSE
Aquisição de vários reagentes,Ajuste Direto Regime Geral,Aquisição de bens móveis,"33696000-5, Reagentes e meios de contraste","Centro Hospitalar Lisboa Norte, E. P. E. (508481287)","ROCHE SISTEMAS DIAGNOSTICOS, SOC. UNIP. LDA (504282921)","76.718,40 €",08-10-2018,27-09-2018,95 dias,"Portugal, Lisboa, Lisboa","Artigo 24.º, n.º 1, alínea e), subalínea iii) do Código dos Contratos Públicos",,,,,,Não aplicável.,Não aplicável.,FALSE
"Aquisição de propofol sol, inj. 20 mg/ml frs. 50 ml",Ajuste Direto Regime Geral,Aquisição de bens móveis,"33690000-3, Medicamentos vários","Centro Hospitalar Lisboa Norte, E. P. E. (508481287)","FRESENIUS KABI PHARMA PORTUGAL,LDA (504293753)","5.058,00 €",08-10-2018,08-10-2018,1 dias,"Portugal, Lisboa, Lisboa","Artigo 24.º, n.º 1, alínea e), subalínea ii) do Código dos Contratos Públicos",,,,,,Não aplicável.,Não aplicável.,FALSE
Aquisição de material de pacing,Ajuste Direto Regime Geral,Aquisição de bens móveis,"33190000-8, Dispositivos e produtos médicos variados","Centro Hospitalar Lisboa Norte, E. P. E. (508481287)","Livanova Portugal, Lda. (505514010)","22.700,00 €",04-10-2018,04-10-2018,1 dias,"Portugal, Lisboa, Lisboa","Artigo 24.º, n.º 1, alínea e), subalínea ii) do Código dos Contratos Públicos",,,,,,Não aplicável.,Não aplicável.,FALSE
Aquisição de consumíveis do Serviço de Pneumologia - UPI,Ajuste Direto Regime Geral,Aquisição de bens móveis,"33140000-3, Material médico de consumo","Centro Hospitalar Lisboa Norte, E. P. E. (508481287)",OLYMPUS IBERIA S.A. SUCURSAL EM PORTUGAL (980474710),"24.430,00 €",04-10-2018,28-09-2018,1 dias,"Portugal, Lisboa, Lisboa","Artigo 24.º, n.º 1, alínea e), subalínea iii) do Código dos Contratos Públicos",,,,,,Não aplicável.,Não aplicável.,FALSE
Aquisição de stents coronários para o ano de 2018 - AQ. SPMS n.º 2017/34,Ao abrigo de acordo-quadro (art.º 259.º),Aquisição de bens móveis,"33111730-7, Material para angioplastia","Centro Hospitalar Lisboa Norte, E. P. E. (508481287)","Abbott LAboratórios, Lda. (500006148)","2.250,00 €",04-10-2018,04-10-2018,88 dias,"Portugal, Lisboa, Lisboa",Artigo 259.º do Código dos Contratos Públicos,,,,,,2771022,CP 2017/34 - Acordo quadro para fornecimento de Stents Coronários às Instituições e Serviços do Serviço Nacional de Saúde,FALSE
Aquisição de sents coronários para o ano de 2018 -AQ SPMS n.º 2017/34,Ao abrigo de acordo-quadro (art.º 259.º),Aquisição de bens móveis,"33111730-7, Material para angioplastia","Centro Hospitalar Lisboa Norte, E. P. E. (508481287)","Boston Scientific, Lda. (504988964)","16.500,00 €",04-10-2018,04-10-2018,88 dias,"Portugal, Lisboa, Lisboa",Artigo 259.º do Código dos Contratos Públicos,,,,,,2771022,CP 2017/34 - Acordo quadro para fornecimento de Stents Coronários às Instituições e Serviços do Serviço Nacional de Saúde,FALSE
Aquisição de stents coronários 2017/34 - P259-2018-124 para o ano de 2018,Ao abrigo de acordo-quadro (art.º 259.º),Aquisição de bens móveis,"33111730-7, Material para angioplastia","Centro Hospitalar Lisboa Norte, E. P. E. (508481287)","B. Braun Medical, Lda. (501506543)","32.400,00 €",04-10-2018,04-10-2018,88 dias,"Portugal, Lisboa, Lisboa",Artigo 259.º do Código dos Contratos Públicos,,,,,,2771022,CP 2017/34 - Acordo quadro para fornecimento de Stents Coronários às Instituições e Serviços do Serviço Nacional de Saúde,FALSE
Aquisição de METILPREDNISOLONA 4 MG COMP -2018,Ao abrigo de acordo-quadro (art.º 259.º),Aquisição de bens móveis,"33652200-7, Medicamentos usados na terapêutica endócrina","Centro Hospitalar Lisboa Norte, E. P. E. (508481287)","Laboratórios  Pfizer, Lda. (500162166)","66,88 €",03-10-2018,19-06-2018,195 dias,"Portugal, Lisboa, Lisboa",Artigo 259.º do Código dos Contratos Públicos,,,,,,1415640,CP 2015/7 - ACORDO QUADRO PARA FORNECIMENTO DE HORMONAS E OUTROS MEDICAMENTOS USADOS NO TRATAMENTO DAS DOENÇAS ENDÓCRINAS ÀS INSTITUIÇÕES E SERVIÇOS DO SERVIÇO NACIONAL DE SAÚDE,FALSE
181001167 - Aquisuição de OXAZEPAM COMP 15 MG - 2018,Ao abrigo de acordo-quadro (art.º 259.º),Aquisição de bens móveis,"33661000-1, Medicamentos para o sistema nervoso","Centro Hospitalar Lisboa Norte, E. P. E. (508481287)",MYLAN LDA (502248793),"286,65 €",03-10-2018,17-09-2018,105 dias,"Portugal, Lisboa, Lisboa",Artigo 259.º do Código dos Contratos Públicos,,,,,,2528670,"CP 2017/2 - Acordo Quadro para fornecimento de Medicamentos do Sistema Nervoso Cerebrospinal, exceto: anestésicos, relaxantes musculares, analgésicos, antipiréticos, antidepressivos e antipsicóticos  às Instituições e Serviços do Serviço Nacional de Saúde",FALSE
181001165 - Aquisição de medicamentos diversos - 2018,Ao abrigo de acordo-quadro (art.º 259.º),Aquisição de bens móveis,"33690000-3, Medicamentos vários","Centro Hospitalar Lisboa Norte, E. P. E. (508481287)","ANGELINI FARMACEUTICA, LDA (500583650)","111,10 €",03-10-2018,22-08-2018,131 dias,"Portugal, Lisboa, Lisboa",Artigo 259.º do Código dos Contratos Públicos,,,,,,2124520,CP 2016/55 - Medicamentos Diversos,FALSE
189G000253 - Empreitada de execução da obra de construção civil para novas instalações do centro de formação - CHLN - HPV,Ajuste Direto Regime Geral,Empreitadas de obras públicas,"45200000-9, Obras de construção total ou parcial e de engenharia civil","Centro Hospitalar Lisboa Norte, E. P. E. (508481287)","Tojalense - Trabalhos em Construção Civil, Unipessoal, Lda (505569400)","12.958,46 €",03-10-2018,26-01-2018,15 dias,"Portugal, Lisboa, Lisboa","Artigo 19.º, alínea d) do Código dos Contratos Públicos",,,,,,Não aplicável.,Não aplicável.,FALSE
Aquisição de hemoculturas anaerobios,Ajuste Direto Regime Geral,Aquisição de bens móveis,"33696000-5, Reagentes e meios de contraste","Centro Hospitalar Lisboa Norte, E. P. E. (508481287)","Biomerieux Portugal, Lda. (501524177)","8.625,00 €",03-10-2018,03-10-2018,1 dias,"Portugal, Lisboa, Lisboa","Artigo 24.º, n.º 1, alínea e), subalínea ii) do Código dos Contratos Públicos",,,,,,Não aplicável.,Não aplicável.,FALSE
Aquisição de cloridrato hidroxilamina 100 g,Consulta Prévia,Aquisição de bens móveis,"33690000-3, Medicamentos vários","Centro Hospitalar Lisboa Norte, E. P. E. (508481287)",José Manuel Gomes dos Santos (501399224),"21,00 €",03-10-2018,03-10-2018,1 dias,"Portugal, Lisboa, Lisboa",Artigo 27.º-A do Código dos Contratos Públicos,,,,,,Não aplicável.,Não aplicável.,FALSE
Empreitada para execução da obra de interligação do sistema de abastecimento de água quente e refrigerada das centrais térmicas do Serviço de Oncologia e Infecto.,Consulta Prévia,Empreitadas de obras públicas,"45232150-8, Obras relacionadas com condutas para abastecimento de água","Centro Hospitalar Lisboa Norte, E. P. E. (508481287)","Termopor, Lda. (502786183)","6.670,00 €",02-10-2018,02-10-2018,60 dias,"Portugal, Lisboa, Lisboa","Artigo 19.º, alínea c) do Código dos Contratos Públicos",,,,,,Não aplicável.,Não aplicável.,FALSE
Aquisição de 8 suportes de Urinóis - Serviço de Medicina II,Ajuste Direto Regime Geral,Aquisição de bens móveis,"44212313-6, Suportes","Centro Hospitalar Lisboa Norte, E. P. E. (508481287)","MUNDINTER, S.A. (500199906)","181,36 €",02-10-2018,02-10-2018,30 dias,"Portugal, Lisboa, Lisboa","Artigo 20.º, n.º 1, alínea a) do Código dos Contratos Públicos",,,,,,Não aplicável.,Não aplicável.,FALSE
"Aquisição de atalureno granulado p/ susp. oral - saqueta apenas representado pela empresa Logifarma, Logística Farmacêutic, S.A. - ano de 2018",Ajuste Direto Regime Geral,Aquisição de bens móveis,"33661700-8, Outros medicamentos para o sistema nervoso","Centro Hospitalar Lisboa Norte, E. P. E. (508481287)",Logifarma (503934640),"593.541,72 €",02-10-2018,12-09-2018,108 dias,"Portugal, Lisboa, Lisboa","Artigo 24.º, n.º 1, alínea e), subalínea iii) do Código dos Contratos Públicos",,,,,,Não aplicável.,Não aplicável.,FALSE
Prestação de serviços de seguros de vida para dadores e potenciais dadores vivos de orgãos - Ref.ª UAQT 2017007,Ao abrigo de acordo-quadro (art.º 259.º),Aquisição de serviços,"66510000-8, Serviços de seguros","Centro Hospitalar Lisboa Norte, E. P. E. (508481287)","Willis - Corretores de Seguros, SA (500188629)","14.473,20 €",02-10-2018,01-06-2018,365 dias,"Portugal, Lisboa, Lisboa","Artigo 24.º, n.º 1, alínea e), subalínea iii) do Código dos Contratos Públicos",,,,,,2648015,CONCURSO PÚBLICO COM PUBLICAÇÃO NO JOUE PARA A CELEBRAÇÃO DE ACORDO  QUADRO PARA A PRESTAÇÃO DE SERVIÇOS DE SEGUROS DE VIDA PARA OS DADORES E POTENCIAIS DADORES  VIVOS DE ÓRGÃOS,FALSE
Aquisição de equipamentos de televisão,Consulta Prévia,Aquisição de bens móveis,"32324100-1, Receptores de televisão a cores","Centro Hospitalar Lisboa Norte, E. P. E. (508481287)","SATURN NUMBERS, LDA (513576150)","53.200,00 €",02-10-2018,15-03-2018,30 dias,"Portugal, Lisboa, Lisboa","Artigo 20.º, n.º 1, alínea c) do Código dos Contratos Públicos",,,,,,Não aplicável.,Não aplicável.,FALSE
Aquisição de DS-DNA conj. DET 100 T,Ajuste Direto Regime Geral,Aquisição de bens móveis,"33696000-5, Reagentes e meios de contraste","Centro Hospitalar Lisboa Norte, E. P. E. (508481287)","Werfen Portugal, Ldª (501086110)","5.780,00 €",02-10-2018,02-10-2018,1 dias,"Portugal, Lisboa, Lisboa","Artigo 24.º, n.º 1, alínea e), subalínea ii) do Código dos Contratos Públicos",,,,,,Não aplicável.,Não aplicável.,FALSE
ECULIZUMAB 300 MG/30 ML INJ,Ajuste Direto Regime Geral,Aquisição de bens móveis,"33651520-9, Imunoglobulinas","Centro Hospitalar Lisboa Norte, E. P. E. (508481287)",ALEXION PHARMA SPAIN S.L. - SUCURSAL P (980553768),"102.935,30 €",02-10-2018,29-08-2018,124 dias,"Portugal, Lisboa, Lisboa","Artigo 24.º, n.º 1, alínea e), subalínea iii) do Código dos Contratos Públicos",,,,,,Não aplicável.,Não aplicável.,FALSE
Aquisição de sistema ID ABO/C cards 4x12,Ajuste Direto Regime Geral,Aquisição de bens móveis,"33696000-5, Reagentes e meios de contraste","Centro Hospitalar Lisboa Norte, E. P. E. (508481287)"," BIO-RAD LABORATORIES, LDA (501301321)","5.516,80 €",02-10-2018,01-10-2018,1 dias,"Portugal, Lisboa, Lisboa","Artigo 24.º, n.º 1, alínea e), subalínea ii) do Código dos Contratos Públicos",,,,,,Não aplicável.,Não aplicável.,FALSE
Ajuste direto nº 181G003037 - Aquisição de reagentes,Ajuste Direto Regime Geral,Aquisição de bens móveis,"33696000-5, Reagentes e meios de contraste","Centro Hospitalar Lisboa Norte, E. P. E. (508481287)","WERFEN PORTUGAL, LDA (501086110)","38.730,00 €",02-10-2018,14-08-2018,139 dias,"Portugal, Lisboa, Lisboa","Artigo 24.º, n.º 1, alínea e), subalínea iii) do Código dos Contratos Públicos",,,,,,Não aplicável.,Não aplicável.,FALSE
Aquisição de uretrocistoscópios para o Serviço de Urologia - Cirurgia de ambulatório,Consulta Prévia,Aquisição de bens móveis,"33125000-2, Material para exploração urológica","Centro Hospitalar Lisboa Norte, E. P. E. (508481287)",OLYMPUS IBERIA S.A. SUCURSAL EM PORTUGAL (980474710),"46.553,82 €",01-10-2018,27-09-2018,30 dias,"Portugal, Lisboa, Lisboa","Artigo 20.º, n.º 1, alínea c) do Código dos Contratos Públicos",,,,,,Não aplicável.,Não aplicável.,FALSE
ABL 800 SOLUÇÃO LAVAGEM 600 ML,Ajuste Direto Regime Geral,Aquisição de bens móveis,"33696000-5, Reagentes e meios de contraste","Centro Hospitalar Lisboa Norte, E. P. E. (508481287)",Radiometer (980201667),"15.796,80 €",01-10-2018,06-09-2018,116 dias,"Portugal, Lisboa, Lisboa","Artigo 24.º, n.º 1, alínea e), subalínea ii) do Código dos Contratos Públicos",,,,,,Não aplicável.,Não aplicável.,FALSE
EPOETINA BETA INJ 30.000 UI,Ajuste Direto Regime Geral,Aquisição de bens móveis,"33690000-3, Medicamentos vários","Centro Hospitalar Lisboa Norte, E. P. E. (508481287)",Roche (500233810),"19.080,00 €",01-10-2018,20-08-2018,133 dias,"Portugal, Lisboa, Lisboa","Artigo 24.º, n.º 1, alínea e), subalínea iii) do Código dos Contratos Públicos",,,,,,Não aplicável.,Não aplicável.,FALSE
REAGENTES DIVERSOS,Ajuste Direto Regime Geral,Aquisição de bens móveis,"33696000-5, Reagentes e meios de contraste","Centro Hospitalar Lisboa Norte, EPE (508481287)","WERFEN PORTUGAL, LDA (501086110)","38.400,00 €",01-10-2018,04-09-2018,118 dias,"Portugal, Lisboa, Lisboa","Artigo 24.º, n.º 1, alínea e), subalínea ii) do Código dos Contratos Públicos",,,,,,Não aplicável.,Não aplicável.,FALSE
"CP n.º 182A000022 - Aquisição de consumíveis para trombectomia intracraniana, durante o ano de 2018",Concurso público,Aquisição de bens móveis,"33111730-7, Material para angioplastia","Centro Hospitalar Lisboa Norte, E. P. E. (508481287)",PENUMBRA GMBH (DE815054796),"98.240,00 €",01-10-2018,27-09-2018,152 dias,"Portugal, Lisboa, Lisboa","Artigo 20.º, n.º 1, alínea a) do Código dos Contratos Públicos",,,,,,Não aplicável.,Não aplicável.,FALSE
"CP n.º 182A000022 - Aquisição de consumíveis para trombectomia intracraniana, durante o ano de 2018",Concurso público,Aquisição de bens móveis,"33111730-7, Material para angioplastia","Centro Hospitalar Lisboa Norte, E. P. E. (508481287)","Medicinália Cormédica-Comercialização de produtos Médico Hospitalares, Lda (500684324)","108.705,00 €",01-10-2018,27-09-2018,152 dias,"Portugal, Lisboa, Lisboa","Artigo 20.º, n.º 1, alínea a) do Código dos Contratos Públicos",,,,,,Não aplicável.,Não aplicável.,FALSE
FACTOR IX RECOMBINANTE 1000 UI INJ ( BENEFIX),Ajuste Direto Regime Geral,Aquisição de bens móveis,"33690000-3, Medicamentos vários","Centro Hospitalar Lisboa Norte, E. P. E. (508481287)","Pfizer Biofarmacêutica , Lda (513300376)","125.674,00 €",01-10-2018,10-09-2018,112 dias,"Portugal, Lisboa, Lisboa","Artigo 24.º, n.º 1, alínea e), subalínea iii) do Código dos Contratos Públicos",,,,,,Não aplicável.,Não aplicável.,FALSE
Aquisição de nicotina sisteam transderm 21 mg/24 H,Consulta Prévia,Aquisição de bens móveis,"33690000-3, Medicamentos vários","Centro Hospitalar Lisboa Norte, E. P. E. (508481287)",PIERRE FABRE DERMOCOSMETIQUE PORTUGAL LDA (501757635),"1.685,04 €",01-10-2018,01-10-2018,1 dias,"Portugal, Lisboa, Lisboa",Artigo 27.º-A do Código dos Contratos Públicos,,,,,,Não aplicável.,Não aplicável.,FALSE
D-DIMERO IL TESTE DET 115 T,Ajuste Direto Regime Geral,Aquisição de bens móveis,"33696000-5, Reagentes e meios de contraste","Centro Hospitalar Lisboa Norte, E. P. E. (508481287)","WERFEN PORTUGAL, LDA (501086110)","31.500,00 €",01-10-2018,04-09-2018,118 dias,"Portugal, Lisboa, Lisboa","Artigo 24.º, n.º 1, alínea e), subalínea ii) do Código dos Contratos Públicos",,,,,,Não aplicável.,Não aplicável.,FALSE
Aquisição de vaselina solida purificada pomada bisng,Consulta Prévia,Aquisição de bens móveis,"33690000-3, Medicamentos vários","Centro Hospitalar Lisboa Norte, E. P. E. (508481287)","PROCLINICA EQUIPAMENTOS E PRODUTOS  CLINICOS, LDA (500222665)","752,00 €",01-10-2018,27-09-2018,1 dias,"Portugal, Lisboa, Lisboa","Artigo 20.º, n.º 1, alínea c) do Código dos Contratos Públicos",,,,,,Não aplicável.,Não aplicável.,FALSE
Aquisição de vitamina A composta pomada bisn,Consulta Prévia,Aquisição de bens móveis,"33690000-3, Medicamentos vários","Centro Hospitalar Lisboa Norte, E. P. E. (508481287)","LABORATÓRIO MEDINFAR, S.A. (500384045)","2.520,00 €",01-10-2018,01-10-2018,1 dias,"Portugal, Lisboa, Lisboa","Artigo 20.º, n.º 1, alínea c) do Código dos Contratos Públicos",,,,,,Não aplicável.,Não aplicável.,FALSE
NT  PROBNP COBAS 8.000 CONJ DET 300 T,Ajuste Direto Regime Geral,Aquisição de bens móveis,"33696000-5, Reagentes e meios de contraste","Centro Hospitalar Lisboa Norte, EPE (508481287)",Roche Sistemas de Diagnósticos (504282921),"18.810,60 €",01-10-2018,04-09-2018,118 dias,"Portugal, Lisboa, Lisboa","Artigo 24.º, n.º 1, alínea e), subalínea ii) do Código dos Contratos Públicos",,,,,,Não aplicável.,Não aplicável.,FALSE
Oxigénio Líquido Medicinal,Ajuste Direto Regime Geral,Aquisição de bens móveis,"33690000-3, Medicamentos vários","Centro Hospitalar Lisboa Norte, E. P. E. (508481287)",LINDE PORTUGAL LDA (500266344),"39.600,00 €",01-10-2018,04-09-2018,118 dias,"Portugal, Lisboa, Lisboa","Artigo 24.º, n.º 1, alínea e), subalínea ii) do Código dos Contratos Públicos",,,,,,Não aplicável.,Não aplicável.,FALSE
CERITINIB 150 MG CAPS,Ajuste Direto Regime Geral,Aquisição de bens móveis,"33690000-3, Medicamentos vários","Centro Hospitalar Lisboa Norte, E. P. E. (508481287)","NOVARTIS FARMA-PROD.FARMACÊUTICOS,SA. (500063524)","14.103,86 €",01-10-2018,10-08-2018,143 dias,"Portugal, Lisboa, Lisboa","Artigo 24.º, n.º 1, alínea e), subalínea iii) do Código dos Contratos Públicos",,,,,,Não aplicável.,Não aplicável.,FALSE
Oxigénio Líquido Medicinal,Ajuste Direto Regime Geral,Aquisição de bens móveis,"33690000-3, Medicamentos vários","Centro Hospitalar Lisboa Norte, E. P. E. (508481287)",LINDE PORTUGAL LDA (500266344),"99.000,00 €",01-10-2018,28-08-2018,125 dias,"Portugal, Lisboa, Lisboa","Artigo 24.º, n.º 1, alínea e), subalínea ii) do Código dos Contratos Públicos",,,,,,Não aplicável.,Não aplicável.,FALSE
HEMOCULTURAS AEROBIOS P/A SISTEMA AUTOMATIZADO,Ajuste Direto Regime Geral,Aquisição de bens móveis,"33696000-5, Reagentes e meios de contraste","Centro Hospitalar Lisboa Norte, E. P. E. (508481287)","Quilaban, S.A. (500399670)","11.400,00 €",01-10-2018,30-08-2018,123 dias,"Portugal, Lisboa, Lisboa","Artigo 24.º, n.º 1, alínea e), subalínea ii) do Código dos Contratos Públicos",,,,,,Não aplicável.,Não aplicável.,FALSE
FACTOR VIII RECOMBINANTE 500 UI ( KOGENATE),Ajuste Direto Regime Geral,Aquisição de bens móveis,"33690000-3, Medicamentos vários","Centro Hospitalar Lisboa Norte, E. P. E. (508481287)","BAYER PORTUGAL, S.A. (500043256)","24.600,00 €",01-10-2018,04-09-2018,117 dias,"Portugal, Lisboa, Lisboa","Artigo 24.º, n.º 1, alínea e), subalínea ii) do Código dos Contratos Públicos",,,,,,Não aplicável.,Não aplicável.,FALSE
Concurso Público n.º 189A000018 - Aquisição de serviços de comunicações de voz em local fixo para entidades do Ministério da Saúde - Ref.ª 00059_2017,Concurso público,Aquisição de serviços,"64000000-6, Serviços postais e de telecomunicações","Centro Hospitalar Lisboa Norte, E. P. E. (508481287)","MEO - Serviços de Comunicações e Multimédia, S. A. (504615947)","9.751,00 €",01-10-2018,29-08-2018,275 dias,"Portugal, Lisboa, Lisboa","Artigo 20.º, n.º 1, alínea b) do Código dos Contratos Públicos",,,,,,Não aplicável.,Não aplicável.,TRUE
