freguesia,acronym,validVotesPercentage,votes,dicofre
São Brás de Alportel,PS,40.29,1017,081201
São Brás de Alportel,PPD/PSD,20.52,518,081201
São Brás de Alportel,B.E.,12.32,311,081201
São Brás de Alportel,PCP-PEV,6.77,171,081201
São Brás de Alportel,PAN,6.06,153,081201
São Brás de Alportel,CDS-PP,3.96,100,081201
São Brás de Alportel,A,2.14,54,081201
São Brás de Alportel,PPM.PPV/CDC,1.66,42,081201
São Brás de Alportel,L,1.62,41,081201
São Brás de Alportel,NC,1.11,28,081201
São Brás de Alportel,PCTP/MRPP,0.99,25,081201
São Brás de Alportel,PNR,0.59,15,081201
São Brás de Alportel,IL,0.55,14,081201
São Brás de Alportel,PDR,0.48,12,081201
São Brás de Alportel,PTP,0.44,11,081201
São Brás de Alportel,PURP,0.28,7,081201
São Brás de Alportel,MAS,0.2,5,081201
