Objeto do Contrato,Tipo de Procedimento,Tipo(s) de Contrato,CPVs,Entidade(s) Adjudicante(s),Entidade(s) Adjudicatária(s),Preço Contratual,Data de Publicação,Data de Celebração do Contrato,Prazo de Execução,Local de Execução,Fundamentação,Data de Fecho do Contrato,Preço Total Efetivo,Causas das Alterações ao Prazo,Causas das Alterações ao Preço,Estado,N.º registo do Acordo Quadro,Descrição do Acordo Quadro,Procedimento Centralizado
"Aquisição de serviços de armazenamento, produção e distribuição de kits no âmbito do Programa de Troca de Seringas para prevenção de VIH/SIDA",Concurso público,Aquisição de serviços,"79921000-6, Serviços de embalagem","SPMS - Serviços Partilhados do Ministério da Saúde, E. P. E. (509540716)","Efervescente - Design e Comunicação, Ldª (506738400)","107.850,00 €",26-05-2017,12-04-2017,365 dias,Portugal,"Artigo 21.º, n.º 1, alínea b) do Código dos Contratos Públicos","","",,,,Não aplicável.,Não aplicável.,FALSE
Aquisição de serviços especializados para apoio à área da contratação pública de bens e serviços,Concurso público,Aquisição de serviços,"79420000-4, Serviços relacionados com a gestão","SPMS - Serviços Partilhados do Ministério da Saúde, E. P. E. (509540716)","Ergoensaio - consultores de Gestão, Lda (508881978)","78.000,00 €",25-05-2017,10-04-2017,365 dias,Portugal,"Artigo 21.º, n.º 1, alínea b) do Código dos Contratos Públicos","","",,,,Não aplicável.,Não aplicável.,FALSE
"Aquisição de serviços para manutenção corretiva, preventiva e evolutiva do RHV(Recursos Humanos e Vencimentos) ",Ao abrigo de acordo-quadro (art.º 259.º),Aquisição de serviços,"71317200-5, Serviços de saúde e segurança","SPMS- Serviços Partilhados do M. da Saúde, E.P.E. (509540716)","Glintt - Healthcare Solutions, SA (502479418)","260.257,20 €",25-05-2017,18-04-2017,228 dias,Portugal,Artigo 259.º do Código dos Contratos Públicos,31-12-2017,"260.257,20 €",,,,2096651,Acordo quadro para Prestação de Serviços de Consultadoria na área Jurídica às Instituições e Serviços do Serviço Nacional de Saúde e entidades do Ministério da Saúde,FALSE
Aquisição de serviços de apoio ao PMO,Concurso público,Aquisição de serviços,"72500000-0, Serviços relacionados com a informática","SPMS - Serviços Partilhados do Ministério da Saúde, E. P. E. (509540716)","AltranPortugal, S.A. (504272179)","31.800,00 €",25-05-2017,13-04-2017,330 dias,Portugal,"Artigo 21.º, n.º 1, alínea b) do Código dos Contratos Públicos","","",,,,Não aplicável.,Não aplicável.,FALSE
Aquisição de serviços de auditoria e tunnig ao Sonho Hospitalar,Ao abrigo de acordo-quadro (art.º 259.º),Aquisição de serviços,"71317200-5, Serviços de saúde e segurança","SPMS- Serviços Partilhados do M. da Saúde, E.P.E. (509540716)","Everis Portugal, S.A. (506204650)","247.300,00 €",25-05-2017,20-04-2017,180 dias,Portugal,Artigo 259.º do Código dos Contratos Públicos,20-10-2017,"247.300,00 €",,,,2096651,Acordo quadro para Prestação de Serviços de Consultadoria na área Jurídica às Instituições e Serviços do Serviço Nacional de Saúde e entidades do Ministério da Saúde,FALSE
Aquisição de serviços especializados advanced customer support (ACS) Oracle,Ao abrigo de acordo-quadro (art.º 259.º),Aquisição de serviços,"72500000-0, Serviços relacionados com a informática","SPMS - Serviços Partilhados do Ministério da Saúde, E. P. E. (509540716)","NORMÁTICA - Serviços de Informática e Organização, S.A. (501782230)","195.000,00 €",25-05-2017,28-04-2017,365 dias,Portugal,Artigo 259.º do Código dos Contratos Públicos,"","",,,,610968,Acordo quadro de licenciamento de software e serviços conexos,FALSE
Aquisição de baterias para UPS do datacenter de Lisboa e Porto,Ajuste Direto Regime Geral,Aquisição de bens móveis,"31440000-2, Baterias","SPMS - Serviços Partilhados do Ministério da Saúde, E. P. E. (509540716)","Piferdal - Instalações Especiais, Lda (508850339)","19.980,00 €",25-05-2017,13-04-2017,255 dias,Portugal,"Artigo 20.º, n.º 1, alínea a) do Código dos Contratos Públicos",31-12-2017,"19.980,00 €",,,,Não aplicável.,Não aplicável.,FALSE
"Aquisição de serviços de revisão ás medidas de autoproteção dos edifícios sitos na Av. da República nº 61, Lisboa e na R. do Breiner 121, Porto, ações de formação e simulacros ",Ajuste Direto Regime Geral,Aquisição de serviços,"71340000-3, Serviços integrados de engenharia","SPMS- Serviços Partilhados do M. da Saúde, E.P.E. (509540716)","Ativa, Lda (514060743)","9.790,00 €",25-05-2017,17-05-2017,227 dias,Portugal,"Artigo 20.º, n.º 1, alínea a) do Código dos Contratos Públicos",31-12-2017,"9.790,00 €",,,,Não aplicável.,Não aplicável.,FALSE
Aquisição de mobiliário para as instalações da SPMS no Porto,Ajuste Direto Regime Geral,Aquisição de bens móveis,"39130000-2, Mobiliário de escritório","SPMS - Serviços Partilhados do Ministério da Saúde, E. P. E. (509540716)","Haworth Portugal - Mobiliário de escritório, S.A. (500077622)","24.315,20 €",25-05-2017,19-04-2017,60 dias,Portugal,"Artigo 20.º, n.º 1, alínea a) do Código dos Contratos Públicos",31-07-2017,"24.315,20 €",,,,Não aplicável.,Não aplicável.,FALSE
Aquisição de serviços de realização e divulgação do programa de informação e comunicação de saúde digital,Ajuste Direto Regime Geral,Aquisição de serviços,"64228200-2, Serviços de transmissão de emissões de rádio","SPMS- Serviços Partilhados do M. da Saúde, E.P.E. (509540716)",AIDFM - Assoc. para a Investigação e Desenvolvimento da Faculdade de Medicina de Lisboa. (503218111),"62.892,00 €",25-05-2017,07-04-2017,265 dias,Portugal,"Artigo 20.º, n.º 1, alínea a) do Código dos Contratos Públicos",31-12-2017,"62.892,00 €",,,,Não aplicável.,Não aplicável.,FALSE
Aquisição de serviços de manutenção e suporte do Licenciamento ORACLE para o Ministério da Saúde,Ao abrigo de acordo-quadro (art.º 259.º),Aquisição de bens móveis,"48218000-9, Pacote de software para gestão de licenças","SPMS - Serviços Partilhados do Ministério da Saúde, E. P. E. (509540716)","NORMÁTICA - Serviços de Informática e Organização, S.A. (501782230)","4.086.000,00 €",25-05-2017,20-02-2017,710 dias,Portugal,Artigo 259.º do Código dos Contratos Públicos,31-12-2017,"4.086.000,00 €",,,,610968,Acordo quadro de licenciamento de software e serviços conexos,FALSE
