Objeto do Contrato,Tipo de Procedimento,Tipo(s) de Contrato,CPVs,Entidade(s) Adjudicante(s),Entidade(s) Adjudicatária(s),Preço Contratual,Data de Publicação,Data de Celebração do Contrato,Prazo de Execução,Local de Execução,Fundamentação,Data de Fecho do Contrato,Preço Total Efetivo,Causas das Alterações ao Prazo,Causas das Alterações ao Preço,Estado,N.º registo do Acordo Quadro,Descrição do Acordo Quadro,Procedimento Centralizado
SC/177/2013 - Aquisição de Vacina Pneumocócica Polissacarida,Ao abrigo de acordo-quadro (art.º 259.º),Aquisição de bens móveis,"33651600-4, Vacinas","Administração Regional de Saúde do Algarve, I.P. (503148709)","Sanofi Pasteur MSD, S.A. (507632796)","82,20 €",17-05-2013,02-05-2013,240 dias,"Portugal, Faro",Artigo 259.º do Código dos Contratos Públicos,18-07-2013,"82,20 €","",,,105573,"CP 2009/13 -Concurso Público para a celebração de contratos públicos de aprovisionamento para a área da saúde com vista ao  fornecimento de vacinas e tuberculinas às Instituições e Serviços do Serviço Nacional de Saúde, e Regiões Autónomas",
SC/160/2013 - Aquisição de Testes Rápidos de Detecção da Infecção HIV/Sida,Ao abrigo de acordo-quadro (art.º 259.º),Aquisição de bens móveis,"33141622-6, Kits para prevenção da sida","Administração Regional de Saúde do Algarve, I.P. (503148709)","Bio Rad Laboratories - Aparelhos Reagentes Laboratórios, Lda. (501301321)","2.983,50 €",17-05-2013,10-05-2013,235 dias,"Portugal, Faro",Artigo 259.º do Código dos Contratos Públicos,24-09-2013,"2.983,50 €","",,,464738,"Concurso público para a celebração de contratos públicos de aprovisionamento para a área da saúde, com vista ao fornecimento de material de prevenção e deteção do HIV.",
AQUISIÇÃO DE REAGENTES PARA SETOR DE FISICO-QUIMICA DE ÁGUAS,Ajuste Direto Regime Geral,Aquisição de bens móveis,"33696500-0, Reagentes de laboratório","Administração Regional de Saúde do Algarve, I.P. (503148709)",VWR INTERNACIONAL MATERIAL DE LABORATORIO LDA. (503842770),"4.474,00 €",16-05-2013,16-05-2013,3 dias,"Portugal, Faro","Artigo 24.º, n.º 1, alínea e) do Código dos Contratos Públicos",17-07-2013,"4.474,00 €","",,,Não aplicável.,Não aplicável.,
"Aquisição produtos higiene ao abrigo do Lote 5 do AQ n.º 5 da ESPAP desenvolvido pela UMC da Secretaria Geral do Ministério da Saúde (Dado que o novo procedimento da UMC para 2013 ainda não se encontra concluído foi dada autorização por essa entidade para que, ao abrigo do disposto no artigo 3.º do contrato n.º 34/2012, o mesmo fosse elaborada uma adenda por um período estimado de 3 meses)  ",Ao abrigo de acordo-quadro (art.º 259.º),Aquisição de bens móveis,"33763000-6, Toalhas de mão de papel<BR/>33741000-6, Produtos para o cuidado das mãos<BR/>33772000-2, Artigos de papel descartáveis<BR/>33761000-2, Papel higiénico","Administração Regional de Saúde do Algarve, I. P. (503148709)","Fitisan - Produtos de Higiene e Embalagem, Lda. (506320073)","37.452,18 €",15-05-2013,29-04-2013,92 dias,"Portugal, Faro",Artigo 259.º do Código dos Contratos Públicos,31-03-2014,"37.452,18 €","O contrato inicial foi desenvolvido pela UMC-SGMS e a cláusula 3.ª do Contrato referia que vigorava até 31-12-2012, podendo ocorrer renovações mensais para além da data mencionada até à entrada em vigor de contrato proveniente de novo procedimento a desenvolver pela UMC-SGMS ao abrigo do AQ Higiene e Limpeza. Pelo exposto, registou-se inicialmente o contrato pelo período estimado transmitido pela UMC-SGMS como previsão para a conclusão do procedimento, contudo o mesmo não se concretizou no período estimado tendo ocorrido várias prorrogações mensais até à sua conclusão em 31-03-2014.",,,614429,Acordo quadro para higiene e limpeza,
Prestação de serviços de manutenção do software da Base de Dados de apoio ao Programa de Rastreio da Retinopatia Diabética,Ajuste Direto Regime Geral,Aquisição de serviços,"72261000-2, Serviços de assistência em matéria de software","Administração Regional de Saúde do Algarve, I.P. (503148709)","Adj 3 Sistemas - Projecto e Gestão de Sistemas Informáticos, Lda. (504026127)","1.944,09 €",15-05-2013,15-05-2013,365 dias,"Portugal, Faro","Artigo 24.º, n.º 1, alínea e) do Código dos Contratos Públicos",31-07-2014,"1.944,09 €","",,,Não aplicável.,Não aplicável.,
"Aquisição de incubadora de cuidados intensivos, Lote I, posição 1  ",Ajuste Direto Regime Geral,Aquisição de bens móveis,"33100000-1, Equipamento médico","Administração Regional de Saúde do Algarve, I.P. (503148709)","Sano-Técnica, Lda (500239819)","23.980,00 €",13-05-2013,10-05-2013,30 dias,"Portugal, Faro, Faro","Artigo 20.º, n.º 1, alínea a) do Código dos Contratos Públicos",07-06-2013,"23.980,00 €","",,,Não aplicável.,Não aplicável.,
