freguesia,acronym,validVotesPercentage,votes,dicofre
Medelim,PS,55.43,51,050506
Medelim,PPD/PSD,26.09,24,050506
Medelim,B.E.,5.43,5,050506
Medelim,CDS-PP,3.26,3,050506
Medelim,PAN,3.26,3,050506
Medelim,L,2.17,2,050506
Medelim,PCP-PEV,2.17,2,050506
Medelim,PCTP/MRPP,1.09,1,050506
Medelim,PPM.PPV/CDC,1.09,1,050506
Medelim,A,0,0,050506
Medelim,IL,0,0,050506
Medelim,MAS,0,0,050506
Medelim,NC,0,0,050506
Medelim,PDR,0,0,050506
Medelim,PNR,0,0,050506
Medelim,PTP,0,0,050506
Medelim,PURP,0,0,050506
