Objeto do Contrato,Tipo de Procedimento,Tipo(s) de Contrato,CPVs,Entidade(s) Adjudicante(s),Entidade(s) Adjudicatária(s),Preço Contratual,Data de Publicação,Data de Celebração do Contrato,Prazo de Execução,Local de Execução,Fundamentação,Data de Fecho do Contrato,Preço Total Efetivo,Causas das Alterações ao Prazo,Causas das Alterações ao Preço,Estado,N.º registo do Acordo Quadro,Descrição do Acordo Quadro,Procedimento Centralizado
CONTRATAÇÃO DE SERVIÇOS DE CONSULTORIA PARA DIAGNOSTICO E AVALIAÇÃO CONDUCENTE Á IMPLEMENTAÇÃO DO RGPD,Consulta Prévia,Aquisição de serviços,"85000000-9, Serviços de saúde e acção social","Centro Hospitalar Porto, E. P. E. (508331471)","KOFORI - SERVIÇOS DE ORGANIZAÇÃO E CONSULTORIA, LDA (513265864)","74.000,00 €",19-06-2018,06-03-2018,180 dias,"Portugal, Porto, Porto",Artigo 27.º-A do Código dos Contratos Públicos,,,,,,Não aplicável.,Não aplicável.,FALSE
FORNECIMENTO E MONTAGEM DE SCHILLERS PARA O SERVIÇO DE CARDIOLOGIA,Ajuste Direto Regime Geral,Aquisição de bens móveis,"42500000-1, Equipamento de refrigeração e ventilação","Centro Hospitalar Porto, E. P. E. (508331471)","Pinto & Cruz - Instalações e Manutenção, S.A (510134980)","64.100,00 €",11-06-2018,03-01-2018,30 dias,"Portugal, Porto, Porto","Artigo 20.º, n.º 1, alínea a) do Código dos Contratos Públicos",,,,,,Não aplicável.,Não aplicável.,FALSE
