freguesia,acronym,validVotesPercentage,votes,dicofre
União das freguesias de Cossourado e Linhares,PS,52.86,74,160523
União das freguesias de Cossourado e Linhares,PPD/PSD,15,21,160523
União das freguesias de Cossourado e Linhares,B.E.,9.29,13,160523
União das freguesias de Cossourado e Linhares,CDS-PP,5.71,8,160523
União das freguesias de Cossourado e Linhares,PAN,5.71,8,160523
União das freguesias de Cossourado e Linhares,L,2.14,3,160523
União das freguesias de Cossourado e Linhares,NC,1.43,2,160523
União das freguesias de Cossourado e Linhares,PCTP/MRPP,1.43,2,160523
União das freguesias de Cossourado e Linhares,PDR,1.43,2,160523
União das freguesias de Cossourado e Linhares,PPM.PPV/CDC,1.43,2,160523
União das freguesias de Cossourado e Linhares,PURP,1.43,2,160523
União das freguesias de Cossourado e Linhares,A,0.71,1,160523
União das freguesias de Cossourado e Linhares,MAS,0.71,1,160523
União das freguesias de Cossourado e Linhares,PCP-PEV,0.71,1,160523
União das freguesias de Cossourado e Linhares,IL,0,0,160523
União das freguesias de Cossourado e Linhares,PNR,0,0,160523
União das freguesias de Cossourado e Linhares,PTP,0,0,160523
