freguesia,acronym,validVotesPercentage,votes,dicofre
Meinedo,PS,49.06,629,130513
Meinedo,PPD/PSD.CDS-PP,22.93,294,130513
Meinedo,PCP-PEV,9.75,125,130513
Meinedo,MPT,6.71,86,130513
Meinedo,B.E.,3.04,39,130513
Meinedo,PCTP/MRPP,2.34,30,130513
Meinedo,L,1.56,20,130513
Meinedo,PAN,1.33,17,130513
Meinedo,PND,1.09,14,130513
Meinedo,PPM,0.78,10,130513
Meinedo,PNR,0.47,6,130513
Meinedo,PTP,0.47,6,130513
Meinedo,PPV,0.23,3,130513
Meinedo,MAS,0.16,2,130513
Meinedo,PDA,0.08,1,130513
Meinedo,POUS,0,0,130513
