Objeto do Contrato,Tipo de Procedimento,Tipo(s) de Contrato,CPVs,Entidade(s) Adjudicante(s),Entidade(s) Adjudicatária(s),Preço Contratual,Data de Publicação,Data de Celebração do Contrato,Prazo de Execução,Local de Execução,Fundamentação,Data de Fecho do Contrato,Preço Total Efetivo,Causas das Alterações ao Prazo,Causas das Alterações ao Preço,Estado,N.º registo do Acordo Quadro,Descrição do Acordo Quadro,Procedimento Centralizado
Prestação de serviços de manutenção e assistência técnica das infraestruturas de suporte ao Datacenter do ministério da Saúde,Ajuste Direto Regime Geral,Aquisição de serviços,"72500000-0, Serviços relacionados com a informática","Serviço Partilhados do Ministério da Saúde, E. P. E. (509540716)","Prologica - Sistemas Informáticos, S.A. (501432507)","19.733,36 €",11-05-2012,08-05-2012,244 dias,"Portugal, Portugal Continental","Artigo 20.º, n.º 1, alínea a) do Código dos Contratos Públicos",,,,,,Não aplicável.,Não aplicável.,
AQUISIÇÃO DE UMA SOLUÇÃO ANTIVIRUS E ANTI-SPAM PARA SPMS,Ajuste Direto Regime Geral,Aquisição de serviços<br/>Aquisição de bens móveis,"72500000-0, Serviços relacionados com a informática","Serviço Partilhados do Ministério da Saúde, E. P. E. (509540716)","COMPANHIA IBM PORTUGUESA, S.A. (500068801)","42.453,43 €",11-05-2012,08-05-2012,244 dias,"Portugal, Lisboa, Lisboa","Artigo 20.º, n.º 1, alínea a) do Código dos Contratos Públicos",,,,,,Não aplicável.,Não aplicável.,
"PRESTAÇÃO DE SERVIÇOS DE AUDITORIA FINANCEIRA NO CENTRO HOSPITALAR DE VILA NOVA DE GAIA/ESPINHO EPE, CENTRO HOSPITALAR DO PORTO EPE, CENTRO HOSPITALAR DE S. JOÃO EPE E ADMINISTRAÇÃO REGIONAL DE SAÚDE DO NORTE, IP",Ajuste Direto Regime Geral,Aquisição de serviços,"79212000-3, Serviços de auditoria","Serviço Partilhados do Ministério da Saúde, E. P. E. (509540716)","PRICEWATERHOUSECOOPERS & ASSOCIADOS, Sociedade de Revisores Oficiais de Contas, LDA (506628752)","96.500,01 €",09-05-2012,30-04-2012,60 dias,Portugal,"Artigo 20.º, n.º 1, alínea a) do Código dos Contratos Públicos",,,,,,Não aplicável.,Não aplicável.,
Prestação de Serviços de Desenvolvimento de Plataforma de Serviços Online para o Utente,Ajuste Direto Regime Geral,Aquisição de serviços,"72500000-0, Serviços relacionados com a informática","Serviço Partilhados do Ministério da Saúde, E. P. E. (509540716)","Softventure - Consultoria e Tecnologia, S.A. (511252277)","113.770,00 €",08-05-2012,07-05-2012,183 dias,"Portugal, Lisboa, Lisboa","Artigo 20.º, n.º 1, alínea a) do Código dos Contratos Públicos",,,,,,Não aplicável.,Não aplicável.,
Prestação de Serviços de Segurança e Vigilância,Ajuste Direto Regime Geral,Aquisição de serviços,"79000000-4, Serviços a empresas: direito, comercialização, consultoria, recrutamento, impressão e segurança","Serviço Partilhados do Ministério da Saúde, E. P. E. (509540716)","STRONG SEGURANÇA, LDA (503257567)","12.083,54 €",02-05-2012,01-05-2012,61 dias,"Portugal, Porto, Porto","Artigo 20.º, n.º 1, alínea a) do Código dos Contratos Públicos",,,,,,Não aplicável.,Não aplicável.,
Prestação de Serviços de Consultoria para Revisão do Contrato com a Microsoft,Ajuste Direto Regime Geral,Aquisição de serviços,"72500000-0, Serviços relacionados com a informática","Serviço Partilhados do Ministério da Saúde, E. P. E. (509540716)",GARTNER FRANCE SARL (350624102),"75.000,00 €",02-05-2012,24-04-2012,92 dias,Portugal,"Artigo 20.º, n.º 1, alínea a) do Código dos Contratos Públicos",,,,,,Não aplicável.,Não aplicável.,
Prestação de Serviços de Manutenção Aplicacional_Sistema de Classificação de Doentes Gestão Financeira,Ajuste Direto Regime Geral,Aquisição de serviços,"72500000-0, Serviços relacionados com a informática","Serviço Partilhados do Ministério da Saúde, E. P. E. (509540716)","SOFTINSA - Engenharia de Software Avançado, Lda (508207908)","86.883,00 €",02-05-2012,05-04-2012,274 dias,"Portugal, Lisboa","Artigo 20.º, n.º 1, alínea a) do Código dos Contratos Públicos",,,,,,Não aplicável.,Não aplicável.,
"SERVIÇOS DE AUDITORIA FINANCEIRA PARA AS ARS (S) CENTRO E ALENTEJO, INFARMED E CENTRO HOSPITALAR E UNIVERSITÁRIO DE COIMBRA",Ajuste Direto Regime Geral,Aquisição de serviços,"79212000-3, Serviços de auditoria","Serviço Partilhados do Ministério da Saúde, E. P. E. (509540716)",ERNST & YOUNG AUDIT & ASSOCIADOS SROC S.A. (505988283),"65.000,00 €",02-05-2012,19-04-2012,60 dias,Portugal,"Artigo 20.º, n.º 1, alínea a) do Código dos Contratos Públicos",,,,,,Não aplicável.,Não aplicável.,
"PRESTAÇÃO DE SERVIÇOS DE AUDITORIA FINANCEIRA PARA A ADMINISTRAÇÃO REGIONAL DE SAÚDE DO ALGARVE IP, CENTRO HOSPITALAR DE LISBOA NORTE EPE, ADMINISTRAÇÃO CENTRAL DO SISTEMA DE SAÚDE IP E HOSPITAL FERNANDO DA FONSECA EPE",Ajuste Direto Regime Geral,Aquisição de serviços,"79212000-3, Serviços de auditoria","Serviço Partilhados do Ministério da Saúde, E. P. E. (509540716)",ERNST & YOUNG AUDIT & ASSOCIADOS SROC S.A. (505988283),"69.500,00 €",02-05-2012,19-04-2012,60 dias,Portugal,"Artigo 20.º, n.º 1, alínea a) do Código dos Contratos Públicos",,,,,,Não aplicável.,Não aplicável.,
