Objeto do Contrato,Tipo de Procedimento,Tipo(s) de Contrato,CPVs,Entidade(s) Adjudicante(s),Entidade(s) Adjudicatária(s),Preço Contratual,Data de Publicação,Data de Celebração do Contrato,Prazo de Execução,Local de Execução,Fundamentação,Data de Fecho do Contrato,Preço Total Efetivo,Causas das Alterações ao Prazo,Causas das Alterações ao Preço,Estado,N.º registo do Acordo Quadro,Descrição do Acordo Quadro,Procedimento Centralizado
Obra de Remodelação de Espaço para Criação de Sala de Formação – Instalações Elétricas e de Comunicações,Ajuste Direto Regime Geral,Empreitadas de obras públicas,"45300000-0, Instalações em edifícios","Unidade Local de Saúde da Guarda, E. P. E. (508752000)","Mega Local, Ldª (508083877)","9.989,72 €",29-01-2018,24-01-2018,30 dias,"Portugal, Guarda, Guarda","Artigo 19.º, alínea a) do Código dos Contratos Públicos",,,,,,Não aplicável.,Não aplicável.,FALSE
Aquisição de Ativos de Rede para a ULS Guarda,Concurso público,Aquisição de bens móveis,"32428000-9, Melhoramento da rede","Unidade Local de Saúde da Guarda, E. P. E. (508752000)","MEO - SERVIÇOS DE COMUNICAÇÕES E MULTIMÉDIA, S.A. (504615947)","68.000,57 €",29-01-2018,25-01-2018,30 dias,"Portugal, Guarda, Guarda","Artigo 20.º, n.º 1, alínea b) do Código dos Contratos Públicos",,,,,,Não aplicável.,Não aplicável.,FALSE
"Aquisição de Serviços para Contentorização, Recolha, Tratamento e Transporte de Resíduos Sólidos Urbanos",Concurso público,Aquisição de serviços,"90511100-3, Serviços de recolha de resíduos sólidos urbanos","UNIDADE LOCAL DE SAÚDE DA GUARDA, E.P.E (508752000)","Suma, Serviços Urbanos e Meio Ambiente, S.A. (503210560)","25.920,00 €",26-01-2018,18-01-2018,365 dias,"Portugal, Guarda, Guarda","Artigo 20.º, n.º 1, alínea b) do Código dos Contratos Públicos",,,,,,Não aplicável.,Não aplicável.,FALSE
Aquisição de serviços de “Seguro Automóvel” para a frota da ULSG - 2018,Ajuste Direto Regime Geral,Aquisição de serviços,"66510000-8, Serviços de seguros","Unidade Local de Saúde da Guarda, E. P. E. (508752000)","Fidelidade Companhia de Seguros, S.A. (500918880)","11.184,98 €",24-01-2018,05-01-2018,365 dias,"Portugal, Guarda, Guarda","Artigo 20.º, n.º 1, alínea a) do Código dos Contratos Públicos",,,,,,Não aplicável.,Não aplicável.,FALSE
