Objeto do Contrato,Tipo de Procedimento,Tipo(s) de Contrato,CPVs,Entidade(s) Adjudicante(s),Entidade(s) Adjudicatária(s),Preço Contratual,Data de Publicação,Data de Celebração do Contrato,Prazo de Execução,Local de Execução,Fundamentação,Data de Fecho do Contrato,Preço Total Efetivo,Causas das Alterações ao Prazo,Causas das Alterações ao Preço,Estado,N.º registo do Acordo Quadro,Descrição do Acordo Quadro,Procedimento Centralizado
"Fornecimento de um serviço de locação de duas aeronaves iguais, tendo em vista a execução de operações secundárias e ocasionalmente, primárias, de transporte de doentes, compreendendo, designadamente, o transporte de equipas de emergência, do equipamento clínico e de quais quer outras pessoas ou objectos que sejam necessários ou convenientes para a realização daquelas operações. Fornecimento dos tripulantes, do combustível e dos serviços de manutenção necessários ao funcionamento das aeronaves e à execução das missões.",Ajuste Direto Regime Geral,Aquisição de serviços,"60424120-3, Aluguer de helicópteros, com tripulação","Instituto Nacional de Emergência Médica, IP (501356126)","INAER HELICOPTER PORTUGAL, LDA. (503546054)","923.512,00 €",10-01-2012,30-12-2011,91 dias,"Portugal, Portugal Continental","Artigo 27.º, n.º 1, alínea a) do Código dos Contratos Públicos","","",,,,Não aplicável.,Não aplicável.,
"Prestação de serviços de gestão de frota do INEM, IP., serviços estes que englobam a gestão da assistência, manutenção e reparações da frota de viaturas do Instituto, em qualquer ponto do território do continente.",Ajuste Direto Regime Geral,Aquisição de serviços,"50111000-6, Serviços de gestão, reparação e manutenção de frota de veículos","Instituto Nacional de Emergência Médica, IP (501356126)","FINLOG - Aluguer e Comércio de Automóveis, S.A. (502584866)","465.000,00 €",10-01-2012,30-12-2011,91 dias,"Portugal, Portugal Continental","Artigo 27.º, n.º 1, alínea a) do Código dos Contratos Públicos",21-08-2013,"698.669,96 €",,,,Não aplicável.,Não aplicável.,
"Prestação de serviço efectuada por 40 (quarenta) trabalhadores, obrigando-se o segundo outorgante a colocar na prestação de serviço os elementos, em número e perfil, indicados no convite do procedimento.",Ajuste Direto Regime Geral,Aquisição de serviços,"79620000-6, Serviços de fornecimento de pessoal, inclusive temporário","Instituto Nacional de Emergência Médica, IP (501356126)","PSICOTEMPOS - Empresa de Trabalho Temporário, Lda. (504617010)","185.679,84 €",09-01-2012,30-12-2011,91 dias,"Portugal, Portugal Continental","Artigo 24.º, n.º 1, alínea c) do Código dos Contratos Públicos","","",,,,Não aplicável.,Não aplicável.,
"Despesa com o complemento da viagem a Timor da 33ª Equipa, devido a um dos elementos não ter nacionalidade Portuguesa.",Ajuste Direto Regime Geral,Aquisição de serviços,"63515000-2, Serviços de viagens","Instituto Nacional de Emergência Médica, IP (501356126)",CLUBE VIAJAR (503542016),"350,00 €",09-01-2012,30-12-2011,30 dias,"Portugal, Lisboa, Lisboa","Artigo 27.º, n.º 1, alínea h) do Código dos Contratos Públicos","","",,,,Não aplicável.,Não aplicável.,
"Aquisição de serviços de seguros, mediante os quais são transferidos para uma seguradora os riscos de acidentes pessoais dos estagiários em equipas de emergência e os elementos escalados em equipas de apoio a eventos de risco.",Ajuste Direto Regime Geral,Aquisição de serviços,"66510000-8, Serviços de seguros","Instituto Nacional de Emergência Médica, IP (501356126)","VILLAS-BOAS ACP - Corretores Associados de Seguros, Lda. (500477540)","22.701,12 €",06-01-2012,30-12-2011,365 dias,"Portugal, Portugal Continental","Artigo 27.º, n.º 1, alínea a) do Código dos Contratos Públicos","","",,,,Não aplicável.,Não aplicável.,
"Aquisição de serviços de seguros, mediante os quais são transferidos para uma seguradora os riscos de acidentes pessoais da equipa de emergência médica.",Ajuste Direto Regime Geral,Aquisição de serviços,"66510000-8, Serviços de seguros","Instituto Nacional de Emergência Médica, IP (501356126)","VILLAS-BOAS ACP - Corretores Associados de Seguros, Lda.s (500477540)","21.486,30 €",06-01-2012,30-12-2011,365 dias,Timor Leste,"Artigo 24.º, n.º 1, alínea c) do Código dos Contratos Públicos","","",,,,Não aplicável.,Não aplicável.,
PRESTAÇÃO DE SERVIÇOS POR EMPRESA DE RECURSOS HUMANOS - ENFERMEIROS - HORAS QUALIDADE,Ajuste Direto Regime Geral,Aquisição de serviços,"79620000-6, Serviços de fornecimento de pessoal, inclusive temporário","Instituto Nacional de Emergência Médica, IP (501356126)","PSICOTEMPOS, LDA. (504617010)","2.417,97 €",06-01-2012,30-12-2011,30 dias,"Portugal, Lisboa, Lisboa","Artigo 24.º, n.º 1, alínea e) do Código dos Contratos Públicos","","",,,,Não aplicável.,Não aplicável.,
Assistencia técnica pós-venda do microsoft office desktop professional,Ajuste Direto Regime Geral,Aquisição de serviços,"72611000-6, Serviços de assistência técnica informática","Instituto Nacional de Emergência Médica, IP (501356126)",CPC (501267255),"88.886,40 €",06-01-2012,28-12-2011,30 dias,"Portugal, Lisboa, Lisboa","Artigo 27.º, n.º 1, alínea h) do Código dos Contratos Públicos","","",,,,Não aplicável.,Não aplicável.,
Aquisição de licenças microsoft business productivity online standard suite,Ajuste Direto Regime Geral,Aquisição de bens móveis,"22456000-1, Licenças","Instituto Nacional de Emergência Médica, IP (501356126)",CPC (501267255),"31.190,00 €",06-01-2012,21-12-2011,30 dias,"Portugal, Lisboa, Lisboa","Artigo 20.º, n.º 1, alínea a) do Código dos Contratos Públicos","","",,,,Não aplicável.,Não aplicável.,
AQUISIÇÃO DE 9 TELEVISORES,Ajuste Direto Regime Geral,Aquisição de bens móveis,"32000000-3, Equipamento de rádio, televisão, comunicação, telecomunicações e afins","Instituto Nacional de Emergência Médica, IP (501356126)",AVILECTROLARSOM (500039631),"3.593,50 €",06-01-2012,20-12-2011,30 dias,"Portugal, Lisboa, Lisboa","Artigo 20.º, n.º 1, alínea a) do Código dos Contratos Públicos","","",,,,Não aplicável.,Não aplicável.,
Aquisição de 60 kits de localização para ambulancias,Ajuste Direto Regime Geral,Aquisição de bens móveis,"38112100-4, Sistemas de navegação e posicionamento globais (GPS ou equivalentes)","Instituto Nacional de Emergência Médica, IP (501356126)",BCCM (503621404),"25.500,00 €",06-01-2012,27-12-2011,30 dias,"Portugal, Lisboa, Lisboa","Artigo 20.º, n.º 1, alínea a) do Código dos Contratos Públicos","","",,,,Não aplicável.,Não aplicável.,
Aquisição de mobiliário,Ajuste Direto Regime Geral,Aquisição de bens móveis,"39130000-2, Mobiliário de escritório","Instituto Nacional de Emergência Médica, IP (501356126)",TRIPOLO (501264124),"1.440,50 €",06-01-2012,09-12-2011,20 dias,"Portugal, Lisboa, Lisboa","Artigo 26.º, n.º 1, alínea e) do Código dos Contratos Públicos","","",,,,Não aplicável.,Não aplicável.,
Aquisição de estantes,Ajuste Direto Regime Geral,Aquisição de bens móveis,"39141100-3, Estantes","Instituto Nacional de Emergência Médica, IP (501356126)",TRIPOLO (501264124),"1.198,50 €",06-01-2012,23-12-2011,20 dias,"Portugal, Lisboa, Lisboa","Artigo 26.º, n.º 1, alínea e) do Código dos Contratos Públicos","","",,,,Não aplicável.,Não aplicável.,
PRESTAÇÃO DE SERVIÇO POR EMPRESA DE RECURSOS HUMANOS - ENFERMEIROS - HORAS QUALIDADE,Ajuste Direto Regime Geral,Aquisição de serviços,"79620000-6, Serviços de fornecimento de pessoal, inclusive temporário","Instituto Nacional de Emergência Médica, IP (501356126)","PSICOTEMPOS, LDA. (504617010)","2.201,39 €",06-01-2012,30-12-2011,30 dias,"Portugal, Lisboa, Lisboa","Artigo 24.º, n.º 1, alínea e) do Código dos Contratos Públicos","","",,,,Não aplicável.,Não aplicável.,
Aquisição de 100 ratos ópticos,Ao abrigo de acordo-quadro (art.º 258.º),Aquisição de bens móveis,"30237410-6, Ratos de computador","Instituto Nacional de Emergência Médica, IP (501356126)","CPCIS, SA (501267255)","263,00 €",05-01-2012,07-12-2011,30 dias,"Portugal, Lisboa, Lisboa",Artigo 258.º do Código dos Contratos Públicos,"","",,,,Não definido.,Não definido.,
Aquisição de 50 computadores de secretária e respectivos acessórios,Ao abrigo de acordo-quadro (art.º 258.º),Aquisição de bens móveis,"30213300-8, Computadores de secretária (desktop computers)","Instituto Nacional de Emergência Médica, IP (501356126)","CPCIS, SA (501267255)","18.717,50 €",05-01-2012,07-12-2011,30 dias,"Portugal, Lisboa, Lisboa",Artigo 258.º do Código dos Contratos Públicos,"","",,,,Não definido.,Não definido.,
Reparação do gerador que fornece energia ao Datacenter e CODU.,Ajuste Direto Regime Geral,Aquisição de serviços,"50000000-5, Serviços de reparação e manutenção","Instituto Nacional de Emergência Médica, IP (501356126)","GRUPEL, LDA. (500442029)","4.580,00 €",04-01-2012,28-12-2011,30 dias,"Portugal, Lisboa, Lisboa","Artigo 24.º, n.º 1, alínea e) do Código dos Contratos Públicos","","",,,,Não aplicável.,Não aplicável.,
- PARKA POLAR TAM.XS + PATCH – 6 UN<br />- PARKA POLAR TAM.S + PATCH – 60 UN<br />- PARKA POLAR TAM.M + PATCH – 100 UN<br />- PARKA POLAR TAM.L + PATCH – 43 UN<br />- PARKA POLAR TAM.XL + PATCH – 16 UN<br />- PARKA POLAR TAM.XXL + PATCH – 7 UN<br />- PARKA POLAR TAM.XXXL + PATCH – 2 UN,Ajuste Direto Regime Geral,Aquisição de bens móveis,"18221000-4, Vestuário impermeável","Instituto Nacional de Emergência Médica, IP (501356126)","DIAS & VICENTES, LDA. (500901694)","29.250,00 €",02-01-2012,21-10-2011,30 dias,"Portugal, Lisboa, Lisboa","Artigo 20.º, n.º 1, alínea a) do Código dos Contratos Públicos","","",,,,Não aplicável.,Não aplicável.,
Aquisição de Impressora de Cartões Datacard CD 800 e respectivo Software IdCentre Bronze.,Ajuste Direto Regime Geral,Aquisição de bens móveis,"30123000-7, Máquinas de escritório","Instituto Nacional de Emergência Médica, IP (501356126)","COPIGÉS, SA (507308646)","1.929,14 €",02-01-2012,29-11-2011,30 dias,"Portugal, Lisboa, Lisboa","Artigo 20.º, n.º 1, alínea a) do Código dos Contratos Públicos","","",,,,Não aplicável.,Não aplicável.,
"Aquisição de 1200 frascos de Paracetamol, sol. inj. 10mg/ml, fr. 100ml.",Ao abrigo de acordo-quadro (art.º 258.º),Aquisição de bens móveis,"33690000-3, Medicamentos vários","Instituto Nacional de Emergência Médica, IP (501356126)","COMBINO PHARM PORTUGAL, LDA. (508622263)","1.536,00 €",02-01-2012,20-12-2011,30 dias,"Portugal, Lisboa, Lisboa","Artigo 26.º, n.º 1, alínea c) do Código dos Contratos Públicos","","",,,,Não definido.,Não definido.,
