Objeto do Contrato,Tipo de Procedimento,Tipo(s) de Contrato,CPVs,Entidade(s) Adjudicante(s),Entidade(s) Adjudicatária(s),Preço Contratual,Data de Publicação,Data de Celebração do Contrato,Prazo de Execução,Local de Execução,Fundamentação,Data de Fecho do Contrato,Preço Total Efetivo,Causas das Alterações ao Prazo,Causas das Alterações ao Preço,Estado,N.º registo do Acordo Quadro,Descrição do Acordo Quadro,Procedimento Centralizado
20180494 - Reparação de analisador e espectrofotómetros,Ajuste Direto Regime Geral,Aquisição de serviços,"50000000-5, Serviços de reparação e manutenção","Instituto Nacional de Saúde Doutor Ricardo Jorge, I. P. (501427511)","Unicam - Sistemas Analiticos, Lda (502614625)","3.191,00 €",19-09-2018,19-09-2018,30 dias,"Portugal, Lisboa, Lisboa","Artigo 24.º, n.º 1, alínea e), subalínea iii) do Código dos Contratos Públicos",21-12-2018,"3.191,00 €",,"",,Não aplicável.,Não aplicável.,FALSE
CP 26-2018,Concurso público,Aquisição de bens móveis,"33696500-0, Reagentes de laboratório","Instituto Nacional de Saúde Doutor Ricardo Jorge, I. P. (501427511)","IZASA Scientific, Lda. (513252088)","7.147,00 €",19-09-2018,09-08-2018,183 dias,"Portugal, Lisboa, Lisboa","Artigo 20.º, n.º 1, alínea b) do Código dos Contratos Públicos","","",,"",,Não aplicável.,Não aplicável.,FALSE
CP 26-2018,Concurso público,Aquisição de bens móveis,"33696500-0, Reagentes de laboratório","Instituto Nacional de Saúde Doutor Ricardo Jorge, I. P. (501427511)","NORMAX - FÁBRICA DE VIDROS CIENTÍFICOS, LDA. (500203130)","450,00 €",19-09-2018,09-08-2018,183 dias,"Portugal, Lisboa, Lisboa","Artigo 20.º, n.º 1, alínea b) do Código dos Contratos Públicos","","",,"",,Não aplicável.,Não aplicável.,FALSE
20180402 - Aquisição de equipamento - Leitor de absorbancias para microplacas,Ajuste Direto Regime Geral,Aquisição de bens móveis,"38000000-5, Equipamento laboratorial, óptico e de precisão (exc. óculos)","Instituto Nacional de Saúde Doutor Ricardo Jorge, I. P. (501427511)",BIOGEN CIENTIFICA S.L. (B-79539441),"8.199,00 €",19-09-2018,14-09-2018,45 dias,"Portugal, Lisboa, Lisboa","Artigo 20.º, n.º 1, alínea d) do Código dos Contratos Públicos",16-11-2018,"8.199,00 €",,"",,Não aplicável.,Não aplicável.,FALSE
CP 26-2018,Concurso público,Aquisição de bens móveis,"33696500-0, Reagentes de laboratório","Instituto Nacional de Saúde Doutor Ricardo Jorge, I. P. (501427511)","VWR International - Material de Laboratório, Lda (503842770)","265,31 €",19-09-2018,09-08-2018,183 dias,"Portugal, Lisboa, Lisboa","Artigo 20.º, n.º 1, alínea b) do Código dos Contratos Públicos","","",,"",,Não aplicável.,Não aplicável.,FALSE
CP 26-2018,Concurso público,Aquisição de bens móveis,"33696500-0, Reagentes de laboratório","Instituto Nacional de Saúde Doutor Ricardo Jorge, I. P. (501427511)",KNOW-HOW (509884296),"80,00 €",19-09-2018,09-08-2018,183 dias,"Portugal, Lisboa, Lisboa","Artigo 20.º, n.º 1, alínea b) do Código dos Contratos Públicos","","",,"",,Não aplicável.,Não aplicável.,FALSE
CP 26-2018,Concurso público,Aquisição de bens móveis,"33696500-0, Reagentes de laboratório","Instituto Nacional de Saúde Doutor Ricardo Jorge, I. P. (501427511)","NZYTECH, LDA. (508432901)","896,00 €",19-09-2018,09-08-2018,183 dias,"Portugal, Lisboa, Lisboa","Artigo 20.º, n.º 1, alínea b) do Código dos Contratos Públicos","","",,"",,Não aplicável.,Não aplicável.,FALSE
CP 26-2018,Concurso público,Aquisição de bens móveis,"33696500-0, Reagentes de laboratório","Instituto Nacional de Saúde Doutor Ricardo Jorge, I. P. (501427511)","WERFEN PORTUGAL, LDA (501086110)","18.685,29 €",19-09-2018,17-08-2018,183 dias,"Portugal, Lisboa, Lisboa","Artigo 20.º, n.º 1, alínea b) do Código dos Contratos Públicos","","",,"",,Não aplicável.,Não aplicável.,FALSE
CP 26-2018,Concurso público,Aquisição de bens móveis,"33696500-0, Reagentes de laboratório","Instituto Nacional de Saúde Doutor Ricardo Jorge, I. P. (501427511)","Fisher Scientific, Lda (506429210)","19.063,37 €",19-09-2018,20-08-2018,183 dias,"Portugal, Lisboa, Lisboa","Artigo 20.º, n.º 1, alínea b) do Código dos Contratos Públicos","","",,"",,Não aplicável.,Não aplicável.,FALSE
20180487 - Aquisição de serviços de desinstalação e instalação de equipamento de laboratório,Ajuste Direto Regime Geral,Aquisição de serviços,"50000000-5, Serviços de reparação e manutenção","Instituto Nacional de Saúde Doutor Ricardo Jorge, I. P. (501427511)","Soquímica – Sociedade de Representações de Química, Lda. (500274231)","640,50 €",19-09-2018,13-09-2018,30 dias,"Portugal, Lisboa, Lisboa","Artigo 24.º, n.º 1, alínea e), subalínea iii) do Código dos Contratos Públicos",21-12-2018,"640,50 €",,"",,Não aplicável.,Não aplicável.,FALSE
CP 26-2018,Concurso público,Aquisição de bens móveis,"33696500-0, Reagentes de laboratório","Instituto Nacional de Saúde Doutor Ricardo Jorge, I. P. (501427511)","Biportugal, Quimico-Farmacêutica, Lda (502380543)","18.464,00 €",19-09-2018,13-08-2018,183 dias,"Portugal, Lisboa, Lisboa","Artigo 20.º, n.º 1, alínea b) do Código dos Contratos Públicos","","",,"",,Não aplicável.,Não aplicável.,FALSE
CP 26-2018,Concurso público,Aquisição de bens móveis,"33696500-0, Reagentes de laboratório","Instituto Nacional de Saúde Doutor Ricardo Jorge, I. P. (501427511)",BIO-RAD LABORATORIES LDA. (501301321),"18.219,20 €",19-09-2018,13-08-2018,183 dias,"Portugal, Lisboa, Lisboa","Artigo 20.º, n.º 1, alínea b) do Código dos Contratos Públicos","","",,"",,Não aplicável.,Não aplicável.,FALSE
20180468 - Aquisição de Consultoria Financeira,Consulta Prévia,Aquisição de serviços,"66171000-9, Serviços de consultoria financeira","Instituto Nacional de Saúde Doutor Ricardo Jorge, I. P. (501427511)","MSCTC - Consulting, Training &Technologies, Lda (510576303)","16.000,00 €",19-09-2018,03-09-2018,110 dias,"Portugal, Lisboa, Lisboa","Artigo 20.º, n.º 1, alínea c) do Código dos Contratos Públicos",05-12-2018,"16.000,00 €",,"",,Não aplicável.,Não aplicável.,FALSE
20180439 - Serviços de publicação,Ajuste Direto Regime Geral,Aquisição de serviços,"79970000-4, Serviços de publicação","Instituto Nacional de Saúde Doutor Ricardo Jorge, I. P. (501427511)",Elvira Maria Marques Silvestre (219559996),"9.930,00 €",18-09-2018,18-09-2018,100 dias,"Portugal, Lisboa, Lisboa","Artigo 20.º, n.º 1, alínea d) do Código dos Contratos Públicos",28-09-2018,"9.930,00 €",,"",,Não aplicável.,Não aplicável.,FALSE
"CP 25-2018 - Aquisição de reagentes para as áreas de Bioquímica Genética, Doenças Infeciosas e outras",Concurso público,Aquisição de bens móveis,"33696500-0, Reagentes de laboratório","Instituto Nacional de Saúde Doutor Ricardo Jorge, I. P. (501427511)","CSPSAUDE - Centro de Serviços Partilhados, SA (508440246)","159,48 €",13-09-2018,08-08-2018,152 dias,"Portugal, Lisboa, Lisboa","Artigo 20.º, n.º 1, alínea b) do Código dos Contratos Públicos","","",,"",,Não aplicável.,Não aplicável.,FALSE
"CP 25-2018 - Aquisição de reagentes para as áreas de Bioquímica Genética, Doenças Infeciosas e outras",Concurso público,Aquisição de bens móveis,"33696500-0, Reagentes de laboratório","Instituto Nacional de Saúde Doutor Ricardo Jorge, I. P. (501427511)",FRILABO II (507958861),"198,00 €",13-09-2018,08-08-2018,152 dias,"Portugal, Lisboa, Lisboa","Artigo 20.º, n.º 1, alínea b) do Código dos Contratos Públicos","","",,"",,Não aplicável.,Não aplicável.,FALSE
"CP 25-2018 - Aquisição de reagentes para as áreas de Bioquímica Genética, Doenças Infeciosas e outras",Concurso público,Aquisição de bens móveis,"33696500-0, Reagentes de laboratório","Instituto Nacional de Saúde Doutor Ricardo Jorge, I. P. (501427511)",QLABO-EQUIPAMENTOS DE LABORATORIO E (503829994),"558,90 €",13-09-2018,08-08-2018,152 dias,"Portugal, Lisboa, Lisboa","Artigo 20.º, n.º 1, alínea b) do Código dos Contratos Públicos","","",,"",,Não aplicável.,Não aplicável.,FALSE
"CP 25-2018 - Aquisição de reagentes para as áreas de Bioquímica Genética, Doenças Infeciosas e outras",Concurso público,Aquisição de bens móveis,"33696500-0, Reagentes de laboratório","Instituto Nacional de Saúde Doutor Ricardo Jorge, I. P. (501427511)",IRLANDOX (502515619),"450,00 €",13-09-2018,08-08-2018,152 dias,"Portugal, Lisboa, Lisboa","Artigo 20.º, n.º 1, alínea b) do Código dos Contratos Públicos","","",,"",,Não aplicável.,Não aplicável.,FALSE
"CP 25-2018 - Aquisição de reagentes para as áreas de Bioquímica Genética, Doenças Infeciosas e outras",Concurso público,Aquisição de bens móveis,"33696500-0, Reagentes de laboratório","Instituto Nacional de Saúde Doutor Ricardo Jorge, I. P. (501427511)","Alfagene - Novas Tecnologias Ciências da Vida, Ldª (503387398)","34,35 €",13-09-2018,08-08-2018,152 dias,"Portugal, Lisboa, Lisboa","Artigo 20.º, n.º 1, alínea b) do Código dos Contratos Públicos","","",,"",,Não aplicável.,Não aplicável.,FALSE
"CP 25-2018 - Aquisição de reagentes para as áreas de Bioquímica Genética, Doenças Infeciosas e outras",Concurso público,Aquisição de bens móveis,"33696500-0, Reagentes de laboratório","Instituto Nacional de Saúde Doutor Ricardo Jorge, I. P. (501427511)",Bio-Rad Laboratories (501301321),"9.800,00 €",13-09-2018,08-08-2018,152 dias,"Portugal, Lisboa, Lisboa","Artigo 20.º, n.º 1, alínea b) do Código dos Contratos Públicos","","",,"",,Não aplicável.,Não aplicável.,FALSE
"CP 25-2018 - Aquisição de reagentes para as áreas de Bioquímica Genética, Doenças Infeciosas e outras",Concurso público,Aquisição de bens móveis,"33696500-0, Reagentes de laboratório","Instituto Nacional de Saúde Doutor Ricardo Jorge, I. P. (501427511)","WERFEN PORTUGAL, LDA. (501086110)","11.499,05 €",13-09-2018,16-08-2018,152 dias,"Portugal, Lisboa, Lisboa","Artigo 20.º, n.º 1, alínea b) do Código dos Contratos Públicos","","",,"",,Não aplicável.,Não aplicável.,FALSE
20170785 - Material de consumo clínico,Ajuste Direto Regime Geral,Aquisição de bens móveis,"33000000-0, Equipamento médico, medicamentos e produtos para cuidados pessoais","Instituto Nacional de Saúde Doutor Ricardo Jorge, I. P. (501427511)",BECTON DICKINSON (514239743),"1.978,40 €",13-09-2018,30-11-2017,47 dias,"Portugal, Lisboa, Lisboa","Artigo 20.º, n.º 1, alínea a) do Código dos Contratos Públicos",28-12-2017,"1.978,40 €",,"O valor estimado foi superior às necessidades efetivas, considerando que estávamos no final do ano.",,Não aplicável.,Não aplicável.,FALSE
20180263 - Aquisição de reagentes para Projeto FIND,Consulta Prévia,Aquisição de bens móveis,"33696500-0, Reagentes de laboratório","Instituto Nacional de Saúde Doutor Ricardo Jorge, I. P. (501427511)","NZYTECH, LDA. (508432901)","51,00 €",13-09-2018,06-07-2018,90 dias,"Portugal, Lisboa, Lisboa","Artigo 20.º, n.º 1, alínea c) do Código dos Contratos Públicos","","",,"",,Não aplicável.,Não aplicável.,FALSE
20180380 - Serviço de instalação de 1 posto de carregamento de veículos elétricos,Consulta Prévia,Aquisição de serviços,"51110000-6, Serviços de instalação de equipamento eléctrico","Instituto Nacional de Saúde Doutor Ricardo Jorge, I. P. (501427511)","ZEEV, LDA. (510785905)","5.190,00 €",12-09-2018,18-07-2018,90 dias,"Portugal, Lisboa, Lisboa","Artigo 20.º, n.º 1, alínea c) do Código dos Contratos Públicos",06-11-2018,"5.190,00 €",,"",,Não aplicável.,Não aplicável.,FALSE
20180418 - Aquisição de reagentes e meios de cultura para Projeto PTDC/BIM-MEC,Ajuste Direto Regime Geral,Aquisição de bens móveis,"33696500-0, Reagentes de laboratório","Instituto Nacional de Saúde Doutor Ricardo Jorge, I. P. (501427511)","Alfagene - Novas Tecnologias Ciências da Vida, Ldª (503387398)","770,70 €",12-09-2018,23-08-2018,90 dias,"Portugal, Lisboa, Lisboa","Artigo 24.º, n.º 1, alínea e), subalínea iii) do Código dos Contratos Públicos",26-09-2018,"770,70 €",,"",,Não aplicável.,Não aplicável.,FALSE
20180476 - Aquisição de meio de cultura (BHI),Ajuste Direto Regime Geral,Aquisição de bens móveis,"33696500-0, Reagentes de laboratório","Instituto Nacional de Saúde Doutor Ricardo Jorge, I. P. (501427511)","PVL, Produtos de Laboratório, Ldª (501411852)","129,00 €",11-09-2018,10-09-2018,2 dias,"Portugal, Lisboa, Lisboa","Artigo 20.º, n.º 1, alínea d) do Código dos Contratos Públicos",15-10-2018,"129,00 €",,"",,Não aplicável.,Não aplicável.,FALSE
20180416 - Aquisição de reagentes para Projeto PTDC/BIM-MEC,Consulta Prévia,Aquisição de bens móveis,"33696500-0, Reagentes de laboratório","Instituto Nacional de Saúde Doutor Ricardo Jorge, I. P. (501427511)","LABORSPIRIT, Lda (507485149)","302,00 €",11-09-2018,24-08-2018,90 dias,"Portugal, Lisboa, Lisboa","Artigo 20.º, n.º 1, alínea c) do Código dos Contratos Públicos",06-12-2018,"302,00 €",,"",,Não aplicável.,Não aplicável.,FALSE
