Objeto do Contrato,Tipo de Procedimento,Tipo(s) de Contrato,CPVs,Entidade(s) Adjudicante(s),Entidade(s) Adjudicatária(s),Preço Contratual,Data de Publicação,Data de Celebração do Contrato,Prazo de Execução,Local de Execução,Fundamentação,Data de Fecho do Contrato,Preço Total Efetivo,Causas das Alterações ao Prazo,Causas das Alterações ao Preço,Estado,N.º registo do Acordo Quadro,Descrição do Acordo Quadro,Procedimento Centralizado
Medicamentos Secucinumab,Ajuste Direto Regime Geral,Aquisição de bens móveis,"33600000-6, Produtos farmacêuticos","Centro Hospitalar do Tâmega e Sousa, E.P.E. (508318262)","NOVARTIS FARMA - PRODUTOS FARMACÊUTICOS, S.A. (500063524)","4.151,20 €",09-11-2016,08-11-2016,53 dias,"Portugal, Porto, Penafiel<BR/>Portugal, Porto, Amarante","Artigo 24.º, n.º 1, alínea e) do Código dos Contratos Públicos",,,,,,Não aplicável.,Não aplicável.,FALSE
CONTRATAÇÃO DA PRESTAÇÃO DE SERVIÇOS DE SAÚDE,Ajuste Direto Regime Geral,Aquisição de serviços,"85120000-6, Serviços de prática médica e serviços conexos","Centro Hospitalar do Tâmega e Sousa, E. P. E. (508318262)",MARIA CECÍLIA PEREIRA FRUTUOSO (156422450),"8.400,00 €",09-11-2016,08-11-2016,53 dias,"Portugal, Porto, Amarante<BR/>Portugal, Porto, Penafiel","Artigo 20.º, n.º 1, alínea a) do Código dos Contratos Públicos",,,,,,Não aplicável.,Não aplicável.,FALSE
