Objeto do Contrato,Tipo de Procedimento,Tipo(s) de Contrato,CPVs,Entidade(s) Adjudicante(s),Entidade(s) Adjudicatária(s),Preço Contratual,Data de Publicação,Data de Celebração do Contrato,Prazo de Execução,Local de Execução,Fundamentação,Data de Fecho do Contrato,Preço Total Efetivo,Causas das Alterações ao Prazo,Causas das Alterações ao Preço,Estado,N.º registo do Acordo Quadro,Descrição do Acordo Quadro,Procedimento Centralizado
Prestação de serviços para o estudo que visa identificar as necessidades de formação em cuidados continuados integrados,Ajuste Direto Regime Geral,Aquisição de serviços,"71621000-7, Serviços técnicos de análise ou consultoria","Administração Central do Sistema de Saúde, I.P. (508188423)",Faculdade de Ciências Médicas da Universidade Nova de Lisboa (600018571),"64.500,00 €",27-03-2012,05-07-2010,304 dias,"Portugal, Lisboa, Lisboa","Artigo 20.º, n.º 1, alínea a) do Código dos Contratos Públicos",04-05-2011,"64.500,00 €",,,,Não aplicável.,Não aplicável.,
Aquisição serviços para revisão da metodologia de adaptação da matriz de Maryland,Ajuste Direto Regime Geral,Aquisição de serviços,"72200000-7, Serviços de consultoria e de programação de software","Administração Central do Sistema de Saúde, I.P. (508188423)","3M España, SA (A28078020)","72.887,50 €",22-03-2012,16-02-2012,180 dias,"Portugal, Lisboa, Lisboa","Artigo 20.º, n.º 1, alínea a) do Código dos Contratos Públicos",16-08-2012,"72.887,50 €",,,,Não aplicável.,Não aplicável.,
"Prestação serviços para atualização dos conteúdos dos suportes de comunicação da ACSS, IP",Ajuste Direto Regime Geral,Aquisição de serviços,"72400000-4, Serviços de Internet","Administração Central do Sistema de Saúde, I.P. (508188423)","Ineditcode, Lda (509681808)","29.762,40 €",22-03-2012,05-03-2012,365 dias,"Portugal, Lisboa, Lisboa","Artigo 20.º, n.º 1, alínea a) do Código dos Contratos Públicos",05-03-2013,"29.762,40 €",,,,Não aplicável.,Não aplicável.,
