Objeto do Contrato,Tipo de Procedimento,Tipo(s) de Contrato,CPVs,Entidade(s) Adjudicante(s),Entidade(s) Adjudicatária(s),Preço Contratual,Data de Publicação,Data de Celebração do Contrato,Prazo de Execução,Local de Execução,Fundamentação,Data de Fecho do Contrato,Preço Total Efetivo,Causas das Alterações ao Prazo,Causas das Alterações ao Preço,Estado,N.º registo do Acordo Quadro,Descrição do Acordo Quadro,Procedimento Centralizado
Aquisição de Material de Drenagen,Concurso público,Aquisição de bens móveis,"33141600-6, Tubos e sacos de drenagem e respectivos kits","Centro Hospitalar de Entre o Douro e Vouga, E.P.E. (508878462)","H.R. -  HOSPITALAR, LDA (501895558)","1.720,71 €",29-09-2017,06-09-2017,116 dias,"Portugal, Aveiro, Santa Maria da Feira","Artigo 20.º, n.º 1, alínea b) do Código dos Contratos Públicos",,,,,,Não aplicável.,Não aplicável.,FALSE
Aquisição de RITUximab 100 mg/10 ml sol inj fr 10 ml iv (P259-AC-2017-128),Ao abrigo de acordo-quadro (art.º 259.º),Aquisição de bens móveis,"33600000-6, Produtos farmacêuticos","Centro Hospitalar de Entre o Douro e Vouga, E.P.E. (508878462)","Roche Farmacêutica Química, Lda. (500233810)","1.256,94 €",29-09-2017,27-09-2017,96 dias,"Portugal, Aveiro, Santa Maria da Feira",Artigo 259.º do Código dos Contratos Públicos,,,,,,1771819,CP 2015/6 - Acordo quadro para o fornecimento de Medicamentos do Foro Oncológico,FALSE
Aquisição de Material de Drenagem,Concurso público,Aquisição de bens móveis,"33141600-6, Tubos e sacos de drenagem e respectivos kits","Centro Hospitalar de Entre o Douro e Vouga, E.P.E. (508878462)","VYGON (PORTUGAL) - PRODUTOS MEDICOS E FARMACÊUTICOS, LDA (503232785)","2.756,96 €",29-09-2017,06-09-2017,116 dias,"Portugal, Aveiro, Santa Maria da Feira","Artigo 20.º, n.º 1, alínea b) do Código dos Contratos Públicos",,,,,,Não aplicável.,Não aplicável.,FALSE
Aquisição de Material de Drenagem,Concurso público,Aquisição de bens móveis,"33141600-6, Tubos e sacos de drenagem e respectivos kits","Centro Hospitalar de Entre o Douro e Vouga, E.P.E. (508878462)",P.M.H (502376899),"11.140,40 €",29-09-2017,06-09-2017,116 dias,"Portugal, Aveiro, Santa Maria da Feira","Artigo 20.º, n.º 1, alínea b) do Código dos Contratos Públicos",,,,,,Não aplicável.,Não aplicável.,FALSE
Aquisição de Material de Drenagem,Concurso público,Aquisição de bens móveis,"33141600-6, Tubos e sacos de drenagem e respectivos kits","Centro Hospitalar de Entre o Douro e Vouga, E.P.E. (508878462)","MEDTRONIC PORTUGAL, LDA (504223933)","77,50 €",29-09-2017,06-09-2017,116 dias,"Portugal, Aveiro, Santa Maria da Feira","Artigo 20.º, n.º 1, alínea b) do Código dos Contratos Públicos",,,,,,Não aplicável.,Não aplicável.,FALSE
Aquisição de Material de Drenagem,Concurso público,Aquisição de bens móveis,"33141600-6, Tubos e sacos de drenagem e respectivos kits","Centro Hospitalar de Entre o Douro e Vouga, E.P.E. (508878462)","MEDICINALIA CORMEDICA - COMER. PROD. MED. HOSP.,LD (500684324)","2.011,35 €",29-09-2017,06-09-2017,116 dias,"Portugal, Aveiro, Santa Maria da Feira","Artigo 20.º, n.º 1, alínea b) do Código dos Contratos Públicos",,,,,,Não aplicável.,Não aplicável.,FALSE
Aquisição de Material de Drenagem,Concurso público,Aquisição de bens móveis,"33141600-6, Tubos e sacos de drenagem e respectivos kits","Centro Hospitalar de Entre o Douro e Vouga, E.P.E. (508878462)","HOSPITEX MATERIAL HOSPITALAR,LDA (501909842)","32,33 €",29-09-2017,06-09-2017,116 dias,"Portugal, Aveiro, Santa Maria da Feira","Artigo 20.º, n.º 1, alínea b) do Código dos Contratos Públicos",,,,,,Não aplicável.,Não aplicável.,FALSE
Aquisição de Material de Drenagem,Concurso público,Aquisição de bens móveis,"33141600-6, Tubos e sacos de drenagem e respectivos kits","Centro Hospitalar de Entre o Douro e Vouga, E.P.E. (508878462)","EPJMÉDICA, LDA. (506820513)","24,38 €",29-09-2017,06-09-2017,116 dias,"Portugal, Aveiro, Santa Maria da Feira","Artigo 20.º, n.º 1, alínea b) do Código dos Contratos Públicos",,,,,,Não aplicável.,Não aplicável.,FALSE
Aquisição de Material de Drenagem,Concurso público,Aquisição de bens móveis,"33141600-6, Tubos e sacos de drenagem e respectivos kits","Centro Hospitalar de Entre o Douro e Vouga, E.P.E. (508878462)","EUROCASMEDICA - PRODUTOS HOSPITALARES,SA (503322105)","293,75 €",29-09-2017,06-09-2017,116 dias,"Portugal, Aveiro, Santa Maria da Feira","Artigo 20.º, n.º 1, alínea b) do Código dos Contratos Públicos",,,,,,Não aplicável.,Não aplicável.,FALSE
Aquisição de Material de Drenagem,Concurso público,Aquisição de bens móveis,"33141600-6, Tubos e sacos de drenagem e respectivos kits","Centro Hospitalar de Entre o Douro e Vouga, E.P.E. (508878462)","DOCWORLD, LDA. (508592909)","1.886,88 €",29-09-2017,06-09-2017,116 dias,"Portugal, Aveiro, Santa Maria da Feira","Artigo 20.º, n.º 1, alínea b) do Código dos Contratos Públicos",,,,,,Não aplicável.,Não aplicável.,FALSE
Aquisição de Material de Drenagem,Concurso público,Aquisição de bens móveis,"33141600-6, Tubos e sacos de drenagem e respectivos kits","Centro Hospitalar de Entre o Douro e Vouga, E.P.E. (508878462)","KVTECH PORTUGAL-PRODUTOS MEDICOS,UNIP.LDA. (508671531)","360,42 €",29-09-2017,06-09-2017,116 dias,"Portugal, Aveiro, Santa Maria da Feira","Artigo 20.º, n.º 1, alínea b) do Código dos Contratos Públicos",,,,,,Não aplicável.,Não aplicável.,FALSE
Aquisição de Material de Drenagem,Concurso público,Aquisição de bens móveis,"33141600-6, Tubos e sacos de drenagem e respectivos kits","Centro Hospitalar de Entre o Douro e Vouga, E.P.E. (508878462)",Coloplast (503989037),"289,27 €",29-09-2017,06-09-2017,116 dias,"Portugal, Aveiro, Santa Maria da Feira","Artigo 20.º, n.º 1, alínea b) do Código dos Contratos Públicos",,,,,,Não aplicável.,Não aplicável.,FALSE
Aquisição de Material de Drenagem,Concurso público,Aquisição de bens móveis,"33141600-6, Tubos e sacos de drenagem e respectivos kits","Centro Hospitalar de Entre o Douro e Vouga, E.P.E. (508878462)",Cateter (502914319),"4.939,21 €",29-09-2017,06-09-2017,116 dias,"Portugal, Aveiro, Santa Maria da Feira","Artigo 20.º, n.º 1, alínea b) do Código dos Contratos Públicos",,,,,,Não aplicável.,Não aplicável.,FALSE
Aquisição de Material de Drenagem,Concurso público,Aquisição de bens móveis,"33141600-6, Tubos e sacos de drenagem e respectivos kits","Centro Hospitalar de Entre o Douro e Vouga, E.P.E. (508878462)","B BRAUN MEDICAL, LDA.                              (501506543)","1.002,50 €",29-09-2017,06-09-2017,116 dias,"Portugal, Aveiro, Santa Maria da Feira","Artigo 20.º, n.º 1, alínea b) do Código dos Contratos Públicos",,,,,,Não aplicável.,Não aplicável.,FALSE
Aquisição de Material de Drenagem,Concurso público,Aquisição de bens móveis,"33141600-6, Tubos e sacos de drenagem e respectivos kits","Centro Hospitalar de Entre o Douro e Vouga, E.P.E. (508878462)",AVIQUIMICA IMPORT E MANUFATURA (500039720),"5.362,92 €",29-09-2017,06-09-2017,116 dias,"Portugal, Aveiro, Santa Maria da Feira","Artigo 20.º, n.º 1, alínea b) do Código dos Contratos Públicos",,,,,,Não aplicável.,Não aplicável.,FALSE
Aquisição do medicamento “Palbociclib”,Ajuste Direto Regime Geral,Aquisição de bens móveis,"33600000-6, Produtos farmacêuticos","Centro Hospitalar de Entre o Douro e Vouga, E.P.E. (508878462)","Pfizer Biofarmacêutica, Sociedade Unipessoal Lda. (513300376)","14.833,34 €",28-09-2017,24-08-2017,130 dias,"Portugal, Aveiro, Santa Maria da Feira","Artigo 24.º, n.º 1, alínea e) do Código dos Contratos Públicos",,,,,,Não aplicável.,Não aplicável.,FALSE
Aquisição do medicamento “Ustecinumab 90mg/1ml”,Ajuste Direto Regime Geral,Aquisição de bens móveis,"33600000-6, Produtos farmacêuticos","CENTRO HOSPITALAR DE ENTRE O DOURO E VOUGA, E.P.E. (508878462)","Janssen Cilag Farmacêutica, Lda (500189412)","16.102,00 €",27-09-2017,24-08-2017,130 dias,"Portugal, Aveiro, Santa Maria da Feira","Artigo 24.º, n.º 1, alínea e) do Código dos Contratos Públicos",,,,,,Não aplicável.,Não aplicável.,FALSE
Aquisição de Infliximab - Infletra (AD-AC-2017-85),Ajuste Direto Regime Geral,Aquisição de bens móveis,"33600000-6, Produtos farmacêuticos","Centro Hospitalar de Entre o Douro e Vouga, E.P.E. (508878462)",LAB. PFIZER (500162166),"83.644,14 €",27-09-2017,09-08-2017,145 dias,"Portugal, Aveiro, Santa Maria da Feira","Artigo 24.º, n.º 1, alínea e) do Código dos Contratos Públicos",,,,,,Não aplicável.,Não aplicável.,FALSE
Aquisição de Trastuzumab – Medicamentos Exclusivos Roche,Ajuste Direto Regime Geral,Aquisição de bens móveis,"33600000-6, Produtos farmacêuticos","Centro Hospitalar de Entre o Douro e Vouga, E.P.E. (508878462)","Roche Farmacêutica Química, Lda. (500233810)","246.520,65 €",27-09-2017,18-05-2017,257 dias,"Portugal, Aveiro, Santa Maria da Feira","Artigo 24.º, n.º 1, alínea e) do Código dos Contratos Públicos",,,,,,Não aplicável.,Não aplicável.,FALSE
Remodelação e ampliação do serviço de Consulta Externa da Unidade de Santa Maria da Feira,Ajuste Direto Regime Geral,Empreitadas de obras públicas,"45454000-4, Obras de reestruturação","CENTRO HOSPITALAR DE ENTRE O DOURO E VOUGA, E.P.E. (508878462)","Alçado Sul - Sociedade de Construções, LDA (509910068)","149.482,15 €",22-09-2017,04-04-2017,120 dias,"Portugal, Aveiro, Santa Maria da Feira","Artigo 19.º, alínea a) do Código dos Contratos Públicos",,,,,,Não aplicável.,Não aplicável.,FALSE
Aq. do medicamento “Palbociclib”,Ajuste Direto Regime Geral,Aquisição de bens móveis,"33000000-0, Equipamento médico, medicamentos e produtos para cuidados pessoais","Centro Hospitalar de Entre o Douro e Vouga, E.P.E. (508878462)","Pfizer Biofarmacêutica, Sociedade Unipessoal Lda. (513300376)","31.500,01 €",22-09-2017,17-08-2017,136 dias,"Portugal, Aveiro, Santa Maria da Feira","Artigo 24.º, n.º 1, alínea e) do Código dos Contratos Públicos",,,,,,Não aplicável.,Não aplicável.,FALSE
"""""ASTRAIA SOFTWARE – ASTRIMED""""",Ajuste Direto Regime Geral,Aquisição de serviços,"50000000-5, Serviços de reparação e manutenção","Centro Hospitalar de Entre o Douro e Vouga, E.P.E. (508878462)",Astrimed (507007867),"3.520,00 €",22-09-2017,05-06-2017,210 dias,"Portugal, Aveiro, Santa Maria da Feira","Artigo 24.º, n.º 1, alínea e) do Código dos Contratos Públicos",,,,,,Não aplicável.,Não aplicável.,FALSE
Aq. de Imunoglobulina Humana 5%,Ajuste Direto Regime Geral,Aquisição de bens móveis,"33000000-0, Equipamento médico, medicamentos e produtos para cuidados pessoais","Centro Hospitalar de Entre o Douro e Vouga, E.P.E. (508878462)","OCTAPHARMA-PRODUTOS FARMACEUTICOS, LDA (502820780)","142.695,00 €",21-09-2017,03-08-2016,44 dias,"Portugal, Aveiro, Santa Maria da Feira","Artigo 24.º, n.º 1, alínea c) do Código dos Contratos Públicos",,,,,,Não aplicável.,Não aplicável.,FALSE
Aq. de Medicamentos ao Abrigo do Acordo Quadro SPMS,Ao abrigo de acordo-quadro (art.º 259.º),Aquisição de bens móveis,"33000000-0, Equipamento médico, medicamentos e produtos para cuidados pessoais","Centro Hospitalar de Entre o Douro e Vouga, E.P.E. (508878462)","GRIFOLS PORTUGAL - PROD. FARMAC. E HOSP., LDA. (502041285)","240,90 €",21-09-2017,06-07-2016,96 dias,"Portugal, Aveiro, Santa Maria da Feira",Artigo 259.º do Código dos Contratos Públicos,,,,,,1423488,ACORDO QUADRO PARA FORNECIMENTO DE DERIVADOS DO PLASMA HUMANO ÀS INSTITUIÇÕES E SERVIÇOS DO SERVIÇO NACIONAL DE SAÚDE CP 2015/9,FALSE
Aq. de Derivados do Plasma - Posições desertas,Ao abrigo de acordo-quadro (art.º 259.º),Aquisição de bens móveis,"33000000-0, Equipamento médico, medicamentos e produtos para cuidados pessoais","Centro Hospitalar de Entre o Douro e Vouga, E.P.E. (508878462)","OCTAPHARMA-PRODUTOS FARMACEUTICOS, LDA (502820780)","6.120,96 €",21-09-2017,16-11-2016,35 dias,"Portugal, Aveiro, Santa Maria da Feira",Artigo 259.º do Código dos Contratos Públicos,,,,,,1423488,ACORDO QUADRO PARA FORNECIMENTO DE DERIVADOS DO PLASMA HUMANO ÀS INSTITUIÇÕES E SERVIÇOS DO SERVIÇO NACIONAL DE SAÚDE CP 2015/9,FALSE
Aq. de Medicamentos ao Abrigo do Acordo Quadro SPMS,Ao abrigo de acordo-quadro (art.º 259.º),Aquisição de bens móveis,"33000000-0, Equipamento médico, medicamentos e produtos para cuidados pessoais","Centro Hospitalar de Entre o Douro e Vouga, E.P.E. (508878462)","CSL BEHRING, LDA. (503047201)","455,00 €",21-09-2017,06-07-2016,96 dias,"Portugal, Aveiro, Santa Maria da Feira",Artigo 259.º do Código dos Contratos Públicos,,,,,,1423488,ACORDO QUADRO PARA FORNECIMENTO DE DERIVADOS DO PLASMA HUMANO ÀS INSTITUIÇÕES E SERVIÇOS DO SERVIÇO NACIONAL DE SAÚDE CP 2015/9,FALSE
Aq. Derivados Plasma Humano,Ao abrigo de acordo-quadro (art.º 259.º),Aquisição de bens móveis,"33000000-0, Equipamento médico, medicamentos e produtos para cuidados pessoais","Centro Hospitalar de Entre o Douro e Vouga, E.P.E. (508878462)","Takeda - Farmacêuticos Portugal, Lda. (502801204)","16.566,00 €",21-09-2017,29-06-2016,85 dias,"Portugal, Aveiro, Santa Maria da Feira",Artigo 259.º do Código dos Contratos Públicos,,,,,,1423488,ACORDO QUADRO PARA FORNECIMENTO DE DERIVADOS DO PLASMA HUMANO ÀS INSTITUIÇÕES E SERVIÇOS DO SERVIÇO NACIONAL DE SAÚDE CP 2015/9,FALSE
Aq. Derivados Plasma Humano,Ao abrigo de acordo-quadro (art.º 259.º),Aquisição de bens móveis,"33000000-0, Equipamento médico, medicamentos e produtos para cuidados pessoais","Centro Hospitalar de Entre o Douro e Vouga, E.P.E. (508878462)","OCTAPHARMA-PRODUTOS FARMACEUTICOS, LDA (502820780)","8.750,00 €",21-09-2017,29-06-2016,85 dias,"Portugal, Aveiro, Santa Maria da Feira",Artigo 259.º do Código dos Contratos Públicos,,,,,,1423488,ACORDO QUADRO PARA FORNECIMENTO DE DERIVADOS DO PLASMA HUMANO ÀS INSTITUIÇÕES E SERVIÇOS DO SERVIÇO NACIONAL DE SAÚDE CP 2015/9,FALSE
Aq. Derivados do Plasma Humano,Ao abrigo de acordo-quadro (art.º 259.º),Aquisição de bens móveis,"33000000-0, Equipamento médico, medicamentos e produtos para cuidados pessoais","Centro Hospitalar de Entre o Douro e Vouga, E.P.E. (508878462)","CSL BEHRING, LDA. (503047201)","4.000,00 €",21-09-2017,29-06-2016,85 dias,"Portugal, Aveiro, Santa Maria da Feira",Artigo 259.º do Código dos Contratos Públicos,,,,,,1423488,ACORDO QUADRO PARA FORNECIMENTO DE DERIVADOS DO PLASMA HUMANO ÀS INSTITUIÇÕES E SERVIÇOS DO SERVIÇO NACIONAL DE SAÚDE CP 2015/9,FALSE
Aq. Derivados do Plasma,Ao abrigo de acordo-quadro (art.º 259.º),Aquisição de bens móveis,"33000000-0, Equipamento médico, medicamentos e produtos para cuidados pessoais","Centro Hospitalar de Entre o Douro e Vouga, E.P.E. (508878462)",BAXTER MEDICO FARMACEUTICA LDA (503347345),"416,00 €",21-09-2017,29-06-2016,85 dias,"Portugal, Aveiro, Santa Maria da Feira",Artigo 259.º do Código dos Contratos Públicos,,,,,,1423488,ACORDO QUADRO PARA FORNECIMENTO DE DERIVADOS DO PLASMA HUMANO ÀS INSTITUIÇÕES E SERVIÇOS DO SERVIÇO NACIONAL DE SAÚDE CP 2015/9,FALSE
Imunoglobulina humana Contra Antigenio D 1500 U.I. /2 ml sol. inj. seringa 2 ml IM/IV,Ao abrigo de acordo-quadro (art.º 259.º),Aquisição de bens móveis,"33000000-0, Equipamento médico, medicamentos e produtos para cuidados pessoais","Centro Hospitalar de Entre o Douro e Vouga, E.P.E. (508878462)","CSL BEHRING, LDA. (503047201)","4.401,59 €",21-09-2017,22-06-2016,154 dias,"Portugal, Aveiro, Santa Maria da Feira",Artigo 259.º do Código dos Contratos Públicos,,,,,,1423488,ACORDO QUADRO PARA FORNECIMENTO DE DERIVADOS DO PLASMA HUMANO ÀS INSTITUIÇÕES E SERVIÇOS DO SERVIÇO NACIONAL DE SAÚDE CP 2015/9,FALSE
Aq. Medicamentos: Derivados Plasma Humano,Ao abrigo de acordo-quadro (art.º 259.º),Aquisição de bens móveis,"33000000-0, Equipamento médico, medicamentos e produtos para cuidados pessoais","Centro Hospitalar de Entre o Douro e Vouga, E.P.E. (508878462)","OCTAPHARMA-PRODUTOS FARMACEUTICOS, LDA (502820780)","7.652,70 €",21-09-2017,22-06-2016,107 dias,"Portugal, Aveiro, Santa Maria da Feira",Artigo 259.º do Código dos Contratos Públicos,,,,,,1423488,ACORDO QUADRO PARA FORNECIMENTO DE DERIVADOS DO PLASMA HUMANO ÀS INSTITUIÇÕES E SERVIÇOS DO SERVIÇO NACIONAL DE SAÚDE CP 2015/9,FALSE
Aq. Centralizada de Medicamentos - Derivados do Plasma Humano,Ao abrigo de acordo-quadro (art.º 259.º),Aquisição de bens móveis,"33000000-0, Equipamento médico, medicamentos e produtos para cuidados pessoais","Centro Hospitalar de Entre o Douro e Vouga, E.P.E. (508878462)","GRIFOLS PORTUGAL - PROD. FARMAC. E HOSP., LDA. (502041285)","19.665,00 €",21-09-2017,27-07-2016,153 dias,"Portugal, Aveiro, Santa Maria da Feira",Artigo 259.º do Código dos Contratos Públicos,,,,,,535788,"CONCURSO PÚBLICO PARA A CELEBRAÇÃO DE CONTRATOSPÚBLICOS DE APROVISIONAMENTO PARA A ÁREA DA SAÚDE, COM VISTA AO FORNECIMENTO DE DERIVADOS DO PLASMA HUMANOÀS INSTITUIÇÕES E SERVIÇOS DO SERVIÇO NACIONAL DE SAÚDE",FALSE
Aq. Albumina 20%,Ao abrigo de acordo-quadro (art.º 259.º),Aquisição de bens móveis,"33600000-6, Produtos farmacêuticos","Centro Hospitalar de Entre o Douro e Vouga, E.P.E. (508878462)","CSL BEHRING, LDA. (503047201)","51.340,00 €",21-09-2017,21-08-2017,340 dias,"Portugal, Aveiro, Santa Maria da Feira",Artigo 259.º do Código dos Contratos Públicos,,,,,,535788,"CONCURSO PÚBLICO PARA A CELEBRAÇÃO DE CONTRATOSPÚBLICOS DE APROVISIONAMENTO PARA A ÁREA DA SAÚDE, COM VISTA AO FORNECIMENTO DE DERIVADOS DO PLASMA HUMANOÀS INSTITUIÇÕES E SERVIÇOS DO SERVIÇO NACIONAL DE SAÚDE",FALSE
Imunoglobulina Humana 5%,Ajuste Direto Regime Geral,Aquisição de bens móveis,"33600000-6, Produtos farmacêuticos","Centro Hospitalar de Entre o Douro e Vouga, E.P.E. (508878462)","OCTAPHARMA-PRODUTOS FARMACEUTICOS, LDA (502820780)","312.000,00 €",21-09-2017,11-02-2016,135 dias,"Portugal, Aveiro, Santa Maria da Feira","Artigo 24.º, n.º 1, alínea e) do Código dos Contratos Públicos",,,,,,Não aplicável.,Não aplicável.,FALSE
aq. medicamentos - Derivados Plasma,Ao abrigo de acordo-quadro (art.º 259.º),Aquisição de bens móveis,"33600000-6, Produtos farmacêuticos","Centro Hospitalar de Entre o Douro e Vouga, E.P.E. (508878462)","GRIFOLS PORTUGAL - PROD. FARMAC. E HOSP., LDA. (502041285)","267,67 €",21-09-2017,14-09-2016,108 dias,"Portugal, Aveiro, Santa Maria da Feira",Artigo 259.º do Código dos Contratos Públicos,,,,,,535788,"CONCURSO PÚBLICO PARA A CELEBRAÇÃO DE CONTRATOSPÚBLICOS DE APROVISIONAMENTO PARA A ÁREA DA SAÚDE, COM VISTA AO FORNECIMENTO DE DERIVADOS DO PLASMA HUMANOÀS INSTITUIÇÕES E SERVIÇOS DO SERVIÇO NACIONAL DE SAÚDE",FALSE
Aq. medicamentos - Derivados Plasma,Ao abrigo de acordo-quadro (art.º 259.º),Aquisição de bens móveis,"33600000-6, Produtos farmacêuticos","Centro Hospitalar de Entre o Douro e Vouga, E.P.E. (508878462)","CSL BEHRING, LDA. (503047201)","8.024,67 €",21-09-2017,14-09-2016,108 dias,"Portugal, Aveiro, Santa Maria da Feira",Artigo 259.º do Código dos Contratos Públicos,,,,,,535788,"CONCURSO PÚBLICO PARA A CELEBRAÇÃO DE CONTRATOSPÚBLICOS DE APROVISIONAMENTO PARA A ÁREA DA SAÚDE, COM VISTA AO FORNECIMENTO DE DERIVADOS DO PLASMA HUMANOÀS INSTITUIÇÕES E SERVIÇOS DO SERVIÇO NACIONAL DE SAÚDE",FALSE
Aq. medicamentos - Derivados do Plasma,Ao abrigo de acordo-quadro (art.º 259.º),Aquisição de bens móveis,"33600000-6, Produtos farmacêuticos","Centro Hospitalar de Entre o Douro e Vouga, E.P.E. (508878462)",BAXTER MEDICO FARMACEUTICA LDA (503347345),"693,33 €",21-09-2017,14-09-2016,108 dias,"Portugal, Aveiro, Santa Maria da Feira",Artigo 259.º do Código dos Contratos Públicos,,,,,,535788,"CONCURSO PÚBLICO PARA A CELEBRAÇÃO DE CONTRATOSPÚBLICOS DE APROVISIONAMENTO PARA A ÁREA DA SAÚDE, COM VISTA AO FORNECIMENTO DE DERIVADOS DO PLASMA HUMANOÀS INSTITUIÇÕES E SERVIÇOS DO SERVIÇO NACIONAL DE SAÚDE",FALSE
Aq. medicamentos - Derivados do Plasma,Ao abrigo de acordo-quadro (art.º 259.º),Aquisição de bens móveis,"33600000-6, Produtos farmacêuticos","Centro Hospitalar de Entre o Douro e Vouga, E.P.E. (508878462)","Takeda - Farmacêuticos Portugal, Lda. (502801204)","22.088,00 €",21-09-2017,14-09-2016,108 dias,"Portugal, Aveiro, Santa Maria da Feira",Artigo 259.º do Código dos Contratos Públicos,,,,,,535788,"CONCURSO PÚBLICO PARA A CELEBRAÇÃO DE CONTRATOSPÚBLICOS DE APROVISIONAMENTO PARA A ÁREA DA SAÚDE, COM VISTA AO FORNECIMENTO DE DERIVADOS DO PLASMA HUMANOÀS INSTITUIÇÕES E SERVIÇOS DO SERVIÇO NACIONAL DE SAÚDE",FALSE
"Aquisição do medicamento  """"IMUNOGLOBULINA HUMANA CONTRA A VARICELA 25 U.I./ML SOL INJ""""",Ajuste Direto Regime Geral,Aquisição de bens móveis,"33600000-6, Produtos farmacêuticos","Centro Hospitalar de Entre o Douro e Vouga, E.P.E. (508878462)","SPCARE, Especialidades Farmacêuticas, Ldª (508284872)","9.368,00 €",21-09-2017,08-01-2015,257 dias,"Portugal, Aveiro, Santa Maria da Feira","Artigo 20.º, n.º 1, alínea a) do Código dos Contratos Públicos",,,,,,Não aplicável.,Não aplicável.,FALSE
Aquisição Imunoglobulina Humana contra o Antigénio D 625U.I./ml sol inj fr 1ml IM,Ao abrigo de acordo-quadro (art.º 259.º),Aquisição de bens móveis,"33600000-6, Produtos farmacêuticos","Centro Hospitalar de Entre o Douro e Vouga, E.P.E. (508878462)","OCTAPHARMA-PRODUTOS FARMACEUTICOS, LDA (502820780)","5.000,00 €",21-09-2017,01-01-2015,365 dias,"Portugal, Aveiro, Santa Maria da Feira",Artigo 259.º do Código dos Contratos Públicos,,,,,,535788,"CONCURSO PÚBLICO PARA A CELEBRAÇÃO DE CONTRATOSPÚBLICOS DE APROVISIONAMENTO PARA A ÁREA DA SAÚDE, COM VISTA AO FORNECIMENTO DE DERIVADOS DO PLASMA HUMANOÀS INSTITUIÇÕES E SERVIÇOS DO SERVIÇO NACIONAL DE SAÚDE",FALSE
Aquisição Imunoglobulina Humana contra o Antigénio D1500U.I./2ml sol inj ser 2ml IM IV,Ao abrigo de acordo-quadro (art.º 259.º),Aquisição de bens móveis,"33600000-6, Produtos farmacêuticos","Centro Hospitalar de Entre o Douro e Vouga, E.P.E. (508878462)","CSL BEHRING, LDA. (503047201)","22.500,00 €",21-09-2017,01-01-2015,365 dias,"Portugal, Aveiro, Santa Maria da Feira",Artigo 259.º do Código dos Contratos Públicos,,,,,,535788,"CONCURSO PÚBLICO PARA A CELEBRAÇÃO DE CONTRATOSPÚBLICOS DE APROVISIONAMENTO PARA A ÁREA DA SAÚDE, COM VISTA AO FORNECIMENTO DE DERIVADOS DO PLASMA HUMANOÀS INSTITUIÇÕES E SERVIÇOS DO SERVIÇO NACIONAL DE SAÚDE",FALSE
Aq. de medicamentos - Derivados do Plasma Humano,Ao abrigo de acordo-quadro (art.º 259.º),Aquisição de bens móveis,"33600000-6, Produtos farmacêuticos","Centro Hospitalar de Entre o Douro e Vouga, E.P.E. (508878462)","OCTAPHARMA-PRODUTOS FARMACEUTICOS, LDA (502820780)","34.506,00 €",21-09-2017,08-05-2014,450 dias,"Portugal, Aveiro, Santa Maria da Feira",Artigo 259.º do Código dos Contratos Públicos,,,,,,535788,"CONCURSO PÚBLICO PARA A CELEBRAÇÃO DE CONTRATOSPÚBLICOS DE APROVISIONAMENTO PARA A ÁREA DA SAÚDE, COM VISTA AO FORNECIMENTO DE DERIVADOS DO PLASMA HUMANOÀS INSTITUIÇÕES E SERVIÇOS DO SERVIÇO NACIONAL DE SAÚDE",FALSE
Aq. de medicamentos - Derivados do Plasma Humano,Ao abrigo de acordo-quadro (art.º 259.º),Aquisição de bens móveis,"33600000-6, Produtos farmacêuticos","Centro Hospitalar de Entre o Douro e Vouga, E.P.E. (508878462)","Takeda - Farmacêuticos Portugal, Lda. (502801204)","56.000,00 €",21-09-2017,08-05-2014,450 dias,"Portugal, Aveiro, Santa Maria da Feira",Artigo 259.º do Código dos Contratos Públicos,,,,,,535788,"CONCURSO PÚBLICO PARA A CELEBRAÇÃO DE CONTRATOSPÚBLICOS DE APROVISIONAMENTO PARA A ÁREA DA SAÚDE, COM VISTA AO FORNECIMENTO DE DERIVADOS DO PLASMA HUMANOÀS INSTITUIÇÕES E SERVIÇOS DO SERVIÇO NACIONAL DE SAÚDE",FALSE
Aquisição de medicamentos - Derivados do Plasma Humano,Ao abrigo de acordo-quadro (art.º 259.º),Aquisição de bens móveis,"33600000-6, Produtos farmacêuticos","Centro Hospitalar de Entre o Douro e Vouga, E.P.E. (508878462)",BAXTER MEDICO FARMACEUTICA LDA (503347345),"2.704,00 €",21-09-2017,08-05-2014,450 dias,"Portugal, Aveiro, Santa Maria da Feira",Artigo 259.º do Código dos Contratos Públicos,,,,,,535788,"CONCURSO PÚBLICO PARA A CELEBRAÇÃO DE CONTRATOSPÚBLICOS DE APROVISIONAMENTO PARA A ÁREA DA SAÚDE, COM VISTA AO FORNECIMENTO DE DERIVADOS DO PLASMA HUMANOÀS INSTITUIÇÕES E SERVIÇOS DO SERVIÇO NACIONAL DE SAÚDE",FALSE
Aq. de medicamentos - Derivados do Plasma Humano,Ao abrigo de acordo-quadro (art.º 259.º),Aquisição de bens móveis,"33600000-6, Produtos farmacêuticos","Centro Hospitalar de Entre o Douro e Vouga, E.P.E. (508878462)","CSL BEHRING, LDA. (503047201)","45.400,00 €",21-09-2017,08-05-2014,450 dias,"Portugal, Aveiro, Santa Maria da Feira",Artigo 259.º do Código dos Contratos Públicos,,,,,,535788,"CONCURSO PÚBLICO PARA A CELEBRAÇÃO DE CONTRATOSPÚBLICOS DE APROVISIONAMENTO PARA A ÁREA DA SAÚDE, COM VISTA AO FORNECIMENTO DE DERIVADOS DO PLASMA HUMANOÀS INSTITUIÇÕES E SERVIÇOS DO SERVIÇO NACIONAL DE SAÚDE",FALSE
"11/00131.11/2017 - Aquisição do medicamento """"Vinflunina 25mg/ml sol inj",Ajuste Direto Regime Geral,Aquisição de bens móveis,"33600000-6, Produtos farmacêuticos","CENTRO HOSPITALAR DE ENTRE O DOURO E VOUGA, E.P.E. (508878462)",Pierre Fabre (500230366),"21.150,00 €",21-09-2017,31-07-2017,155 dias,"Portugal, Aveiro, Santa Maria da Feira","Artigo 24.º, n.º 1, alínea e) do Código dos Contratos Públicos",,,,,,Não aplicável.,Não aplicável.,FALSE
Aquisição de Máquinas de Sutura Endoscópica,Concurso público,Aquisição de bens móveis,"33141122-1, Agrafos cirúrgicos","Centro Hospitalar de Entre o Douro e Vouga, E.P.E. (508878462)","JOHNSON & JOHNSON, LDA (500153370)","206.440,00 €",21-09-2017,07-08-2017,150 dias,"Portugal, Aveiro, Santa Maria da Feira","Artigo 20.º, n.º 1, alínea b) do Código dos Contratos Públicos",,,,,,Não aplicável.,Não aplicável.,FALSE
