freguesia,acronym,validVotesPercentage,votes,dicofre
Boidobra,PS,39.03,361,050305
Boidobra,B.E.,14.81,137,050305
Boidobra,PPD/PSD,12.22,113,050305
Boidobra,PCP-PEV,12.11,112,050305
Boidobra,CDS-PP,6.59,61,050305
Boidobra,PAN,3.68,34,050305
Boidobra,A,2.81,26,050305
Boidobra,NC,2.05,19,050305
Boidobra,PPM.PPV/CDC,1.73,16,050305
Boidobra,L,1.41,13,050305
Boidobra,PCTP/MRPP,0.97,9,050305
Boidobra,IL,0.86,8,050305
Boidobra,PDR,0.54,5,050305
Boidobra,MAS,0.32,3,050305
Boidobra,PNR,0.32,3,050305
Boidobra,PURP,0.32,3,050305
Boidobra,PTP,0.22,2,050305
