Objeto do Contrato,Tipo de Procedimento,Tipo(s) de Contrato,CPVs,Entidade(s) Adjudicante(s),Entidade(s) Adjudicatária(s),Preço Contratual,Data de Publicação,Data de Celebração do Contrato,Prazo de Execução,Local de Execução,Fundamentação,Data de Fecho do Contrato,Preço Total Efetivo,Causas das Alterações ao Prazo,Causas das Alterações ao Preço,Estado,N.º registo do Acordo Quadro,Descrição do Acordo Quadro,Procedimento Centralizado
"Aquisição de Material de Penso Posição 1 COMPRESSA GAZE HIDROFILA N/EST. 7,5CMX7,5CM = 15000 unidades Posição 2 LIGADURA GASE, S/OURELA 10MX10CM = 140 unidades Posição 3 PENSO CIRURGICO EST.POST OPERATORIO 6X7CM = 950 unidades Posição 4 PENSO CIRURGICO EST.POST OPERATORIO 8,5X9,5CM = 200 unidades Posição 5 PENSO PENSO CIRURGICO EST.POST OPERATORIO 10X12CM = 80 unidades Posição 6 PENSO CIRURGICO EST.POST OPERATORIO 15,5X8,5CM = 200 unidades",Ao abrigo de acordo-quadro (art.º 259.º),Aquisição de bens móveis,"33000000-0, Equipamento médico, medicamentos e produtos para cuidados pessoais","Centro Hospitalar e Universitário de Coimbra, E. P. E. (510103448)","SMITH &  NEPHEW, LDA (503552461)","372,04 €",31-10-2013,29-06-2013,365 dias,"Portugal, Coimbra, Coimbra",Artigo 259.º do Código dos Contratos Públicos,,,,,,534953,"CONCURSO PÚBLICO PARA A CELEBRAÇÃO DE CONTRATOS PÚBLICOS DE APROVISIONAMENTO PARA A ÁREA DA SAÚDE, COM VISTA AO FORNECIMENTO DE MATERIAL DE PENSO TRADICIONAL/CLASSICO - PARTE 1 - ÀS INSTITUIÇÕES E SERVIÇOS DO SERVIÇO NACIONAL DE SAÚDE  ",
Contrato de manutenção do elevador n.º VN399016,Ajuste Direto Regime Geral,Aquisição de serviços,"50000000-5, Serviços de reparação e manutenção","Centro Hospitalar e Universitário de Coimbra, E. P. E. (510103448)","Schmitt - Elevadores, Lda. (500230757)","948,40 €",31-10-2013,23-10-2013,365 dias,"Portugal, Coimbra, Coimbra","Artigo 20.º, n.º 1, alínea a) do Código dos Contratos Públicos",,,,,,Não aplicável.,Não aplicável.,
Assinatura para acesso a bases de dados on-line da OvidSP,Ajuste Direto Regime Geral,Aquisição de serviços,"72000000-5, Serviços de TI: consultoria, desenvolvimento de software, Internet e apoio","Centro Hospitalar e Universitário de Coimbra, E. P. E. (510103448)","Lusodoc, Documentação Técnico-Cientifica, Lda. (502609982)","3.500,00 €",31-10-2013,10-10-2013,154 dias,"Portugal, Coimbra, Coimbra","Artigo 24.º, n.º 1, alínea e) do Código dos Contratos Públicos",,,,,,Não aplicável.,Não aplicável.,
Substituição de mesa operatória na suite 4 do BOC.,Ajuste Direto Regime Geral,Aquisição de bens móveis,"33000000-0, Equipamento médico, medicamentos e produtos para cuidados pessoais","Centro Hospitalar e Universitário de Coimbra, E. P. E. (510103448)","Maquet Portugal - Comércio de Equipamentos Hospitalares, Unipessoal, Lda. (506819698)","74.999,00 €",31-10-2013,04-10-2013,42 dias,"Portugal, Coimbra, Coimbra","Artigo 24.º, n.º 1, alínea e) do Código dos Contratos Públicos",,,,,,Não aplicável.,Não aplicável.,
100 Unidades - Stent Coronários com Farmaco,Ajuste Direto Regime Geral,Aquisição de bens móveis,"33000000-0, Equipamento médico, medicamentos e produtos para cuidados pessoais","Centro Hospitalar e Universitário de Coimbra, E. P. E. (510103448)","Abbott Laboratórios,Lda (500006148)","67.500,00 €",30-10-2013,12-09-2013,60 dias,"Portugal, Coimbra, Coimbra","Artigo 24.º, n.º 1, alínea e) do Código dos Contratos Públicos",,,,,,Não aplicável.,Não aplicável.,
5375 Unidades de Sensores de Bis Adultos; 50 Unidades de Sensores de Bis Pediatricos,Ajuste Direto Regime Geral,Aquisição de bens móveis,"33000000-0, Equipamento médico, medicamentos e produtos para cuidados pessoais","Centro Hospitalar e Universitário de Coimbra, E. P. E. (510103448)","IBERDATA EQUIPAMENTOS, LDA (501904921)","74.865,00 €",30-10-2013,23-08-2013,60 dias,"Portugal, Coimbra, Coimbra","Artigo 20.º, n.º 1, alínea a) do Código dos Contratos Públicos",,,,,,Não aplicável.,Não aplicável.,
5460547/2013 - Baterias,Ajuste Direto Regime Geral,Aquisição de bens móveis,"31000000-6, Maquinaria, aparelhagem, equipamento e consumíveis eléctricos; iluminação","Centro Hospitalar e Universitário de Coimbra, E. P. E. (510103448)","Powerfusion,Lda (507994205), Irtel-Instalações de Rádio,Televisão e Electricidade,Lda (501583033)","333,00 €",28-10-2013,15-10-2013,30 dias,"Portugal, Coimbra, Coimbra","Artigo 20.º, n.º 1, alínea a) do Código dos Contratos Públicos",,,,,,Não aplicável.,Não aplicável.,
5460444/2013 - Suportes de sensor,Ajuste Direto Regime Geral,Aquisição de bens móveis,"33000000-0, Equipamento médico, medicamentos e produtos para cuidados pessoais","Centro Hospitalar e Universitário de Coimbra, E. P. E. (510103448)","Drager Portugal,Lda (508771323)","200,70 €",28-10-2013,11-10-2013,30 dias,"Portugal, Coimbra, Coimbra","Artigo 24.º, n.º 1, alínea e) do Código dos Contratos Públicos",,,,,,Não aplicável.,Não aplicável.,
CARDIODESFIBRILHADOR-CDI BIVENTRICULAR SEM ELECTRODO - 1 UNIDADE  CARDIODESFIBRILHADOR-CDI BIVENTRICULAR COM ELECTRODO - 1 UNIDADE,Ajuste Direto Regime Geral,Aquisição de bens móveis,"33000000-0, Equipamento médico, medicamentos e produtos para cuidados pessoais","Centro Hospitalar e Universitário de Coimbra, E. P. E. (510103448)","MEDTRONIC PORTUGAL, LDA (504223933)","40.375,00 €",25-10-2013,25-10-2013,2 dias,"Portugal, Coimbra, Coimbra","Artigo 24.º, n.º 1, alínea a) do Código dos Contratos Públicos",,,,,,Não aplicável.,Não aplicável.,
CARDIODESFIBRILHADRO-CDI BIVENTRICULAR COM ELECTRODO - 1 UNIDADE  CARDIODESFIBRILHADRO-CDI BIVENTRICULAR SEM ELECTRODO - 2 UNIDADES,Ajuste Direto Regime Geral,Aquisição de bens móveis,"33000000-0, Equipamento médico, medicamentos e produtos para cuidados pessoais","Centro Hospitalar e Universitário de Coimbra, E. P. E. (510103448)","MEDTRONIC PORTUGAL, LDA (504223933)","60.350,00 €",25-10-2013,25-10-2013,2 dias,"Portugal, Coimbra, Coimbra","Artigo 24.º, n.º 1, alínea a) do Código dos Contratos Públicos",,,,,,Não aplicável.,Não aplicável.,
1 unidade - Cardioversor Desf. Biventricular sem Electrodo,Ajuste Direto Regime Geral,Aquisição de bens móveis,"33000000-0, Equipamento médico, medicamentos e produtos para cuidados pessoais","Centro Hospitalar e Universitário de Coimbra, E. P. E. (510103448)","Medtronic Portugal - Comercio e Distribuição de Aparelhos Médicos, Lda (504223933)","19.975,00 €",25-10-2013,24-10-2013,20 dias,"Portugal, Coimbra, Coimbra","Artigo 24.º, n.º 1, alínea e) do Código dos Contratos Públicos",,,,,,Não aplicável.,Não aplicável.,
5460526/2013 - Braçadeiras,Ajuste Direto Regime Geral,Aquisição de bens móveis,"33000000-0, Equipamento médico, medicamentos e produtos para cuidados pessoais","Centro Hospitalar e Universitário de Coimbra, E. P. E. (510103448)","Bacelar & Irmão,Lda (500532818)","1.050,00 €",25-10-2013,16-10-2013,80 dias,"Portugal, Coimbra, Coimbra","Artigo 20.º, n.º 1, alínea a) do Código dos Contratos Públicos",,,,,,Não aplicável.,Não aplicável.,
1 Unidade - Cardioversor Desf.  Camara Unica  com Electrodo  1 Unidade - Cardioversor Desf.  Camara Unica sem Electrodo  1 Unidade - Cardioversor Desf.  Camara Dupla sem Electrodo,Ajuste Direto Regime Geral,Aquisição de bens móveis,"33000000-0, Equipamento médico, medicamentos e produtos para cuidados pessoais","Centro Hospitalar e Universitário de Coimbra, E. P. E. (510103448)","Medtronic Portugal - Comércio e Distribuição de Aparelhos Médicos, Lda (504223933)","43.300,00 €",25-10-2013,24-10-2013,20 dias,"Portugal, Coimbra, Coimbra","Artigo 24.º, n.º 1, alínea e) do Código dos Contratos Públicos",,,,,,Não aplicável.,Não aplicável.,
1 unidade - Cardioversor Desfibrilhador camara dupla com Electrodo  1 unidade - Cardioversor Desfibrilhador Biventricular com Electrodo,Ajuste Direto Regime Geral,Aquisição de bens móveis,"33000000-0, Equipamento médico, medicamentos e produtos para cuidados pessoais","Centro Hospitalar e Universitário de Coimbra, E. P. E. (510103448)","Medtronic Portugal - Comércio e Distribuição de Aparelhos Médicos, Lda (504223933)","36.975,00 €",25-10-2013,24-10-2013,20 dias,"Portugal, Coimbra, Coimbra","Artigo 24.º, n.º 1, alínea e) do Código dos Contratos Públicos",,,,,,Não aplicável.,Não aplicável.,
1 Unidade - Cardiodesfibrilhador  Biventricular com Electrodo,Ajuste Direto Regime Geral,Aquisição de bens móveis,"33000000-0, Equipamento médico, medicamentos e produtos para cuidados pessoais","Centro Hospitalar e Universitário de Coimbra, E. P. E. (510103448)","Medtronic Portugal - Comércio e Distribuição de Aparelhos Médicos, Lda (504223933)","20.400,00 €",24-10-2013,16-10-2013,20 dias,"Portugal, Coimbra, Coimbra","Artigo 24.º, n.º 1, alínea e) do Código dos Contratos Públicos",,,,,,Não aplicável.,Não aplicável.,
Licenciamento datacenter-VMWare Infraestrutura(renovação)-SSTI.HG,Ajuste Direto Regime Geral,Aquisição de bens móveis,"48210000-3, Pacote de software para ligações em rede","Centro Hospitalar e Universitário de Coimbra, E. P. E. (510103448)","ATM Informática, SA (504062859)","6.131,57 €",24-10-2013,23-10-2013,15 dias,"Portugal, Coimbra, Coimbra","Artigo 20.º, n.º 1, alínea a) do Código dos Contratos Públicos",,,,,,Não aplicável.,Não aplicável.,
1 unidade - Cardiodesfibrilhador camara unica sem Electrodos  1 unidade - cardiodesfibrilhador camara unica com Electrodos,Ajuste Direto Regime Geral,Aquisição de bens móveis,"33000000-0, Equipamento médico, medicamentos e produtos para cuidados pessoais","Centro Hospitalar e Universitário de Coimbra, E.P.E. (510103448)","Medtronic Portugal-Comercio e Distribuição de Aparelhos Médicos, Lda. (504223933)","28.000,00 €",22-10-2013,16-10-2013,20 dias,"Portugal, Coimbra, Coimbra","Artigo 24.º, n.º 1, alínea e) do Código dos Contratos Públicos",,,,,,Não aplicável.,Não aplicável.,
"Seguro automovel das viaturas do CHUC, EPE, Renovação 2013",Ajuste Direto Regime Geral,Aquisição de serviços,"66514110-0, Serviços de seguro automóvel","Centro Hospitalar e Universitário de Coimbra, E.P.E. (510103448)","Companhia de Seguros Açoreana, SA (512004048)","2.672,37 €",22-10-2013,22-10-2013,69 dias,"Portugal, Coimbra, Coimbra","Artigo 20.º, n.º 1, alínea a) do Código dos Contratos Públicos",,,,,,Não aplicável.,Não aplicável.,
