freguesia,acronym,validVotesPercentage,votes,dicofre
União das freguesias de Caminha (Matriz) e Vilarelho,PS,44.94,360,160222
União das freguesias de Caminha (Matriz) e Vilarelho,PPD/PSD.CDS-PP,27.34,219,160222
União das freguesias de Caminha (Matriz) e Vilarelho,PCP-PEV,10.36,83,160222
União das freguesias de Caminha (Matriz) e Vilarelho,MPT,5.62,45,160222
União das freguesias de Caminha (Matriz) e Vilarelho,B.E.,3.87,31,160222
União das freguesias de Caminha (Matriz) e Vilarelho,L,3,24,160222
União das freguesias de Caminha (Matriz) e Vilarelho,PAN,1.37,11,160222
União das freguesias de Caminha (Matriz) e Vilarelho,PCTP/MRPP,1.12,9,160222
União das freguesias de Caminha (Matriz) e Vilarelho,PPM,1,8,160222
União das freguesias de Caminha (Matriz) e Vilarelho,PND,0.75,6,160222
União das freguesias de Caminha (Matriz) e Vilarelho,PTP,0.37,3,160222
União das freguesias de Caminha (Matriz) e Vilarelho,MAS,0.12,1,160222
União das freguesias de Caminha (Matriz) e Vilarelho,PNR,0.12,1,160222
União das freguesias de Caminha (Matriz) e Vilarelho,PDA,0,0,160222
União das freguesias de Caminha (Matriz) e Vilarelho,POUS,0,0,160222
União das freguesias de Caminha (Matriz) e Vilarelho,PPV,0,0,160222
