Objeto do Contrato,Tipo de Procedimento,Tipo(s) de Contrato,CPVs,Entidade(s) Adjudicante(s),Entidade(s) Adjudicatária(s),Preço Contratual,Data de Publicação,Data de Celebração do Contrato,Prazo de Execução,Local de Execução,Fundamentação,Data de Fecho do Contrato,Preço Total Efetivo,Causas das Alterações ao Prazo,Causas das Alterações ao Preço,Estado,N.º registo do Acordo Quadro,Descrição do Acordo Quadro,Procedimento Centralizado
Aquisição de equipamento de frio para USF Cynthia e US Queluz (Aces Sintra),Concurso público,Aquisição de bens móveis,"33100000-1, Equipamento médico","Administração Regional de Saúde de Lisboa e Vale do Tejo, I. P. (503148776)","FILSAT, EQUIP.MEDICO CIRURG.LDA (506708616)","3.619,00 €",18-01-2018,14-12-2017,20 dias,"Portugal, Lisboa, Sintra","Artigo 20.º, n.º 1, alínea b) do Código dos Contratos Públicos",,,,,,Não aplicável.,Não aplicável.,FALSE
Aquisição de Equipamento - Grupo III para USF Cynthia e US Queluz (Aces Sintra),Concurso público,Aquisição de bens móveis,"33100000-1, Equipamento médico","Administração Regional de Saúde de Lisboa e Vale do Tejo, I. P. (503148776)",Salutec - Serviços e Equipamentos de Saúde Lda (506380408),"1.961,40 €",18-01-2018,14-12-2017,20 dias,"Portugal, Lisboa, Sintra","Artigo 20.º, n.º 1, alínea b) do Código dos Contratos Públicos",,,,,,Não aplicável.,Não aplicável.,FALSE
Aquisição de Equipamento - Grupo IV para a USF Cynthia e US Queluz (Aces Sintra),Concurso público,Aquisição de bens móveis,"33100000-1, Equipamento médico","Administração Regional de Saúde de Lisboa e Vale do Tejo, I. P. (503148776)",Bramédica (508560152),"1.796,00 €",18-01-2018,14-12-2017,20 dias,"Portugal, Lisboa, Sintra","Artigo 20.º, n.º 1, alínea b) do Código dos Contratos Públicos",,,,,,Não aplicável.,Não aplicável.,FALSE
Aquisição de Equipamento - Grupo II para USF Cynthia e US Queluz (Aces Sintra),Concurso público,Aquisição de bens móveis,"33100000-1, Equipamento médico","Administração Regional de Saúde de Lisboa e Vale do Tejo, I. P. (503148776)",Bramédica (508560152),"1.987,50 €",18-01-2018,14-12-2017,20 dias,"Portugal, Lisboa, Sintra","Artigo 20.º, n.º 1, alínea b) do Código dos Contratos Públicos",,,,,,Não aplicável.,Não aplicável.,FALSE
Aquisição de equipamento para o USF Cynthia e US Queluz (Aces Sintra),Concurso público,Aquisição de bens móveis,"33100000-1, Equipamento médico","Administração Regional de Saúde de Lisboa e Vale do Tejo, I. P. (503148776)","Duekipa, Comércio de Equipamento Médico-Hospitalares, Lda (508690102)","9.660,00 €",18-01-2018,14-12-2017,20 dias,"Portugal, Lisboa, Sintra","Artigo 20.º, n.º 1, alínea b) do Código dos Contratos Públicos",,,,,,Não aplicável.,Não aplicável.,FALSE
Aquisição de Equipamento - Grupo III para a USF Cynthia e US Queluz (Aces Sintra),Concurso público,Aquisição de bens móveis,"33100000-1, Equipamento médico","Administração Regional de Saúde de Lisboa e Vale do Tejo, I. P. (503148776)","Bacelar & Irmão, Lda. (500532818)","36.570,05 €",18-01-2018,14-12-2017,20 dias,"Portugal, Lisboa, Sintra","Artigo 20.º, n.º 1, alínea b) do Código dos Contratos Públicos",,,,,,Não aplicável.,Não aplicável.,FALSE
Aquisição de equipamento - Grupo I para USF Cynthia e USF Queluz (Aces Sintra),Concurso público,Aquisição de bens móveis,"33100000-1, Equipamento médico","Administração Regional de Saúde de Lisboa e Vale do Tejo, I. P. (503148776)",Alfraphar (504223895),"20.935,00 €",18-01-2018,14-12-2017,20 dias,"Portugal, Lisboa, Sintra","Artigo 20.º, n.º 1, alínea b) do Código dos Contratos Públicos",,,,,,Não aplicável.,Não aplicável.,FALSE
"Manutenção e Reparação de Maq. Agua - Pedido de Compra 3400012098, NPD 17J00290 e Compromisso 5017061305",Ajuste Direto Regime Geral,Aquisição de serviços,"50000000-5, Serviços de reparação e manutenção","Administração Regional de Saúde de Lisboa e Vale do Tejo, I. P. (503148776)",SADOMAGIC COM DISTRIBUIÇÃO ELETRODOMÉSTICOS UNIPESSOAL LDA (505135655),"54,62 €",17-01-2018,08-09-2017,5 dias,"Portugal, Lisboa, Loures","Artigo 24.º, n.º 1, alínea e) do Código dos Contratos Públicos",,,,,,Não aplicável.,Não aplicável.,FALSE
"Adenda Contrato de Desinfestação - Pedido de Compra 3400011466, NPD 17E00401",Ajuste Direto Regime Geral,Aquisição de serviços,"50000000-5, Serviços de reparação e manutenção","Administração Regional de Saúde de Lisboa e Vale do Tejo, I. P. (503148776)","TNOLEN- Estudos e Serv. Proteção Ambiental, Lda. (504840479)","435,00 €",17-01-2018,11-05-2017,5 dias,"Portugal, Lisboa, Loures","Artigo 20.º, n.º 1, alínea a) do Código dos Contratos Públicos",,,,,,Não aplicável.,Não aplicável.,FALSE
"Adenda ao contrato de serviço de segurança - Pedido de Compra 3400011218, NPD 17J00131 e Compromisso 5017020931",Ajuste Direto Regime Geral,Aquisição de serviços,"79000000-4, Serviços a empresas: direito, comercialização, consultoria, recrutamento, impressão e segurança","Administração Regional de Saúde de Lisboa e Vale do Tejo, I. P. (503148776)",PRESTIBEL (501326456),"3.000,00 €",17-01-2018,29-03-2017,5 dias,"Portugal, Lisboa, Loures","Artigo 24.º, n.º 1, alínea e) do Código dos Contratos Públicos",,,,,,Não aplicável.,Não aplicável.,FALSE
"Manutenção e reparação de Equipamentos - PC Nº. 3400011045, NPD 17E00263 e Compromisso 5017007127",Ajuste Direto Regime Geral,Aquisição de serviços,"50000000-5, Serviços de reparação e manutenção","Administração Regional de Saúde de Lisboa e Vale do Tejo, I. P. (503148776)","Portigrade - Portas e Grades, Lda. (502073381)","500,00 €",17-01-2018,01-03-2017,5 dias,"Portugal, Lisboa, Loures","Artigo 20.º, n.º 1, alínea a) do Código dos Contratos Públicos",,,,,,Não aplicável.,Não aplicável.,FALSE
"Manutenção e Reparação Equipamentos - Pedido de Compra 3400012580, NPD 17E00722 e Compromisso 5017076017",Ajuste Direto Regime Geral,Aquisição de serviços,"50000000-5, Serviços de reparação e manutenção","Administração Regional de Saúde de Lisboa e Vale do Tejo, I. P. (503148776)",Augusto Silva (505738180),"1.204,00 €",17-01-2018,04-12-2017,5 dias,"Portugal, Lisboa, Loures","Artigo 20.º, n.º 1, alínea a) do Código dos Contratos Públicos",,,,,,Não aplicável.,Não aplicável.,FALSE
"Reparação e Manutenção de Equipamento - Pedido Compra 3400012466, NPD17E00704 e Compromisso 5017074005",Ajuste Direto Regime Geral,Aquisição de serviços,"50000000-5, Serviços de reparação e manutenção","Administração Regional de Saúde de Lisboa e Vale do Tejo, I. P. (503148776)",Augusto Silva (505738180),"35,00 €",17-01-2018,20-11-2017,5 dias,"Portugal, Lisboa, Loures","Artigo 20.º, n.º 1, alínea a) do Código dos Contratos Públicos",,,,,,Não aplicável.,Não aplicável.,FALSE
"Aquisição de sinalética - Pedido de Compra 3400011913, NPD 17E00536 e Compromisso 5017052618",Ajuste Direto Regime Geral,Aquisição de bens móveis,"22000000-0, Material impresso e afins","Administração Regional de Saúde de Lisboa e Vale do Tejo, I. P. (503148776)",Infortipo (502964472),"604,80 €",17-01-2018,25-07-2017,5 dias,"Portugal, Lisboa, Loures","Artigo 20.º, n.º 1, alínea a) do Código dos Contratos Públicos",,,,,,Não aplicável.,Não aplicável.,FALSE
"Impressão Etiquetas Armazém - Pedido de Compra 3400012598, NPD 17E00724 e Compromisso 5017078597",Ajuste Direto Regime Geral,Aquisição de bens móveis,"22000000-0, Material impresso e afins","Administração Regional de Saúde de Lisboa e Vale do Tejo, I. P. (503148776)","CALBERGRAFICA - ARTES GRAFICAS, LDA (502890231)","380,00 €",16-01-2018,07-12-2017,5 dias,"Portugal, Lisboa, Loures","Artigo 20.º, n.º 1, alínea a) do Código dos Contratos Públicos",,,,,,Não aplicável.,Não aplicável.,FALSE
"Impressão Etiquetas para farmácias - pedido de compra 3400011916, NPD 17E00540e Compromisso 5017052625 ",Ajuste Direto Regime Geral,Aquisição de bens móveis,"22000000-0, Material impresso e afins","Administração Regional de Saúde de Lisboa e Vale do Tejo, I. P. (503148776)","CALBERGRAFICA - ARTES GRAFICAS, LDA (502890231)","380,00 €",16-01-2018,25-07-2017,5 dias,"Portugal, Lisboa, Loures","Artigo 20.º, n.º 1, alínea a) do Código dos Contratos Públicos",,,,,,Não aplicável.,Não aplicável.,FALSE
"Aquisição de sinalética - Pedido de Compra 3400012325, NPD 17E00667 e Compromisso 5017069247",Ajuste Direto Regime Geral,Aquisição de bens móveis,"22000000-0, Material impresso e afins","Administração Regional de Saúde de Lisboa e Vale do Tejo, I. P. (503148776)",Infortipo (502964472),"261,50 €",16-01-2018,25-10-2017,5 dias,"Portugal, Lisboa, Loures","Artigo 20.º, n.º 1, alínea a) do Código dos Contratos Públicos",,,,,,Não aplicável.,Não aplicável.,FALSE
"Serviço de Copia e Impressão Guias - Pedido de Compra 3400011902, NPD 17E00526 e Compromisso 5017052433",Ajuste Direto Regime Geral,Aquisição de serviços,"79000000-4, Serviços a empresas: direito, comercialização, consultoria, recrutamento, impressão e segurança","Administração Regional de Saúde de Lisboa e Vale do Tejo, I. P. (503148776)","CALBERGRAFICA - ARTES GRAFICAS, LDA (502890231)","540,00 €",16-01-2018,21-07-2017,5 dias,"Portugal, Lisboa, Loures","Artigo 20.º, n.º 1, alínea a) do Código dos Contratos Públicos",,,,,,Não aplicável.,Não aplicável.,FALSE
"Serviço Cópia e Impressão - Pedido de Compra 3400010898, NPD 17E00195 e Compromisso 5017004204",Ajuste Direto Regime Geral,Aquisição de serviços,"79000000-4, Serviços a empresas: direito, comercialização, consultoria, recrutamento, impressão e segurança","Administração Regional de Saúde de Lisboa e Vale do Tejo, I. P. (503148776)","CALBERGRAFICA - ARTES GRAFICAS, LDA (502890231)","120,00 €",16-01-2018,07-02-2017,5 dias,"Portugal, Lisboa, Loures","Artigo 20.º, n.º 1, alínea a) do Código dos Contratos Públicos",,,,,,Não aplicável.,Não aplicável.,FALSE
"Transporte de Mercadorias - Pedido de Compra 3400012323, NPD 17E00674 e Compromisso 5017069244",Ajuste Direto Regime Geral,Aquisição de serviços,"60000000-8, Serviços de transporte (excl. transporte de resíduos)","Administração Regional de Saúde de Lisboa e Vale do Tejo, I. P. (503148776)","Paulo Alexandre Luis, Unipessoal Lda (513903011)","5.000,00 €",16-01-2018,25-10-2017,5 dias,"Portugal, Lisboa, Loures","Artigo 20.º, n.º 1, alínea a) do Código dos Contratos Públicos",,,,,,Não aplicável.,Não aplicável.,FALSE
"Transporte de Mercadorias - PC nº. 3400010938, NPD 17E00227 e Compromisso 5017005238",Ajuste Direto Regime Geral,Aquisição de serviços,"60000000-8, Serviços de transporte (excl. transporte de resíduos)","Administração Regional de Saúde de Lisboa e Vale do Tejo, I. P. (503148776)","Paulo Alexandre Luis, Unipessoal Lda (513903011)","5.000,00 €",16-01-2018,10-02-2017,5 dias,"Portugal, Lisboa, Loures","Artigo 20.º, n.º 1, alínea a) do Código dos Contratos Públicos",,,,,,Não aplicável.,Não aplicável.,FALSE
"Manutenção e Reparação de Equipamentos e Centrais Telefónicas - Pedido de Compra 3400010933, NPD 17E00221 e Compromisso 5017005230",Ajuste Direto Regime Geral,Aquisição de serviços,"50000000-5, Serviços de reparação e manutenção","Administração Regional de Saúde de Lisboa e Vale do Tejo, I. P. (503148776)",Fonotel - Comunicações  (501397469),"600,00 €",16-01-2018,10-02-2017,5 dias,"Portugal, Lisboa, Loures","Artigo 20.º, n.º 1, alínea a) do Código dos Contratos Públicos",,,,,,Não aplicável.,Não aplicável.,FALSE
"Reparação da viatura UD-03-45 - Pedido de Compra 3400011458, NPD 17E00389 e Compromisso 5017034100",Ajuste Direto Regime Geral,Aquisição de serviços,"50000000-5, Serviços de reparação e manutenção","Administração Regional de Saúde de Lisboa e Vale do Tejo, I. P. (503148776)","Catiana Reparações Auto, Lda (503664626)","1.153,91 €",16-01-2018,10-05-2017,5 dias,"Portugal, Lisboa, Loures","Artigo 20.º, n.º 1, alínea a) do Código dos Contratos Públicos",,,,,,Não aplicável.,Não aplicável.,FALSE
"Reparação da viatura 76-13-DB - Pedido de Compra 3400011457, NPD 17E00388 e Compromisso 5017034099",Ajuste Direto Regime Geral,Aquisição de serviços,"50000000-5, Serviços de reparação e manutenção","Administração Regional de Saúde de Lisboa e Vale do Tejo, I. P. (503148776)","Catiana Reparações Auto, Lda (503664626)","1.480,50 €",16-01-2018,10-05-2017,5 dias,"Portugal, Lisboa, Loures","Artigo 20.º, n.º 1, alínea a) do Código dos Contratos Públicos",,,,,,Não aplicável.,Não aplicável.,FALSE
"Reparação e manutenção viatura 73-EG-53 - Pedido de Compra  3400011690, NPD 17E00484 e Compromisso 5017044085",Ajuste Direto Regime Geral,Aquisição de serviços,"50000000-5, Serviços de reparação e manutenção","Administração Regional de Saúde de Lisboa e Vale do Tejo, I. P. (503148776)","Catiana Reparações Auto, Lda (503664626)","2.000,00 €",16-01-2018,21-06-2017,5 dias,"Portugal, Lisboa, Loures","Artigo 20.º, n.º 1, alínea a) do Código dos Contratos Públicos",,,,,,Não aplicável.,Não aplicável.,FALSE
"Manutenção e Reparação equipamentos informáticos - Pedido de Compra 3400011914, NPD 17E00537 e Compromisso 5017052620",Ajuste Direto Regime Geral,Aquisição de serviços,"50000000-5, Serviços de reparação e manutenção","Administração Regional de Saúde de Lisboa e Vale do Tejo, I. P. (503148776)",Marco António Pinho Castela AC (224064290),"5.000,00 €",16-01-2018,25-07-2017,5 dias,"Portugal, Lisboa, Loures","Artigo 20.º, n.º 1, alínea a) do Código dos Contratos Públicos",,,,,,Não aplicável.,Não aplicável.,FALSE
"Aquisição de discos gráficos e canetas para registo de temperaturas - Pedido de compra 3400011687, NPD 17E00480 e Compromisso 5017052422",Ajuste Direto Regime Geral,Aquisição de bens móveis,"33000000-0, Equipamento médico, medicamentos e produtos para cuidados pessoais","Administração Regional de Saúde de Lisboa e Vale do Tejo, I. P. (503148776)","Medical Import, Lda (506662055)","4.750,00 €",16-01-2018,21-06-2017,5 dias,"Portugal, Lisboa, Loures","Artigo 20.º, n.º 1, alínea a) do Código dos Contratos Públicos",,,,,,Não aplicável.,Não aplicável.,FALSE
"Manutenção e Reparação de Equipamentos - Pedido de Compra 3400011085, NPD 17E00264 e Compromisso 5017012840",Ajuste Direto Regime Geral,Aquisição de serviços,"50000000-5, Serviços de reparação e manutenção","Administração Regional de Saúde de Lisboa e Vale do Tejo, I. P. (503148776)","Medical Import, Lda (506662055)","1.743,00 €",15-01-2018,06-03-2017,5 dias,"Portugal, Lisboa, Loures","Artigo 20.º, n.º 1, alínea a) do Código dos Contratos Públicos",,,,,,Não aplicável.,Não aplicável.,FALSE
"Reparação e manutenção de equipamentos - Pedido de compra 3400010805, NPD 17E00165 e compromisso 5017000741",Ajuste Direto Regime Geral,Aquisição de serviços,"50000000-5, Serviços de reparação e manutenção","Administração Regional de Saúde de Lisboa e Vale do Tejo, I. P. (503148776)","Medical Import, Lda (506662055)","1.000,00 €",15-01-2018,23-01-2017,5 dias,"Portugal, Lisboa, Loures","Artigo 20.º, n.º 1, alínea a) do Código dos Contratos Públicos",,,,,,Não aplicável.,Não aplicável.,FALSE
"Reparação da viatura 82-11-OR - Pedido de Compra 3400010736, NPD 17E00106 e Compromisso 5017000307",Ajuste Direto Regime Geral,Aquisição de serviços,"50000000-5, Serviços de reparação e manutenção","Administração Regional de Saúde de Lisboa e Vale do Tejo, I. P. (503148776)","Catiana Reparações Auto, Lda (503664626)","1.000,00 €",15-01-2018,09-01-2017,5 dias,"Portugal, Lisboa, Loures","Artigo 20.º, n.º 1, alínea a) do Código dos Contratos Públicos",,,,,,Não aplicável.,Não aplicável.,FALSE
"Reparação e Manutenção da viatura 19-MM-58  - Pedido de Compra 3400010735, 17E00105 e Compromisso 5017000306",Ajuste Direto Regime Geral,Aquisição de serviços,"50000000-5, Serviços de reparação e manutenção","Administração Regional de Saúde de Lisboa e Vale do Tejo, I. P. (503148776)","Catiana Reparações Auto, Lda (503664626)","1.000,00 €",15-01-2018,09-01-2017,5 dias,"Portugal, Lisboa, Loures","Artigo 20.º, n.º 1, alínea a) do Código dos Contratos Públicos",,,,,,Não aplicável.,Não aplicável.,FALSE
"Reparação e Manutenção da viatura 14-IO-60 - PC nº. 3400010734, NPD17E00104 e Compromisso 5017000305",Ajuste Direto Regime Geral,Aquisição de serviços,"50000000-5, Serviços de reparação e manutenção","Administração Regional de Saúde de Lisboa e Vale do Tejo, I. P. (503148776)","Catiana Reparações Auto, Lda (503664626)","1.000,00 €",15-01-2018,09-01-2017,5 dias,"Portugal, Lisboa, Loures","Artigo 20.º, n.º 1, alínea a) do Código dos Contratos Públicos",,,,,,Não aplicável.,Não aplicável.,FALSE
"Reparação e Manutenção da Viatura 73-EG-53 - Pedido de Compra 3400010731, 17E00102 e Compromisso 5017000303",Ajuste Direto Regime Geral,Aquisição de serviços,"50000000-5, Serviços de reparação e manutenção","Administração Regional de Saúde de Lisboa e Vale do Tejo, I. P. (503148776)","Catiana Reparações Auto, Lda (503664626)","1.000,00 €",15-01-2018,09-01-2017,5 dias,"Portugal, Lisboa, Loures","Artigo 20.º, n.º 1, alínea a) do Código dos Contratos Públicos",,,,,,Não aplicável.,Não aplicável.,FALSE
"Reparação e manutenção da viatura 76-13-BD - Pedido de Compra 3400010730, NPD 17E00101 e Compromisso 5017000302",Ajuste Direto Regime Geral,Aquisição de serviços,"50000000-5, Serviços de reparação e manutenção","Administração Regional de Saúde de Lisboa e Vale do Tejo, I. P. (503148776)","Catiana Reparações Auto, Lda (503664626)","1.000,00 €",15-01-2018,09-01-2017,5 dias,"Portugal, Lisboa, Loures","Artigo 20.º, n.º 1, alínea a) do Código dos Contratos Públicos",,,,,,Não aplicável.,Não aplicável.,FALSE
"Reparação e manutenção da viatura 98-CQ-53 - Pedido de Compra 3400010729, NPD 17E00100 e Compromisso 5017000301",Ajuste Direto Regime Geral,Aquisição de serviços,"50000000-5, Serviços de reparação e manutenção","Administração Regional de Saúde de Lisboa e Vale do Tejo, I. P. (503148776)","Catiana Reparações Auto, Lda (503664626)","2.500,00 €",15-01-2018,09-01-2017,5 dias,"Portugal, Lisboa, Loures","Artigo 20.º, n.º 1, alínea a) do Código dos Contratos Públicos",,,,,,Não aplicável.,Não aplicável.,FALSE
"Manutenção e Reparação de Equipamentos Centrais Telefónicas - Pedido de Compra 3400010745, NPD 17J00046 e Compromisso 5017000316",Ajuste Direto Regime Geral,Aquisição de serviços,"50000000-5, Serviços de reparação e manutenção","Administração Regional de Saúde de Lisboa e Vale do Tejo, I. P. (503148776)",RFS.PT (503027952),"2.000,00 €",15-01-2018,09-01-2017,5 dias,"Portugal, Lisboa, Loures","Artigo 24.º, n.º 1, alínea e) do Código dos Contratos Públicos",,,,,,Não aplicável.,Não aplicável.,FALSE
"Manutenção e Reparação de Equipamentos Centrais Telefónicas - Pedido de Compra 3400010746, NPD 17J00045 e Compromisso 5017000317",Ajuste Direto Regime Geral,Aquisição de serviços,"50000000-5, Serviços de reparação e manutenção","Administração Regional de Saúde de Lisboa e Vale do Tejo, I. P. (503148776)","Lusofónica, Lda (501793054)","5.000,00 €",15-01-2018,09-01-2017,5 dias,"Portugal, Lisboa, Loures","Artigo 24.º, n.º 1, alínea e) do Código dos Contratos Públicos",,,,,,Não aplicável.,Não aplicável.,FALSE
"Manutenção e Reparação Equipamentos Informáticos - Pedido de Compra 3400012129, NPD 17E00618 e Compromisso 5017061935",Ajuste Direto Regime Geral,Aquisição de serviços,"50000000-5, Serviços de reparação e manutenção","Administração Regional de Saúde de Lisboa e Vale do Tejo, I. P. (503148776)",Marco António Pinho Castela AC (224064290),"5.000,00 €",12-01-2018,15-09-2017,5 dias,"Portugal, Lisboa, Loures","Artigo 20.º, n.º 1, alínea a) do Código dos Contratos Públicos",,,,,,Não aplicável.,Não aplicável.,FALSE
"Manutenção e Reparação de Material Informático - PC Nº. 3400010747, NPD 17E00080 e COMPROMISSO 5017000318",Ajuste Direto Regime Geral,Aquisição de serviços,"50000000-5, Serviços de reparação e manutenção","Administração Regional de Saúde de Lisboa e Vale do Tejo, I. P. (503148776)",Marco António Pinho Castela AC (224064290),"5.000,00 €",12-01-2018,09-01-2017,5 dias,"Portugal, Lisboa, Loures","Artigo 20.º, n.º 1, alínea a) do Código dos Contratos Públicos",,,,,,Não aplicável.,Não aplicável.,FALSE
"Contrato de manutenção e reparação de equipamentos - Pedido de Compra 3400011123, NPD 17E00077 e Compromisso 5017016241",Ajuste Direto Regime Geral,Aquisição de serviços,"50000000-5, Serviços de reparação e manutenção","Administração Regional de Saúde de Lisboa e Vale do Tejo, I. P. (503148776)",Desentop Ambiente Lda. (503555380),"1.300,00 €",12-01-2018,09-03-2017,5 dias,"Portugal, Lisboa, Loures","Artigo 20.º, n.º 1, alínea a) do Código dos Contratos Públicos",,,,,,Não aplicável.,Não aplicável.,FALSE
"Manutenção e Reparação de Maq. de Água - PC Nº. 3400010806, NPD 17J00079 e COMPROMISSO 5017000746",Ajuste Direto Regime Geral,Aquisição de serviços,"50000000-5, Serviços de reparação e manutenção","Administração Regional de Saúde de Lisboa e Vale do Tejo, I. P. (503148776)",SADOMAGIC COM DISTRIBUIÇÃO ELETRODOMÉSTICOS UNIPESSOAL LDA (505135655),"552,42 €",12-01-2018,23-01-2017,5 dias,"Portugal, Lisboa, Loures","Artigo 24.º, n.º 1, alínea e) do Código dos Contratos Públicos",,,,,,Não aplicável.,Não aplicável.,FALSE
"Contrato de Máquinas de água - PC Nº. 3400011121, NPD 17J00044 e Compromisso 5017016240",Ajuste Direto Regime Geral,Aquisição de serviços,"50000000-5, Serviços de reparação e manutenção","Administração Regional de Saúde de Lisboa e Vale do Tejo, I. P. (503148776)",PMS COFFEE SOLUTIONS S.A.  (507441443),"2.692,80 €",12-01-2018,09-03-2017,5 dias,"Portugal, Lisboa, Loures","Artigo 24.º, n.º 1, alínea e) do Código dos Contratos Públicos",,,,,,Não aplicável.,Não aplicável.,FALSE
"Contrato Fotocopiadora Xerox UCC Nostra Pontinha - Pedido de Compra 3400011116, NPD 17J00043 e Compromisso 5017016235",Ajuste Direto Regime Geral,Aquisição de serviços,"50000000-5, Serviços de reparação e manutenção","Administração Regional de Saúde de Lisboa e Vale do Tejo, I. P. (503148776)","Juvex3 - Equipamentos e Serviços, Lda (505486954)","300,00 €",12-01-2018,09-03-2017,5 dias,"Portugal, Lisboa, Loures","Artigo 24.º, n.º 1, alínea e) do Código dos Contratos Públicos",,,,,,Não aplicável.,Não aplicável.,FALSE
"Contrato de Desinfestações - PC Nº. 3400011120, NPD 17E00076 e Compromisso 5017016239",Ajuste Direto Regime Geral,Aquisição de serviços,"50000000-5, Serviços de reparação e manutenção","Administração Regional de Saúde de Lisboa e Vale do Tejo, I. P. (503148776)","TNOLEN- Estudos e Serv. Proteção Ambiental, Lda. (504840479)","3.780,00 €",12-01-2018,09-03-2017,5 dias,"Portugal, Lisboa, Loures","Artigo 20.º, n.º 1, alínea a) do Código dos Contratos Públicos",,,,,,Não aplicável.,Não aplicável.,FALSE
"Seguros acidentes pessoais - Pedido de Compra 3400010838, NPD 17E00075 e Compromisso 5017000898",Ajuste Direto Regime Geral,Aquisição de serviços,"66000000-0, Serviços de finanças e seguros","Administração Regional de Saúde de Lisboa e Vale do Tejo, I. P. (503148776)",Maria Margarida Vargas (509822401),"5.000,00 €",12-01-2018,27-01-2017,5 dias,"Portugal, Lisboa, Loures","Artigo 20.º, n.º 1, alínea a) do Código dos Contratos Públicos",,,,,,Não aplicável.,Não aplicável.,FALSE
"contrato de manutenção e reparação de equipamentos de fotocopiadoras e faxes- pedido de compra 3400011117, NPD17J00042 e compromisso 5017016236",Ajuste Direto Regime Geral,Aquisição de serviços,"50000000-5, Serviços de reparação e manutenção","Administração Regional de Saúde de Lisboa e Vale do Tejo, I. P. (503148776)","Canon Portugal, SA (507477740)","2.200,00 €",11-01-2018,09-03-2017,5 dias,"Portugal, Lisboa, Loures","Artigo 24.º, n.º 1, alínea e) do Código dos Contratos Públicos",,,,,,Não aplicável.,Não aplicável.,FALSE
"Contrato manutenção e reparação de equipamentos - Pedido de Compra 3400011118, NPD 17J00041 e Compromisso 5017016238",Ajuste Direto Regime Geral,Aquisição de serviços,"50000000-5, Serviços de reparação e manutenção","Administração Regional de Saúde de Lisboa e Vale do Tejo, I. P. (503148776)","Beltrão Coelho, Lda (504654748)","806,88 €",11-01-2018,09-03-2017,5 dias,"Portugal, Lisboa, Loures","Artigo 24.º, n.º 1, alínea e) do Código dos Contratos Públicos",,,,,,Não aplicável.,Não aplicável.,FALSE
"Pedido de Compra nº. 3400010932, NPD 17E00222 e Compromisso 5017005226",Ajuste Direto Regime Geral,Aquisição de serviços,"50000000-5, Serviços de reparação e manutenção","Administração Regional de Saúde de Lisboa e Vale do Tejo, I. P. (503148776)",Chaves do Areeiro (500601534),"600,00 €",11-01-2018,10-02-2017,5 dias,"Portugal, Lisboa, Loures","Artigo 20.º, n.º 1, alínea a) do Código dos Contratos Públicos",,,,,,Não aplicável.,Não aplicável.,FALSE
"Reparação Viatura matricula 94-54-DA - Pedido de Compra 3400010727, NPD 17E00098 e Compromisso 5017000296",Ajuste Direto Regime Geral,Aquisição de serviços,"50000000-5, Serviços de reparação e manutenção","Administração Regional de Saúde de Lisboa e Vale do Tejo, I. P. (503148776)","Catiana Reparações Auto, Lda (503664626)","1.000,00 €",11-01-2018,09-01-2017,5 dias,"Portugal, Lisboa, Loures","Artigo 20.º, n.º 1, alínea a) do Código dos Contratos Públicos",,,,,,Não aplicável.,Não aplicável.,FALSE
"Reparação e manutenção da viatura - 05-64-DC - Pedido de compra 3400010725, NPD 17E00097 e Compromisso 5017000295",Ajuste Direto Regime Geral,Aquisição de serviços,"50000000-5, Serviços de reparação e manutenção","Administração Regional de Saúde de Lisboa e Vale do Tejo, I. P. (503148776)","Catiana Reparações Auto, Lda (503664626)","1.000,00 €",11-01-2018,09-01-2017,5 dias,"Portugal, Lisboa, Loures","Artigo 20.º, n.º 1, alínea a) do Código dos Contratos Públicos",,,,,,Não aplicável.,Não aplicável.,FALSE
Reparação da viatura 82-13-OR - Pedido de compra 3400010724 e Compromisso 5017000294,Ajuste Direto Regime Geral,Aquisição de serviços,"50000000-5, Serviços de reparação e manutenção","Administração Regional de Saúde de Lisboa e Vale do Tejo, I. P. (503148776)","Catiana Reparações Auto, Lda (503664626)","1.000,00 €",11-01-2018,09-01-2017,5 dias,"Portugal, Lisboa, Loures","Artigo 20.º, n.º 1, alínea a) do Código dos Contratos Públicos",,,,,,Não aplicável.,Não aplicável.,FALSE
"Reparação / Manutenção da viatura 98-CQ-59 - Pedido de Compra 3400010723, NPD 17E00094 e Compromisso 5017000293",Ajuste Direto Regime Geral,Aquisição de serviços,"50000000-5, Serviços de reparação e manutenção","Administração Regional de Saúde de Lisboa e Vale do Tejo, I. P. (503148776)","Catiana Reparações Auto, Lda (503664626)","1.000,00 €",11-01-2018,09-01-2017,5 dias,"Portugal, Lisboa, Loures","Artigo 20.º, n.º 1, alínea a) do Código dos Contratos Públicos",,,,,,Não aplicável.,Não aplicável.,FALSE
"Reparação / Manutenção da Viatura 98-CQ-55 - PC 3400010722, NPD 17E00095 e Compromisso 5017000292",Ajuste Direto Regime Geral,Aquisição de serviços,"50000000-5, Serviços de reparação e manutenção","Administração Regional de Saúde de Lisboa e Vale do Tejo, I. P. (503148776)","Catiana Reparações Auto, Lda (503664626)","1.000,00 €",11-01-2018,09-01-2017,5 dias,"Portugal, Lisboa, Loures","Artigo 20.º, n.º 1, alínea a) do Código dos Contratos Públicos",,,,,,Não aplicável.,Não aplicável.,FALSE
"Manutenção e Reparação de Edifícios - Pedido de Compra 3400012226, NPD 17E00651 e Compromisso 5017067387",Ajuste Direto Regime Geral,Aquisição de serviços,"50000000-5, Serviços de reparação e manutenção","Administração Regional de Saúde de Lisboa e Vale do Tejo, I. P. (503148776)",CONSTRUMASIL S.A. (501948880),"5.000,00 €",11-01-2018,04-10-2017,5 dias,"Portugal, Lisboa, Loures","Artigo 20.º, n.º 1, alínea a) do Código dos Contratos Públicos",,,,,,Não aplicável.,Não aplicável.,FALSE
"PC nº. 3400011748, NPD 17E00497 e Compromisso 5017045782",Ajuste Direto Regime Geral,Aquisição de serviços,"50000000-5, Serviços de reparação e manutenção","Administração Regional de Saúde de Lisboa e Vale do Tejo, I. P. (503148776)",CONSTRUMASIL S.A. (501948880),"5.000,00 €",11-01-2018,28-06-2017,5 dias,"Portugal, Lisboa, Loures","Artigo 20.º, n.º 1, alínea a) do Código dos Contratos Públicos",,,,,,Não aplicável.,Não aplicável.,FALSE
"Utensilio de desgaste rápido - escadote - Pedido de Compra 3400012327, NPD 17E00669 e Compromisso 5017069249",Ajuste Direto Regime Geral,Aquisição de bens móveis,"19000000-6, Materiais têxteis, de couro, de plástico e de borracha","Administração Regional de Saúde de Lisboa e Vale do Tejo, I. P. (503148776)",Ergoarea (506705161),"28,00 €",11-01-2018,25-10-2017,5 dias,"Portugal, Lisboa, Loures","Artigo 20.º, n.º 1, alínea a) do Código dos Contratos Públicos",,,,,,Não aplicável.,Não aplicável.,FALSE
"Ferramentas e utensílios de desgaste rápido - dispensadores de toalhas de papel e dispensadores de sabão liquido - Pedido de Compra 3400012326, NPD 17E00668 e Compromisso 5017069248",Ajuste Direto Regime Geral,Aquisição de bens móveis,"19000000-6, Materiais têxteis, de couro, de plástico e de borracha","Administração Regional de Saúde de Lisboa e Vale do Tejo, I. P. (503148776)",Ergoarea (506705161),"199,00 €",11-01-2018,25-10-2017,5 dias,"Portugal, Lisboa, Loures","Artigo 20.º, n.º 1, alínea a) do Código dos Contratos Públicos",,,,,,Não aplicável.,Não aplicável.,FALSE
Aquisição de comunicações fixas de voz e dados em local fixo para o período de 01/07/2017 a 31/12/2017,Ajuste Direto Regime Geral,Aquisição de serviços,"64200000-8, Serviços de telecomunicações","Administração Regional de Saúde de Lisboa e Vale do Tejo, I. P. (503148776)","NOS Comunicações, SA (502604751)","40.784,68 €",11-01-2018,30-11-2017,184 dias,"Portugal, Lisboa, Lisboa","Artigo 24.º, n.º 1, alínea c) do Código dos Contratos Públicos",,,,,,Não aplicável.,Não aplicável.,FALSE
"Aquisição de toner Lexmark MS410D Preto 50F2H0E e Toner Samsung M3820ND MLT-D203E Preto - Pedido de Compra 3400012657, NPD 17E00723 e Compromisso 5017078910",Ajuste Direto Regime Geral,Aquisição de bens móveis,"22000000-0, Material impresso e afins","Administração Regional de Saúde de Lisboa e Vale do Tejo, I. P. (503148776)",Ecoazoia (507425480),"753,00 €",11-01-2018,18-12-2017,5 dias,"Portugal, Lisboa, Loures","Artigo 20.º, n.º 1, alínea a) do Código dos Contratos Públicos",,,,,,Não aplicável.,Não aplicável.,FALSE
"Manutenção e Reparação de Edifícios (pequenas obras) - Pedido de Compra 3400012425, NPD 17E00687 e Compromisso 5017073800",Ajuste Direto Regime Geral,Aquisição de serviços,"50000000-5, Serviços de reparação e manutenção","Administração Regional de Saúde de Lisboa e Vale do Tejo, I. P. (503148776)",BlocoZero (502689730),"5.000,00 €",11-01-2018,17-11-2017,5 dias,"Portugal, Lisboa, Loures","Artigo 20.º, n.º 1, alínea a) do Código dos Contratos Públicos",,,,,,Não aplicável.,Não aplicável.,FALSE
"Pedido de Compra 3400012110, NPD 17E00610 e Compromisso 5017061521",Ajuste Direto Regime Geral,Aquisição de serviços,"50000000-5, Serviços de reparação e manutenção","Administração Regional de Saúde de Lisboa e Vale do Tejo, I. P. (503148776)",BlocoZero (502689730),"5.000,00 €",11-01-2018,13-09-2017,5 dias,"Portugal, Lisboa, Loures","Artigo 20.º, n.º 1, alínea a) do Código dos Contratos Públicos",,,,,,Não aplicável.,Não aplicável.,FALSE
