Objeto do Contrato,Tipo de Procedimento,Tipo(s) de Contrato,CPVs,Entidade(s) Adjudicante(s),Entidade(s) Adjudicatária(s),Preço Contratual,Data de Publicação,Data de Celebração do Contrato,Prazo de Execução,Local de Execução,Fundamentação,Data de Fecho do Contrato,Preço Total Efetivo,Causas das Alterações ao Prazo,Causas das Alterações ao Preço,Estado,N.º registo do Acordo Quadro,Descrição do Acordo Quadro,Procedimento Centralizado
"Fornecimento de energia elétrica em BTE + MT às unidades de saúde da ARSLVT, IP",Ajuste Direto Regime Geral,Aquisição de serviços,"65310000-9, Distribuição de electricidade","Administração Regional de Saúde de Lisboa e Vale do Tejo, I. P. (503148776)","Galp Power, SA (504723456)","694.327,61 €",11-08-2016,09-08-2016,184 dias,"Portugal, Santarém<BR/>Portugal, Leiria<BR/>Portugal, Lisboa<BR/>Portugal, Setúbal","Artigo 24.º, n.º 1, alínea e) do Código dos Contratos Públicos","","",,,,Não aplicável.,Não aplicável.,FALSE
"Fornecimento de energia elétrica em BTE + MT às unidades de saúde da ARSLVT, IP",Ajuste Direto Regime Geral,Aquisição de serviços,"65310000-9, Distribuição de electricidade","Administração Regional de Saúde de Lisboa e Vale do Tejo, I. P. (503148776)","Iberdrola Clientes, SAU (ESA95758389)","6.007,02 €",11-08-2016,09-08-2016,184 dias,"Portugal, Setúbal","Artigo 24.º, n.º 1, alínea e) do Código dos Contratos Públicos","","",,,,Não aplicável.,Não aplicável.,FALSE
"Fornecimento de energia elétrica em BTN às unidades de saúde da ARSLVT, IP",Ajuste Direto Regime Geral,Aquisição de serviços,"65310000-9, Distribuição de electricidade","Administração Regional de Saúde de Lisboa e Vale do Tejo, I. P. (503148776)","EDP Serviço Unoversal, SA (507846044)","73.809,52 €",11-08-2016,09-08-2016,184 dias,"Portugal, Setúbal<BR/>Portugal, Lisboa<BR/>Portugal, Leiria<BR/>Portugal, Santarém","Artigo 24.º, n.º 1, alínea e) do Código dos Contratos Públicos","","",,,,Não aplicável.,Não aplicável.,FALSE
"Fornecimento de energia elétrica em BTN às unidades de saúde da ARSLVT, IP",Ajuste Direto Regime Geral,Aquisição de serviços,"65310000-9, Distribuição de electricidade","Administração Regional de Saúde de Lisboa e Vale do Tejo, I. P. (503148776)","EDP Serviço Universal, SA (507846044)","45.937,68 €",11-08-2016,09-08-2016,184 dias,"Portugal, Leiria<BR/>Portugal, Santarém<BR/>Portugal, Lisboa<BR/>Portugal, Setúbal","Artigo 24.º, n.º 1, alínea e) do Código dos Contratos Públicos","","",,,,Não aplicável.,Não aplicável.,FALSE
Aquisição de blocos e vinhetas - ACES Oeste Sul,Ajuste Direto Regime Geral,Aquisição de bens móveis,"30199761-2, Etiquetas com códigos de barras","Administração Regional de Saúde de Lisboa e Vale do Tejo, I. P. (503148776)",Imprensa Nacional Casa da Moeda (500792887),"20,00 €",09-08-2016,01-07-2016,20 dias,"Portugal, Lisboa, Torres Vedras","Artigo 24.º, n.º 1, alínea e) do Código dos Contratos Públicos",01-07-2016,"20,00 €",,,,Não aplicável.,Não aplicável.,FALSE
Aquisição de blocos e vinhetas - ACES Oeste Sul,Ajuste Direto Regime Geral,Aquisição de bens móveis,"30199761-2, Etiquetas com códigos de barras","Administração Regional de Saúde de Lisboa e Vale do Tejo, I. P. (503148776)",Imprensa Nacional Casa da Moeda (500792887),"105,00 €",09-08-2016,19-07-2016,20 dias,"Portugal, Lisboa, Torres Vedras","Artigo 24.º, n.º 1, alínea e) do Código dos Contratos Públicos",19-07-2016,"105,00 €",,,,Não aplicável.,Não aplicável.,FALSE
Aquisição de blocos e vinhetas - ACES Oeste Sul,Ajuste Direto Regime Geral,Aquisição de bens móveis,"30199761-2, Etiquetas com códigos de barras","Administração Regional de Saúde de Lisboa e Vale do Tejo, I. P. (503148776)",Imprensa Nacional Casa da Moeda (500792887),"50,00 €",09-08-2016,07-06-2016,20 dias,"Portugal, Lisboa, Torres Vedras","Artigo 24.º, n.º 1, alínea e) do Código dos Contratos Públicos",07-06-2016,"50,00 €",,,,Não aplicável.,Não aplicável.,FALSE
Aquisição da vacina contra a febre amarela (V32),Ajuste Direto Regime Geral,Aquisição de bens móveis,"33651600-4, Vacinas","Administração Regional de Saúde de Lisboa e Vale do Tejo, I. P. (503148776)","Sanofi Pasteur MSD, S.A. (507632796)","88.000,00 €",08-08-2016,08-08-2016,145 dias,"Portugal, Lisboa, Lisboa",Artigo 258.º do Código dos Contratos Públicos,"","",,,,Não aplicável.,Não aplicável.,FALSE
"Aquisição de serviços de diagnóstico histológico, pesquisa de HPV, recolha e transporte de produto biológico, no âmbito do projecto de intervenção Precoce Cancro Oral",Ajuste Direto Regime Geral,Aquisição de serviços,"85100000-0, Serviços de saúde","Administração Regional de Saúde de Lisboa e Vale do Tejo, I. P. (503148776)",Ipatimup - Instituto Patologia e Imunologia Molecular - Universidade do Porto (502246308),"20.582,50 €",08-08-2016,30-05-2016,145 dias,"Portugal, Lisboa, Lisboa","Artigo 20.º, n.º 1, alínea a) do Código dos Contratos Públicos","","",,,,Não aplicável.,Não aplicável.,FALSE
"Aquisição de equipamentos para varias unidades de saúde da área de influencia da ARSLVT, IP",Concurso público,Aquisição de bens móveis,"39300000-5, Equipamento diverso","Administração Regional de Saúde de Lisboa e Vale do Tejo, I. P. (503148776)","Eugénio Pereira ,Lda (503989525)","107,00 €",05-08-2016,30-06-2016,20 dias,"Portugal, Lisboa","Artigo 20.º, n.º 1, alínea b) do Código dos Contratos Públicos","","",,,,Não aplicável.,Não aplicável.,FALSE
"Aquisição de equipamentos para varias unidades de saúde da área de influencia da ARSLVT, IP",Concurso público,Aquisição de bens móveis,"33131000-7, Material odontológico","Administração Regional de Saúde de Lisboa e Vale do Tejo, I. P. (503148776)","Montellano,Lda (500196494)","5.412,80 €",05-08-2016,05-08-2016,20 dias,"Portugal, Lisboa","Artigo 20.º, n.º 1, alínea b) do Código dos Contratos Públicos","","",,,,Não aplicável.,Não aplicável.,FALSE
"Aquisição de equipamentos para varias unidades de saúde da área de influencia da ARSLVT, IP",Concurso público,Aquisição de bens móveis,"39300000-5, Equipamento diverso","Administração Regional de Saúde de Lisboa e Vale do Tejo, I. P. (503148776)","Filsat- Equip. Medico,Lda (506708616)","610,50 €",05-08-2016,30-06-2016,20 dias,"Portugal, Lisboa","Artigo 20.º, n.º 1, alínea b) do Código dos Contratos Públicos","","",,,,Não aplicável.,Não aplicável.,FALSE
"Aquisição de equipamentos para varias unidades de saúde da área de influencia da ARSLVT, IP",Concurso público,Aquisição de bens móveis,"39300000-5, Equipamento diverso","Administração Regional de Saúde de Lisboa e Vale do Tejo, I. P. (503148776)",Speculum - Artigos Medicos S.A (502996323),"181,05 €",05-08-2016,30-06-2016,20 dias,"Portugal, Lisboa","Artigo 20.º, n.º 1, alínea b) do Código dos Contratos Públicos","","",,,,Não aplicável.,Não aplicável.,FALSE
"Aquisição de equipamentos para varias unidades de saúde da área de influencia da ARSLVT, IP",Concurso público,Aquisição de bens móveis,"38000000-5, Equipamento laboratorial, óptico e de precisão (exc. óculos)","Administração Regional de Saúde de Lisboa e Vale do Tejo, I. P. (503148776)","Iberlab e Imunoreage - Soluçoes Lab,Lda (503406694)","875,00 €",05-08-2016,30-06-2016,20 dias,"Portugal, Lisboa","Artigo 20.º, n.º 1, alínea b) do Código dos Contratos Públicos","","",,,,Não aplicável.,Não aplicável.,FALSE
"Aquisição de equipamentos para varias unidades de saúde da área de influencia da ARSLVT, IP",Concurso público,Aquisição de bens móveis,"39150000-8, Mobiliário e equipamento diverso","Administração Regional de Saúde de Lisboa e Vale do Tejo, I. P. (503148776)","Eugénio Pereira,Lda (503989525)","3.894,00 €",05-08-2016,30-06-2016,20 dias,"Portugal, Lisboa","Artigo 20.º, n.º 1, alínea b) do Código dos Contratos Públicos","","",,,,Não aplicável.,Não aplicável.,FALSE
"Aquisição de equipamentos para varias unidades de saúde da área de influencia da ARSLVT, IP",Concurso público,Aquisição de bens móveis,"39150000-8, Mobiliário e equipamento diverso","Administração Regional de Saúde de Lisboa e Vale do Tejo, I. P. (503148776)","Frisinde-Equip. industriais,Lda (502365889)","830,00 €",05-08-2016,30-06-2016,20 dias,"Portugal, Lisboa","Artigo 20.º, n.º 1, alínea b) do Código dos Contratos Públicos","","",,,,Não aplicável.,Não aplicável.,FALSE
"Aquisição de equipamentos para varias unidades de saúde da área de influencia da ARSLVT, IP",Concurso público,Aquisição de bens móveis,"39150000-8, Mobiliário e equipamento diverso","Administração Regional de Saúde de Lisboa e Vale do Tejo, I. P. (503148776)",filsat - Equip. Médico Lda (506708616),"256,00 €",05-08-2016,30-06-2016,20 dias,"Portugal, Lisboa","Artigo 20.º, n.º 1, alínea b) do Código dos Contratos Públicos","","",,,,Não aplicável.,Não aplicável.,FALSE
"Aquisição de equipamentos para varias unidades de saúde da área de influencia da ARSLVT, IP",Concurso público,Aquisição de bens móveis,"39100000-3, Mobiliário","Administração Regional de Saúde de Lisboa e Vale do Tejo, I. P. (503148776)","Filsat- Equip. Medico,Lda (506708616)","897,00 €",05-08-2016,30-06-2016,20 dias,"Portugal, Lisboa","Artigo 20.º, n.º 1, alínea b) do Código dos Contratos Públicos","","",,,,Não aplicável.,Não aplicável.,FALSE
"Aquisição de equipamentos para varias unidades de saúde da área de influencia da ARSLVT, IP",Concurso público,Aquisição de bens móveis,"39100000-3, Mobiliário","Administração Regional de Saúde de Lisboa e Vale do Tejo, I. P. (503148776)","Eugénio Pereira ,Lda (503989525)","6.345,00 €",05-08-2016,30-06-2016,20 dias,"Portugal, Lisboa","Artigo 20.º, n.º 1, alínea b) do Código dos Contratos Públicos","","",,,,Não aplicável.,Não aplicável.,FALSE
"Aquisição de equipamentos para varias unidades de saúde da área de influencia da ARSLVT, IP",Concurso público,Aquisição de bens móveis,"39100000-3, Mobiliário","Administração Regional de Saúde de Lisboa e Vale do Tejo, I. P. (503148776)","Filsat - Equip. s Médico,Lda (506708616)","8.183,00 €",05-08-2016,30-06-2016,20 dias,"Portugal, Lisboa","Artigo 20.º, n.º 1, alínea b) do Código dos Contratos Públicos","","",,,,Não aplicável.,Não aplicável.,FALSE
"Aquisição de equipamentos para varias unidades de saúde da área de influencia da ARSLVT, IP",Concurso público,Aquisição de bens móveis,"39100000-3, Mobiliário","Administração Regional de Saúde de Lisboa e Vale do Tejo, I. P. (503148776)","Alfraphar - Equip. e prod. Farmac. ,Lda (504223895)","4.155,00 €",05-08-2016,30-06-2016,20 dias,"Portugal, Lisboa","Artigo 20.º, n.º 1, alínea b) do Código dos Contratos Públicos","","",,,,Não aplicável.,Não aplicável.,FALSE
"Aquisição de equipamentos para varias unidades de saúde da área de influencia da ARSLVT, IP",Concurso público,Aquisição de bens móveis,"39100000-3, Mobiliário","Administração Regional de Saúde de Lisboa e Vale do Tejo, I. P. (503148776)","Alfraphar - Equip. e Produtos Farmac. , Lda (504223895)","1.555,00 €",05-08-2016,30-06-2016,20 dias,"Portugal, Lisboa","Artigo 20.º, n.º 1, alínea b) do Código dos Contratos Públicos","","",,,,Não aplicável.,Não aplicável.,FALSE
"Aquisição de equipamentos para varias unidades de saúde da área de influencia da ARSLVT, IP",Concurso público,Aquisição de bens móveis,"39100000-3, Mobiliário","Administração Regional de Saúde de Lisboa e Vale do Tejo, I. P. (503148776)","Alpia2-NJew Concept,Lda (510105327)","2.661,00 €",05-08-2016,30-06-2016,20 dias,"Portugal, Lisboa","Artigo 20.º, n.º 1, alínea b) do Código dos Contratos Públicos","","",,,,Não aplicável.,Não aplicável.,FALSE
"Aquisição de equipamentos para varias unidades de saúde da área de influencia da ARSLVT, IP",Concurso público,Aquisição de bens móveis,"33100000-1, Equipamento médico","Administração Regional de Saúde de Lisboa e Vale do Tejo, I. P. (503148776)",Paramédica-Equipamento Médico Lda (501393005),"8.420,00 €",05-08-2016,30-06-2016,20 dias,"Portugal, Lisboa","Artigo 20.º, n.º 1, alínea b) do Código dos Contratos Públicos","","",,,,Não aplicável.,Não aplicável.,FALSE
"Aquisição de equipamentos para varias unidades de saúde da área de influencia da ARSLVT, IP.",Concurso público,Aquisição de bens móveis,"33100000-1, Equipamento médico","Administração Regional de Saúde de Lisboa e Vale do Tejo, I. P. (503148776)","Bacelar & Irmão, Lda. (500532818)","2.650,60 €",05-08-2016,30-06-2016,20 dias,"Portugal, Lisboa","Artigo 20.º, n.º 1, alínea b) do Código dos Contratos Públicos","","",,,,Não aplicável.,Não aplicável.,FALSE
"Aquisição de equipamentos para varias unidades de saúde da área de influencia da ARSLVT, IP.",Concurso público,Aquisição de bens móveis,"33100000-1, Equipamento médico","Administração Regional de Saúde de Lisboa e Vale do Tejo, I. P. (503148776)","Sano-Técnica, Limitada (500239819)","2.175,75 €",05-08-2016,30-06-2016,20 dias,"Portugal, Santarém","Artigo 20.º, n.º 1, alínea b) do Código dos Contratos Públicos","","",,,,Não aplicável.,Não aplicável.,FALSE
"Aquisição de equipamentos para varias unidades de saúde da área de influencia da ARSLVT, IP.",Concurso público,Aquisição de bens móveis,"33100000-1, Equipamento médico","Administração Regional de Saúde de Lisboa e Vale do Tejo, I. P. (503148776)","Alfraphar, Lda (504223895)","1.050,00 €",05-08-2016,30-06-2016,20 dias,"Portugal, Lisboa","Artigo 20.º, n.º 1, alínea b) do Código dos Contratos Públicos","","",,,,Não aplicável.,Não aplicável.,FALSE
"Aquisição de equipamentos para varias unidades de saúde da área de influencia da ARSLVT, IP.",Concurso público,Aquisição de bens móveis,"33100000-1, Equipamento médico","Administração Regional de Saúde de Lisboa e Vale do Tejo, I. P. (503148776)","Montellano, Lda (500196494)","12.937,25 €",05-08-2016,05-07-2016,20 dias,"Portugal, Lisboa","Artigo 20.º, n.º 1, alínea b) do Código dos Contratos Públicos","","",,,,Não aplicável.,Não aplicável.,FALSE
"Aquisição de equipamentos para varias unidades de saúde da área de influencia da ARSLVT, IP.",Concurso público,Aquisição de bens móveis,"33100000-1, Equipamento médico","Administração Regional de Saúde de Lisboa e Vale do Tejo, I. P. (503148776)","Alfraphar, Lda (504223895)","1.735,00 €",05-08-2016,30-06-2016,20 dias,"Portugal, Lisboa","Artigo 20.º, n.º 1, alínea b) do Código dos Contratos Públicos","","",,,,Não aplicável.,Não aplicável.,FALSE
"Aquisição de equipamentos para varias unidades de saúde da área de influencia da ARSLVT, IP.",Concurso público,Aquisição de bens móveis,"33111000-1, Aparelhos para radiologia","Administração Regional de Saúde de Lisboa e Vale do Tejo, I. P. (503148776)","Clinifar, SA (503281115)","1.960,00 €",05-08-2016,30-06-2016,20 dias,"Portugal, Lisboa","Artigo 20.º, n.º 1, alínea b) do Código dos Contratos Públicos","","",,,,Não aplicável.,Não aplicável.,FALSE
"Aquisição de equipamentos para varias unidades de saúde da área de influencia da ARSLVT, IP.",Concurso público,Aquisição de bens móveis,"33100000-1, Equipamento médico","Administração Regional de Saúde de Lisboa e Vale do Tejo, I. P. (503148776)","Filsat - Equipamento S. Médico Cientificos, Lda. (506708616)","9.540,00 €",05-08-2016,30-06-2016,20 dias,"Portugal, Lisboa","Artigo 20.º, n.º 1, alínea b) do Código dos Contratos Públicos","","",,,,Não aplicável.,Não aplicável.,FALSE
"Aquisição de equipamentos para varias unidades de saúde da área de influencia da ARSLVT, IP.",Concurso público,Aquisição de bens móveis,"33100000-1, Equipamento médico","Administração Regional de Saúde de Lisboa e Vale do Tejo, I. P. (503148776)","Bacelar & Irmãos, Lda. (500532818)","118,30 €",05-08-2016,30-06-2016,20 dias,"Portugal, Lisboa","Artigo 20.º, n.º 1, alínea b) do Código dos Contratos Públicos","","",,,,Não aplicável.,Não aplicável.,FALSE
"Aquisição de equipamentos para varias unidades de saúde da área de influencia da ARSLVT, IP",Concurso público,Aquisição de bens móveis,"33100000-1, Equipamento médico","Administração Regional de Saúde de Lisboa e Vale do Tejo, I. P. (503148776)","Bacelar & Irmão, Lda. (500532818)","1.783,20 €",05-08-2016,30-06-2016,20 dias,"Portugal, Lisboa","Artigo 20.º, n.º 1, alínea b) do Código dos Contratos Públicos","","",,,,Não aplicável.,Não aplicável.,FALSE
Aquisição de equipamento para a nova USF Foral Novo (Alcanede e Amiais de Baixo) e CRI Lisboa Oriental.,Concurso público,Aquisição de bens móveis,"39150000-8, Mobiliário e equipamento diverso","Administração Regional de Saúde de Lisboa e Vale do Tejo, I. P. (503148776)","Filsat - Equipamentos S. Médico Cientificos, Lda. (506708616)","234,50 €",05-08-2016,01-08-2016,20 dias,"Portugal, Santarém","Artigo 20.º, n.º 1, alínea b) do Código dos Contratos Públicos","","",,,,Não aplicável.,Não aplicável.,FALSE
Aquisição de equipamento para a nova USF Foral Novo (Alcanede e Amiais de Baixo) e CRI Lisboa Oriental.,Concurso público,Aquisição de bens móveis,"39100000-3, Mobiliário","Administração Regional de Saúde de Lisboa e Vale do Tejo, I. P. (503148776)","Speculum Artigos Médicos, Lda. (502996323)","1.317,00 €",05-08-2016,01-08-2016,20 dias,"Portugal, Santarém","Artigo 20.º, n.º 1, alínea b) do Código dos Contratos Públicos","","",,,,Não aplicável.,Não aplicável.,FALSE
Aquisição de equipamento para a nova USF Foral Novo (Alcanede e Amiais de Baixo) e CRI Lisboa Oriental.,Concurso público,Aquisição de bens móveis,"33100000-1, Equipamento médico","Administração Regional de Saúde de Lisboa e Vale do Tejo, I. P. (503148776)","Filsat - Equipamento S. Médico Cientifícos, Lda. (506708616)","222,40 €",05-08-2016,01-08-2016,20 dias,"Portugal, Santarém","Artigo 20.º, n.º 1, alínea b) do Código dos Contratos Públicos","","",,,,Não aplicável.,Não aplicável.,FALSE
Aquisição de equipamento para a nova USF Foral Novo (Alcanede e Amiais de Baixo) e CRI Lisboa Oriental.,Concurso público,Aquisição de bens móveis,"33100000-1, Equipamento médico","Administração Regional de Saúde de Lisboa e Vale do Tejo, I. P. (503148776)","Eugénio Pereira, Lda.  (503989525)","1.080,00 €",05-08-2016,01-08-2016,20 dias,"Portugal, Santarém","Artigo 20.º, n.º 1, alínea b) do Código dos Contratos Públicos","","",,,,Não aplicável.,Não aplicável.,FALSE
Aquisição de equipamento para a nova USF Foral Novo (Alcanede e Amiais de Baixo) e CRI Lisboa Oriental.,Concurso público,Aquisição de bens móveis,"33100000-1, Equipamento médico","Administração Regional de Saúde de Lisboa e Vale do Tejo, I. P. (503148776)","Filsat - Equipamento Médico Cientifícos, Lda. (506708616)","2.442,00 €",05-08-2016,01-08-2016,20 dias,"Portugal, Santarém, Alcanena","Artigo 20.º, n.º 1, alínea b) do Código dos Contratos Públicos","","",,,,Não aplicável.,Não aplicável.,FALSE
Aquisição de vitrines para a nova USF Francisco de Almeida em Abrantes.,Ajuste Direto Regime Geral,Aquisição de bens móveis,"39171000-1, Expositores","Administração Regional de Saúde de Lisboa e Vale do Tejo, I. P. (503148776)",Mundo ao Quadrado - Unipessoal (510174086),"1.031,02 €",04-08-2016,03-08-2016,5 dias,"Portugal, Lisboa, Lisboa","Artigo 20.º, n.º 1, alínea a) do Código dos Contratos Públicos","","",,,,Não aplicável.,Não aplicável.,FALSE
"Reparação de instalações elétricas, canalizações, carpintarias dos edifícios do Parque Saúde (ET Taipas e Alcoologia), CRI Setúbal, ACES Amadora e Sede.",Ajuste Direto Regime Geral,Aquisição de serviços,"50700000-2, Serviços de reparação e manutenção de equipamento em edifícios","Administração Regional de Saúde de Lisboa e Vale do Tejo, I. P. (503148776)","Ribaminho - Sociedade de Construções, Lda (501848479)","762,00 €",04-08-2016,03-08-2016,10 dias,"Portugal, Lisboa, Lisboa","Artigo 20.º, n.º 1, alínea a) do Código dos Contratos Públicos","","",,,,Não aplicável.,Não aplicável.,FALSE
Empreitada para substituição de rede da caldeira e das infiltrações na IS Parque Saúde - Taipas.,Ajuste Direto Regime Geral,Empreitadas de obras públicas,"45113000-2, Obras no local","Administração Regional de Saúde de Lisboa e Vale do Tejo, I. P. (503148776)","Ribaminho - Sociedade de Construções, Lda. (501848479)","1.989,90 €",04-08-2016,03-08-2016,10 dias,"Portugal, Lisboa, Lisboa","Artigo 19.º, alínea a) do Código dos Contratos Públicos","","",,,,Não aplicável.,Não aplicável.,FALSE
Serviços de acreditação/recertificação de gestão clinica com o Programa Nacional de Acreditação em saúde - USF Tornada,Ajuste Direto Regime Geral,Aquisição de serviços,"79132000-8, Serviços de certificação","Administração Regional de Saúde de Lisboa e Vale do Tejo, I. P. (503148776)",Direcção-Geral de Saúde (600037100),"4.950,00 €",03-08-2016,03-08-2016,30 dias,"Portugal, Leiria, Caldas da Rainha","Artigo 24.º, n.º 1, alínea e) do Código dos Contratos Públicos","","",,,,Não aplicável.,Não aplicável.,FALSE
Serviços de acreditação/recertificação de gestão clinica com o Programa Nacional de Acreditação em saúde - USF Gama,Ajuste Direto Regime Geral,Aquisição de serviços,"79132000-8, Serviços de certificação","Administração Regional de Saúde de Lisboa e Vale do Tejo, I. P. (503148776)",Direcção-Geral de Saúde (600037100),"4.950,00 €",03-08-2016,03-08-2016,30 dias,"Portugal, Lisboa, Torres Vedras","Artigo 24.º, n.º 1, alínea e) do Código dos Contratos Públicos","","",,,,Não aplicável.,Não aplicável.,FALSE
Obra para reparação de rotura de água na ala noroeste do C. S. do Cartaxo.,Ajuste Direto Regime Geral,Empreitadas de obras públicas,"45113000-2, Obras no local","Administração Regional de Saúde de Lisboa e Vale do Tejo, I. P. (503148776)","Metal Cúbico, Lda. (503852880)","23.286,00 €",02-08-2016,02-08-2016,20 dias,"Portugal, Lisboa, Lisboa","Artigo 19.º, alínea a) do Código dos Contratos Públicos","","",,,,Não aplicável.,Não aplicável.,FALSE
Aquisição de Consumíveis Informáticos,Ajuste Direto Regime Geral,Aquisição de bens móveis,"30125100-2, Cartuchos de tinta (toner)","Administração Regional de Saúde de Lisboa e Vale do Tejo, I. P. (503148776)","Toptoner - Reciclagem e Comercialização de Consumíveis Informáticos, Lda (504242644)","47,45 €",02-08-2016,02-08-2016,151 dias,"Portugal, Lisboa, Lisboa","Artigo 20.º, n.º 1, alínea a) do Código dos Contratos Públicos","","",,,,Não aplicável.,Não aplicável.,FALSE
Aquisição de Consumíveis Informáticos,Ajuste Direto Regime Geral,Aquisição de bens móveis,"30125100-2, Cartuchos de tinta (toner)","Administração Regional de Saúde de Lisboa e Vale do Tejo, I. P. (503148776)","Toptoner  - Reciclagem e comercialização de Consumíveis Informáticos, Lda (504242644)","14.225,00 €",02-08-2016,02-08-2016,151 dias,"Portugal, Lisboa, Lisboa","Artigo 20.º, n.º 1, alínea a) do Código dos Contratos Públicos","","",,,,Não aplicável.,Não aplicável.,FALSE
Aquisição de Consumíveis Informáticos,Ajuste Direto Regime Geral,Aquisição de bens móveis,"30125100-2, Cartuchos de tinta (toner)","Administração Regional de Saúde de Lisboa e Vale do Tejo, I. P. (503148776)","Toptoner - Reciclagem e Comercialização de Consumíveis Informáticos, Lda (504242644)","7.275,00 €",02-08-2016,02-08-2016,151 dias,"Portugal, Lisboa, Lisboa","Artigo 20.º, n.º 1, alínea a) do Código dos Contratos Públicos","","",,,,Não aplicável.,Não aplicável.,FALSE
