freguesia,acronym,validVotesPercentage,votes,dicofre
Vila Nova da Telha,PS,35.28,700,130616
Vila Nova da Telha,PPD/PSD,25.1,498,130616
Vila Nova da Telha,B.E.,11.54,229,130616
Vila Nova da Telha,PAN,6.85,136,130616
Vila Nova da Telha,CDS-PP,5.04,100,130616
Vila Nova da Telha,PCP-PEV,5.04,100,130616
Vila Nova da Telha,L,2.07,41,130616
Vila Nova da Telha,A,2.02,40,130616
Vila Nova da Telha,IL,1.86,37,130616
Vila Nova da Telha,NC,1.66,33,130616
Vila Nova da Telha,PPM.PPV/CDC,0.81,16,130616
Vila Nova da Telha,PCTP/MRPP,0.71,14,130616
Vila Nova da Telha,PTP,0.6,12,130616
Vila Nova da Telha,PURP,0.55,11,130616
Vila Nova da Telha,PDR,0.4,8,130616
Vila Nova da Telha,PNR,0.3,6,130616
Vila Nova da Telha,MAS,0.15,3,130616
