Objeto do Contrato,Tipo de Procedimento,Tipo(s) de Contrato,CPVs,Entidade(s) Adjudicante(s),Entidade(s) Adjudicatária(s),Preço Contratual,Data de Publicação,Data de Celebração do Contrato,Prazo de Execução,Local de Execução,Fundamentação,Data de Fecho do Contrato,Preço Total Efetivo,Causas das Alterações ao Prazo,Causas das Alterações ao Preço,Estado,N.º registo do Acordo Quadro,Descrição do Acordo Quadro,Procedimento Centralizado
41.637.2017 Medicamentos do Aparelho Cardiovascular,Ao abrigo de acordo-quadro (art.º 259.º),Aquisição de bens móveis,"33690000-3, Medicamentos vários","Centro Hospitalar Universitário do Algarve, E.P.E. (510745997)","FERRAZ,LYNCE,S.A. (500113270), Astra - Zeneca - Produtos Farmacêuticos, Lda. (502942240), SANDOZ FARMACÊUTICA, LDA. (506985261)","348,36 €",21-11-2017,07-04-2017,268 dias,"Portugal, Faro, Faro",Artigo 259.º do Código dos Contratos Públicos,"","",,"",,2335591,CP 2016/01 - Acordo Quadro para fornecimento de Medicamentos do Aparelho Cardiovascular   às Instituições e Serviços do Serviço Nacional de Saúde,FALSE
41.638.2017 Medicamentos do Sistema Nervoso CerebroEspinal,Ao abrigo de acordo-quadro (art.º 259.º),Aquisição de bens móveis,"33690000-3, Medicamentos vários","Centro Hospitalar Universitário do Algarve, E. P. E. (510745997)","HIKMA FARMACÊUTICA (502266791), Aurovitas Unipessoal, Lda (513053239), LABESFAL-LAB. ALMIRO, SA. (501169580), FARMOZ - SOC TECNICO MEDICINAL SA (501505334)","26.658,74 €",21-11-2017,13-03-2017,293 dias,"Portugal, Faro, Faro",Artigo 259.º do Código dos Contratos Públicos,"","",,"",,2528670,"CP 2017/2 - Acordo Quadro para fornecimento de Medicamentos do Sistema Nervoso Cerebrospinal, exceto: anestésicos, relaxantes musculares, analgésicos, antipiréticos, antidepressivos e antipsicóticos  às Instituições e Serviços do Serviço Nacional de Saúde",FALSE
41.639.2017 Medicamentos Sorbitol e Manitol,Ao abrigo de acordo-quadro (art.º 259.º),Aquisição de bens móveis,"33690000-3, Medicamentos vários","Centro Hospitalar Universitário do Algarve, E. P. E. (510745997)","LABESFAL-LAB. ALMIRO, SA. (501169580)","3.524,40 €",21-11-2017,26-04-2017,249 dias,"Portugal, Faro, Faro",Artigo 259.º do Código dos Contratos Públicos,"","",,"",,2528675,CP 2017/3 - Acordo Quadro para fornecimento de corretivos da volémia e outras soluções estéreis,FALSE
Aq. de Serviços Médicos de Ortopedia,Ajuste Direto Regime Geral,Aquisição de serviços,"85121283-0, Serviços de ortopedia","Centro Hospitalar Universitário do Algarve, E. P. E. (510745997)","Génio Curioso, Lda (510090745)","24.960,00 €",20-11-2017,23-10-2017,91 dias,"Portugal, Faro, Faro<BR/>Portugal, Faro, Lagos<BR/>Portugal, Faro, Portimão","Artigo 24.º, n.º 1, alínea e) do Código dos Contratos Públicos",23-10-2017,"17.280,00 €",,"O valor inicial do Contrato teve por base as necessidades estimadas para o período de 1 Abril de 2017 a 30 junho de 2017, o valor final reflecte as necessidades efectivas.",,Não aplicável.,Não aplicável.,FALSE
Aq. de Serviços Médicos Ginecologia/Obstetricia,Ajuste Direto Regime Geral,Aquisição de serviços,"85121210-8, Serviços de ginecologia ou obstetrícia","Centro Hospitalar Universitário do Algarve, E. P. E. (510745997)","David Frutuoso, Lda (509707297)","46.800,00 €",20-11-2017,23-08-2017,183 dias,"Portugal, Faro, Faro<BR/>Portugal, Faro, Portimão","Artigo 24.º, n.º 1, alínea e) do Código dos Contratos Públicos",31-12-2017,"36.600,00 €",,"O valor inicial do Contrato teve por base as necessidades estimadas para o período de 1 julho de 2017 a 31 dezembro de 2017, o valor final reflecte as necessidades efectivas.",,Não aplicável.,Não aplicável.,FALSE
"Prestação de Serviços de Manutenção Assistência Técnica de Equipamentos AVAC, Instalações Frigoríficas",Ajuste Direto Regime Geral,Aquisição de serviços,"50000000-5, Serviços de reparação e manutenção","Centro Hospitalar Universitário do Algarve, E. P. E. (510745997)",Serviço de Utilização Comum dos Hospitais (500900469),"29.166,00 €",20-11-2017,27-10-2017,61 dias,"Portugal, Faro, Faro<BR/>Portugal, Faro, Lagos<BR/>Portugal, Faro, Portimão","Artigo 24.º, n.º 1, alínea c) do Código dos Contratos Públicos","","",,"",,Não aplicável.,Não aplicável.,FALSE
41.583.2017 Medicamentos Lidoocaina,Ao abrigo de acordo-quadro (art.º 259.º),Aquisição de bens móveis,"33690000-3, Medicamentos vários","Centro Hospitalar Universitário do Algarve, E. P. E. (510745997)","SIDEFARMA, S.A. (500717419), LABESFAL-LAB. ALMIRO, SA. (501169580)","4.650,00 €",20-11-2017,15-03-2017,291 dias,"Portugal, Faro, Faro",Artigo 259.º do Código dos Contratos Públicos,"","",,"",,1370278,CP 2015/51 - Acordo quadro para fornecimento de medicamentos usados nas afeções cutâneas às instituições e serviços do serviço nacional de saúde,FALSE
41.584.2017 Medicamentos Lamivudina e lamivudina +Zidovudina,Ao abrigo de acordo-quadro (art.º 259.º),Aquisição de bens móveis,"33696500-0, Reagentes de laboratório","Centro Hospitalar Universitário do Algarve, E. P. E. (510745997)","Teva Pharma - Produtos Farmacêuticos, Lda (507045491), Aurobindo Pharma (Portugal), Unipessoal, Lda (508527465)","11.638,53 €",20-11-2017,21-04-2017,254 dias,"Portugal, Faro, Faro",Artigo 259.º do Código dos Contratos Públicos,"","",,"",,2183729,Medicamentos antirretrovíricos para o tratamento da infeção por VIH,FALSE
41.585.2017 Medicamentos  Loperamida 2mg,Ao abrigo de acordo-quadro (art.º 259.º),Aquisição de bens móveis,"33690000-3, Medicamentos vários","Centro Hospitalar Universitário do Algarve, E. P. E. (510745997)",RATIOPHARM (502414910),"216,00 €",20-11-2017,06-01-2017,359 dias,"Portugal, Faro, Faro",Artigo 259.º do Código dos Contratos Públicos,"","",,"",,2222779,Medicamentos do aparelho digestivo,FALSE
41.586.2017 Medicamentos Latanoproste,Ao abrigo de acordo-quadro (art.º 259.º),Aquisição de bens móveis,"33690000-3, Medicamentos vários","Centro Hospitalar Universitário do Algarve, E. P. E. (510745997)","Aurovitas Unipessoal, Lda (513053239)","64,00 €",20-11-2017,17-02-2017,317 dias,"Portugal, Faro, Faro",Artigo 259.º do Código dos Contratos Públicos,"","",,"",,1377420,Acordo quadro para fornecimento de medicamentos usados nas afecções oculares e otorrinolaringologias às instituições e serviços do serviço nacional de saúde,FALSE
Prestação de Serviços de Radioterapia,Ajuste Direto Regime Geral,Aquisição de serviços,"85100000-0, Serviços de saúde","Centro Hospitalar Universitário do Algarve, E. P. E. (510745997)","Quadrantes Faro, Unidade de Radioterapia do Algarve, Lda. (505446120)","331.820,00 €",20-11-2017,26-10-2017,61 dias,"Portugal, Faro, Faro","Artigo 24.º, n.º 1, alínea c) do Código dos Contratos Públicos","","",,"",,Não aplicável.,Não aplicável.,FALSE
Aluguer Torres Laparoscopia 2018 ( 78/2061/17),Ajuste Direto Regime Geral,Aquisição de serviços,"98300000-6, Serviços diversos","Centro Hospitalar Universitário do Algarve, E. P. E. (510745997)","STRYKER PORTUGAL - PRODUTOS MEDICOS, UNIPESSOAL,LDA. (504594214)","25.200,00 €",17-11-2017,01-04-2017,270 dias,"Portugal, Faro, Faro<BR/>Portugal, Faro, Portimão","Artigo 20.º, n.º 1, alínea a) do Código dos Contratos Públicos",27-12-2017,"25.200,00 €",,"",,Não aplicável.,Não aplicável.,FALSE
Aquisição equipamento Informático,Concurso público,Aquisição de bens móveis,"30000000-9, Máquinas, equipamento e material de escritório e de informática, excepto mobiliário e pacotes de programas (software)","Centro Hospitalar do Algarve, E. P. E. (510745997)","Meo-Serviços de Comunicações e Multimédia, S.A. (504615947)","125.092,50 €",17-11-2017,11-10-2017,81 dias,"Portugal, Faro, Faro<BR/>Portugal, Faro, Portimão<BR/>Portugal, Faro, Lagos","Artigo 20.º, n.º 1, alínea b) do Código dos Contratos Públicos","","",,"",,Não aplicável.,Não aplicável.,TRUE
62/4021/17-AQUISIÇÃO DE MATERIAL CONSUMO CLINICO (DRAGER),Ajuste Direto Regime Geral,Aquisição de bens móveis,"33140000-3, Material médico de consumo","Centro Hospitalar Universitário do Algarve, E. P. E. (510745997)",DRAGER PORTUGAL (508771323),"7.389,00 €",17-11-2017,13-10-2017,48 dias,"Portugal, Faro, Faro<BR/>Portugal, Faro, Lagos<BR/>Portugal, Faro, Portimão","Artigo 20.º, n.º 1, alínea a) do Código dos Contratos Públicos","","",,"",,Não aplicável.,Não aplicável.,FALSE
Aquisição de Ecógrafo para o Serviço de Radiologia,Concurso público,Aquisição de bens móveis,"33111000-1, Aparelhos para radiologia","Centro Hospitalar do Algarve, E. P. E. (510745997)",GE (500357129),"56.000,00 €",17-11-2017,22-09-2017,100 dias,"Portugal, Faro, Portimão","Artigo 20.º, n.º 1, alínea b) do Código dos Contratos Públicos","","",,"",,Não aplicável.,Não aplicável.,FALSE
Aquisição de Viaturas Médicas de Emergência e Reanimação (VMER) para várias entidades do Serviço Nacional de Saúde  - 2 viaturas (1 VMER Unidade de Portimão + 1 VMER Sub de Albufeira),Concurso público,Aquisição de bens móveis,"34114100-0, Veículos de emergência","Centro Hospitalar do Algarve, E. P. E. (510745997)",Hermotor (502817852),"72.600,00 €",17-11-2017,09-10-2017,30 dias,"Portugal, Faro, Albufeira<BR/>Portugal, Faro, Portimão","Artigo 20.º, n.º 1, alínea b) do Código dos Contratos Públicos","","",,"",,Não aplicável.,Não aplicável.,TRUE
Aquisição de Aparelho Angio - OCT,Ajuste Direto Regime Geral,Aquisição de bens móveis,"33122000-1, Equipamento oftalmológico","Centro Hospitalar Universitário do Algarve, E.P.E. (510745997)",GRUPO TAPER  (506886336),"74.000,00 €",17-11-2017,27-10-2017,65 dias,"Portugal, Faro, Portimão","Artigo 20.º, n.º 1, alínea a) do Código dos Contratos Públicos","","",,"",,Não aplicável.,Não aplicável.,FALSE
Prestação de Serviços Médicos de Urgência Geral e Básica ao abrigo do Acordo Quadro – Concurso 2015/102 – MD108 – Faro – Sem Especialidade,Ao abrigo de acordo-quadro (art.º 259.º),Aquisição de serviços,"85100000-0, Serviços de saúde","Centro Hospitalar Universitário do Algarve, E. P. E. (510745997)","Talenter-Gestão de Projetos, SA (506111148)","83.334,00 €",17-11-2017,09-11-2017,53 dias,"Portugal, Faro, Albufeira<BR/>Portugal, Faro, Portimão<BR/>Portugal, Faro, Faro<BR/>Portugal, Faro, Loulé<BR/>Portugal, Faro, Lagos<BR/>Portugal, Faro, Vila Real Sto Antonio",Artigo 259.º do Código dos Contratos Públicos,"","",,"",,454020,"CONCURSO PÚBLICO PARA A CELEBRAÇÃO DE CONTRATOS PÚBLICOS DE APROVISIONAMENTO PARA A ÁREA DA SAÚDE, COM VISTA À PRESTAÇÃO DE SERVIÇOS MÉDICOS ÀS INSTITUIÇÕES E SERVIÇOS DO SERVIÇO NACIONAL DE SAÚDE",FALSE
"41.577.2017 medicamentos lamotrigina, Levetiracetam, Lorazepam",Ao abrigo de acordo-quadro (art.º 259.º),Aquisição de bens móveis,"33690000-3, Medicamentos vários","Centro Hospitalar Universitário do Algarve, E. P. E. (510745997)","Aurovitas Unipessoal, Lda. (513053239), Labesfal - Laboratorios Almiro, S.A. (501169580), Glaxo SmithKline - Produtos Farmacêutico, Lda.  (500139962), Generis Farmaceutica, S.A. (508107997)","15.119,02 €",15-11-2017,08-02-2017,326 dias,"Portugal, Faro, Faro",Artigo 259.º do Código dos Contratos Públicos,"","",,"",,2528670,"CP 2017/2 - Acordo Quadro para fornecimento de Medicamentos do Sistema Nervoso Cerebrospinal, exceto: anestésicos, relaxantes musculares, analgésicos, antipiréticos, antidepressivos e antipsicóticos  às Instituições e Serviços do Serviço Nacional de Saúde",FALSE
Prestação de Serviços Médicos,Ajuste Direto Regime Geral,Aquisição de serviços,"85121000-3, Serviços de prática médica","Centro Hospitalar Universitário do Algarve, E. P. E. (510745997)",Kelly Healthcare Resourses (510723691),"62.640,00 €",15-11-2017,07-11-2017,365 dias,"Portugal, Faro, Faro","Artigo 24.º, n.º 1, alínea e) do Código dos Contratos Públicos",15-11-2017,"62.640,00 €",,"O valor inicial do Contrato teve por base as necessidades estimadas para o período de 1 Janeiro de 2016 a 31 Dezembro de 2016, o valor final reflecte as necessidades efectivas.",,Não aplicável.,Não aplicável.,FALSE
41.578.2017 Medicamentos Levofloxacina,Ao abrigo de acordo-quadro (art.º 259.º),Aquisição de bens móveis,"33690000-3, Medicamentos vários","Centro Hospitalar Universitário do Algarve, E.P.E. (510745997)","FARMOZ - SOCIEDADE TÉCNICO MEDICINAL S.A. (501505334), FRESENIUS KABI PHARMA PORTUGAL,LDA (504293753)","5.104,10 €",15-11-2017,28-03-2017,278 dias,"Portugal, Faro, Faro",Artigo 259.º do Código dos Contratos Públicos,"","",,"",,1326195,ACORDO QUADRO PARA FORNECIMENTO DE MEDICAMENTOS ANTI-INFECIOSOS: EXCETO ANTIVÍRICOS E ANTIFÚNGICOS ÀS INSTITUIÇÕES E SERVIÇOS DO SERVIÇO NACIONAL DE SAÚDE,FALSE
41.581.2017 Medicamento Lidocaína e Lidocaína + Cloro + Hexidina,Ao abrigo de acordo-quadro (art.º 259.º),Aquisição de bens móveis,"33690000-3, Medicamentos vários","Centro Hospitalar Universitário do Algarve, E. P. E. (510745997)","QUILABAN (500399670), B BRAUN MEDICAL LDA (501506543), Labesfal - Laboratorios Almiro, S.A. (501169580)","25.439,00 €",14-11-2017,09-02-2017,325 dias,"Portugal, Faro, Faro",Artigo 259.º do Código dos Contratos Públicos,"","",,"",,2211341,Medicamentos anestésicos e relaxantes musculares,FALSE
"41.479.Medicamento Letrozol 2,5mg",Ao abrigo de acordo-quadro (art.º 259.º),Aquisição de bens móveis,"33690000-3, Medicamentos vários","Centro Hospitalar Universitário do Algarve, E. P. E. (510745997)",FARMOZ - SOCIEDADE TÉCNICO MEDICINAL S.A. (501505334),"2.483,38 €",14-11-2017,14-03-2017,292 dias,"Portugal, Faro, Faro",Artigo 259.º do Código dos Contratos Públicos,"","",,"",,1771819,CP 2015/6 - Acordo quadro para o fornecimento de Medicamentos do Foro Oncológico,FALSE
41.580.2017 Medicamento Levotiroxina Sodica,Ao abrigo de acordo-quadro (art.º 259.º),Aquisição de bens móveis,"33690000-3, Medicamentos vários","Centro Hospitalar Universitário do Algarve, E. P. E. (510745997)","RATIOPHARM, LDA (502414910)","514,15 €",14-11-2017,14-03-2017,292 dias,"Portugal, Faro, Faro",Artigo 259.º do Código dos Contratos Públicos,"","",,"",,603979,"CONCURSO PÚBLICO PARA A CELEBRAÇÃO DE CONTRATOS PÚBLICOS DE APROVISIONAMENTO PARA A ÁREA DA SAÚDE, COM VISTA AO FORNECIMENTO DE HORMONAS E OUTROS MEDICAMENTOS USADOS NO TRATAMENTO DAS DOENÇAS ENDÓCRINAS, ÀS INSTITUIÇÕES E SERVIÇOS DO SERVIÇO NACIONAL DE SAÚDE",FALSE
41.582.2017 Medicamento Loratadina 10mg,Ao abrigo de acordo-quadro (art.º 259.º),Aquisição de bens móveis,"33690000-3, Medicamentos vários","Centro Hospitalar Universitário do Algarve, E. P. E. (510745997)","LABESFAL, Laboratório Almiro S.A. (501169580)","17,64 €",14-11-2017,07-04-2017,268 dias,"Portugal, Faro, Faro",Artigo 259.º do Código dos Contratos Públicos,"","",,"",,1338581,"Acordo quadro para fornecimento de Medicação antialérgica, medicamentos usados no tratamento de intoxicações, vitaminas e sais minerais e grupo 20.9 - outros produtos às instituições e serviços do serviço nacional de saúde",FALSE
62/3905/2017 - Aquisição Cardioversor desfibrilhador - 1 camara (CDI-VR) gerador s/electrodo,Ajuste Direto Regime Geral,Aquisição de bens móveis,"33182000-9, Material de assistência à função cardíaca","Centro Hospitalar Universitário do Algarve, E. P. E. (510745997)","BIOTRONIK PORTUGAL UNIPESSOAL, LDA (510726941)","7.000,00 €",13-11-2017,22-09-2017,5 dias,"Portugal, Faro, Faro","Artigo 24.º, n.º 1, alínea e) do Código dos Contratos Públicos","","",,"",,Não aplicável.,Não aplicável.,FALSE
Realização de Ecografias,Ajuste Direto Regime Geral,Aquisição de serviços,"85100000-0, Serviços de saúde","Centro Hospitalar Universitário do Algarve, E. P. E. (510745997)",Fernando Sancho Lda (500602522),"13.500,00 €",13-11-2017,13-11-2017,50 dias,"Portugal, Faro, Faro","Artigo 20.º, n.º 1, alínea a) do Código dos Contratos Públicos","","",,"",,Não aplicável.,Não aplicável.,FALSE
