Objeto do Contrato,Tipo de Procedimento,Tipo(s) de Contrato,CPVs,Entidade(s) Adjudicante(s),Entidade(s) Adjudicatária(s),Preço Contratual,Data de Publicação,Data de Celebração do Contrato,Prazo de Execução,Local de Execução,Fundamentação,Data de Fecho do Contrato,Preço Total Efetivo,Causas das Alterações ao Prazo,Causas das Alterações ao Preço,Estado,N.º registo do Acordo Quadro,Descrição do Acordo Quadro,Procedimento Centralizado
Material de Otorrino,Ajuste Direto Regime Geral,Aquisição de bens móveis,"33140000-3, Material médico de consumo","Centro Hospitalar do Algarve, E. P. E. (510745997)","SURGYLINE - DISPOSITIVOS MÉDICOS CIRURGICOS, LDA. (509811663), EPJMEDICA-ARTIGOS MED.HOSPITAL (506820513), MICRO-MEDICA, LDA. (501904956), ATOS MEDICAL SPAIN, SL - SUCURSAL EM PORTUGAL (980435978), MEDTRONIC PORTUGAL, LDA. (504223933)","44.884,85 €",20-03-2015,20-03-2015,287 dias,"Portugal, Faro, Faro<BR/>Portugal, Faro, Portimão<BR/>Portugal, Faro, Lagos","Artigo 20.º, n.º 1, alínea a) do Código dos Contratos Públicos","","","","",,Não aplicável.,Não aplicável.,FALSE
processo n.º 61/532-Nutrição,Ajuste Direto Regime Geral,Aquisição de bens móveis,"33690000-3, Medicamentos vários","Centro Hospitalar do Algarve, E. P. E. (510745997)","labesfal (501169580), Bayer (500043256), merck (500650870), tecnifar (501738207), lab. atral (500162085), Desma (980300649), janssen (500189412)","27.751,83 €",20-03-2015,27-02-2014,360 dias,"Portugal, Faro, Faro","Artigo 24.º, n.º 1, alínea e) do Código dos Contratos Públicos","","","","",,Não aplicável.,Não aplicável.,FALSE
Aquisição de Sistemas de Monitorização e Sistema pacemaker,Ajuste Direto Regime Geral,Aquisição de bens móveis,"33182000-9, Material de assistência à função cardíaca","Centro Hospitalar do Algarve, E. P. E. (510745997)","BIOTRONIK Portugal (Unipessoal Lda. (510726941), ST. JUDE MEDICAL PORTUGAL,LDA. (504180746)","9.143,00 €",20-03-2015,13-03-2015,286 dias,"Portugal, Faro, Lagos<BR/>Portugal, Faro, Faro<BR/>Portugal, Faro, Portimão","Artigo 20.º, n.º 1, alínea a) do Código dos Contratos Públicos","","","","",,Não aplicável.,Não aplicável.,FALSE
processo n.º 61/519-Medicamentos aparelho cardio -vascular,Ajuste Direto Regime Geral,Aquisição de bens móveis,"33690000-3, Medicamentos vários","Centro Hospitalar do Algarve, E. P. E. (510745997)","Quilaban (500399670), angelini (500583650), bene (508735696), bluemed (509912060), servier (502177420), sankyo (501509860), Orienfin (508907365), desma (980300649), Abbottt (500006148), bristol (500048193), Unilfarma (500293023), sanofi (500134960), overpharma (505792362)","13.712,18 €",20-03-2015,17-01-2014,360 dias,"Portugal, Faro, Faro","Artigo 24.º, n.º 1, alínea e) do Código dos Contratos Públicos",31-12-2014,"13.712,18 €","","",,Não aplicável.,Não aplicável.,FALSE
Prestação de Serviços de Lavagem e Tratamento de Roupa,Concurso público,Aquisição de serviços,"98311000-6, Serviços de recolha de roupa por lavandarias","Centro Hospitalar do Algarve, E. P. E. (510745997)",Serviço Utilização Comum Hospitais (500900469),"64.492,32 €",20-03-2015,01-12-2014,31 dias,"Portugal, Faro, Portimão<BR/>Portugal, Faro, Lagos<BR/>Portugal, Faro, Faro",Artigo 155.º do Código dos Contratos Públicos,31-12-2014,"74.266,42 €","Nenhuma, não existiu alteração no prazo","As quantidades estimadas foram ultrapassadas relativamente as efetivas, foi autorizado acrescimo da despesa inicialmente autorizada, nos termos do art.º 370.º do CCP - Trabalhos a mais",,Não aplicável.,Não aplicável.,FALSE
Prestação de Serviços de Realização de Análises Clínicas,Ajuste Direto Regime Geral,Aquisição de serviços,"85000000-9, Serviços de saúde e acção social","Centro Hospitalar do Algarve, E. P. E. (510745997)",Dr. Joaquim Chaves - Laboratório de Análises Clínicas (500753636),"14.750,08 €",20-03-2015,20-03-2015,286 dias,"Portugal, Faro, Lagos<BR/>Portugal, Faro, Faro<BR/>Portugal, Faro, Portimão","Artigo 20.º, n.º 1, alínea a) do Código dos Contratos Públicos","","","","",,Não aplicável.,Não aplicável.,FALSE
"61/71/2015 - Medicamento """"Moroctocog""""",Ajuste Direto Regime Geral,Aquisição de bens móveis,"33690000-3, Medicamentos vários","Centro Hospitalar do Algarve, E. P. E. (510745997)","Laboratórios Pfizer, Lda (500162166)","439.711,80 €",19-03-2015,17-12-2014,365 dias,"Portugal, Faro, Faro","Artigo 24.º, n.º 1, alínea e) do Código dos Contratos Públicos","","","","",,Não aplicável.,Não aplicável.,FALSE
"31/47/2015 - Medicamento """"Raltegravir""""",Ao abrigo de acordo-quadro (art.º 258.º),Aquisição de bens móveis,"33690000-3, Medicamentos vários","Centro Hospitalar do Algarve, E. P. E. (510745997)","Merck Sharp & Dohme, Lda (500191360)","949.680,00 €",19-03-2015,17-12-2014,365 dias,"Portugal, Faro, Faro","Artigo 26.º, n.º 1, alínea e) do Código dos Contratos Públicos","","","","",,611354,"CONCURSO PÚBLICO PARA A CELEBRAÇÃO DE CONTRATOS PÚBLICOS DE APROVISIONAMENTO PARA A ÁREA DA SAÚDE, COM VISTA AO FORNECIMENTO DE MEDICAMENTOS ANTI-INFECIOSOS: ANTIVÍRICOS E ANTIFÚNGICOS, ÀS INSTITUIÇÕES E SERVIÇOS DO SERVIÇO NACIONAL DE SAÚDE",FALSE
"31/147/2015 - Medicamento """"Emtricitabina+Tenofovir""""",Ao abrigo de acordo-quadro (art.º 258.º),Aquisição de bens móveis,"33690000-3, Medicamentos vários","Centro Hospitalar do Algarve, E. P. E. (510745997)","Gilead Sciences, Lda (503604704)","948.976,89 €",19-03-2015,23-12-2014,365 dias,"Portugal, Faro, Faro","Artigo 26.º, n.º 1, alínea e) do Código dos Contratos Públicos","","","","",,1120578,"CONCURSO PÚBLICO PARA A CELEBRAÇÃO DE CONTRATOS PÚBLICOS DE APROVISIONAMENTO PARA A ÁREA DA SAÚDE, COM VISTA AO FORNECIMENTO DE MEDICAMENTOS ANTI-RETROVIRAIS, ÀS INSTITUIÇÕES E SERVIÇOS DO SERVIÇO NACIONAL DE SAÚDE  ",FALSE
processo n.º 41/581-Factores hemofilicos,Ao abrigo de acordo-quadro (art.º 259.º),Aquisição de bens móveis,"33690000-3, Medicamentos vários","Centro Hospitalar do Algarve, E. P. E. (510745997)","bayer (500043256), novo nordisk (501485210), baxter (503347345)","280.084,86 €",19-03-2015,13-03-2014,270 dias,"Portugal, Faro, Faro",Artigo 259.º do Código dos Contratos Públicos,31-12-2014,"280.084,86 €","","",,606744,"CONCURSO PÚBLICO PARA A CELEBRAÇÃO DE CONTRATOS PÚBLICOS DE APROVISIONAMENTO PARA A ÁREA DA SAÚDE, COM VISTA AO FORNECIMENTO DE FATORES RECOMBINANTES DA COAGULAÇÃO, ÀS INSTITUIÇÕES E SERVIÇOS DO SERVIÇO NACIONAL DE SAÚDE",FALSE
Processo n.º 41/563-Medicamentos para o sangue,Ao abrigo de acordo-quadro (art.º 259.º),Aquisição de bens móveis,"33690000-3, Medicamentos vários","Centro Hospitalar do Algarve, E. P. E. (510745997)","combino (508622263), hospira (502918098), generis (508107997), actavis (980334934)","68.654,66 €",19-03-2015,18-02-2014,300 dias,"Portugal, Faro, Faro",Artigo 259.º do Código dos Contratos Públicos,31-12-2014,"68.654,66 €","","",,1210107,"CONCURSO PÚBLICO PARA A CELEBRAÇÃO DE CONTRATOS PÚBLICOS DE APROVISIONAMENTO PARA A ÁREA DA SAÚDE, COM VISTA AO FORNECIMENTO DE MEDICAMENTOS DO GRUPO 4: SANGUE, ÀS INSTITUIÇÕES E SERVIÇOS DO SERVIÇO NACIONAL DE SAÚDE",FALSE
Processo n.º 41/1054-Penso terapeutico,Ao abrigo de acordo-quadro (art.º 259.º),Aquisição de bens móveis,"33690000-3, Medicamentos vários","Centro Hospitalar do Algarve, E. P. E. (510745997)","linea medica (505148676), covidien (503413410), clinifar (503281115), paul hartman (502271728), b.braun (501506543), queenlabs (503984485), smith (503552461), spcare (508284872)","33.505,70 €",19-03-2015,30-05-2014,210 dias,"Portugal, Faro, Faro",Artigo 259.º do Código dos Contratos Públicos,31-12-2014,"33.505,70 €","","",,490160,"CONCURSO PÚBLICO PARA A CELEBRAÇÃO DE CONTRATOS PÚBLICOS DE APROVISIONAMENTO PARA A ÁREA DA SAÚDE, COM VISTA AO FORNECIMENTO DE MATERIAL PENSO DE EFEITO TERAPÊUTICO - ÀS INSTITUIÇÕES E SERVIÇOS DO SERVIÇO NACIONAL DE SAÚDE",FALSE
"31/48/2015 - Medicamentos """"Lopinavir+Ritonavir e Ritonavir""""",Ao abrigo de acordo-quadro (art.º 258.º),Aquisição de bens móveis,"33690000-3, Medicamentos vários","Centro Hospitalar do Algarve, E. P. E. (510745997)","Abbvie, Lda (510229050)","601.195,96 €",19-03-2015,19-12-2014,365 dias,"Portugal, Faro, Faro","Artigo 26.º, n.º 1, alínea e) do Código dos Contratos Públicos","","","","",,1120578,"CONCURSO PÚBLICO PARA A CELEBRAÇÃO DE CONTRATOS PÚBLICOS DE APROVISIONAMENTO PARA A ÁREA DA SAÚDE, COM VISTA AO FORNECIMENTO DE MEDICAMENTOS ANTI-RETROVIRAIS, ÀS INSTITUIÇÕES E SERVIÇOS DO SERVIÇO NACIONAL DE SAÚDE  ",FALSE
Alugueres Equipamentos ( 78/829/15),Ajuste Direto Regime Geral,Aquisição de serviços,"98300000-6, Serviços diversos","Centro Hospitalar do Algarve, E. P. E. (510745997)",Linde Saude Lda  (500125546),"17.782,80 €",19-03-2015,16-02-2015,365 dias,"Portugal, Faro, Faro<BR/>Portugal, Faro, Portimão","Artigo 20.º, n.º 1, alínea a) do Código dos Contratos Públicos","","","","",,Não aplicável.,Não aplicável.,FALSE
Manutenção Equip Medico ( 6879715),Ajuste Direto Regime Geral,Aquisição de serviços,"50420000-5, Serviços de reparação e manutenção de equipamento médico e cirúrgico","Centro Hospitalar do Algarve, E. P. E. (510745997)",Philips Portuguesa  (500216843),"10.675,80 €",19-03-2015,24-02-2015,90 dias,"Portugal, Faro, Faro","Artigo 24.º, n.º 1, alínea e) do Código dos Contratos Públicos",31-05-2015,"17.793,00 €","","Por necessidade de dar continuidade ao contrato de assistência técnica existente para o 1º trimestre, para mais  2 meses ( abril e maio ) enquanto decorria o CPI nº 630/15 para aquisição dos mencionados serviços .",,Não aplicável.,Não aplicável.,FALSE
Manutenção Bombas e Seringas ( 68/822/15),Ajuste Direto Regime Geral,Aquisição de serviços,"50420000-5, Serviços de reparação e manutenção de equipamento médico e cirúrgico","Centro Hospitalar do Algarve, E. P. E. (510745997)",B.Braun Medical  (501506543),"12.482,76 €",19-03-2015,20-02-2015,90 dias,"Portugal, Faro, Faro<BR/>Portugal, Faro, Portimão","Artigo 24.º, n.º 1, alínea e) do Código dos Contratos Públicos",31-05-2015,"20.804,60 €","","Por necessidade de dar continuidade ao contrato de assistência técnica existente para o 1º trimestre, para mais  2 meses ( abril e maio ) enquanto decorria o CPI nº 630/15 para aquisição dos mencionados serviços .",,Não aplicável.,Não aplicável.,FALSE
Manutenção Elevadores (68/697/15),Ajuste Direto Regime Geral,Aquisição de serviços,"50750000-7, Serviços de manutenção de elevadores","Centro Hospitalar do Algarve, E. P. E. (510745997)",Otis Elevadores (500069824),"45.197,28 €",19-03-2015,10-03-2015,365 dias,"Portugal, Faro, Lagos<BR/>Portugal, Faro, Faro<BR/>Portugal, Faro, Portimão","Artigo 24.º, n.º 1, alínea e) do Código dos Contratos Públicos","","","","",,Não aplicável.,Não aplicável.,FALSE
processo n.º 41/1518-Derivados do plasma,Ao abrigo de acordo-quadro (art.º 259.º),Aquisição de bens móveis,"33690000-3, Medicamentos vários","Centro Hospitalar do Algarve, E. P. E. (510745997)","csl behring (503047201), octafharma (502820780), kedrion (508472830)","218.947,50 €",19-03-2015,13-03-2014,270 dias,"Portugal, Faro, Faro",Artigo 259.º do Código dos Contratos Públicos,31-12-2014,"218.947,50 €","","",,535788,"CONCURSO PÚBLICO PARA A CELEBRAÇÃO DE CONTRATOSPÚBLICOS DE APROVISIONAMENTO PARA A ÁREA DA SAÚDE, COM VISTA AO FORNECIMENTO DE DERIVADOS DO PLASMA HUMANOÀS INSTITUIÇÕES E SERVIÇOS DO SERVIÇO NACIONAL DE SAÚDE",FALSE
"31/62/2015 - Medicamento """"Atazanavir 300mg""""",Ao abrigo de acordo-quadro (art.º 258.º),Aquisição de bens móveis,"33690000-3, Medicamentos vários","Centro Hospitalar do Algarve, E. P. E. (510745997)","Bristol Myers Squibb, SA (500048193)","940.357,53 €",19-03-2015,17-12-2014,365 dias,"Portugal, Faro, Faro","Artigo 26.º, n.º 1, alínea e) do Código dos Contratos Públicos","","","","",,1120578,"CONCURSO PÚBLICO PARA A CELEBRAÇÃO DE CONTRATOS PÚBLICOS DE APROVISIONAMENTO PARA A ÁREA DA SAÚDE, COM VISTA AO FORNECIMENTO DE MEDICAMENTOS ANTI-RETROVIRAIS, ÀS INSTITUIÇÕES E SERVIÇOS DO SERVIÇO NACIONAL DE SAÚDE  ",FALSE
processo n.º 41/1442-Aciclovir 50 mg /creme,Ao abrigo de acordo-quadro (art.º 259.º),Aquisição de bens móveis,"33690000-3, Medicamentos vários","Centro Hospitalar do Algarve, E. P. E. (510745997)",Mendinfar (500384045),"92,00 €",19-03-2015,26-03-2014,270 dias,"Portugal, Faro, Faro",Artigo 259.º do Código dos Contratos Públicos,31-12-2014,"92,00 €","","",,602875,"CONCURSO PÚBLICO PARA A CELEBRAÇÃO DE CONTRATOS PÚBLICOS DE APROVISIONAMENTO PARA A ÁREA DA SAÚDE, COM VISTA AO FORNECIMENTO DE MEDICAMENTOS DE CONSUMO GERAL - USADOS NAS AFECÇÕES CUTÂNEAS, ÀS INSTITUIÇÕES E SERVIÇOS DO SERVIÇO NACIONAL DE SAÚDE",FALSE
Manutenção rede gases ( 78/1045/15),Ajuste Direto Regime Geral,Aquisição de serviços,"50700000-2, Serviços de reparação e manutenção de equipamento em edifícios","Centro Hospitalar do Algarve, E. P. E. (510745997)",Air Liquide Medicinal (501576436),"41.214,48 €",19-03-2015,06-03-2015,365 dias,"Portugal, Faro, Portimão<BR/>Portugal, Faro, Faro","Artigo 20.º, n.º 1, alínea a) do Código dos Contratos Públicos","","","","",,Não aplicável.,Não aplicável.,FALSE
"61/234/2015 - Medicamento """"Darunavir""""",Ajuste Direto Regime Geral,Aquisição de bens móveis,"33690000-3, Medicamentos vários","Centro Hospitalar do Algarve, E. P. E. (510745997)","Jansse Cilag Farmacêutica, Lda (500189412)","570.645,00 €",19-03-2015,17-12-2014,365 dias,"Portugal, Faro, Faro","Artigo 24.º, n.º 1, alínea e) do Código dos Contratos Públicos","","","","",,Não aplicável.,Não aplicável.,FALSE
processo n.º 41/1440-Aciclovir 250 mg,Ao abrigo de acordo-quadro (art.º 259.º),Aquisição de bens móveis,"33690000-3, Medicamentos vários","Centro Hospitalar do Algarve, E. P. E. (510745997)",generis (508107997),"3.677,10 €",19-03-2015,26-03-2014,270 dias,"Portugal, Faro, Faro",Artigo 259.º do Código dos Contratos Públicos,31-12-2014,"3.677,10 €","","",,611354,"CONCURSO PÚBLICO PARA A CELEBRAÇÃO DE CONTRATOS PÚBLICOS DE APROVISIONAMENTO PARA A ÁREA DA SAÚDE, COM VISTA AO FORNECIMENTO DE MEDICAMENTOS ANTI-INFECIOSOS: ANTIVÍRICOS E ANTIFÚNGICOS, ÀS INSTITUIÇÕES E SERVIÇOS DO SERVIÇO NACIONAL DE SAÚDE",FALSE
processo n.º 41/1432-Cetorolac 30 mg,Ao abrigo de acordo-quadro (art.º 259.º),Aquisição de bens móveis,"33690000-3, Medicamentos vários","Centro Hospitalar do Algarve, E. P. E. (510745997)",combino (508622263),"48.671,46 €",19-03-2015,28-02-2014,300 dias,"Portugal, Faro, Faro",Artigo 259.º do Código dos Contratos Públicos,31-12-2014,"48.671,46 €","","",,600392,"CONCURSO PÚBLICO PARA A CELEBRAÇÃO DE CONTRATOS PÚBLICOS DE APROVISIONAMENTO PARA A ÁREA DA SAÚDE, COM VISTA AO FORNECIMENTO DE MEDICAMENTOS DE CONSUMO GERAL - APARELHO LOCOMOTOR ÀS INSTITUIÇÕES E SERVIÇOS DO SERVIÇO NACIONAL DE SAÚDE",FALSE
Manutenção Geradores ( 78/1171/15),Ajuste Direto Regime Geral,Aquisição de serviços,"50710000-5, Serviços de reparação e manutenção de equipamento eléctrico e mecânico em edifícios","Centro Hospitalar do Algarve, E. P. E. (510745997)",Turbomar  (500290946),"12.190,73 €",19-03-2015,04-03-2015,300 dias,"Portugal, Faro, Lagos<BR/>Portugal, Faro, Faro<BR/>Portugal, Faro, Portimão","Artigo 20.º, n.º 1, alínea a) do Código dos Contratos Públicos","","","","",,Não aplicável.,Não aplicável.,FALSE
"31/11/2015 - Medicamento """"Pemetrexedo""""",Ao abrigo de acordo-quadro (art.º 258.º),Locação de bens móveis,"33690000-3, Medicamentos vários","Centro Hospitalar do Algarve, E. P. E. (510745997)","Lilly Portugal - Produtos Farmacêuticos, Lda (500165602)","531.260,28 €",19-03-2015,19-12-2014,365 dias,"Portugal, Faro, Faro","Artigo 26.º, n.º 1, alínea e) do Código dos Contratos Públicos","","","","",,1119467,"CONCURSO PÚBLICO PARA A CELEBRAÇÃO DE CONTRATOS PÚBLICOS DE APROVISIONAMENTO PARA A ÁREA DA SAÚDE, COM VISTA AO FORNECIMENTO DE MEDICAMENTOS DO FORO ONCOLÓGICO, ÀS INSTITUIÇÕES E SERVIÇOS DO SERVIÇO NACIONAL DE SAÚDE",FALSE
Manutenção Equip Cardiologia ( 68/1291/15),Ajuste Direto Regime Geral,Aquisição de serviços,"50420000-5, Serviços de reparação e manutenção de equipamento médico e cirúrgico","Centro Hospitalar do Algarve, E. P. E. (510745997)",Siemens SA  (500247480),"58.408,76 €",19-03-2015,10-03-2015,365 dias,"Portugal, Faro, Faro","Artigo 24.º, n.º 1, alínea e) do Código dos Contratos Públicos","","","","",,Não aplicável.,Não aplicável.,FALSE
"31/106/2015 - Medicamento """"Pegfilgrastim""""",Ao abrigo de acordo-quadro (art.º 258.º),Aquisição de bens móveis,"33690000-3, Medicamentos vários","Centro Hospitalar do Algarve, E. P. E. (510745997)","Amgen Biofarmacêutica, Lda. (502942959)","660.000,00 €",19-03-2015,18-12-2014,365 dias,"Portugal, Faro, Faro","Artigo 26.º, n.º 1, alínea e) do Código dos Contratos Públicos",31-12-2014,"660.000,00 €","","",,1210107,"CONCURSO PÚBLICO PARA A CELEBRAÇÃO DE CONTRATOS PÚBLICOS DE APROVISIONAMENTO PARA A ÁREA DA SAÚDE, COM VISTA AO FORNECIMENTO DE MEDICAMENTOS DO GRUPO 4: SANGUE, ÀS INSTITUIÇÕES E SERVIÇOS DO SERVIÇO NACIONAL DE SAÚDE",FALSE
"31/95/2015 - Medicamentos """"Tocilizumab, Peginterferão Alfa e Bevacizumab""""",Ao abrigo de acordo-quadro (art.º 258.º),Locação de bens móveis,"33690000-3, Medicamentos vários","Centro Hospitalar do Algarve, E. P. E. (510745997)","Roche Farmacêutica & Química, Lda (500233810)","538.050,80 €",19-03-2015,19-12-2014,365 dias,"Portugal, Faro, Faro","Artigo 26.º, n.º 1, alínea e) do Código dos Contratos Públicos","","","","",,1119467,"CONCURSO PÚBLICO PARA A CELEBRAÇÃO DE CONTRATOS PÚBLICOS DE APROVISIONAMENTO PARA A ÁREA DA SAÚDE, COM VISTA AO FORNECIMENTO DE MEDICAMENTOS DO FORO ONCOLÓGICO, ÀS INSTITUIÇÕES E SERVIÇOS DO SERVIÇO NACIONAL DE SAÚDE",FALSE
"31/101/2015 - Medicamento Etanercept""""",Ao abrigo de acordo-quadro (art.º 258.º),Locação de bens móveis,"33600000-6, Produtos farmacêuticos","Centro Hospitalar do Algarve, E. P. E. (510745997)","Laboratórios Pfizer, Lda (500162166)","898.512,08 €",19-03-2015,17-12-2014,365 dias,"Portugal, Faro, Faro","Artigo 26.º, n.º 1, alínea e) do Código dos Contratos Públicos","","","","",,1119467,"CONCURSO PÚBLICO PARA A CELEBRAÇÃO DE CONTRATOS PÚBLICOS DE APROVISIONAMENTO PARA A ÁREA DA SAÚDE, COM VISTA AO FORNECIMENTO DE MEDICAMENTOS DO FORO ONCOLÓGICO, ÀS INSTITUIÇÕES E SERVIÇOS DO SERVIÇO NACIONAL DE SAÚDE",FALSE
"31/43/2015 - Medicamento """"Efavirenz+Emtricitabina+Tenofovir""""",Ao abrigo de acordo-quadro (art.º 258.º),Aquisição de bens móveis,"33690000-3, Medicamentos vários","Centro Hospitalar do Algarve, E. P. E. (510745997)","Gilead Sciences, Lda (503604704)","943.950,00 €",19-03-2015,23-12-2014,337 dias,"Portugal, Faro, Faro","Artigo 26.º, n.º 1, alínea e) do Código dos Contratos Públicos","","","","",,1120578,"CONCURSO PÚBLICO PARA A CELEBRAÇÃO DE CONTRATOS PÚBLICOS DE APROVISIONAMENTO PARA A ÁREA DA SAÚDE, COM VISTA AO FORNECIMENTO DE MEDICAMENTOS ANTI-RETROVIRAIS, ÀS INSTITUIÇÕES E SERVIÇOS DO SERVIÇO NACIONAL DE SAÚDE  ",FALSE
processo n.º 41/1286-Sevoflurano,Ao abrigo de acordo-quadro (art.º 259.º),Aquisição de bens móveis,"33690000-3, Medicamentos vários","Centro Hospitalar do Algarve, E. P. E. (510745997)",ABBVIE (510229050),"142.354,60 €",18-03-2015,04-02-2014,300 dias,"Portugal, Faro, Faro",Artigo 259.º do Código dos Contratos Públicos,31-12-2014,"142.354,60 €","","",,611371,"CONCURSO PÚBLICO PARA A CELEBRAÇÃO DE CONTRATOS PÚBLICOS DE APROVISIONAMENTO PARA A ÁREA DA SAÚDE, COM VISTA AO FORNECIMENTO DE MEDICAMENTOS ANESTÉSICOS E RELAXANTES MUSCULARES, ÀS INSTITUIÇÕES E SERVIÇOS DO SERVIÇO NACIONAL DE SAÚDE    ",FALSE
"31/94/2015 - Medicamento """"Trastuzumab""""",Ao abrigo de acordo-quadro (art.º 258.º),Locação de bens móveis,"33690000-3, Medicamentos vários","Centro Hospitalar do Algarve, E. P. E. (510745997)","Roche Farmacêutica & Química, Lda (500233810)","916.452,00 €",18-03-2015,19-12-2014,365 dias,"Portugal, Faro, Faro","Artigo 26.º, n.º 1, alínea e) do Código dos Contratos Públicos","","","","",,1119467,"CONCURSO PÚBLICO PARA A CELEBRAÇÃO DE CONTRATOS PÚBLICOS DE APROVISIONAMENTO PARA A ÁREA DA SAÚDE, COM VISTA AO FORNECIMENTO DE MEDICAMENTOS DO FORO ONCOLÓGICO, ÀS INSTITUIÇÕES E SERVIÇOS DO SERVIÇO NACIONAL DE SAÚDE",FALSE
processo n.º 41/1234-Fentanilo,Ao abrigo de acordo-quadro (art.º 259.º),Aquisição de bens móveis,"33690000-3, Medicamentos vários","Centro Hospitalar do Algarve, E. P. E. (510745997)",labesfal (501169580),"8.952,00 €",18-03-2015,28-02-2014,300 dias,"Portugal, Faro, Faro",Artigo 259.º do Código dos Contratos Públicos,31-12-2014,"8.952,00 €","","",,613285,"CONCURSO PÚBLICO PARA A CELEBRAÇÃO DE CONTRATOS PÚBLICOS DE APROVISIONAMENTO PARA A ÁREA DA SAÚDE, COM VISTA AO FORNECIMENTO DE MEDICAMENTOS ANALGÉSICOS, ANTIPIRÉTICOS E ANTIDEPRESSORES, ÀS INSTITUIÇÕES E SERVIÇOS DO SERVIÇO NACIONAL DE SAÚDE",FALSE
72151015 - Aquisição de Cimentos e Misturadoras,Ajuste Direto Regime Geral,Aquisição de bens móveis,"33140000-3, Material médico de consumo","Centro Hospitalar do Algarve, E. P. E. (510745997)","BIOMET PORTUGAL UNIPESSOAL,LDA (500254990)","8.717,00 €",18-03-2015,12-03-2015,365 dias,"Portugal, Faro, Portimão<BR/>Portugal, Faro, Faro<BR/>Portugal, Faro, Lagos","Artigo 20.º, n.º 1, alínea a) do Código dos Contratos Públicos","","","","",,Não aplicável.,Não aplicável.,FALSE
processo n.º 41/1216-Soluções para dialise,Ao abrigo de acordo-quadro (art.º 259.º),Aquisição de bens móveis,"33690000-3, Medicamentos vários","Centro Hospitalar do Algarve, E. P. E. (510745997)",fresenius (503070220),"20.332,20 €",18-03-2015,26-03-2014,270 dias,"Portugal, Faro, Faro",Artigo 259.º do Código dos Contratos Públicos,31-12-2014,"20.332,20 €","","",,601978,"CONCURSO PÚBLICO PARA A CELEBRAÇÃO DE CONTRATOS PÚBLICOS DE APROVISIONAMENTO PARA A ÁREA DA SAÚDE, COM VISTA AO FORNECIMENTO DE BENS DE DÁLISE PERITONEAL ÀS INSTITUIÇÕES E SERVIÇOS DO SERVIÇO NACIONAL DE SAÚDE",FALSE
72151015 - Aquisição de Cimentos e Misturadoras,Ajuste Direto Regime Geral,Aquisição de bens móveis,"33140000-3, Material médico de consumo","Centro Hospitalar do Algarve, E. P. E. (510745997)",JOHNSON & JOHNSON PROD.PROF. (500153370),"12.740,00 €",18-03-2015,12-03-2015,365 dias,"Portugal, Faro, Faro<BR/>Portugal, Faro, Portimão<BR/>Portugal, Faro, Lagos","Artigo 20.º, n.º 1, alínea a) do Código dos Contratos Públicos","","","","",,Não aplicável.,Não aplicável.,FALSE
processo n.º 41/1569-Aquisição de desinfectantes e antisepticos,Ao abrigo de acordo-quadro (art.º 259.º),Aquisição de bens móveis,"33690000-3, Medicamentos vários","Centro Hospitalar do Algarve, E. P. E. (510745997)","vygon (503232785), b.braun (501506543), johnson (500153370), proclinica (500222665)","59.880,99 €",18-03-2015,08-04-2014,240 dias,"Portugal, Faro, Faro",Artigo 259.º do Código dos Contratos Públicos,31-12-2014,"59.880,99 €","","",,549298,"Concurso Público para a celebração de Contratos Publicos de Aprovisionamento para a área da saúde com vista ao fornecimento de Antisepticos, Desinfetantes e Outros, às Instituições e Serviços do Serviço Nacional de Saúde.",FALSE
"31/96/2015 - Medicamento """"Rituximab""""",Ao abrigo de acordo-quadro (art.º 258.º),Locação de bens móveis,"33690000-3, Medicamentos vários","Centro Hospitalar do Algarve, E. P. E. (510745997)","Roche Farmacêutica e Química, Lda (500233810)","569.465,00 €",18-03-2015,19-12-2014,365 dias,"Portugal, Faro, Faro","Artigo 24.º, n.º 1, alínea e) do Código dos Contratos Públicos","","","","",,1119467,"CONCURSO PÚBLICO PARA A CELEBRAÇÃO DE CONTRATOS PÚBLICOS DE APROVISIONAMENTO PARA A ÁREA DA SAÚDE, COM VISTA AO FORNECIMENTO DE MEDICAMENTOS DO FORO ONCOLÓGICO, ÀS INSTITUIÇÕES E SERVIÇOS DO SERVIÇO NACIONAL DE SAÚDE",FALSE
Serviços Médicos Ginecologia/Obstetrícia,Ajuste Direto Regime Geral,Aquisição de serviços,"85121210-8, Serviços de ginecologia ou obstetrícia","Centro Hospitalar do Algarve, E. P. E. (510745997)","F. Alves. Sociedade Unipessoal, Lda (504306987)","15.480,00 €",18-03-2015,02-03-2015,306 dias,"Portugal, Faro, Faro<BR/>Portugal, Faro, Portimão","Artigo 24.º, n.º 1, alínea c) do Código dos Contratos Públicos",31-12-2015,"6.720,00 €","","O valor inicial do Contrato teve por base as necessidades estimadas para o período de 1 Março de 2015 a 31 Dezembro de 2015, o valor final reflecte as necessidades efectivas.",,Não aplicável.,Não aplicável.,FALSE
Processo n.º 81010814-Corretivos da volemia,Ao abrigo de acordo-quadro (art.º 259.º),Aquisição de bens móveis,"33690000-3, Medicamentos vários","Centro Hospitalar do Algarve, E. P. E. (510745997)","overpharma (505792362), b.braun (501506543), grifols (502041285), korangi (505322307), labesfal (501169580), baxter (503347345)","926.922,96 €",18-03-2015,17-02-2014,300 dias,"Portugal, Faro, Faro",Artigo 259.º do Código dos Contratos Públicos,31-12-2014,"926.922,96 €","","",,1185600,Próteses Cardiacas - Sistemas de Pacemarkers,FALSE
Serviços Médicos de Ginecologia/Obstétricia,Ajuste Direto Regime Geral,Aquisição de serviços,"85121210-8, Serviços de ginecologia ou obstetrícia","Centro Hospitalar do Algarve, E. P. E. (510745997)","Centro Médico Santa Clara, Lda (501202684)","41.280,00 €",18-03-2015,02-03-2015,306 dias,"Portugal, Faro, Faro<BR/>Portugal, Faro, Albufeira","Artigo 24.º, n.º 1, alínea c) do Código dos Contratos Públicos",31-12-2015,"21.120,00 €","","O valor inicial do Contrato teve por base as necessidades estimadas para o período de 1 Março de 2015 a 31 Dezembro de 2015, o valor final reflecte as necessidades efectivas.",,Não aplicável.,Não aplicável.,FALSE
Serviços Médicos de Anestesiologia,Ajuste Direto Regime Geral,Aquisição de serviços,"85121000-3, Serviços de prática médica","Centro Hospitalar do Algarve, E. P. E. (510745997)","Marco Dornelles Unipessoal, Lda (510362656)","82.560,00 €",18-03-2015,16-03-2015,306 dias,"Portugal, Faro, Portimão<BR/>Portugal, Faro, Faro","Artigo 24.º, n.º 1, alínea c) do Código dos Contratos Públicos",17-11-2015,"15.662,00 €",Profissional indisponível para continuar a prestar serviços de Anestesiologia,"O valor inicial do Contrato teve por base as necessidades estimadas para o período de 1 Março de 2015 a 31 Dezembro de 2015, o valor final reflecte as necessidades efectivas e o profissional deixou de prestar serviço a partir do mês de Outubro de 2015",,Não aplicável.,Não aplicável.,FALSE
Serviços Médicos Anestesiologia,Ajuste Direto Regime Geral,Aquisição de serviços,"85121000-3, Serviços de prática médica","Centro Hospitalar do Algarve, E. P. E. (510745997)","Sonho Branco, Lda (508663342)","82.560,00 €",18-03-2015,27-02-2015,306 dias,"Portugal, Faro, Faro<BR/>Portugal, Faro, Portimão","Artigo 24.º, n.º 1, alínea c) do Código dos Contratos Públicos",31-12-2015,"78.960,00 €","","O valor inicial do Contrato teve por base as necessidades estimadas para o período de 1 Março de 2015 a 31 Dezembro de 2015, o valor final reflecte as necessidades efectivas.",,Não aplicável.,Não aplicável.,FALSE
"61/439/2015 - Medicamento """"Infliximab""""",Ajuste Direto Regime Geral,Aquisição de bens móveis,"33690000-3, Medicamentos vários","Centro Hospitalar do Algarve, E. P. E. (510745997)","Merck Sharp & Dohme, Lda (500191360)","757.900,00 €",18-03-2015,06-01-2015,365 dias,"Portugal, Faro, Faro","Artigo 24.º, n.º 1, alínea e) do Código dos Contratos Públicos","","","","",,Não aplicável.,Não aplicável.,FALSE
processo n.º 41/1792-injectaveis,Ao abrigo de acordo-quadro (art.º 259.º),Aquisição de bens móveis,"33690000-3, Medicamentos vários","Centro Hospitalar do Algarve, E. P. E. (510745997)","labesfal (501169580), overpharma (505792362)","96.909,83 €",18-03-2015,29-05-2014,210 dias,"Portugal, Faro, Faro",Artigo 259.º do Código dos Contratos Públicos,"","","","",,405999,CONCURSO PÚBLICO PARA A CELEBRAÇÃO DE CONTRATOS PÚBLICOS DE APROVISIONAMENTO PARA AQUISIÇÃO CORRECTIVOS DA VOLÉMIA E OUTRAS SOLUÇÕES ESTÉREIS,FALSE
processo n.º 41/1793-alfuzosina,Ao abrigo de acordo-quadro (art.º 259.º),Aquisição de bens móveis,"33690000-3, Medicamentos vários","Centro Hospitalar do Algarve, E. P. E. (510745997)",labesfal (501169580),"82,04 €",18-03-2015,14-05-2014,210 dias,"Portugal, Faro, Faro",Artigo 259.º do Código dos Contratos Públicos,"","","","",,602067,"ONCURSO PÚBLICO PARA A CELEBRAÇÃO DE CONTRATOS PÚBLICOS DE APROVISIONAMENTO PARA A ÁREA DA SAÚDE, COM VISTA AO FORNECIMENTO DE MEDICAMENTOS DE CONSUMO GERAL - MEDICAÇÃO ANTIALÉRGICA, MEDICAMENTOS USADOS NO TRATAMENTO DE INTOXICAÇÕES, VITAMINAS E SAIS MINERAIS  E GRUPO 20.9 - OUTROS PRODUTOS, ÀS INSTITUIÇÕES E SERVIÇOS DO SERVIÇO NACIONAL DE SAÚDE",FALSE
Serviços Médicos Anestesiologia,Ajuste Direto Regime Geral,Aquisição de serviços,"85121000-3, Serviços de prática médica","Centro Hospitalar do Algarve, E. P. E. (510745997)","Baltar Torres - Anestesiologia, Lda (507448219)","137.600,00 €",18-03-2015,13-03-2015,275 dias,"Portugal, Faro, Faro<BR/>Portugal, Faro, Portimão","Artigo 24.º, n.º 1, alínea c) do Código dos Contratos Públicos",31-12-2015,"131.410,00 €","","O valor inicial do Contrato teve por base as necessidades estimadas para o período de 1 Março de 2015 a 31 Dezembro de 2015, o valor final reflecte as necessidades efectivas.",,Não aplicável.,Não aplicável.,FALSE
processo n.º 41/1790-Bisoprolol,Ao abrigo de acordo-quadro (art.º 259.º),Aquisição de bens móveis,"33690000-3, Medicamentos vários","Centro Hospitalar do Algarve, E. P. E. (510745997)",generis (508107997),"14,04 €",18-03-2015,09-04-2014,240 dias,"Portugal, Faro, Faro",Artigo 259.º do Código dos Contratos Públicos,31-12-2014,"14,04 €","","",,513025,"CONCURSO PÚBLICO PARA A CELEBRAÇÃO DE CONTRATOS PÚBLICOS DE APROVISIONAMENTO PARA A ÁREA DA SAÚDE, COM VISTA AO FORNECIMENTO DE MEDICAMENTOS DE CONSUMO GERAL  (FFOSI)- APARELHO CARDIOVASCULAR., ÀS INSTITUIÇÕES E SERVIÇOS DO SERVIÇO NACIONAL DE SAÚDE",FALSE
processo n.º 41/1757-Carboplatina 450mg,Ao abrigo de acordo-quadro (art.º 259.º),Aquisição de bens móveis,"33690000-3, Medicamentos vários","Centro Hospitalar do Algarve, E. P. E. (510745997)",hospira (502918098),"12.870,00 €",18-03-2015,09-04-2014,240 dias,"Portugal, Faro, Faro",Artigo 259.º do Código dos Contratos Públicos,31-12-2014,"12.870,00 €","","",,383205,CONCURSO PÚBLICO PARA A CELEBRAÇÃO DE CONTRATOS PÚBLICOS DE APROVISIONAMENTO PARA AQUISIÇÃO MEDICAMENTOS DO FORO ONCOLÓGICO II,FALSE
processo n.º 41/1625-Estimulantes da eritropoiese,Ao abrigo de acordo-quadro (art.º 259.º),Aquisição de bens móveis,"33690000-3, Medicamentos vários","Centro Hospitalar do Algarve, E. P. E. (510745997)",roche farmaceutica (500233810),"258.300,00 €",18-03-2015,13-03-2014,300 dias,"Portugal, Faro, Faro",Artigo 259.º do Código dos Contratos Públicos,31-12-2014,"258.300,00 €","","",,463788,CP 2012/11 - Estimulantes da Eritropoiese,FALSE
Serviços Médicos de Anestesiologia,Ajuste Direto Regime Geral,Aquisição de serviços,"85121000-3, Serviços de prática médica","Centro Hospitalar do Algarve, E. P. E. (510745997)","Baltar Torres - Anestesiologia, Lda (507448219)","28.800,00 €",18-03-2015,09-03-2015,59 dias,"Portugal, Faro, Portimão<BR/>Portugal, Faro, Faro","Artigo 24.º, n.º 1, alínea c) do Código dos Contratos Públicos",27-03-2015,"24.480,00 €","","O valor inicial do Contrato teve por base as necessidades estimadas para o período de 1 Janeiro de 2015 a 28 Fevereiro de 2015, o valor final reflecte as necessidades efectivas.",,Não aplicável.,Não aplicável.,FALSE
"Serv Med Urg Geral e Bas, Cuid Inter, Sal Rean, Vmer",Ajuste Direto Regime Geral,Aquisição de serviços,"85121100-4, Serviços de médicos de clínica geral","Centro Hospitalar do Algarve, E. P. E. (510745997)","Juramento Ético, Serviços Médicos Unipessoal, Lda (509630561)","6.750,00 €",18-03-2015,10-03-2015,59 dias,"Portugal, Faro, Faro<BR/>Portugal, Faro, Lagos<BR/>Portugal, Faro, Albufeira<BR/>Portugal, Faro, Portimão","Artigo 24.º, n.º 1, alínea c) do Código dos Contratos Públicos",31-03-2015,"2.400,00 €","","O valor inicial do Contrato teve por base as necessidades estimadas para o período de 1 Janeiro de 2015 a 31 Março de 2015, o valor final reflecte as necessidades efectivas.",,Não aplicável.,Não aplicável.,FALSE
"Serv Méd Urgência Geral e Básica e Ped , Cuidados Inter, Vmer, Sala Reanim",Ajuste Direto Regime Geral,Aquisição de serviços,"85121100-4, Serviços de médicos de clínica geral","Centro Hospitalar do Algarve, E. P. E. (510745997)","Ilya&Elena - Serviços Médicos, Lda (510504485)","5.400,00 €",18-03-2015,06-03-2015,59 dias,"Portugal, Faro, Faro<BR/>Portugal, Faro, Lagos<BR/>Portugal, Faro, Portimão","Artigo 24.º, n.º 1, alínea c) do Código dos Contratos Públicos",31-03-2015,"7.800,00 €","","",,Não aplicável.,Não aplicável.,FALSE
Processo n.º 41/1792-Agua destilada+ manitol+agua para preparações injectaveis,Ao abrigo de acordo-quadro (art.º 259.º),Aquisição de bens móveis,"33690000-3, Medicamentos vários","Centro Hospitalar do Algarve, E. P. E. (510745997)","Overpharma (505792362), Labesfal (501169580)","96.909,83 €",17-03-2015,29-05-2014,180 dias,"Portugal, Faro, Faro",Artigo 259.º do Código dos Contratos Públicos,31-12-2014,"96.909,83 €","","",,602067,"ONCURSO PÚBLICO PARA A CELEBRAÇÃO DE CONTRATOS PÚBLICOS DE APROVISIONAMENTO PARA A ÁREA DA SAÚDE, COM VISTA AO FORNECIMENTO DE MEDICAMENTOS DE CONSUMO GERAL - MEDICAÇÃO ANTIALÉRGICA, MEDICAMENTOS USADOS NO TRATAMENTO DE INTOXICAÇÕES, VITAMINAS E SAIS MINERAIS  E GRUPO 20.9 - OUTROS PRODUTOS, ÀS INSTITUIÇÕES E SERVIÇOS DO SERVIÇO NACIONAL DE SAÚDE",FALSE
62149515 - Aquisição de Manga para Cassete faco FU,Ajuste Direto Regime Geral,Aquisição de bens móveis,"33140000-3, Material médico de consumo","Centro Hospitalar do Algarve, E. P. E. (510745997)",ALCON PORTUGAL (501251685),"1.152,00 €",17-03-2015,16-03-2015,290 dias,"Portugal, Faro, Lagos<BR/>Portugal, Faro, Faro<BR/>Portugal, Faro, Portimão","Artigo 24.º, n.º 1, alínea e) do Código dos Contratos Públicos","","","","",,Não aplicável.,Não aplicável.,FALSE
processo n.º 41/1796-Medicamentos aparelho locomotor,Ao abrigo de acordo-quadro (art.º 259.º),Aquisição de bens móveis,"33690000-3, Medicamentos vários","Centro Hospitalar do Algarve, E. P. E. (510745997)","labesfal (501169580), overpharma (505792362), ratiopharm (502414910), generis (508107997), hospira (502918098)","2.876,64 €",17-03-2015,09-05-2014,180 dias,"Portugal, Faro, Faro",Artigo 259.º do Código dos Contratos Públicos,31-12-2014,"2.876,64 €","","",,600392,"CONCURSO PÚBLICO PARA A CELEBRAÇÃO DE CONTRATOS PÚBLICOS DE APROVISIONAMENTO PARA A ÁREA DA SAÚDE, COM VISTA AO FORNECIMENTO DE MEDICAMENTOS DE CONSUMO GERAL - APARELHO LOCOMOTOR ÀS INSTITUIÇÕES E SERVIÇOS DO SERVIÇO NACIONAL DE SAÚDE",FALSE
processo n.º 41/1795-Medicamentos betametasona,Ao abrigo de acordo-quadro (art.º 259.º),Aquisição de bens móveis,"33690000-3, Medicamentos vários","Centro Hospitalar do Algarve, E. P. E. (510745997)",overpharma (505792362),"1.240,60 €",17-03-2015,14-05-2014,180 dias,"Portugal, Faro, Faro",Artigo 259.º do Código dos Contratos Públicos,31-12-2014,"1.240,60 €","","",,602875,"CONCURSO PÚBLICO PARA A CELEBRAÇÃO DE CONTRATOS PÚBLICOS DE APROVISIONAMENTO PARA A ÁREA DA SAÚDE, COM VISTA AO FORNECIMENTO DE MEDICAMENTOS DE CONSUMO GERAL - USADOS NAS AFECÇÕES CUTÂNEAS, ÀS INSTITUIÇÕES E SERVIÇOS DO SERVIÇO NACIONAL DE SAÚDE",FALSE
Processo n.º 41/3382-Aquisição de piperacilina + tazobactam,Ao abrigo de acordo-quadro (art.º 259.º),Aquisição de bens móveis,"33690000-3, Medicamentos vários","Centro Hospitalar do Algarve, E. P. E. (510745997)",combino (508622263),"2.904,00 €",17-03-2015,16-12-2014,30 dias,"Portugal, Faro, Faro",Artigo 259.º do Código dos Contratos Públicos,31-12-2014,"2.904,00 €","","",,611389,"CONCURSO PÚBLICO PARA A CELEBRAÇÃO DE CONTRATOS PÚBLICOS DE APROVISIONAMENTO PARA A ÁREA DA SAÚDE, COM VISTA AO FORNECIMENTO DE MEDICAMENTOS ANTI-INFECIOSOS: EXCETO ANTIVÍRICOS E ANTIFÚNGICOS, ÀS INSTITUIÇÕES E SERVIÇOS DO SERVIÇO NACIONAL DE SAÚDE",FALSE
Processo n.º 41/3221-Aquisição de Meropenem 1000 mg,Ao abrigo de acordo-quadro (art.º 259.º),Aquisição de bens móveis,"33690000-3, Medicamentos vários","Centro Hospitalar do Algarve, E. P. E. (510745997)",hikma (502266791),"18.585,00 €",17-03-2015,01-12-2014,30 dias,"Portugal, Faro, Faro",Artigo 259.º do Código dos Contratos Públicos,31-12-2014,"18.585,00 €","","",,611389,"CONCURSO PÚBLICO PARA A CELEBRAÇÃO DE CONTRATOS PÚBLICOS DE APROVISIONAMENTO PARA A ÁREA DA SAÚDE, COM VISTA AO FORNECIMENTO DE MEDICAMENTOS ANTI-INFECIOSOS: EXCETO ANTIVÍRICOS E ANTIFÚNGICOS, ÀS INSTITUIÇÕES E SERVIÇOS DO SERVIÇO NACIONAL DE SAÚDE",FALSE
processo n.º 41/3378-Aquisição de imipenem 500 mg+cilastatina 500 mg,Ao abrigo de acordo-quadro (art.º 259.º),Aquisição de bens móveis,"33690000-3, Medicamentos vários","Centro Hospitalar do Algarve, E. P. E. (510745997)",merck sharp (500191360),"1.600,00 €",17-03-2015,16-12-2014,30 dias,"Portugal, Faro, Faro",Artigo 259.º do Código dos Contratos Públicos,31-12-2014,"1.600,00 €","","",,611389,"CONCURSO PÚBLICO PARA A CELEBRAÇÃO DE CONTRATOS PÚBLICOS DE APROVISIONAMENTO PARA A ÁREA DA SAÚDE, COM VISTA AO FORNECIMENTO DE MEDICAMENTOS ANTI-INFECIOSOS: EXCETO ANTIVÍRICOS E ANTIFÚNGICOS, ÀS INSTITUIÇÕES E SERVIÇOS DO SERVIÇO NACIONAL DE SAÚDE",FALSE
processo n.º 41/2902-Aquisição de capecitabina,Ao abrigo de acordo-quadro (art.º 259.º),Locação de bens móveis,"33690000-3, Medicamentos vários","Centro Hospitalar do Algarve, E. P. E. (510745997)",farmoz (501505334),"1.196,25 €",17-03-2015,20-10-2014,360 dias,"Portugal, Faro, Faro",Artigo 259.º do Código dos Contratos Públicos,31-12-2014,"1.196,25 €","","",,1119467,"CONCURSO PÚBLICO PARA A CELEBRAÇÃO DE CONTRATOS PÚBLICOS DE APROVISIONAMENTO PARA A ÁREA DA SAÚDE, COM VISTA AO FORNECIMENTO DE MEDICAMENTOS DO FORO ONCOLÓGICO, ÀS INSTITUIÇÕES E SERVIÇOS DO SERVIÇO NACIONAL DE SAÚDE",FALSE
processo n.º 61/144-Aquisição de trastuzumab,Ajuste Direto Regime Geral,Aquisição de bens móveis,"33690000-3, Medicamentos vários","Centro Hospitalar do Algarve, E. P. E. (510745997)",roche farmaceutica (500233810),"30.548,40 €",17-03-2015,13-02-2014,300 dias,"Portugal, Faro, Faro","Artigo 24.º, n.º 1, alínea e) do Código dos Contratos Públicos",31-12-2014,"30.548,40 €","","",,Não aplicável.,Não aplicável.,FALSE
Aquisição de Material de Gastro,Concurso público,Aquisição de bens móveis,"33140000-3, Material médico de consumo","Centro Hospitalar do Algarve, E. P. E. (510745997)","EUROCASMEDICA,S.A. (503322105), COVIDIEN PORTUGAL - PRODUTOS  DE SAUDE, UNIPESSOAL, LDA. (503413410), MUNDINTER,S.A. (500199906), BIOSONDA,LDA. (501463313), ENDOTÉCNICA - Soluções Hospitalares  (503818348), ALVES & CA(IRMAOS),LDA. (500310068), AVIQUIMICA IMPORT E MANUFATURA (500039720), BOSTON SCIENTIFIC PORTUGAL-DISPOSITIVOS MÉDICOS, LDA. (504988964), CATETER-PROD.MEDICOS HOSP.LDA. (502914319), OLYMPUS IBERIA, s.a.u. (980474710), CAREWILL, LDA (507484851), SOCIME II - Produtos Medicos Lda (504453939)","135.079,10 €",17-03-2015,05-03-2015,290 dias,"Portugal, Faro, Faro<BR/>Portugal, Faro, Portimão<BR/>Portugal, Faro, Lagos","Artigo 20.º, n.º 1, alínea b) do Código dos Contratos Públicos","","","","",,Não aplicável.,Não aplicável.,FALSE
Processo n.º 61/119-Medicamentos para doenças endocrinas,Ajuste Direto Regime Geral,Aquisição de bens móveis,"33690000-3, Medicamentos vários","Centro Hospitalar do Algarve, E. P. E. (510745997)","novo nordisk (501485210), Lab pfizer (500162166), novartis (500063524), merck (500650870), Lab. vitoria (500162220), merck skarp (500191360), dilofar (500563004)","164.615,02 €",17-03-2015,08-01-2014,360 dias,"Portugal, Faro, Faro","Artigo 24.º, n.º 1, alínea e) do Código dos Contratos Públicos",31-12-2014,"164.615,02 €","","",,Não aplicável.,Não aplicável.,FALSE
"Serviços Médicos Urgência Geral, Pediátrica e Básica, Cuid Inter, Sala Reanimação Decisão clínica e So/Obs, Vmer",Ajuste Direto Regime Geral,Aquisição de serviços,"85121100-4, Serviços de médicos de clínica geral","Centro Hospitalar do Algarve, E. P. E. (510745997)",Svartz Lda (507360559),"10.800,00 €",17-03-2015,06-03-2015,59 dias,"Portugal, Faro, Portimão<BR/>Portugal, Faro, Faro<BR/>Portugal, Faro, Albufeira<BR/>Portugal, Faro, Lagos","Artigo 24.º, n.º 1, alínea c) do Código dos Contratos Públicos",31-03-2015,"12.625,00 €","","O valor inicial do Contrato teve por base as necessidades estimadas para o período de 1 Janeiro de 2015 a 31 Março de 2015, o valor final reflecte as necessidades efectivas.",,Não aplicável.,Não aplicável.,FALSE
76/0835/2015 - Aquisição de consumíveis para tratamento de água,Ajuste Direto Regime Geral,Aquisição de bens móveis,"24962000-5, Produtos químicos para tratamento da água","Centro Hospitalar do Algarve, E. P. E. (510745997)","Watercare Gest, Tratamento de Águas (508804779)","7.996,54 €",16-03-2015,13-03-2015,365 dias,"Portugal, Faro, Portimão<BR/>Portugal, Faro, Faro<BR/>Portugal, Faro, Lagos","Artigo 20.º, n.º 1, alínea a) do Código dos Contratos Públicos","","","","",,Não aplicável.,Não aplicável.,FALSE
processo n.º 61/112-aquisição de medicamentos afecções oculares,Ajuste Direto Regime Geral,Aquisição de bens móveis,"33690000-3, Medicamentos vários","Centro Hospitalar do Algarve, E. P. E. (510745997)","novartis (500063524), thea (507978358), alcon (501251685), davi (508309450)","63.007,25 €",16-03-2015,22-01-2014,360 dias,"Portugal, Faro, Faro","Artigo 24.º, n.º 1, alínea e) do Código dos Contratos Públicos",31-12-2014,"63.007,25 €","","",,Não aplicável.,Não aplicável.,FALSE
76/1452/2015 - AQUISIÇÃO DE MATERIAL DE MANUTENÇÃO,Ajuste Direto Regime Geral,Aquisição de bens móveis,"39300000-5, Equipamento diverso","Centro Hospitalar do Algarve, E. P. E. (510745997)",Dimorasept - Higiéne Médica Hospitalar Lda. (510258786),"16.004,00 €",16-03-2015,13-03-2015,0 dias,"Portugal, Faro, Lagos<BR/>Portugal, Faro, Faro<BR/>Portugal, Faro, Portimão","Artigo 20.º, n.º 1, alínea a) do Código dos Contratos Públicos","","","","",,Não aplicável.,Não aplicável.,FALSE
Processo n.º 61/105-Medicamentos para o aparelho respiratorio,Ajuste Direto Regime Geral,Aquisição de bens móveis,"33690000-3, Medicamentos vários","Centro Hospitalar do Algarve, E. P. E. (510745997)","Angellini (500583650), ferraz lynce (500113270), zambon (502155930), labesfal (501169580)","78.846,30 €",16-03-2015,18-12-2013,360 dias,"Portugal, Faro, Faro","Artigo 24.º, n.º 1, alínea e) do Código dos Contratos Públicos",31-12-2014,"78.846,30 €","","",,Não aplicável.,Não aplicável.,FALSE
Processo 61/102-Medicamentos aparelho geniturinario,Ajuste Direto Regime Geral,Aquisição de bens móveis,"33690000-3, Medicamentos vários","Centro Hospitalar do Algarve, E. P. E. (510745997)","Meda (500082090), Dilofar (500563004), ipsen (502609800), Ferring (502034831), Overpharma (505792362), lab.vitoria (500162220), Lab.Pfizer (500162166), Distrifarma (502948663)","47.371,02 €",16-03-2015,11-02-2014,300 dias,"Portugal, Faro, Faro","Artigo 24.º, n.º 1, alínea e) do Código dos Contratos Públicos",31-12-2014,"47.371,02 €","","",,Não aplicável.,Não aplicável.,FALSE
processo n.º 61/67-Medicação anti-alergica,Ajuste Direto Regime Geral,Aquisição de bens móveis,"33690000-3, Medicamentos vários","Centro Hospitalar do Algarve, E. P. E. (510745997)","ucb (500291322), Novartis (500268215)","9.997,31 €",16-03-2015,04-02-2014,300 dias,"Portugal, Faro, Faro","Artigo 24.º, n.º 1, alínea e) do Código dos Contratos Públicos",31-12-2014,"9.997,31 €","","",,Não aplicável.,Não aplicável.,FALSE
Proc.68/1514/15 - UpGrade Sistema RIS,Ajuste Direto Regime Geral,Aquisição de serviços,"72540000-2, Serviços de actualização informática","Centro Hospitalar do Algarve, E. P. E. (510745997)","Glintt-Healthcare Solutions,SA (502479418)","5.000,00 €",16-03-2015,13-03-2015,30 dias,"Portugal, Faro, Faro","Artigo 24.º, n.º 1, alínea e) do Código dos Contratos Públicos",31-12-2015,"","",Sem execução até 31/12/2015.,,Não aplicável.,Não aplicável.,FALSE
Processo n.º 61/49-Medicamentos para o aparelho degistivo,Ajuste Direto Regime Geral,Aquisição de bens móveis,"33690000-3, Medicamentos vários","Centro Hospitalar do Algarve, E. P. E. (510745997)","Novartis (500268215), Distrifarma (502948663), labesfal (501169580), Meda (500082090), merck (500650870), Johnson (500153370), Unilfarma (500293023), overpharma (505792362), Dr. Falk (506171612), Lab. Pfizer (500162166), Angellini (500583650), Abbott (500006148), Lab. Vitoria (500162220), Om Pharma (500207410)","36.553,26 €",16-03-2015,06-02-2014,300 dias,"Portugal, Faro, Faro","Artigo 24.º, n.º 1, alínea e) do Código dos Contratos Públicos",31-12-2014,"36.553,26 €","","",,Não aplicável.,Não aplicável.,FALSE
Proc. 68/1547/15 - Quotizações,Ajuste Direto Regime Geral,Aquisição de serviços,"75110000-0, Serviços públicos gerais","Centro Hospitalar do Algarve, E. P. E. (510745997)",Serviço Utilização Comum dos Hospitais (500900469),"3.000,00 €",16-03-2015,10-03-2015,365 dias,"Portugal, Faro, Faro","Artigo 24.º, n.º 1, alínea e) do Código dos Contratos Públicos","","","","",,Não aplicável.,Não aplicável.,FALSE
Prestação de Serviços em Regime de Aluguer de Lavagem e Respectivo Tratamento de Roupa - Março e Abril,Ajuste Direto Regime Geral,Aquisição de serviços,"98311000-6, Serviços de recolha de roupa por lavandarias","Centro Hospitalar do Algarve, E. P. E. (510745997)",SUCH (500900469),"138.894,64 €",16-03-2015,27-02-2015,61 dias,"Portugal, Faro, Faro<BR/>Portugal, Faro, Portimão<BR/>Portugal, Faro, Lagos","Artigo 24.º, n.º 1, alínea c) do Código dos Contratos Públicos","","","","",,Não aplicável.,Não aplicável.,FALSE
Prestação Serviços Seguro Acidentes Trabalho 2015,Ajuste Direto Regime Geral,Aquisição de serviços,"66500000-5, Serviços de seguros e pensões","Centro Hospitalar do Algarve, E. P. E. (510745997)",João Manuel Falcão Marques (115084150),"257.855,88 €",16-03-2015,24-02-2015,365 dias,"Portugal, Faro, Faro<BR/>Portugal, Faro, Portimão<BR/>Portugal, Faro, Lagos","Artigo 24.º, n.º 1, alínea b) do Código dos Contratos Públicos","","","","",,Não aplicável.,Não aplicável.,FALSE
Prestação de Serviços de Seguro - Ramo Automóvel - Ano 2015,Ajuste Direto Regime Geral,Aquisição de serviços,"66510000-8, Serviços de seguros","Centro Hospitalar do Algarve, E. P. E. (510745997)",João Manuel Falcão Marques (115084150),"7.798,74 €",16-03-2015,27-01-2015,365 dias,"Portugal, Faro, Lagos<BR/>Portugal, Faro, Portimão<BR/>Portugal, Faro, Faro","Artigo 20.º, n.º 1, alínea a) do Código dos Contratos Públicos","","","","",,Não aplicável.,Não aplicável.,FALSE
74/1363/2015 - AQUISIÇÃO DE MATERIAL DE LIMPEZA,Ajuste Direto Regime Geral,Aquisição de bens móveis,"39830000-9, Produtos de limpeza","Centro Hospitalar do Algarve, E. P. E. (510745997)",HIGIGUIMA - REPRESENTACOES SOCIEDADE UNIP. LDA (505786516),"218,00 €",16-03-2015,13-03-2015,60 dias,"Portugal, Faro, Portimão<BR/>Portugal, Faro, Faro<BR/>Portugal, Faro, Lagos","Artigo 20.º, n.º 1, alínea a) do Código dos Contratos Públicos","","","","",,Não aplicável.,Não aplicável.,FALSE
74/1363/2015 - AQUISIÇÃO DE MATERIAL DE LIMPEZA,Ajuste Direto Regime Geral,Aquisição de bens móveis,"39830000-9, Produtos de limpeza","Centro Hospitalar do Algarve, E. P. E. (510745997)","IGNISSOL, LDA (508613248)","3.288,00 €",16-03-2015,13-03-2015,60 dias,"Portugal, Faro, Faro<BR/>Portugal, Faro, Portimão<BR/>Portugal, Faro, Lagos","Artigo 20.º, n.º 1, alínea a) do Código dos Contratos Públicos","","","","",,Não aplicável.,Não aplicável.,FALSE
74/1363/2015 - AQUISIÇÃO DE MATERIAL DE LIMPEZA,Ajuste Direto Regime Geral,Aquisição de bens móveis,"44617000-8, Caixas","Centro Hospitalar do Algarve, E. P. E. (510745997)","Plásticos Industriais e Domésticos, SA (500219672)","136,50 €",16-03-2015,13-03-2015,60 dias,"Portugal, Faro, Faro<BR/>Portugal, Faro, Portimão<BR/>Portugal, Faro, Lagos","Artigo 20.º, n.º 1, alínea a) do Código dos Contratos Públicos","","","","",,Não aplicável.,Não aplicável.,FALSE
74/1363/2015 - AQUISIÇÃO DE MATERIAL DE LIMPEZA,Ajuste Direto Regime Geral,Aquisição de bens móveis,"33700000-7, Produtos para cuidados pessoais","Centro Hospitalar do Algarve, E. P. E. (510745997)",MUNDISAN-PAPEIS E PROD.HIGIENE (502729252),"115,00 €",16-03-2015,13-03-2015,60 dias,"Portugal, Faro, Faro<BR/>Portugal, Faro, Portimão<BR/>Portugal, Faro, Lagos","Artigo 20.º, n.º 1, alínea a) do Código dos Contratos Públicos","","","","",,Não aplicável.,Não aplicável.,FALSE
74/1363/2015 - AQUISIÇÃO DE MATERIAL DE LIMPEZA,Ajuste Direto Regime Geral,Aquisição de bens móveis,"39222100-5, Material descartável para fornecimento de refeições (catering)","Centro Hospitalar do Algarve, E. P. E. (510745997)","MEILEX, LDA (501759441)","88,38 €",16-03-2015,13-03-2015,60 dias,"Portugal, Faro, Lagos<BR/>Portugal, Faro, Portimão<BR/>Portugal, Faro, Faro","Artigo 20.º, n.º 1, alínea a) do Código dos Contratos Públicos","","","","",,Não aplicável.,Não aplicável.,FALSE
74/1363/2015 - AQUISIÇÃO DE MATERIAL DE LIMPEZA,Ajuste Direto Regime Geral,Aquisição de bens móveis,"39831200-8, Detergentes","Centro Hospitalar do Algarve, E. P. E. (510745997)",MM-ENDOCARE (510093124),"1.485,80 €",16-03-2015,13-03-2015,60 dias,"Portugal, Faro, Portimão<BR/>Portugal, Faro, Lagos<BR/>Portugal, Faro, Faro","Artigo 20.º, n.º 1, alínea a) do Código dos Contratos Públicos","","","","",,Não aplicável.,Não aplicável.,FALSE
74/1363/2015 - AQUISIÇÃO DE MATERIAL DE LIMPEZA,Ajuste Direto Regime Geral,Aquisição de bens móveis,"39830000-9, Produtos de limpeza","Centro Hospitalar do Algarve, E. P. E. (510745997)","JBSHIGI, Lda. (513110461)","10.643,83 €",16-03-2015,13-03-2015,60 dias,"Portugal, Faro, Lagos<BR/>Portugal, Faro, Faro<BR/>Portugal, Faro, Portimão","Artigo 20.º, n.º 1, alínea a) do Código dos Contratos Públicos","","","","",,Não aplicável.,Não aplicável.,FALSE
Próteses de Joelho,Concurso público,Aquisição de bens móveis,"33183200-8, Próteses ortopédicas","Centro Hospitalar do Algarve, E. P. E. (510745997)","BIOMET PORTUGAL UNIPESSOAL,LDA (500254990)","113.190,00 €",16-03-2015,16-03-2015,291 dias,"Portugal, Faro, Lagos<BR/>Portugal, Faro, Portimão<BR/>Portugal, Faro, Faro","Artigo 20.º, n.º 1, alínea b) do Código dos Contratos Públicos","","","","",,Não aplicável.,Não aplicável.,FALSE
74/1363/2015 - AQUISIÇÃO DE MATERIAL DE LIMPEZA,Ajuste Direto Regime Geral,Aquisição de bens móveis,"33700000-7, Produtos para cuidados pessoais","Centro Hospitalar do Algarve, E. P. E. (510745997)","HR  HOSPITALAR, LDA (501895558)","126,40 €",16-03-2015,13-03-2015,60 dias,"Portugal, Faro, Faro<BR/>Portugal, Faro, Lagos<BR/>Portugal, Faro, Portimão","Artigo 20.º, n.º 1, alínea a) do Código dos Contratos Públicos","","","","",,Não aplicável.,Não aplicável.,FALSE
74/1363/2015 - AQUISIÇÃO DE MATERIAL DE LIMPEZA,Ajuste Direto Regime Geral,Aquisição de bens móveis,"39290000-1, Acessórios diversos","Centro Hospitalar do Algarve, E. P. E. (510745997)","GLORIA & SILVESTRE,LDA. (501124713)","3,52 €",16-03-2015,13-03-2015,60 dias,"Portugal, Faro, Portimão<BR/>Portugal, Faro, Lagos<BR/>Portugal, Faro, Faro","Artigo 20.º, n.º 1, alínea a) do Código dos Contratos Públicos","","","","",,Não aplicável.,Não aplicável.,FALSE
74/1363/2015 - AQUISIÇÃO DE MATERIAL DE LIMPEZA,Ajuste Direto Regime Geral,Aquisição de bens móveis,"39831200-8, Detergentes","Centro Hospitalar do Algarve, E. P. E. (510745997)","FRANKLAB PORTUGAL, LDA (506058654)","5.331,60 €",16-03-2015,13-03-2015,60 dias,"Portugal, Faro, Faro<BR/>Portugal, Faro, Lagos<BR/>Portugal, Faro, Portimão","Artigo 20.º, n.º 1, alínea a) do Código dos Contratos Públicos","","","","",,Não aplicável.,Não aplicável.,FALSE
74/1363/2015 - AQUISIÇÃO DE MATERIAL DE LIMPEZA,Ajuste Direto Regime Geral,Aquisição de bens móveis,"39300000-5, Equipamento diverso","Centro Hospitalar do Algarve, E. P. E. (510745997)","FLEX2000-PRODUTOS FLEXIVEIS,SA (504663232)","430,00 €",16-03-2015,13-03-2015,60 dias,"Portugal, Faro, Faro<BR/>Portugal, Faro, Portimão<BR/>Portugal, Faro, Lagos","Artigo 20.º, n.º 1, alínea a) do Código dos Contratos Públicos","","","","",,Não aplicável.,Não aplicável.,FALSE
74/1363/2015 - AQUISIÇÃO DE MATERIAL DE LIMPEZA,Ajuste Direto Regime Geral,Aquisição de bens móveis,"39830000-9, Produtos de limpeza","Centro Hospitalar do Algarve, E. P. E. (510745997)","FALGI-EQUIP.PROD.LIMPEZA, LDA (504629565)","2.921,20 €",16-03-2015,13-03-2015,60 dias,"Portugal, Faro, Lagos<BR/>Portugal, Faro, Portimão<BR/>Portugal, Faro, Faro","Artigo 20.º, n.º 1, alínea a) do Código dos Contratos Públicos","","","","",,Não aplicável.,Não aplicável.,FALSE
72145315 - SUBSTITUTOS OSSEOS,Ajuste Direto Regime Geral,Aquisição de bens móveis,"33140000-3, Material médico de consumo","Centro Hospitalar do Algarve, E. P. E. (510745997)",Artrodelite - Dispositivos Médicos Unipessoal Lda  (510369499),"11.120,00 €",16-03-2015,16-03-2015,365 dias,"Portugal, Faro, Lagos<BR/>Portugal, Faro, Portimão<BR/>Portugal, Faro, Faro","Artigo 20.º, n.º 1, alínea a) do Código dos Contratos Públicos","","","","",,Não aplicável.,Não aplicável.,FALSE
74/1363/2015 - AQUISIÇÃO DE MATERIAL DE LIMPEZA,Ajuste Direto Regime Geral,Aquisição de bens móveis,"39830000-9, Produtos de limpeza","Centro Hospitalar do Algarve, E. P. E. (510745997)","DOMOTEL-MAQ EPROD DE LIMPEZA,L (501772367)","1.075,52 €",16-03-2015,13-03-2015,60 dias,"Portugal, Faro, Faro<BR/>Portugal, Faro, Lagos<BR/>Portugal, Faro, Portimão","Artigo 20.º, n.º 1, alínea a) do Código dos Contratos Públicos","","","","",,Não aplicável.,Não aplicável.,FALSE
74/1363/2015 - AQUISIÇÃO DE MATERIAL DE LIMPEZA,Ajuste Direto Regime Geral,Aquisição de bens móveis,"39830000-9, Produtos de limpeza","Centro Hospitalar do Algarve, E. P. E. (510745997)",AVIQUIMICA IMPORT E MANUFATURA (500039720),"4.857,50 €",16-03-2015,13-03-2015,60 dias,"Portugal, Faro, Lagos<BR/>Portugal, Faro, Faro<BR/>Portugal, Faro, Portimão","Artigo 20.º, n.º 1, alínea a) do Código dos Contratos Públicos","","","","",,Não aplicável.,Não aplicável.,FALSE
74/1363/15 - AQUISIÇÃO DE MATERIAL DE LIMPEZA,Ajuste Direto Regime Geral,Aquisição de bens móveis,"39830000-9, Produtos de limpeza","Centro Hospitalar do Algarve, E. P. E. (510745997)",A.MENDES DA SILVA LDA (502064080),"480,30 €",16-03-2015,13-03-2015,60 dias,"Portugal, Faro, Lagos<BR/>Portugal, Faro, Faro<BR/>Portugal, Faro, Portimão","Artigo 20.º, n.º 1, alínea a) do Código dos Contratos Públicos","","","","",,Não aplicável.,Não aplicável.,FALSE
Sistemas de soros perfusão com arejador,Ajuste Direto Regime Geral,Aquisição de bens móveis,"33140000-3, Material médico de consumo","Centro Hospitalar do Algarve, E. P. E. (510745997)","CareFusion Portugal 332, Lda.  (503898554)","57.443,40 €",13-03-2015,13-03-2015,294 dias,"Portugal, Faro, Portimão<BR/>Portugal, Faro, Lagos<BR/>Portugal, Faro, Faro","Artigo 24.º, n.º 1, alínea b) do Código dos Contratos Públicos","","","","",,Não aplicável.,Não aplicável.,FALSE
processo n.º 31/93-medicamentos antineoplasicos,Ao abrigo de acordo-quadro (art.º 258.º),Locação de bens móveis,"33690000-3, Medicamentos vários","Centro Hospitalar do Algarve, E. P. E. (510745997)","cph pharma (500069190), medac (980369959), generis (508107997), farmoz (501505334), lab.pfizer (500162166), sanofi (500134960), teva (507045491), hospira (502918098), glaxo (500139962), baxter (503347345)","147.034,99 €",13-03-2015,22-01-2014,320 dias,"Portugal, Faro, Faro",Artigo 258.º do Código dos Contratos Públicos,31-12-2014,"147.034,99 €","","",,1119467,"CONCURSO PÚBLICO PARA A CELEBRAÇÃO DE CONTRATOS PÚBLICOS DE APROVISIONAMENTO PARA A ÁREA DA SAÚDE, COM VISTA AO FORNECIMENTO DE MEDICAMENTOS DO FORO ONCOLÓGICO, ÀS INSTITUIÇÕES E SERVIÇOS DO SERVIÇO NACIONAL DE SAÚDE",FALSE
processo 31/567-Aquisição medicamentos para o sangue,Ao abrigo de acordo-quadro (art.º 258.º),Aquisição de bens móveis,"33690000-3, Medicamentos vários","Centro Hospitalar do Algarve, E. P. E. (510745997)","B.Braun (501506543), actavis (980334934), lab. almiro (501169580), Unilfarma (500293023), Merck sharp (500191360), om pharma (500207410), glaxo (500139962), lab.pfiizer (500162166), bial (500220913), amgen (502942959), sanofi (500134960)","102.376,99 €",13-03-2015,18-02-2014,320 dias,"Portugal, Faro, Faro",Artigo 258.º do Código dos Contratos Públicos,31-12-2014,"102.376,99 €","","",,1210107,"CONCURSO PÚBLICO PARA A CELEBRAÇÃO DE CONTRATOS PÚBLICOS DE APROVISIONAMENTO PARA A ÁREA DA SAÚDE, COM VISTA AO FORNECIMENTO DE MEDICAMENTOS DO GRUPO 4: SANGUE, ÀS INSTITUIÇÕES E SERVIÇOS DO SERVIÇO NACIONAL DE SAÚDE",FALSE
processo n.º 31/566-Hormonas,Ao abrigo de acordo-quadro (art.º 258.º),Aquisição de bens móveis,"33690000-3, Medicamentos vários","Centro Hospitalar do Algarve, E. P. E. (510745997)","merck sharp (500191360), lab.pfizer (500162166), jaba (500492867), Generis (508107997), sanofi (500134960), labesfal (501169580), ferring (502034831), medinfar (500384045), ipsen (502609800)","112.921,98 €",13-03-2015,23-01-2014,320 dias,"Portugal, Faro, Faro",Artigo 258.º do Código dos Contratos Públicos,31-12-2014,"112.921,98 €","","",,603979,"CONCURSO PÚBLICO PARA A CELEBRAÇÃO DE CONTRATOS PÚBLICOS DE APROVISIONAMENTO PARA A ÁREA DA SAÚDE, COM VISTA AO FORNECIMENTO DE HORMONAS E OUTROS MEDICAMENTOS USADOS NO TRATAMENTO DAS DOENÇAS ENDÓCRINAS, ÀS INSTITUIÇÕES E SERVIÇOS DO SERVIÇO NACIONAL DE SAÚDE",FALSE
processo n.º 71/1566-reagentes,Ajuste Direto Regime Geral,Aquisição de bens móveis,"33696000-5, Reagentes e meios de contraste","Centro Hospitalar do Algarve, E. P. E. (510745997)","johnson (500153370), diamed (501675809)","6.089,76 €",13-03-2015,09-04-2014,180 dias,"Portugal, Faro, Faro","Artigo 20.º, n.º 1, alínea a) do Código dos Contratos Públicos",31-12-2014,"6.089,76 €","","",,Não aplicável.,Não aplicável.,FALSE
processo n.º 71/1567-reagentes para hematologia,Ajuste Direto Regime Geral,Aquisição de bens móveis,"33696000-5, Reagentes e meios de contraste","Centro Hospitalar do Algarve, E. P. E. (510745997)",Izasa (501086110),"7.150,00 €",13-03-2015,27-02-2014,300 dias,"Portugal, Faro, Faro","Artigo 20.º, n.º 1, alínea a) do Código dos Contratos Públicos",31-12-2014,"7.150,00 €","","",,Não aplicável.,Não aplicável.,FALSE
processo n.º 71/1561-Alcool,Ajuste Direto Regime Geral,Aquisição de bens móveis,"33690000-3, Medicamentos vários","Centro Hospitalar do Algarve, E. P. E. (510745997)",proclinica (500222665),"16.089,35 €",13-03-2015,30-12-2014,300 dias,"Portugal, Faro, Faro","Artigo 20.º, n.º 1, alínea a) do Código dos Contratos Públicos",31-12-2014,"16.089,35 €","","",,Não aplicável.,Não aplicável.,FALSE
processo n.71/1452-material penso,Ajuste Direto Regime Geral,Aquisição de bens móveis,"33690000-3, Medicamentos vários","Centro Hospitalar do Algarve, E. P. E. (510745997)",smith (503552461),"23.058,66 €",13-03-2015,30-12-2014,300 dias,"Portugal, Faro, Faro","Artigo 20.º, n.º 1, alínea a) do Código dos Contratos Públicos",31-12-2014,"23.058,66 €","","",,Não aplicável.,Não aplicável.,FALSE
processo n.º 71/1451-Nutrição infantil,Ajuste Direto Regime Geral,Aquisição de bens móveis,"33690000-3, Medicamentos vários","Centro Hospitalar do Algarve, E. P. E. (510745997)",milupa (502192828),"9.806,04 €",13-03-2015,31-03-2014,300 dias,"Portugal, Faro, Faro","Artigo 20.º, n.º 1, alínea a) do Código dos Contratos Públicos",31-12-2014,"9.806,04 €","","",,Não aplicável.,Não aplicável.,FALSE
processo n.º 71/1403-terlipresssina,Ajuste Direto Regime Geral,Aquisição de bens móveis,"33690000-3, Medicamentos vários","Centro Hospitalar do Algarve, E. P. E. (510745997)",ferring (502034831),"7.500,00 €",13-03-2015,18-02-2014,300 dias,"Portugal, Faro, Faro","Artigo 20.º, n.º 1, alínea a) do Código dos Contratos Públicos",31-12-2014,"7.500,00 €","","",,Não aplicável.,Não aplicável.,FALSE
processo n.º 61/3050-Aquisição de Abacavir+lamivudina,Ajuste Direto Regime Geral,Aquisição de bens móveis,"33690000-3, Medicamentos vários","Centro Hospitalar do Algarve, E. P. E. (510745997)",Viiv (509117961),"193.712,26 €",13-03-2015,29-12-2014,60 dias,"Portugal, Faro, Faro","Artigo 24.º, n.º 1, alínea e) do Código dos Contratos Públicos",31-12-2014,"193.712,26 €","","",,Não aplicável.,Não aplicável.,FALSE
Prestação Serviços Radioterapia,Ajuste Direto Regime Geral,Aquisição de serviços,"85100000-0, Serviços de saúde","Centro Hospitalar do Algarve, E. P. E. (510745997)","Quadrantes Faro - Unidade de Radioterapia do Algarve, Lda., (505446120)","166.014,00 €",12-03-2015,06-03-2015,31 dias,"Portugal, Faro, Faro<BR/>Portugal, Faro, Portimão<BR/>Portugal, Faro, Lagos","Artigo 24.º, n.º 1, alínea c) do Código dos Contratos Públicos","","","","",,Não aplicável.,Não aplicável.,FALSE
"Prestação de Serviços de Alimentação para Utentes e Profissionais do Centro Hospitalar do Algarve, EPE",Ajuste Direto Regime Geral,Aquisição de serviços,"55000000-0, Serviços de hotelaria, restauração e comércio a retalho","Centro Hospitalar do Algarve, E. P. E. (510745997)",SUCH - Serviços de Utilização Comum dos Hospitais (500900469),"205.383,24 €",12-03-2015,09-03-2015,31 dias,"Portugal, Faro, Portimão<BR/>Portugal, Faro, Lagos<BR/>Portugal, Faro, Faro","Artigo 24.º, n.º 1, alínea c) do Código dos Contratos Públicos","","","","",,Não aplicável.,Não aplicável.,FALSE
Processo n.º 71/2192-Aquisição de factor IX,Ajuste Direto Regime Geral,Aquisição de bens móveis,"33690000-3, Medicamentos vários","Centro Hospitalar do Algarve, E. P. E. (510745997)",octafarma (502820780),"45.000,00 €",12-03-2015,30-12-2014,30 dias,"Portugal, Faro, Faro","Artigo 20.º, n.º 1, alínea a) do Código dos Contratos Públicos",31-12-2014,"45.000,00 €","","",,Não aplicável.,Não aplicável.,FALSE
Processo n.º 71/2232-Aquisição de lactulose,Ajuste Direto Regime Geral,Aquisição de bens móveis,"33690000-3, Medicamentos vários","Centro Hospitalar do Algarve, E. P. E. (510745997)",ferraz lynce (500113270),"10.086,03 €",12-03-2015,30-12-2014,120 dias,"Portugal, Faro, Faro","Artigo 24.º, n.º 1, alínea a) do Código dos Contratos Públicos",31-12-2014,"10.086,03 €","","",,Não aplicável.,Não aplicável.,FALSE
Processo n. 71/2447-Aquisição de solução acida,Ajuste Direto Regime Geral,Aquisição de bens móveis,"33690000-3, Medicamentos vários","Centro Hospitalar do Algarve, E. P. E. (510745997)",fresenius (503070220),"2.250,00 €",12-03-2015,02-06-2014,30 dias,"Portugal, Faro, Faro","Artigo 20.º, n.º 1, alínea a) do Código dos Contratos Públicos",31-12-2014,"2.250,00 €","","",,Não aplicável.,Não aplicável.,FALSE
Processo n.º 71/2480-Aquisição de hidrocortisona,Ajuste Direto Regime Geral,Aquisição de bens móveis,"33690000-3, Medicamentos vários","Centro Hospitalar do Algarve, E. P. E. (510745997)",lab. pfizer (500162166),"9.660,00 €",12-03-2015,06-06-2014,120 dias,"Portugal, Faro, Faro","Artigo 20.º, n.º 1, alínea a) do Código dos Contratos Públicos",31-12-2014,"9.660,00 €","","",,Não aplicável.,Não aplicável.,FALSE
processo n.º 71/1704-Aquisição de gentamicina,Ajuste Direto Regime Geral,Aquisição de bens móveis,"33690000-3, Medicamentos vários","Centro Hospitalar do Algarve, E. P. E. (510745997)",b.braun (501506543),"13.062,50 €",12-03-2015,09-04-2014,240 dias,"Portugal, Faro, Faro","Artigo 20.º, n.º 1, alínea a) do Código dos Contratos Públicos",31-12-2014,"13.062,50 €","","",,Não aplicável.,Não aplicável.,FALSE
processo n.º 71/1716-aquisição de bosentano,Ajuste Direto Regime Geral,Aquisição de bens móveis,"33690000-3, Medicamentos vários","Centro Hospitalar do Algarve, E. P. E. (510745997)",sanofi (500134960),"31.411,52 €",12-03-2015,07-03-2014,60 dias,"Portugal, Faro, Faro","Artigo 20.º, n.º 1, alínea a) do Código dos Contratos Públicos",31-12-2014,"31.411,52 €","","",,Não aplicável.,Não aplicável.,FALSE
processo n.º 71/1808-aquisição de imunoglobulina,Ajuste Direto Regime Geral,Aquisição de bens móveis,"33690000-3, Medicamentos vários","Centro Hospitalar do Algarve, E. P. E. (510745997)",kedrion (508472830),"37.730,00 €",12-03-2015,31-12-2014,60 dias,"Portugal, Faro, Faro","Artigo 20.º, n.º 1, alínea a) do Código dos Contratos Públicos",31-12-2014,"37.730,00 €","","",,Não aplicável.,Não aplicável.,FALSE
processo n. 71/1841-Aquisição de reagentes,Ajuste Direto Regime Geral,Aquisição de bens móveis,"33696000-5, Reagentes e meios de contraste","Centro Hospitalar do Algarve, E. P. E. (510745997)","inopat (503294420), zmway (508085349), vwr (503842770)","7.323,77 €",12-03-2015,12-12-2014,15 dias,"Portugal, Faro, Faro","Artigo 20.º, n.º 1, alínea a) do Código dos Contratos Públicos",31-12-2014,"7.323,77 €","","",,Não aplicável.,Não aplicável.,FALSE
processo n.º 71/1890-Aquisição de agua para preparações injectaveis,Ajuste Direto Regime Geral,Aquisição de bens móveis,"33690000-3, Medicamentos vários","Centro Hospitalar do Algarve, E. P. E. (510745997)",labesfal (501169580),"6.619,20 €",12-03-2015,12-05-2014,120 dias,"Portugal, Faro, Faro","Artigo 20.º, n.º 1, alínea a) do Código dos Contratos Públicos",31-12-2014,"6.619,20 €","","",,Não aplicável.,Não aplicável.,FALSE
Processo nº 71/1667-AQuisição de reagentes,Ajuste Direto Regime Geral,Aquisição de bens móveis,"33696000-5, Reagentes e meios de contraste","Centro Hospitalar do Algarve, E. P. E. (510745997)","beckman (509035167), Immucor (503007358)","22.043,63 €",12-03-2015,30-12-2014,120 dias,"Portugal, Faro, Faro","Artigo 20.º, n.º 1, alínea a) do Código dos Contratos Públicos",31-12-2014,"22.043,63 €","","",,Não aplicável.,Não aplicável.,FALSE
Processo n.º 71/1616-Aquisição de cal sodada+alcoole detergente enzimatico,Ajuste Direto Regime Geral,Aquisição de bens móveis,"33690000-3, Medicamentos vários","Centro Hospitalar do Algarve, E. P. E. (510745997)","franklab (506058654), b.braun (501506543), vygon (503232785), paul hartman (502271728), vwr (503842770)","19.293,80 €",12-03-2015,01-12-2014,30 dias,"Portugal, Faro, Faro","Artigo 20.º, n.º 1, alínea a) do Código dos Contratos Públicos",31-12-2014,"19.293,80 €","","",,Não aplicável.,Não aplicável.,FALSE
Processo n. 71/2301/2014-Aquisição de meios de diagnostico rápido,Ajuste Direto Regime Geral,Aquisição de bens móveis,"33696000-5, Reagentes e meios de contraste","Centro Hospitalar do Algarve, E. P. E. (510745997)","Abbott (500006148), Iberlab (503406694), know how (509884296)","27.215,66 €",11-03-2015,05-08-2014,120 dias,"Portugal, Faro, Faro","Artigo 20.º, n.º 1, alínea a) do Código dos Contratos Públicos",05-08-2014,"27.215,66 €","","",,Não aplicável.,Não aplicável.,FALSE
Processo n.º 71/2381-Aquisição de electroforeses,Ajuste Direto Regime Geral,Aquisição de bens móveis,"33696000-5, Reagentes e meios de contraste","Centro Hospitalar do Algarve, E. P. E. (510745997)",Phadia (506916243),"6.284,00 €",11-03-2015,12-12-2014,120 dias,"Portugal, Faro, Faro","Artigo 20.º, n.º 1, alínea a) do Código dos Contratos Públicos",31-12-2014,"6.284,00 €","","",,Não aplicável.,Não aplicável.,FALSE
Processo n.º 71/2683-Aquisição de reagentes,Ajuste Direto Regime Geral,Aquisição de bens móveis,"33696000-5, Reagentes e meios de contraste","Centro Hospitalar do Algarve, E. P. E. (510745997)",Emilio de azevedo campos (500094853),"4.691,00 €",11-03-2015,10-07-2014,30 dias,"Portugal, Faro, Faro","Artigo 20.º, n.º 1, alínea a) do Código dos Contratos Públicos",31-12-2014,"4.691,00 €","","",,Não aplicável.,Não aplicável.,FALSE
75/0789/2015 - Material Administrativo,Ajuste Direto Regime Geral,Aquisição de bens móveis,"30192000-1, Material de escritório","Centro Hospitalar do Algarve, E. P. E. (510745997)",OLMAR.FERNADO G.OLIVEIRA & CA. (500440263),"26,90 €",11-03-2015,26-02-2015,8 dias,"Portugal, Faro, Lagos<BR/>Portugal, Faro, Portimão<BR/>Portugal, Faro, Faro","Artigo 20.º, n.º 1, alínea a) do Código dos Contratos Públicos","","","","",,Não aplicável.,Não aplicável.,FALSE
75/0789/2015 - Material Administrativo,Ajuste Direto Regime Geral,Aquisição de bens móveis,"30192000-1, Material de escritório","Centro Hospitalar do Algarve, E. P. E. (510745997)","Ohmtecnica - Representações de Marcas, Lda. (504059521)","29,00 €",11-03-2015,26-02-2015,8 dias,"Portugal, Faro, Lagos<BR/>Portugal, Faro, Faro<BR/>Portugal, Faro, Portimão","Artigo 20.º, n.º 1, alínea a) do Código dos Contratos Públicos","","","","",,Não aplicável.,Não aplicável.,FALSE
75/0789/2015 - Material Administrativo,Ajuste Direto Regime Geral,Aquisição de bens móveis,"30192000-1, Material de escritório","Centro Hospitalar do Algarve, E. P. E. (510745997)","OFFICE CENTRE PORTUGAL,LDA. (503789372)","3.432,60 €",11-03-2015,26-02-2015,8 dias,"Portugal, Faro, Faro<BR/>Portugal, Faro, Portimão<BR/>Portugal, Faro, Lagos","Artigo 20.º, n.º 1, alínea a) do Código dos Contratos Públicos","","","","",,Não aplicável.,Não aplicável.,FALSE
Processo n.º 61/435/2015 - Aquisição de medicamentos,Ajuste Direto Regime Geral,Aquisição de bens móveis,"33690000-3, Medicamentos vários","Centro Hospitalar do Algarve, E. P. E. (510745997)",Celgene (507791690),"787.076,09 €",11-03-2015,26-01-2015,330 dias,"Portugal, Faro, Faro","Artigo 24.º, n.º 1, alínea e) do Código dos Contratos Públicos","","","","",,Não aplicável.,Não aplicável.,FALSE
Material Administrativo - 75/0001404/2015,Ajuste Direto Regime Geral,Aquisição de bens móveis,"30192000-1, Material de escritório","Centro Hospitalar do Algarve, E. P. E. (510745997)","PLANNER, LDA (507011082)","117,50 €",11-03-2015,27-02-2015,10 dias,"Portugal, Faro, Faro<BR/>Portugal, Faro, Lagos<BR/>Portugal, Faro, Portimão","Artigo 20.º, n.º 1, alínea a) do Código dos Contratos Públicos","","","","",,Não aplicável.,Não aplicável.,FALSE
Material Administrativo - 75/0001404/2015,Ajuste Direto Regime Geral,Aquisição de bens móveis,"30192000-1, Material de escritório","Centro Hospitalar do Algarve, E. P. E. (510745997)","ROTULOS DO SUL, UNIPESSOAL, LDA (510274161)","1.950,00 €",11-03-2015,27-02-2015,10 dias,"Portugal, Faro, Portimão<BR/>Portugal, Faro, Faro<BR/>Portugal, Faro, Lagos","Artigo 20.º, n.º 1, alínea a) do Código dos Contratos Públicos","","","","",,Não aplicável.,Não aplicável.,FALSE
Material Administrativo - 75/0001404/2015,Ajuste Direto Regime Geral,Aquisição de bens móveis,"30192000-1, Material de escritório","Centro Hospitalar do Algarve, E. P. E. (510745997)","BIOPULSE, LDA (508369231)","329,99 €",11-03-2015,27-02-2015,10 dias,"Portugal, Faro, Faro<BR/>Portugal, Faro, Portimão<BR/>Portugal, Faro, Lagos","Artigo 20.º, n.º 1, alínea a) do Código dos Contratos Públicos","","","","",,Não aplicável.,Não aplicável.,FALSE
Material Administrativo - 75/0001404/2015,Ajuste Direto Regime Geral,Aquisição de bens móveis,"30192000-1, Material de escritório","Centro Hospitalar do Algarve, E. P. E. (510745997)","SOCIEDADE ACESSORIOS ESCRITORIO, LDA --- (SAPEL) (500242194)","154,83 €",11-03-2015,27-02-2015,10 dias,"Portugal, Faro, Lagos<BR/>Portugal, Faro, Faro<BR/>Portugal, Faro, Portimão","Artigo 20.º, n.º 1, alínea a) do Código dos Contratos Públicos","","","","",,Não aplicável.,Não aplicável.,FALSE
Material Administrativo - 75/0001404/2015,Ajuste Direto Regime Geral,Aquisição de bens móveis,"30192000-1, Material de escritório","Centro Hospitalar do Algarve, E. P. E. (510745997)","XESEQUIPA, LDA (502787392)","28,30 €",11-03-2015,27-02-2015,10 dias,"Portugal, Faro, Faro<BR/>Portugal, Faro, Portimão<BR/>Portugal, Faro, Lagos","Artigo 20.º, n.º 1, alínea a) do Código dos Contratos Públicos","","","","",,Não aplicável.,Não aplicável.,FALSE
Material Administrativo - 75/0001404/2015,Ajuste Direto Regime Geral,Aquisição de bens móveis,"30192000-1, Material de escritório","Centro Hospitalar do Algarve, E. P. E. (510745997)",PAPELARIA E LIVRARIA SAGRES (501212973),"894,85 €",11-03-2015,27-02-2015,10 dias,"Portugal, Faro, Portimão<BR/>Portugal, Faro, Lagos<BR/>Portugal, Faro, Faro","Artigo 20.º, n.º 1, alínea a) do Código dos Contratos Públicos","","","","",,Não aplicável.,Não aplicável.,FALSE
Material Administrativo - 75/0001404/2015,Ajuste Direto Regime Geral,Aquisição de bens móveis,"30192000-1, Material de escritório","Centro Hospitalar do Algarve, E. P. E. (510745997)",OLMAR.FERNADO G.OLIVEIRA & CA. (500440263),"647,44 €",11-03-2015,27-02-2015,10 dias,"Portugal, Faro, Faro<BR/>Portugal, Faro, Portimão<BR/>Portugal, Faro, Lagos","Artigo 20.º, n.º 1, alínea a) do Código dos Contratos Públicos","","","","",,Não aplicável.,Não aplicável.,FALSE
Material Administrativo - 75/0001404/2015,Ajuste Direto Regime Geral,Aquisição de bens móveis,"30192000-1, Material de escritório","Centro Hospitalar do Algarve, E. P. E. (510745997)",Marcos de Azevedo Dias (108701476),"7.096,87 €",11-03-2015,27-02-2015,10 dias,"Portugal, Faro, Faro<BR/>Portugal, Faro, Portimão<BR/>Portugal, Faro, Lagos","Artigo 20.º, n.º 1, alínea a) do Código dos Contratos Públicos","","","","",,Não aplicável.,Não aplicável.,FALSE
Material Administrativo - 75/0001404/2015,Ajuste Direto Regime Geral,Aquisição de bens móveis,"30192000-1, Material de escritório","Centro Hospitalar do Algarve, E. P. E. (510745997)","LITOGRAFIS-ARTES GRAFICAS,LDA (502044403)","251,64 €",11-03-2015,27-02-2015,10 dias,"Portugal, Faro, Portimão<BR/>Portugal, Faro, Lagos<BR/>Portugal, Faro, Faro","Artigo 20.º, n.º 1, alínea a) do Código dos Contratos Públicos","","","","",,Não aplicável.,Não aplicável.,FALSE
Material Administrativo - 75/0001404/2015,Ajuste Direto Regime Geral,Aquisição de bens móveis,"30192000-1, Material de escritório","Centro Hospitalar do Algarve, E. P. E. (510745997)","PRN INFORMÁTICA, LDA (504100327)","3.945,60 €",11-03-2015,27-02-2015,10 dias,"Portugal, Faro, Portimão<BR/>Portugal, Faro, Faro<BR/>Portugal, Faro, Lagos","Artigo 20.º, n.º 1, alínea a) do Código dos Contratos Públicos","","","","",,Não aplicável.,Não aplicável.,FALSE
Material Administrativo - 75/0001404/2015,Ajuste Direto Regime Geral,Aquisição de bens móveis,"30192000-1, Material de escritório","Centro Hospitalar do Algarve, E. P. E. (510745997)","COPIDATA, S.A. (508225140)","2.998,93 €",11-03-2015,27-02-2015,10 dias,"Portugal, Faro, Lagos<BR/>Portugal, Faro, Portimão<BR/>Portugal, Faro, Faro","Artigo 20.º, n.º 1, alínea a) do Código dos Contratos Públicos","","","","",,Não aplicável.,Não aplicável.,FALSE
Material Administrativo - 75/0001404/2015,Ajuste Direto Regime Geral,Aquisição de bens móveis,"30192000-1, Material de escritório","Centro Hospitalar do Algarve, E. P. E. (510745997)","COPIGÉS - Sistemas de Identificação, S.A. (507308646)","117,00 €",11-03-2015,27-02-2015,10 dias,"Portugal, Faro, Faro<BR/>Portugal, Faro, Lagos<BR/>Portugal, Faro, Portimão","Artigo 20.º, n.º 1, alínea a) do Código dos Contratos Públicos","","","","",,Não aplicável.,Não aplicável.,FALSE
Material Administrativo - 75/0001404/2015,Ajuste Direto Regime Geral,Aquisição de bens móveis,"30192000-1, Material de escritório","Centro Hospitalar do Algarve, E. P. E. (510745997)","NEWALBAN - SOLUÇÕES PARA EMPRESAS, S.A. (505076780)","6,27 €",11-03-2015,27-02-2015,10 dias,"Portugal, Faro, Lagos<BR/>Portugal, Faro, Portimão<BR/>Portugal, Faro, Faro","Artigo 20.º, n.º 1, alínea a) do Código dos Contratos Públicos","","","","",,Não aplicável.,Não aplicável.,FALSE
Material Administrativo - 75/0001404/2015,Ajuste Direto Regime Geral,Aquisição de bens móveis,"30192000-1, Material de escritório","Centro Hospitalar do Algarve, E. P. E. (510745997)",A.MENDES DA SILVA LDA (502064080),"614,86 €",11-03-2015,27-02-2015,10 dias,"Portugal, Faro, Portimão<BR/>Portugal, Faro, Faro<BR/>Portugal, Faro, Lagos","Artigo 20.º, n.º 1, alínea a) do Código dos Contratos Públicos","","","","",,Não aplicável.,Não aplicável.,FALSE
Leitura Dosimetros ( 78/1256/15),Ajuste Direto Regime Geral,Aquisição de serviços,"50410000-2, Serviços de reparação e manutenção de aparelhos de medição, ensaio e controlo","Centro Hospitalar do Algarve, E. P. E. (510745997)",Medical Consult (504092138),"8.386,20 €",11-03-2015,09-03-2015,365 dias,"Portugal, Faro, Portimão<BR/>Portugal, Faro, Faro","Artigo 20.º, n.º 1, alínea a) do Código dos Contratos Públicos","","","","",,Não aplicável.,Não aplicável.,FALSE
