freguesia,acronym,validVotesPercentage,votes,dicofre
União das freguesias de Moscavide e Portela,PS,33.82,2808,110726
União das freguesias de Moscavide e Portela,PPD/PSD.CDS-PP,29.58,2456,110726
União das freguesias de Moscavide e Portela,PCP-PEV,15.19,1261,110726
União das freguesias de Moscavide e Portela,MPT,7.2,598,110726
União das freguesias de Moscavide e Portela,B.E.,4.48,372,110726
União das freguesias de Moscavide e Portela,L,3.52,292,110726
União das freguesias de Moscavide e Portela,PAN,2.29,190,110726
União das freguesias de Moscavide e Portela,PCTP/MRPP,1.36,113,110726
União das freguesias de Moscavide e Portela,PNR,0.51,42,110726
União das freguesias de Moscavide e Portela,PPM,0.46,38,110726
União das freguesias de Moscavide e Portela,MAS,0.45,37,110726
União das freguesias de Moscavide e Portela,PPV,0.37,31,110726
União das freguesias de Moscavide e Portela,PND,0.31,26,110726
União das freguesias de Moscavide e Portela,PTP,0.31,26,110726
União das freguesias de Moscavide e Portela,PDA,0.11,9,110726
União das freguesias de Moscavide e Portela,POUS,0.04,3,110726
