freguesia,acronym,validVotesPercentage,votes,dicofre
Fragoso,PPD/PSD,39.24,175,030235
Fragoso,PS,37,165,030235
Fragoso,B.E.,8.52,38,030235
Fragoso,CDS-PP,4.93,22,030235
Fragoso,PCP-PEV,2.24,10,030235
Fragoso,PAN,1.79,8,030235
Fragoso,NC,1.12,5,030235
Fragoso,PPM.PPV/CDC,1.12,5,030235
Fragoso,L,0.9,4,030235
Fragoso,PDR,0.9,4,030235
Fragoso,A,0.45,2,030235
Fragoso,MAS,0.45,2,030235
Fragoso,PCTP/MRPP,0.45,2,030235
Fragoso,PURP,0.45,2,030235
Fragoso,IL,0.22,1,030235
Fragoso,PNR,0.22,1,030235
Fragoso,PTP,0,0,030235
