freguesia,acronym,validVotesPercentage,votes,dicofre
São Martinho de Angueira,PPD/PSD.CDS-PP,45.05,41,040613
São Martinho de Angueira,PS,39.56,36,040613
São Martinho de Angueira,PCP-PEV,3.3,3,040613
São Martinho de Angueira,MPT,2.2,2,040613
São Martinho de Angueira,PCTP/MRPP,2.2,2,040613
São Martinho de Angueira,PND,2.2,2,040613
São Martinho de Angueira,PPM,2.2,2,040613
São Martinho de Angueira,B.E.,1.1,1,040613
São Martinho de Angueira,MAS,1.1,1,040613
São Martinho de Angueira,PNR,1.1,1,040613
São Martinho de Angueira,L,0,0,040613
São Martinho de Angueira,PAN,0,0,040613
São Martinho de Angueira,PDA,0,0,040613
São Martinho de Angueira,POUS,0,0,040613
São Martinho de Angueira,PPV,0,0,040613
São Martinho de Angueira,PTP,0,0,040613
