freguesia,acronym,validVotesPercentage,votes,dicofre
"União das freguesias de Pinheiro da Bemposta, Travanca e Palmaz",PPD/PSD.CDS-PP,42.33,776,011322
"União das freguesias de Pinheiro da Bemposta, Travanca e Palmaz",PS,33.39,612,011322
"União das freguesias de Pinheiro da Bemposta, Travanca e Palmaz",MPT,8.73,160,011322
"União das freguesias de Pinheiro da Bemposta, Travanca e Palmaz",PCP-PEV,3.76,69,011322
"União das freguesias de Pinheiro da Bemposta, Travanca e Palmaz",B.E.,2.67,49,011322
"União das freguesias de Pinheiro da Bemposta, Travanca e Palmaz",L,1.8,33,011322
"União das freguesias de Pinheiro da Bemposta, Travanca e Palmaz",PAN,1.58,29,011322
"União das freguesias de Pinheiro da Bemposta, Travanca e Palmaz",PND,1.36,25,011322
"União das freguesias de Pinheiro da Bemposta, Travanca e Palmaz",PCTP/MRPP,1.09,20,011322
"União das freguesias de Pinheiro da Bemposta, Travanca e Palmaz",PPM,0.87,16,011322
"União das freguesias de Pinheiro da Bemposta, Travanca e Palmaz",PTP,0.76,14,011322
"União das freguesias de Pinheiro da Bemposta, Travanca e Palmaz",PPV,0.55,10,011322
"União das freguesias de Pinheiro da Bemposta, Travanca e Palmaz",MAS,0.49,9,011322
"União das freguesias de Pinheiro da Bemposta, Travanca e Palmaz",PNR,0.44,8,011322
"União das freguesias de Pinheiro da Bemposta, Travanca e Palmaz",PDA,0.16,3,011322
"União das freguesias de Pinheiro da Bemposta, Travanca e Palmaz",POUS,0,0,011322
