Objeto do Contrato,Tipo de Procedimento,Tipo(s) de Contrato,CPVs,Entidade(s) Adjudicante(s),Entidade(s) Adjudicatária(s),Preço Contratual,Data de Publicação,Data de Celebração do Contrato,Prazo de Execução,Local de Execução,Fundamentação,Data de Fecho do Contrato,Preço Total Efetivo,Causas das Alterações ao Prazo,Causas das Alterações ao Preço,Estado,N.º registo do Acordo Quadro,Descrição do Acordo Quadro,Procedimento Centralizado
Aquisição de serviços de manutenção evolutiva  novos desenvolvimentos para o SICC - SNC-AP,Ao abrigo de acordo-quadro (art.º 259.º),Aquisição de serviços,"72500000-0, Serviços relacionados com a informática","SPMS - Serviços Partilhados do Ministério da Saúde, E. P. E. (509540716)","AltranPortugal, S.A. (504272179)","114.804,80 €",21-11-2016,26-10-2016,365 dias,Portugal,Artigo 259.º do Código dos Contratos Públicos,"","",,,,425776,CONCURSO PÚBLICO n.º 20120117 -,FALSE
Aquisição de serviços TIC para alterações na plataforma de concursos especiais,Ajuste Direto Regime Geral,Outros Tipos (Concessão de exploração de bens do domínio público),"72500000-0, Serviços relacionados com a informática","SPMS- Serviços Partilhados do M. da Saúde, E.P.E. (509540716)","MasterLink - Sistemas de Informação, Lda (504143603)","5.000,00 €",21-11-2016,10-11-2016,60 dias,Portugal,"Artigo 20.º, n.º 1, alínea a) do Código dos Contratos Públicos",31-12-2016,"5.000,00 €",,,,Não aplicável.,Não aplicável.,FALSE
"Aquisição de serviços de metodologias """"Kaizen Lean"""" ",Ajuste Direto Regime Geral,Aquisição de serviços,"79420000-4, Serviços relacionados com a gestão","SPMS - Serviços Partilhados do Ministério da Saúde, E. P. E. (509540716)","KAIZEN INSTITUTE PORTUGAL – CONSULTORIA MANAGEMENT, UNIPESSOAL, LDA (508830001)","9.000,00 €",21-11-2016,09-11-2016,60 dias,Portugal,"Artigo 20.º, n.º 1, alínea a) do Código dos Contratos Públicos",31-12-2016,"9.000,00 €",,,,Não aplicável.,Não aplicável.,FALSE
Aquisição de serviços de auditoria à infraestrutura dos serviços centrais,Ajuste Direto Regime Geral,Outros Tipos (Concessão de exploração de bens do domínio público),"72810000-1, Serviços de auditoria informática","SPMS - Serviços Partilhados do Ministério da Saúde, E. P. E. (509540716)","Companhia IBM Portuguesa, S.A. (500068801)","74.950,00 €",21-11-2016,04-11-2016,419 dias,Portugal,"Artigo 20.º, n.º 1, alínea a) do Código dos Contratos Públicos",31-12-2017,"74.950,00 €",,,,Não aplicável.,Não aplicável.,FALSE
"Aquisição de serviços de manutenção, arranjos, deslocação e montagem de mobiliário e equipamento ",Ajuste Direto Regime Geral,Aquisição de serviços,"50700000-2, Serviços de reparação e manutenção de equipamento em edifícios","SPMS - Serviços Partilhados do Ministério da Saúde, E. P. E. (509540716)",José Luis Gomes de Azevedo (162637047),"74.500,00 €",17-11-2016,27-10-2016,795 dias,Portugal,"Artigo 20.º, n.º 1, alínea a) do Código dos Contratos Públicos","","",,,,Não aplicável.,Não aplicável.,FALSE
Aquisição de equipamentos,Ajuste Direto Regime Geral,Aquisição de bens móveis,"30200000-1, Equipamento e material informático","SPMS - Serviços Partilhados do Ministério da Saúde, E. P. E. (509540716)",Ésistemas (506504948),"9.900,00 €",16-11-2016,04-11-2016,60 dias,Portugal,"Artigo 20.º, n.º 1, alínea a) do Código dos Contratos Públicos",31-12-2016,"9.900,00 €",,,,Não aplicável.,Não aplicável.,FALSE
Aquisição de infraestrutura para partilha de resultados de MCDT,Concurso público,Aquisição de serviços,"72500000-0, Serviços relacionados com a informática","SPMS - Serviços Partilhados do Ministério da Saúde, E. P. E. (509540716)","First Solutions-Sistemas de Informação, S.A. (505345978)","198.700,00 €",16-11-2016,18-10-2016,365 dias,Portugal,"Artigo 21.º, n.º 1, alínea b) do Código dos Contratos Públicos","","",,,,Não aplicável.,Não aplicável.,FALSE
Aquisição de serviços de implementação de solução de gestão e partilha móveis,Ajuste Direto Regime Geral,Outros Tipos (Concessão de exploração de bens do domínio público),"72200000-7, Serviços de consultoria e de programação de software","SPMS - Serviços Partilhados do Ministério da Saúde, E. P. E. (509540716)",CENTRALGEST SA (501932992),"48.900,00 €",15-11-2016,06-10-2016,210 dias,Portugal,"Artigo 20.º, n.º 1, alínea a) do Código dos Contratos Públicos",05-05-2017,"48.900,00 €",,,,Não aplicável.,Não aplicável.,FALSE
Aquisição de serviços de desenvolvimento aplicacional do SITAM,Ao abrigo de acordo-quadro (art.º 259.º),Aquisição de serviços,"72500000-0, Serviços relacionados com a informática","SPMS - Serviços Partilhados do Ministério da Saúde, E. P. E. (509540716)","GFI PORTUGAL - Tecnologias de Informação, S. A. (502726890)","91.606,14 €",15-11-2016,20-09-2016,365 dias,Portugal,Artigo 259.º do Código dos Contratos Públicos,20-09-2017,"91.606,14 €",,,,494439,"CONCURSO PÚBLICO COM PUBLICAÇÃO NO JOUE PARA A CELEBRAÇÃO DE ACORDO QUADRO PARA A PRESTAÇÃO DE SERVIÇOS DE CONSULTADORIA, DESENVOLVIMENTO E MANUTENÇÃO DE SOFTWARE  ",FALSE
Aquisição de serviços de interligação do datacenter da SPMS com a Cloud,Ajuste Direto Regime Geral,Aquisição de bens móveis,"32412000-4, Rede de comunicações","SPMS - Serviços Partilhados do Ministério da Saúde, E. P. E. (509540716)",NOS Comunicações SA (502604751),"74.400,00 €",15-11-2016,28-09-2016,365 dias,Portugal,"Artigo 20.º, n.º 1, alínea a) do Código dos Contratos Públicos","","",,,,Não aplicável.,Não aplicável.,FALSE
Aquisição de serviços de manutenção e upgrade do sistema IPBRICK,Ajuste Direto Regime Geral,Aquisição de serviços,"72260000-5, Serviços relacionados com software","SPMS- Serviços Partilhados do M. da Saúde, E.P.E. (509540716)","IPBRICK, SA (504837958)","8.470,00 €",15-11-2016,29-09-2016,365 dias,Portugal,"Artigo 20.º, n.º 1, alínea a) do Código dos Contratos Públicos",28-10-2017,"8.470,00 €",,,,Não aplicável.,Não aplicável.,FALSE
Aquisição de equipamento informático,Ajuste Direto Regime Geral,Aquisição de bens móveis,"30213100-6, Computadores portáteis","SPMS - Serviços Partilhados do Ministério da Saúde, E. P. E. (509540716)","INFORMANTEM-INFORMÁTICA E MANUTENÇÃO,S.A. (503670693)","31.747,50 €",11-11-2016,06-10-2016,60 dias,Portugal,"Artigo 20.º, n.º 1, alínea a) do Código dos Contratos Públicos",31-12-2016,"31.747,50 €",,,,Não aplicável.,Não aplicável.,FALSE
