freguesia,acronym,validVotesPercentage,votes,dicofre
Abambres,PPD/PSD.CDS-PP,53,53,040701
Abambres,PS,21,21,040701
Abambres,PCP-PEV,6,6,040701
Abambres,PPV,5,5,040701
Abambres,MPT,4,4,040701
Abambres,PND,3,3,040701
Abambres,PTP,3,3,040701
Abambres,PAN,2,2,040701
Abambres,B.E.,1,1,040701
Abambres,L,1,1,040701
Abambres,MAS,1,1,040701
Abambres,PCTP/MRPP,0,0,040701
Abambres,PDA,0,0,040701
Abambres,PNR,0,0,040701
Abambres,POUS,0,0,040701
Abambres,PPM,0,0,040701
