Objeto do Contrato,Tipo de Procedimento,Tipo(s) de Contrato,CPVs,Entidade(s) Adjudicante(s),Entidade(s) Adjudicatária(s),Preço Contratual,Data de Publicação,Data de Celebração do Contrato,Prazo de Execução,Local de Execução,Fundamentação,Data de Fecho do Contrato,Preço Total Efetivo,Causas das Alterações ao Prazo,Causas das Alterações ao Preço,Estado,N.º registo do Acordo Quadro,Descrição do Acordo Quadro,Procedimento Centralizado
"Prestação de serviços médicos Urgência Geral, pediátrica e Básica, Cuidados Intermédios, Sala de Reanimação, Decisão clinica e SO/OBS e Vmer",Ajuste Direto Regime Geral,Aquisição de serviços,"85100000-0, Serviços de saúde","Centro Hospitalar Universitário do Algarve, E. P. E. (510745997)","Naturospa, Lda (507566351)","31.200,00 €",10-10-2017,24-07-2017,180 dias,"Portugal, Faro, Portimão","Artigo 24.º, n.º 1, alínea e) do Código dos Contratos Públicos",31-12-2017,"3.900,00 €",,"O valor inicial do Contrato teve por base as necessidades estimadas para o período de 1 julho de 2017 a 31 dezembro de 2017, o valor final reflecte as necessidades efectivas.",,Não aplicável.,Não aplicável.,FALSE
Prestação de serviços médicos de Ginecologia/Obstetrícia,Ajuste Direto Regime Geral,Aquisição de serviços,"85111300-3, Serviços hospitalares de ginecologia","Centro Hospitalar Universitário do Algarve, E. P. E. (510745997)","JOSÉ SACRAMENTO SOUSA, UNIPESSOAL, LDA (509553761)","31.200,00 €",10-10-2017,24-07-2017,180 dias,"Portugal, Faro, Portimão","Artigo 24.º, n.º 1, alínea e) do Código dos Contratos Públicos",31-12-2017,"28.500,00 €",,"O valor inicial do Contrato teve por base as necessidades estimadas para o período de 1 de julho de 2017 a 31 dezembro de 2017, o valor final reflete as necessidades efectivas.",,Não aplicável.,Não aplicável.,FALSE
Prestação de serviços médicos de Pediatria,Ajuste Direto Regime Geral,Aquisição de serviços,"85100000-0, Serviços de saúde","Centro Hospitalar Universitário do Algarve, E. P. E. (510745997)",Oficina dos Mimos-Centro Desenv da Criança e da Família do Sul  (508778255),"16.380,00 €",10-10-2017,27-07-2017,180 dias,"Portugal, Faro, Faro","Artigo 24.º, n.º 1, alínea e) do Código dos Contratos Públicos",31-12-2017,"10.235,75 €",,"O valor inicial do Contrato teve por base as necessidades estimadas para o período de 1 de julho de 2017 a 31 dezembro de 2017, o valor final reflete as necessidades efectivas.",,Não aplicável.,Não aplicável.,FALSE
Ajudas Técnicas ( Produtos de Apoio ),Ajuste Direto Regime Geral,Aquisição de serviços,"85111400-4, Serviços hospitalares de reabilitação","Centro Hospitalar Universitário do Algarve, E. P. E. (510745997)",Ortopedia Moderna Lda (500481300),"22.886,33 €",04-10-2017,12-06-2017,90 dias,"Portugal, Faro, Portimão<BR/>Portugal, Faro, Faro","Artigo 20.º, n.º 1, alínea a) do Código dos Contratos Públicos","","",,"",,Não aplicável.,Não aplicável.,FALSE
Ajudas Técnicas ( Produtos de Apoio ),Ajuste Direto Regime Geral,Aquisição de serviços,"85111400-4, Serviços hospitalares de reabilitação","Centro Hospitalar Universitário do Algarve, E. P. E. (510745997)",PORTOPÉDICO COMÉRCIO E APLICAÇÃO DE PRODUTOS ORTOPEDICOS (509829953),"9.816,45 €",04-10-2017,09-06-2017,90 dias,"Portugal, Faro, Albufeira<BR/>Portugal, Faro, Faro","Artigo 20.º, n.º 1, alínea a) do Código dos Contratos Públicos","","",,"",,Não aplicável.,Não aplicável.,FALSE
Ajudas Técnicas ( Produtos de Apoio ),Ajuste Direto Regime Geral,Aquisição de serviços,"85111400-4, Serviços hospitalares de reabilitação","Centro Hospitalar Universitário do Algarve, E. P. E. (510745997)",OrtoAtlas (513781790),"16.328,49 €",04-10-2017,19-06-2017,90 dias,"Portugal, Faro, Faro<BR/>Portugal, Faro, Portimão","Artigo 20.º, n.º 1, alínea a) do Código dos Contratos Públicos","","",,"",,Não aplicável.,Não aplicável.,FALSE
Ajudas Técnicas ( Produtos de Apoio ),Ajuste Direto Regime Geral,Aquisição de serviços,"85111400-4, Serviços hospitalares de reabilitação","Centro Hospitalar Universitário do Algarve, E. P. E. (510745997)",PORTOPÉDICO COMÉRCIO E APLICAÇÃO DE PRODUTOS ORTOPEDICOS (509829953),"9.816,45 €",04-10-2017,09-06-2017,90 dias,"Portugal, Faro, Portimão<BR/>Portugal, Faro, Faro","Artigo 20.º, n.º 1, alínea a) do Código dos Contratos Públicos","","",,"",,Não aplicável.,Não aplicável.,FALSE
Ajudas Técnicas ( Produtos de Apoio ),Ajuste Direto Regime Geral,Aquisição de serviços,"85111400-4, Serviços hospitalares de reabilitação","Centro Hospitalar Universitário do Algarve, E. P. E. (510745997)",Rehactivar (513252967),"1.588,13 €",04-10-2017,09-06-2017,90 dias,"Portugal, Faro, Faro<BR/>Portugal, Faro, Portimão","Artigo 20.º, n.º 1, alínea a) do Código dos Contratos Públicos","","",,"",,Não aplicável.,Não aplicável.,FALSE
Ajudas Técnicas ( Produtos de Apoio ),Ajuste Direto Regime Geral,Aquisição de serviços,"85111400-4, Serviços hospitalares de reabilitação","Centro Hospitalar Universitário do Algarve, E. P. E. (510745997)","António Moutinho & Cª, Lda (500025550)","440,00 €",04-10-2017,09-06-2017,90 dias,"Portugal, Faro, Portimão<BR/>Portugal, Faro, Faro","Artigo 20.º, n.º 1, alínea a) do Código dos Contratos Públicos","","",,"",,Não aplicável.,Não aplicável.,FALSE
Ajudas Técnicas ( Produtos de Apoio ),Ajuste Direto Regime Geral,Aquisição de serviços,"85111400-4, Serviços hospitalares de reabilitação","Centro Hospitalar Universitário do Algarve, E. P. E. (510745997)",Impulse (513076891),"81,09 €",04-10-2017,09-06-2017,90 dias,"Portugal, Faro, Portimão<BR/>Portugal, Faro, Faro","Artigo 20.º, n.º 1, alínea a) do Código dos Contratos Públicos","","",,"",,Não aplicável.,Não aplicável.,FALSE
Ajudas Técnicas ( Produtos de Apoio ),Ajuste Direto Regime Geral,Aquisição de serviços,"85111400-4, Serviços hospitalares de reabilitação","Centro Hospitalar Universitário do Algarve, E. P. E. (510745997)",Lab. Dentarios (502276878),"1.516,86 €",04-10-2017,09-06-2017,90 dias,"Portugal, Faro, Faro<BR/>Portugal, Faro, Portimão","Artigo 20.º, n.º 1, alínea a) do Código dos Contratos Públicos","","",,"",,Não aplicável.,Não aplicável.,FALSE
Ajudas Técnicas ( Produtos de Apoio ),Ajuste Direto Regime Geral,Aquisição de serviços,"85111400-4, Serviços hospitalares de reabilitação","Centro Hospitalar Universitário do Algarve, E. P. E. (510745997)","Orto Rego - Comércio e Aplicação de Produtos Ortopédicos, Lda. (504820915)","3.166,22 €",04-10-2017,09-06-2017,90 dias,"Portugal, Faro, Faro<BR/>Portugal, Faro, Portimão","Artigo 20.º, n.º 1, alínea a) do Código dos Contratos Públicos","","",,"",,Não aplicável.,Não aplicável.,FALSE
Ajudas Técnicas ( Produtos de Apoio ),Ajuste Direto Regime Geral,Aquisição de serviços,"85111400-4, Serviços hospitalares de reabilitação","Centro Hospitalar Universitário do Algarve, E. P. E. (510745997)",Ortobalance (513555587),"1.557,14 €",04-10-2017,09-06-2017,90 dias,"Portugal, Faro, Portimão<BR/>Portugal, Faro, Faro","Artigo 20.º, n.º 1, alínea a) do Código dos Contratos Públicos","","",,"",,Não aplicável.,Não aplicável.,FALSE
Ajudas Técnicas ( Produtos de Apoio ),Ajuste Direto Regime Geral,Aquisição de serviços,"85111400-4, Serviços hospitalares de reabilitação","Centro Hospitalar Universitário do Algarve, E. P. E. (510745997)","AMÉRICO QUINTINO E FILHOS, PRODUTOS ORT.LDA (508988390)","25.630,25 €",04-10-2017,12-06-2017,90 dias,"Portugal, Faro, Portimão<BR/>Portugal, Faro, Faro","Artigo 20.º, n.º 1, alínea a) do Código dos Contratos Públicos","","",,"",,Não aplicável.,Não aplicável.,FALSE
Prestação de serviços médicos de Anestesiologia,Ajuste Direto Regime Geral,Aquisição de serviços,"85121200-5, Serviços de medicina especializada","Centro Hospitalar Universitário do Algarve, E. P. E. (510745997)","Urbanopium, Lda (508279429)","46.800,00 €",03-10-2017,27-07-2017,153 dias,"Portugal, Faro, Faro","Artigo 24.º, n.º 1, alínea e) do Código dos Contratos Públicos",30-09-2017,"23.000,00 €",,"O valor inicial do Contrato teve por base as necessidades estimadas para o período de 1 Maio de 2017 a 30 Setembro de 2017, o valor final reflecte as necessidades efectivas.",,Não aplicável.,Não aplicável.,FALSE
interface ( 77/3703/17),Ajuste Direto Regime Geral,Aquisição de serviços,"72590000-7, Serviços de informática prestados por profissionais","Centro Hospitalar Universitário do Algarve, E. P. E. (510745997)",SERVIÇOS TÉCNICOS INFORMATICA (502246995),"6.000,00 €",03-10-2017,25-09-2017,15 dias,"Portugal, Faro, Portimão<BR/>Portugal, Faro, Lagos<BR/>Portugal, Faro, Faro","Artigo 20.º, n.º 1, alínea a) do Código dos Contratos Públicos","","",,"",,Não aplicável.,Não aplicável.,FALSE
Proc. 67/3732/2017-Reparação de UPS MGE,Ajuste Direto Regime Geral,Aquisição de serviços,"50420000-5, Serviços de reparação e manutenção de equipamento médico e cirúrgico","Centro Hospitalar Universitário do Algarve, E. P. E. (510745997)","Shcneider Eletric Portugal, Lda (500281858)","643,20 €",03-10-2017,08-09-2017,60 dias,"Portugal, Faro, Faro","Artigo 24.º, n.º 1, alínea e) do Código dos Contratos Públicos","","",,"",,Não aplicável.,Não aplicável.,FALSE
31/3356/2017,Ao abrigo de acordo-quadro (art.º 258.º),Aquisição de bens móveis,"33690000-3, Medicamentos vários","Centro Hospitalar Universitário do Algarve, E. P. E. (510745997)","Pfizer Biofarmacêutica, Sociedade Unipessoal Lda. (513300376)","26.984,44 €",02-10-2017,27-09-2017,30 dias,"Portugal, Faro, Faro","Artigo 26.º, n.º 1, alínea e) do Código dos Contratos Públicos","","",,"",,1771819,CP 2015/6 - Acordo quadro para o fornecimento de Medicamentos do Foro Oncológico,FALSE
31/3727/2017,Ao abrigo de acordo-quadro (art.º 258.º),Aquisição de bens móveis,"33690000-3, Medicamentos vários","Centro Hospitalar Universitário do Algarve, E. P. E. (510745997)","LABORATÓRIO MEDINFAR - PRODUTOS FARMACÊUTICOS, SA (500384045)","590,00 €",02-10-2017,26-09-2017,96 dias,"Portugal, Faro, Faro","Artigo 26.º, n.º 1, alínea e) do Código dos Contratos Públicos","","",,"",,1422736,CP 2015/41 - ACORDO QUADRO PARA FORNECIMENTO DE MEDICAMENTOS ANTI-INFECIOSOS: ANTIVÍRICOS E ANTIFÚNGICOS ÀS INSTITUIÇÕES E SERVIÇOS DO SERVIÇO NACIONAL DE SAÚDE,FALSE
31/3721/2017,Ao abrigo de acordo-quadro (art.º 258.º),Aquisição de bens móveis,"33690000-3, Medicamentos vários","Centro Hospitalar Universitário do Algarve, E. P. E. (510745997)","Generis Farmacêutica, S.A. (508107997)","10.211,40 €",02-10-2017,27-09-2017,30 dias,"Portugal, Faro, Faro","Artigo 26.º, n.º 1, alínea e) do Código dos Contratos Públicos","","",,"",,1771819,CP 2015/6 - Acordo quadro para o fornecimento de Medicamentos do Foro Oncológico,FALSE
31/3233/2017,Ao abrigo de acordo-quadro (art.º 258.º),Aquisição de bens móveis,"33690000-3, Medicamentos vários","Centro Hospitalar Universitário do Algarve, E. P. E. (510745997)","Novo Nordisk - Comércio Produtos Farmacêuticos, Lda. (501485210)","2.241,48 €",02-10-2017,27-09-2017,30 dias,"Portugal, Faro, Faro","Artigo 26.º, n.º 1, alínea e) do Código dos Contratos Públicos","","",,"",,603979,"CONCURSO PÚBLICO PARA A CELEBRAÇÃO DE CONTRATOS PÚBLICOS DE APROVISIONAMENTO PARA A ÁREA DA SAÚDE, COM VISTA AO FORNECIMENTO DE HORMONAS E OUTROS MEDICAMENTOS USADOS NO TRATAMENTO DAS DOENÇAS ENDÓCRINAS, ÀS INSTITUIÇÕES E SERVIÇOS DO SERVIÇO NACIONAL DE SAÚDE",FALSE
31/3869/2017,Ao abrigo de acordo-quadro (art.º 258.º),Aquisição de bens móveis,"33690000-3, Medicamentos vários","Centro Hospitalar Universitário do Algarve, E. P. E. (510745997)",Jaba Recordati (500492867),"907,80 €",02-10-2017,26-09-2017,96 dias,"Portugal, Faro, Faro","Artigo 26.º, n.º 1, alínea e) do Código dos Contratos Públicos","","",,"",,1404918,CP 2015/48 - Acordo Quadro para fornecimento de Medicamentos de Consumo Geral - Aparelho Geniturinário às Instituições e Serviços do Serviço Nacional de Saúde,FALSE
