freguesia,acronym,validVotesPercentage,votes,dicofre
Pínzio,PPD/PSD.CDS-PP,45.86,61,091018
Pínzio,PS,29.32,39,091018
Pínzio,MPT,12.03,16,091018
Pínzio,B.E.,3.01,4,091018
Pínzio,L,1.5,2,091018
Pínzio,PAN,1.5,2,091018
Pínzio,PCP-PEV,1.5,2,091018
Pínzio,PND,1.5,2,091018
Pínzio,PPV,1.5,2,091018
Pínzio,PCTP/MRPP,0.75,1,091018
Pínzio,PDA,0.75,1,091018
Pínzio,PTP,0.75,1,091018
Pínzio,MAS,0,0,091018
Pínzio,PNR,0,0,091018
Pínzio,POUS,0,0,091018
Pínzio,PPM,0,0,091018
