freguesia,acronym,validVotesPercentage,votes,dicofre
"União das freguesias de Freixeda do Torrão, Quintã de Pêro Martins e Penha de Águia",PPD/PSD,46.91,76,090421
"União das freguesias de Freixeda do Torrão, Quintã de Pêro Martins e Penha de Águia",PS,38.89,63,090421
"União das freguesias de Freixeda do Torrão, Quintã de Pêro Martins e Penha de Águia",B.E.,3.09,5,090421
"União das freguesias de Freixeda do Torrão, Quintã de Pêro Martins e Penha de Águia",CDS-PP,2.47,4,090421
"União das freguesias de Freixeda do Torrão, Quintã de Pêro Martins e Penha de Águia",A,1.85,3,090421
"União das freguesias de Freixeda do Torrão, Quintã de Pêro Martins e Penha de Águia",NC,1.85,3,090421
"União das freguesias de Freixeda do Torrão, Quintã de Pêro Martins e Penha de Águia",PCTP/MRPP,1.85,3,090421
"União das freguesias de Freixeda do Torrão, Quintã de Pêro Martins e Penha de Águia",PAN,1.23,2,090421
"União das freguesias de Freixeda do Torrão, Quintã de Pêro Martins e Penha de Águia",L,0.62,1,090421
"União das freguesias de Freixeda do Torrão, Quintã de Pêro Martins e Penha de Águia",PCP-PEV,0.62,1,090421
"União das freguesias de Freixeda do Torrão, Quintã de Pêro Martins e Penha de Águia",PURP,0.62,1,090421
"União das freguesias de Freixeda do Torrão, Quintã de Pêro Martins e Penha de Águia",IL,0,0,090421
"União das freguesias de Freixeda do Torrão, Quintã de Pêro Martins e Penha de Águia",MAS,0,0,090421
"União das freguesias de Freixeda do Torrão, Quintã de Pêro Martins e Penha de Águia",PDR,0,0,090421
"União das freguesias de Freixeda do Torrão, Quintã de Pêro Martins e Penha de Águia",PNR,0,0,090421
"União das freguesias de Freixeda do Torrão, Quintã de Pêro Martins e Penha de Águia",PPM.PPV/CDC,0,0,090421
"União das freguesias de Freixeda do Torrão, Quintã de Pêro Martins e Penha de Águia",PTP,0,0,090421
