Objeto do Contrato,Tipo de Procedimento,Tipo(s) de Contrato,CPVs,Entidade(s) Adjudicante(s),Entidade(s) Adjudicatária(s),Preço Contratual,Data de Publicação,Data de Celebração do Contrato,Prazo de Execução,Local de Execução,Fundamentação,Data de Fecho do Contrato,Preço Total Efetivo,Causas das Alterações ao Prazo,Causas das Alterações ao Preço,Estado,N.º registo do Acordo Quadro,Descrição do Acordo Quadro,Procedimento Centralizado
Aquisição de sol. ácida p/ hemodiálise,Ajuste Direto Regime Geral,Aquisição de bens móveis,"33690000-3, Medicamentos vários","Centro Hospitalar Lisboa Norte, E. P. E. (508481287)","Fresenius Medical Care, SA (503070220)","8.064,00 €",11-01-2016,11-01-2016,1 dias,"Portugal, Lisboa, Lisboa","Artigo 24.º, n.º 1, alínea e) do Código dos Contratos Públicos",,,,,,Não aplicável.,Não aplicável.,FALSE
Aquisição de mitomicina sol. inj. 40 mg,Ajuste Direto Regime Geral,Aquisição de bens móveis,"33690000-3, Medicamentos vários","Centro Hospitalar Lisboa Norte, E. P. E. (508481287)","Ferrer Portugal, SA (500069190)","10.085,52 €",11-01-2016,11-01-2016,1 dias,"Portugal, Lisboa, Lisboa","Artigo 24.º, n.º 1, alínea e) do Código dos Contratos Públicos",,,,,,Não aplicável.,Não aplicável.,FALSE
Aquisição de serviços de manutenção ao equipamento de esterilização Sterrad Johnson,Ajuste Direto Regime Geral,Aquisição de serviços,"50421000-2, Serviços de reparação e manutenção de equipamento médico","CENTRO HOSPITALAR LISBOA NORTE, EPE (508481287)","Johnson & Johnson, Lda. (500153370)","4.860,00 €",11-01-2016,11-01-2016,355 dias,"Portugal, Lisboa, Lisboa","Artigo 24.º, n.º 1, alínea e) do Código dos Contratos Públicos",,,,,,Não aplicável.,Não aplicável.,FALSE
Aquisição de casaco polar,Ajuste Direto Regime Geral,Aquisição de bens móveis,"18235200-7, Casacos de malha","CENTRO HOSPITALAR LISBOA NORTE, EPE (508481287)",RIBEIRO & CARLOS LDA (502383542),"885,00 €",08-01-2016,08-01-2016,365 dias,"Portugal, Lisboa, Lisboa","Artigo 20.º, n.º 1, alínea a) do Código dos Contratos Públicos",,,,,,Não aplicável.,Não aplicável.,FALSE
Aquisição de CDI VR,Ajuste Direto Regime Geral,Aquisição de bens móveis,"33190000-8, Dispositivos e produtos médicos variados","Centro Hospitalar Lisboa Norte, E. P. E. (508481287)","St. Jude Medical, Lda. (504180746)","8.772,00 €",08-01-2016,08-01-2016,1 dias,"Portugal, Lisboa, Lisboa","Artigo 20.º, n.º 1, alínea a) do Código dos Contratos Públicos",,,,,,Não aplicável.,Não aplicável.,FALSE
Aquisição de lidocaina + clorohexidina,Ajuste Direto Regime Geral,Aquisição de bens móveis,"33690000-3, Medicamentos vários","Centro Hospitalar Lisboa Norte, E. P. E. (508481287)","Pharmis Biofarmacêutica, Lda. (502595442)","19.380,00 €",08-01-2016,08-01-2016,1 dias,"Portugal, Lisboa, Lisboa","Artigo 24.º, n.º 1, alínea e) do Código dos Contratos Públicos",,,,,,Não aplicável.,Não aplicável.,FALSE
Aquisição de colchões,Ajuste Direto Regime Geral,Aquisição de bens móveis,"39143112-4, Colchões","Centro Hospitalar Lisboa Norte, E. P. E. (508481287)","Duekipa, Lda. (508690102)","635,50 €",08-01-2016,08-01-2016,15 dias,"Portugal, Lisboa, Lisboa","Artigo 20.º, n.º 1, alínea a) do Código dos Contratos Públicos",,,,,,Não aplicável.,Não aplicável.,FALSE
Aquisição de 5 colchões,Ajuste Direto Regime Geral,Aquisição de bens móveis,"39143112-4, Colchões","Centro Hospitalar Lisboa Norte, E. P. E. (508481287)","Duekipa, Lda. (508690102)","317,75 €",08-01-2016,08-01-2016,15 dias,"Portugal, Lisboa, Lisboa","Artigo 20.º, n.º 1, alínea a) do Código dos Contratos Públicos",,,,,,Não aplicável.,Não aplicável.,FALSE
Aquisição de fralda adulto descartável,Ajuste Direto Regime Geral,Aquisição de bens móveis,"33140000-3, Material médico de consumo","Centro Hospitalar Lisboa Norte, E. P. E. (508481287)","Procter & Gamble Portugal, Lda. (503037753)","6.720,00 €",08-01-2016,08-01-2016,2 dias,"Portugal, Lisboa, Lisboa","Artigo 24.º, n.º 1, alínea c) do Código dos Contratos Públicos",,,,,,Não aplicável.,Não aplicável.,FALSE
Aquisição de hidropolimeros médios,Ajuste Direto Regime Geral,Aquisição de bens móveis,"33690000-3, Medicamentos vários","Centro Hospitalar Lisboa Norte, E. P. E. (508481287)","Molnlycke, Lda. (511101066)","6.930,00 €",08-01-2016,08-01-2016,1 dias,"Portugal, Lisboa, Lisboa","Artigo 24.º, n.º 1, alínea e) do Código dos Contratos Públicos",,,,,,Não aplicável.,Não aplicável.,FALSE
Aqusição de resina permutadora de catiões,Ajuste Direto Regime Geral,Aquisição de bens móveis,"33690000-3, Medicamentos vários","Centro Hospitalar Lisboa Norte, E. P. E. (508481287)","Fresenius Medical Care, SA (503070220)","5.556,00 €",08-01-2016,08-01-2016,1 dias,"Portugal, Lisboa, Lisboa","Artigo 24.º, n.º 1, alínea e) do Código dos Contratos Públicos",,,,,,Não aplicável.,Não aplicável.,FALSE
Instalação de um variador de velocidades para controlo manual da velocidade de electroradiador,Ajuste Direto Regime Geral,Aquisição de serviços,"51112200-2, Serviços de instalação de equipamento para controlo de electricidade","Centro Hospitalar Lisboa Norte, E. P. E. (508481287)","Turbomar energia, Lda (500290946)","5.504,00 €",07-01-2016,07-01-2016,10 dias,"Portugal, Lisboa, Lisboa","Artigo 20.º, n.º 1, alínea a) do Código dos Contratos Públicos",,,,,,Não aplicável.,Não aplicável.,FALSE
Locação de viatura para transporte de medicamentos no CHLN,Ajuste Direto Regime Geral,Aquisição de serviços,"60180000-3, Aluguer de veículos para transporte de mercadorias com condutor","Centro Hospitalar Lisboa Norte, E. P. E. (508481287)","Herofibra, lda. (506923134)","9.600,00 €",07-01-2016,07-01-2016,359 dias,"Portugal, Lisboa, Lisboa","Artigo 20.º, n.º 1, alínea a) do Código dos Contratos Públicos",,,,,,Não aplicável.,Não aplicável.,FALSE
Aquisição de cateter ablação,Ajuste Direto Regime Geral,Aquisição de bens móveis,"33190000-8, Dispositivos e produtos médicos variados","Centro Hospitalar Lisboa Norte, E. P. E. (508481287)","Metronic Portugal, Lda. (504223933)","19.921,55 €",07-01-2016,07-01-2016,1 dias,"Portugal, Lisboa, Lisboa","Artigo 20.º, n.º 1, alínea a) do Código dos Contratos Públicos",,,,,,Não aplicável.,Não aplicável.,FALSE
Aquisição de giletes descartáveis e lâminas de barbear,Ajuste Direto Regime Geral,Aquisição de bens móveis,"33721100-1, Lâminas de barbear","Centro Hospitalar Lisboa Norte, E. P. E. (508481287)","HR Hospitalar, Lda. (501895558)","156,00 €",07-01-2016,07-01-2016,359 dias,"Portugal, Lisboa, Lisboa","Artigo 20.º, n.º 1, alínea a) do Código dos Contratos Públicos",,,,,,Não aplicável.,Não aplicável.,FALSE
Aquisição de giletes descartaveis e laminas de barbear,Ajuste Direto Regime Geral,Aquisição de bens móveis,"33721100-1, Lâminas de barbear","Centro Hospitalar Lisboa Norte, E. P. E. (508481287)","VReis, Lda (500294453)","9.884,94 €",07-01-2016,07-01-2016,359 dias,"Portugal, Lisboa, Lisboa","Artigo 20.º, n.º 1, alínea a) do Código dos Contratos Públicos",,,,,,Não aplicável.,Não aplicável.,FALSE
Aquisição de 20 computadores portáteis,Ajuste Direto Regime Geral,Aquisição de bens móveis,"30213100-6, Computadores portáteis","Centro Hospitalar Lisboa Norte, E. P. E. (508481287)","VTT Link, Lda. (508888018)","9.900,00 €",07-01-2016,07-01-2016,2 dias,"Portugal, Lisboa, Lisboa","Artigo 20.º, n.º 1, alínea a) do Código dos Contratos Públicos",,,,,,Não aplicável.,Não aplicável.,FALSE
Aquisição de lamina c/ canto fosco,Ajuste Direto Regime Geral,Aquisição de bens móveis,"33190000-8, Dispositivos e produtos médicos variados","Centro Hospitalar Lisboa Norte, E. P. E. (508481287)","VWR Internacional, Lda. (503842770)","285,00 €",07-01-2016,07-01-2016,1 dias,"Portugal, Lisboa, Lisboa","Artigo 20.º, n.º 1, alínea a) do Código dos Contratos Públicos",,,,,,Não aplicável.,Não aplicável.,FALSE
Aquisição de CDI-BIV - conexões,Ajuste Direto Regime Geral,Aquisição de bens móveis,"33190000-8, Dispositivos e produtos médicos variados","Centro Hospitalar Lisboa Norte, E. P. E. (508481287)","Medtronic Portugal, Lda. (504223933)","13.308,00 €",07-01-2016,07-01-2016,1 dias,"Portugal, Lisboa, Lisboa","Artigo 20.º, n.º 1, alínea a) do Código dos Contratos Públicos",,,,,,Não aplicável.,Não aplicável.,FALSE
Aquisição de diverso material de cardiologia,Ajuste Direto Regime Geral,Aquisição de bens móveis,"33190000-8, Dispositivos e produtos médicos variados","Centro Hospitalar Lisboa Norte, E. P. E. (508481287)","Boston Scientific, Lda. (504988964)","5.790,00 €",07-01-2016,07-01-2016,1 dias,"Portugal, Lisboa, Lisboa","Artigo 20.º, n.º 1, alínea a) do Código dos Contratos Públicos",,,,,,Não aplicável.,Não aplicável.,FALSE
Aquisição de CDI VR + CDI BIV + electrodos,Ajuste Direto Regime Geral,Aquisição de bens móveis,"33190000-8, Dispositivos e produtos médicos variados","Centro Hospitalar Lisboa Norte, E. P. E. (508481287)","Medtronic Portugal, Lda. (504223933)","24.105,00 €",07-01-2016,07-01-2016,1 dias,"Portugal, Lisboa, Lisboa","Artigo 20.º, n.º 1, alínea a) do Código dos Contratos Públicos",,,,,,Não aplicável.,Não aplicável.,FALSE
Aquisição de consumíveis para o Serviço de Cardiologia,Ajuste Direto Regime Geral,Aquisição de bens móveis,"33190000-8, Dispositivos e produtos médicos variados","Centro Hospitalar Lisboa Norte, E. P. E. (508481287)","J & J, Lda. (500153370)","35.450,00 €",05-01-2016,05-01-2016,1 dias,"Portugal, Lisboa, Lisboa","Artigo 20.º, n.º 1, alínea a) do Código dos Contratos Públicos",,,,,,Não aplicável.,Não aplicável.,FALSE
Aquisição de prótese dentaria,Ajuste Direto Regime Geral,Aquisição de bens móveis,"33138100-7, Dentaduras","Centro Hospitalar Lisboa Norte, E. P. E. (508481287)",Mário Paulo Moura da Silva Ferreira (197118372),"183,96 €",05-01-2016,05-01-2016,10 dias,"Portugal, Lisboa, Lisboa","Artigo 20.º, n.º 1, alínea a) do Código dos Contratos Públicos",,,,,,Não aplicável.,Não aplicável.,FALSE
Aquisição de serviços de manutenção e equipamentos de oftalmologia ALCON,Ajuste Direto Regime Geral,Aquisição de serviços,"50421000-2, Serviços de reparação e manutenção de equipamento médico","CENTRO HOSPITALAR LISBOA NORTE, EPE (508481287)","Alcon Portugal, Lda. (501251685)","6.311,76 €",05-01-2016,05-01-2016,361 dias,"Portugal, Lisboa, Lisboa","Artigo 24.º, n.º 1, alínea e) do Código dos Contratos Públicos",,,,,,Não aplicável.,Não aplicável.,FALSE
Aquisição de serviços de manutenção aos equipamentos de imagiologia Tecnomédica,Ajuste Direto Regime Geral,Aquisição de serviços,"50421200-4, Serviços de reparação e manutenção de equipamentos de raios X","CENTRO HOSPITALAR LISBOA NORTE, EPE (508481287)","Tecnomédica, Lda. (501334270)","2.703,12 €",05-01-2016,05-01-2016,361 dias,"Portugal, Lisboa, Lisboa","Artigo 24.º, n.º 1, alínea e) do Código dos Contratos Públicos",,,,,,Não aplicável.,Não aplicável.,FALSE
Aquisição de serviços de manutenção aos equipamentos EMG Keypoint Mundinter,Ajuste Direto Regime Geral,Aquisição de serviços,"50421000-2, Serviços de reparação e manutenção de equipamento médico","CENTRO HOSPITALAR LISBOA NORTE, EPE (508481287)","Mundinter, SA (500199906)","1.186,00 €",05-01-2016,05-01-2016,361 dias,"Portugal, Lisboa, Lisboa","Artigo 24.º, n.º 1, alínea e) do Código dos Contratos Públicos",,,,,,Não aplicável.,Não aplicável.,FALSE
Aquisição de serviços de manutenção à Central de cloragem,Ajuste Direto Regime Geral,Aquisição de serviços,"50514200-3, Serviços de reparação e manutenção de reservatórios","Centro Hospitalar Lisboa Norte, E. P. E. (508481287)","Tecnilab, SA (500758158)","3.033,36 €",05-01-2016,05-01-2016,361 dias,"Portugal, Lisboa, Lisboa","Artigo 24.º, n.º 1, alínea e) do Código dos Contratos Públicos",,,,,,Não aplicável.,Não aplicável.,FALSE
Aquisição de serviços de manutenção aos equipamentos Laser Dornier,Ajuste Direto Regime Geral,Aquisição de serviços,"50422000-9, Serviços de reparação e manutenção de equipamento cirúrgico","Centro Hospitalar Lisboa Norte, E. P. E. (508481287)",Artur Oliveira (155810073),"1.728,68 €",05-01-2016,05-01-2016,361 dias,"Portugal, Lisboa, Lisboa","Artigo 24.º, n.º 1, alínea e) do Código dos Contratos Públicos",,,,,,Não aplicável.,Não aplicável.,FALSE
Aquisição de serviços de manutenção aos equipamentos de separação celular Fresenius,Ajuste Direto Regime Geral,Aquisição de serviços,"50421000-2, Serviços de reparação e manutenção de equipamento médico","CENTRO HOSPITALAR LISBOA NORTE, EPE (508481287)","Fresenius KabiPharma, Lda. (504293753)","5.464,80 €",05-01-2016,05-01-2016,361 dias,"Portugal, Lisboa, Lisboa","Artigo 24.º, n.º 1, alínea e) do Código dos Contratos Públicos",,,,,,Não aplicável.,Não aplicável.,FALSE
Aquisição de serviços de manutenção aos equipamentos de esterilização AJ Costa,Ajuste Direto Regime Geral,Aquisição de serviços,"50421000-2, Serviços de reparação e manutenção de equipamento médico","CENTRO HOSPITALAR LISBOA NORTE, EPE (508481287)","A.J. Costa (Irmãos), Lda. (500002576)","4.080,48 €",05-01-2016,05-01-2016,361 dias,"Portugal, Lisboa, Lisboa","Artigo 24.º, n.º 1, alínea e) do Código dos Contratos Públicos",,,,,,Não aplicável.,Não aplicável.,FALSE
Aquisição de artigos de retrosaria,Ajuste Direto Regime Geral,Aquisição de bens móveis,"39560000-5, Artigos têxteis diversos","CENTRO HOSPITALAR LISBOA NORTE, EPE (508481287)","Botilã, Lda. (501313460)","4.606,64 €",04-01-2016,04-01-2016,362 dias,"Portugal, Lisboa, Lisboa","Artigo 20.º, n.º 1, alínea a) do Código dos Contratos Públicos",,,,,,Não aplicável.,Não aplicável.,FALSE
Aquisição de bilhetes de estacionamento 4 cores,Ajuste Direto Regime Geral,Aquisição de bens móveis,"22457000-8, Cartões de acesso","Centro Hospitalar Lisboa Norte, E. P. E. (508481287)","Fernando L. Gaspar, SA (502042044)","7.956,00 €",04-01-2016,04-01-2016,362 dias,"Portugal, Lisboa, Lisboa","Artigo 20.º, n.º 1, alínea a) do Código dos Contratos Públicos",,,,,,Não aplicável.,Não aplicável.,FALSE
Aquisição de cartão de colaborador durante o ano de 2016,Ajuste Direto Regime Geral,Aquisição de bens móveis,"22457000-8, Cartões de acesso","CENTRO HOSPITALAR LISBOA NORTE, EPE (508481287)","Paulo Jesus Costa, Lda. (510167780)","6.150,00 €",04-01-2016,04-01-2016,362 dias,"Portugal, Lisboa, Lisboa","Artigo 20.º, n.º 1, alínea a) do Código dos Contratos Públicos",,,,,,Não aplicável.,Não aplicável.,FALSE
Aquisição de detergente/desinfectante para máquina de endoscopia Olympus,Ajuste Direto Regime Geral,Aquisição de bens móveis,"24455000-8, Desinfectantes","CENTRO HOSPITALAR LISBOA NORTE, EPE (508481287)",Olympus Iberia SAU (980474710),"783,75 €",04-01-2016,04-01-2016,362 dias,"Portugal, Lisboa, Lisboa","Artigo 24.º, n.º 1, alínea e) do Código dos Contratos Públicos",,,,,,Não aplicável.,Não aplicável.,FALSE
Aquisição de diversas almofadas,Ajuste Direto Regime Geral,Aquisição de bens móveis,"39516110-6, Almofadas","CENTRO HOSPITALAR LISBOA NORTE, EPE (508481287)","Meilex, Lda. (501759441)","3.549,52 €",04-01-2016,04-01-2016,362 dias,"Portugal, Lisboa, Lisboa","Artigo 20.º, n.º 1, alínea a) do Código dos Contratos Públicos",,,,,,Não aplicável.,Não aplicável.,FALSE
Aquisição de material para manutenção de equipamento médico,Ajuste Direto Regime Geral,Aquisição de bens móveis,"33100000-1, Equipamento médico","Centro Hospitalar Lisboa Norte, E. P. E. (508481287)","Sanotécnica, Lda. (500239819)","5.230,00 €",04-01-2016,04-01-2016,30 dias,"Portugal, Lisboa, Lisboa","Artigo 20.º, n.º 1, alínea a) do Código dos Contratos Públicos",,,,,,Não aplicável.,Não aplicável.,FALSE
