Objeto do Contrato,Tipo de Procedimento,Tipo(s) de Contrato,CPVs,Entidade(s) Adjudicante(s),Entidade(s) Adjudicatária(s),Preço Contratual,Data de Publicação,Data de Celebração do Contrato,Prazo de Execução,Local de Execução,Fundamentação,Data de Fecho do Contrato,Preço Total Efetivo,Causas das Alterações ao Prazo,Causas das Alterações ao Preço,Estado,N.º registo do Acordo Quadro,Descrição do Acordo Quadro,Procedimento Centralizado
Reparação e manutenção de mobiliário,Ajuste Direto Regime Geral,Aquisição de serviços,"50000000-5, Serviços de reparação e manutenção","Administração Regional de Saúde de Lisboa e Vale do Tejo, I. P. (503148776)",Ergoárea - Mobiliário Escritório Lda (506705161),"5.000,00 €",10-11-2016,22-01-2016,5 dias,"Portugal, Lisboa, Loures","Artigo 20.º, n.º 1, alínea a) do Código dos Contratos Públicos",,,,,,Não aplicável.,Não aplicável.,FALSE
Aquisição de 30 unidades de Agar Chapman - Estafilocos e 1 unidade de Reagente de Kovacks - Revelador de Indol,Ajuste Direto Regime Geral,Aquisição de bens móveis,"33696000-5, Reagentes e meios de contraste","Administração Regional de Saúde de Lisboa e Vale do Tejo, I. P. (503148776)","Biogerm, SA (503265390)","281,30 €",10-11-2016,08-11-2016,52 dias,"Portugal, Lisboa","Artigo 24.º, n.º 1, alínea e) do Código dos Contratos Públicos",,,,,,Não aplicável.,Não aplicável.,FALSE
Aquisição de 600 comprimidos de Linezolida 600mg,Ao abrigo de acordo-quadro (art.º 258.º),Aquisição de bens móveis,"33690000-3, Medicamentos vários","Administração Regional de Saúde de Lisboa e Vale do Tejo, I. P. (503148776)","Laboratórios Pfizer, Lda (500162166)","21.806,28 €",09-11-2016,08-11-2016,52 dias,"Portugal, Lisboa",Artigo 258.º do Código dos Contratos Públicos,,,,,,1422736,CP 2015/41 - ACORDO QUADRO PARA FORNECIMENTO DE MEDICAMENTOS ANTI-INFECIOSOS: ANTIVÍRICOS E ANTIFÚNGICOS ÀS INSTITUIÇÕES E SERVIÇOS DO SERVIÇO NACIONAL DE SAÚDE,FALSE
"Aquisição de fornecimento e montagem de sinalética para a nova USF Moscavide, USF Tejo e Catus.",Ajuste Direto Regime Geral,Aquisição de bens móveis,"34928470-3, Sinalização","Administração Regional de Saúde de Lisboa e Vale do Tejo, I. P. (503148776)","Rascunho Design, Lda (504131770)","4.757,00 €",09-11-2016,09-11-2016,15 dias,"Portugal, Lisboa, Lisboa","Artigo 20.º, n.º 1, alínea a) do Código dos Contratos Públicos",,,,,,Não aplicável.,Não aplicável.,FALSE
"Aquisição de substituição de portão de garagem, Centro de Saúde Arruda dos Vinhos.",Ajuste Direto Regime Geral,Empreitadas de obras públicas,"45454100-5, Obras de restauro","Administração Regional de Saúde de Lisboa e Vale do Tejo, I. P. (503148776)",Marco Mineiro Unipessoal Lda (510385664),"2.300,00 €",09-11-2016,07-11-2016,1 dias,"Portugal, Lisboa, Arruda dos Vinhos","Artigo 19.º, alínea a) do Código dos Contratos Públicos",,,,,,Não aplicável.,Não aplicável.,FALSE
Aquisição de empreitada para substituição da coluna de água e impermeabilização da cobertura do Centro de Saúde Quinta da Lomba.,Ajuste Direto Regime Geral,Empreitadas de obras públicas,"45113000-2, Obras no local","Administração Regional de Saúde de Lisboa e Vale do Tejo, I. P. (503148776)",Eugénio & Mendes Lda (505657236),"40.850,00 €",09-11-2016,03-11-2016,45 dias,"Portugal, Setúbal, Montijo","Artigo 19.º, alínea a) do Código dos Contratos Públicos",,,,,,Não aplicável.,Não aplicável.,FALSE
"Aquisição de empreitada de adaptação de espaços para implementação de 2 USF´s, na Charneca da Caparica.",Ajuste Direto Regime Geral,Empreitadas de obras públicas,"45113000-2, Obras no local","Administração Regional de Saúde de Lisboa e Vale do Tejo, I. P. (503148776)",Luzécon - Sociedade de Construção e Restauro Lda (504400673),"97.893,85 €",09-11-2016,03-11-2016,60 dias,"Portugal, Setúbal, Almada","Artigo 19.º, alínea a) do Código dos Contratos Públicos",,,,,,Não aplicável.,Não aplicável.,FALSE
"Aquisição de obras de beneficiação na USF Flor de Lotus, USF Alphamouro e sede do ACES Sintra.",Ajuste Direto Regime Geral,Empreitadas de obras públicas,"45113000-2, Obras no local","Administração Regional de Saúde de Lisboa e Vale do Tejo, I. P. (503148776)",MTRSantos - Instalações Técnic Unipessoal Lda (509424066),"31.001,45 €",09-11-2016,03-11-2016,60 dias,"Portugal, Lisboa, Sintra","Artigo 19.º, alínea a) do Código dos Contratos Públicos",,,,,,Não aplicável.,Não aplicável.,FALSE
"Aquisição de contratação de serviços operacionais no âmbito da gestão de stocks e logística, para o armazém da sede da ARSLVT, IP.",Ajuste Direto Regime Geral,Aquisição de serviços,"75122000-7, Serviços administrativos na área da saúde","Administração Regional de Saúde de Lisboa e Vale do Tejo, I. P. (503148776)",Randstad II - Prestação de Serviços (503298999),"7.128,00 €",09-11-2016,08-11-2016,53 dias,"Portugal, Lisboa, Lisboa","Artigo 20.º, n.º 1, alínea a) do Código dos Contratos Públicos",,,,,,Não aplicável.,Não aplicável.,FALSE
"Aquisição de Fluoresceína 2,5mg/ml + Oxibuprocaina",Ajuste Direto Regime Geral,Aquisição de bens móveis,"33690000-3, Medicamentos vários","Administração Regional de Saúde de Lisboa e Vale do Tejo, I. P. (503148776)",Alcon Portugal - Produtos e Equipamentos Oftalmológicos Lda (501251685),"24,12 €",08-11-2016,21-10-2016,72 dias,"Portugal, Lisboa, Lisboa","Artigo 24.º, n.º 1, alínea e) do Código dos Contratos Públicos",,,,,,Não aplicável.,Não aplicável.,FALSE
Aquisição de empreitada de obras de remodelação e beneficiação do edifício do Centro de Saúde da Lourinhã.,Ajuste Direto Regime Geral,Empreitadas de obras públicas,"45113000-2, Obras no local","Administração Regional de Saúde de Lisboa e Vale do Tejo, I. P. (503148776)","Francarmo - Engenharia e Construção, Lda (503533068)","98.119,80 €",08-11-2016,07-11-2016,60 dias,"Portugal, Lisboa, Lourinhã","Artigo 19.º, alínea a) do Código dos Contratos Públicos",,,,,,Não aplicável.,Não aplicável.,FALSE
Aquisição de lâmpada para aparelho laringoscópio,Ajuste Direto Regime Geral,Aquisição de bens móveis,"19000000-6, Materiais têxteis, de couro, de plástico e de borracha","Administração Regional de Saúde de Lisboa e Vale do Tejo, I. P. (503148776)",M.I.Medical Import (506662055),"67,50 €",08-11-2016,03-10-2016,5 dias,"Portugal, Lisboa, Loures","Artigo 20.º, n.º 1, alínea a) do Código dos Contratos Públicos",,,,,,Não aplicável.,Não aplicável.,FALSE
Aquisição de eletctodos,Ajuste Direto Regime Geral,Aquisição de bens móveis,"19000000-6, Materiais têxteis, de couro, de plástico e de borracha","Administração Regional de Saúde de Lisboa e Vale do Tejo, I. P. (503148776)",M.I.Medical Import (506662055),"270,00 €",04-11-2016,01-03-2016,5 dias,"Portugal, Lisboa, Loures","Artigo 20.º, n.º 1, alínea a) do Código dos Contratos Públicos",,,,,,Não aplicável.,Não aplicável.,FALSE
Aquisição de Escova Cervical para Citologia,Ajuste Direto Regime Geral,Aquisição de bens móveis,"33140000-3, Material médico de consumo","Administração Regional de Saúde de Lisboa e Vale do Tejo, I. P. (503148776)","VWR Internacional - Material de Laboratório, Lda (503842770)","8.800,00 €",04-11-2016,04-11-2016,57 dias,"Portugal, Lisboa, Lisboa","Artigo 20.º, n.º 1, alínea a) do Código dos Contratos Públicos",,,,,,Não aplicável.,Não aplicável.,FALSE
Reparação e Manutenção de Edifícios - Pequenas obras,Ajuste Direto Regime Geral,Aquisição de serviços,"50000000-5, Serviços de reparação e manutenção","Administração Regional de Saúde de Lisboa e Vale do Tejo, I. P. (503148776)",Montafil  (501316078),"5.000,00 €",03-11-2016,12-02-2016,5 dias,"Portugal, Lisboa, Loures","Artigo 20.º, n.º 1, alínea a) do Código dos Contratos Públicos",,,,,,Não aplicável.,Não aplicável.,FALSE
Aquisição de fornecimento e montagem de sinalética para a USF Lusa.,Ajuste Direto Regime Geral,Aquisição de bens móveis,"34928470-3, Sinalização","Administração Regional de Saúde de Lisboa e Vale do Tejo, I. P. (503148776)","Rascunho Design, Lda (504131770)","912,00 €",03-11-2016,03-11-2016,15 dias,"Portugal, Lisboa, Oeiras","Artigo 20.º, n.º 1, alínea a) do Código dos Contratos Públicos",,,,,,Não aplicável.,Não aplicável.,FALSE
"Empreitada de """"obras de remodelação e beneficiação do edifício do Centro de Saúde da Amora"""".",Ajuste Direto Regime Geral,Empreitadas de obras públicas,"45113000-2, Obras no local","Administração Regional de Saúde de Lisboa e Vale do Tejo, I. P. (503148776)","Cadimarte - Construções, Lda (502341165)","97.977,38 €",03-11-2016,02-11-2016,60 dias,"Portugal, Setúbal, Seixal","Artigo 19.º, alínea a) do Código dos Contratos Públicos",,,,,,Não aplicável.,Não aplicável.,FALSE
Aquisição de serviços de assistência técnica ao Datacenter da ARSLVT.,Ajuste Direto Regime Geral,Aquisição de serviços,"72267100-0, Manutenção de software para as tecnologias da infomação","Administração Regional de Saúde de Lisboa e Vale do Tejo, I. P. (503148776)","Novabase IMS - Infrastructures Managed Services, SA (500074372)","9.117,42 €",02-11-2016,31-10-2016,366 dias,"Portugal, Lisboa, Lisboa","Artigo 20.º, n.º 1, alínea a) do Código dos Contratos Públicos",,,,,,Não aplicável.,Não aplicável.,FALSE
Empreitada de obras de manutenção de cobertura - Unidade Saúde da Sobreda da Caparica.,Ajuste Direto Regime Geral,Empreitadas de obras públicas,"45113000-2, Obras no local","Administração Regional de Saúde de Lisboa e Vale do Tejo, I. P. (503148776)","Miniterras, Lda (503642630)","49.476,25 €",02-11-2016,02-11-2016,30 dias,"Portugal, Setúbal, Almada","Artigo 19.º, alínea a) do Código dos Contratos Públicos",,,,,,Não aplicável.,Não aplicável.,FALSE
Aquisição de prestação de serviços médicos sem especialidade para o ACES Estuário do Tejo - Período de 01/10/2016 a 31/12/2016.,Ajuste Direto Regime Geral,Aquisição de serviços,"85141000-9, Serviços prestados pelo pessoal médico","Administração Regional de Saúde de Lisboa e Vale do Tejo, I. P. (503148776)",Marianna Katrich (277943256),"8.320,00 €",02-11-2016,31-10-2016,86 dias,"Portugal, Lisboa, Lisboa","Artigo 24.º, n.º 1, alínea c) do Código dos Contratos Públicos",,,,,,Não aplicável.,Não aplicável.,FALSE
Aquisição de prestação de serviços médicos sem especialidade para o ACES Estuário do Tejo - Período de 01/10/2016 a 31/12/2016.,Ajuste Direto Regime Geral,Aquisição de serviços,"85141000-9, Serviços prestados pelo pessoal médico","Administração Regional de Saúde de Lisboa e Vale do Tejo, I. P. (503148776)",Claudio de Souza Sandner (179966677),"10.400,00 €",02-11-2016,31-10-2016,86 dias,"Portugal, Lisboa, Lisboa","Artigo 24.º, n.º 1, alínea c) do Código dos Contratos Públicos",,,,,,Não aplicável.,Não aplicável.,FALSE
Manutenção e reparação de equipamento,Ajuste Direto Regime Geral,Aquisição de serviços,"50000000-5, Serviços de reparação e manutenção","Administração Regional de Saúde de Lisboa e Vale do Tejo, I. P. (503148776)",Chaves do Areeiro (500601534),"500,00 €",02-11-2016,22-01-2016,5 dias,"Portugal, Lisboa, Loures","Artigo 20.º, n.º 1, alínea a) do Código dos Contratos Públicos",,,,,,Não aplicável.,Não aplicável.,FALSE
