freguesia,acronym,validVotesPercentage,votes,dicofre
Quinta do Anjo,PS,32.21,1182,150804
Quinta do Anjo,PCP-PEV,15.64,574,150804
Quinta do Anjo,B.E.,13.27,487,150804
Quinta do Anjo,PPD/PSD,13.24,486,150804
Quinta do Anjo,PAN,7.79,286,150804
Quinta do Anjo,CDS-PP,4.93,181,150804
Quinta do Anjo,A,2.83,104,150804
Quinta do Anjo,L,2.75,101,150804
Quinta do Anjo,PPM.PPV/CDC,2.04,75,150804
Quinta do Anjo,NC,1.5,55,150804
Quinta do Anjo,PCTP/MRPP,1.31,48,150804
Quinta do Anjo,IL,0.84,31,150804
Quinta do Anjo,PDR,0.54,20,150804
Quinta do Anjo,PNR,0.46,17,150804
Quinta do Anjo,MAS,0.25,9,150804
Quinta do Anjo,PTP,0.22,8,150804
Quinta do Anjo,PURP,0.16,6,150804
