freguesia,acronym,validVotesPercentage,votes,dicofre
União das freguesias de Luz de Tavira e Santo Estêvão,PS,37.88,397,081411
União das freguesias de Luz de Tavira e Santo Estêvão,PPD/PSD.CDS-PP,23.66,248,081411
União das freguesias de Luz de Tavira e Santo Estêvão,PCP-PEV,11.83,124,081411
União das freguesias de Luz de Tavira e Santo Estêvão,B.E.,7.73,81,081411
União das freguesias de Luz de Tavira e Santo Estêvão,MPT,6.39,67,081411
União das freguesias de Luz de Tavira e Santo Estêvão,PAN,2.77,29,081411
União das freguesias de Luz de Tavira e Santo Estêvão,L,2.58,27,081411
União das freguesias de Luz de Tavira e Santo Estêvão,PCTP/MRPP,2.48,26,081411
União das freguesias de Luz de Tavira e Santo Estêvão,PND,1.24,13,081411
União das freguesias de Luz de Tavira e Santo Estêvão,PPM,1.05,11,081411
União das freguesias de Luz de Tavira e Santo Estêvão,PTP,0.86,9,081411
União das freguesias de Luz de Tavira e Santo Estêvão,PNR,0.76,8,081411
União das freguesias de Luz de Tavira e Santo Estêvão,MAS,0.38,4,081411
União das freguesias de Luz de Tavira e Santo Estêvão,PDA,0.19,2,081411
União das freguesias de Luz de Tavira e Santo Estêvão,PPV,0.19,2,081411
União das freguesias de Luz de Tavira e Santo Estêvão,POUS,0,0,081411
