freguesia,acronym,validVotesPercentage,votes,dicofre
"União das freguesias de São Pedro do Sul, Várzea e Baiões",PS,40.42,648,181623
"União das freguesias de São Pedro do Sul, Várzea e Baiões",PPD/PSD,25.76,413,181623
"União das freguesias de São Pedro do Sul, Várzea e Baiões",B.E.,9.67,155,181623
"União das freguesias de São Pedro do Sul, Várzea e Baiões",CDS-PP,5.8,93,181623
"União das freguesias de São Pedro do Sul, Várzea e Baiões",PCP-PEV,5.36,86,181623
"União das freguesias de São Pedro do Sul, Várzea e Baiões",PAN,4.05,65,181623
"União das freguesias de São Pedro do Sul, Várzea e Baiões",A,2.12,34,181623
"União das freguesias de São Pedro do Sul, Várzea e Baiões",L,1.56,25,181623
"União das freguesias de São Pedro do Sul, Várzea e Baiões",NC,1.31,21,181623
"União das freguesias de São Pedro do Sul, Várzea e Baiões",PCTP/MRPP,1.31,21,181623
"União das freguesias de São Pedro do Sul, Várzea e Baiões",IL,0.94,15,181623
"União das freguesias de São Pedro do Sul, Várzea e Baiões",PPM.PPV/CDC,0.69,11,181623
"União das freguesias de São Pedro do Sul, Várzea e Baiões",PNR,0.25,4,181623
"União das freguesias de São Pedro do Sul, Várzea e Baiões",PTP,0.25,4,181623
"União das freguesias de São Pedro do Sul, Várzea e Baiões",PURP,0.25,4,181623
"União das freguesias de São Pedro do Sul, Várzea e Baiões",PDR,0.19,3,181623
"União das freguesias de São Pedro do Sul, Várzea e Baiões",MAS,0.06,1,181623
