freguesia,acronym,validVotesPercentage,votes,dicofre
Urrô,PPD/PSD.CDS-PP,58.25,166,010419
Urrô,PS,18.95,54,010419
Urrô,MPT,12.98,37,010419
Urrô,PCP-PEV,2.11,6,010419
Urrô,PAN,1.75,5,010419
Urrô,B.E.,1.4,4,010419
Urrô,L,1.05,3,010419
Urrô,PPV,1.05,3,010419
Urrô,PND,0.7,2,010419
Urrô,PPM,0.7,2,010419
Urrô,PTP,0.7,2,010419
Urrô,PCTP/MRPP,0.35,1,010419
Urrô,MAS,0,0,010419
Urrô,PDA,0,0,010419
Urrô,PNR,0,0,010419
Urrô,POUS,0,0,010419
