Objeto do Contrato,Tipo de Procedimento,Tipo(s) de Contrato,CPVs,Entidade(s) Adjudicante(s),Entidade(s) Adjudicatária(s),Preço Contratual,Data de Publicação,Data de Celebração do Contrato,Prazo de Execução,Local de Execução,Fundamentação,Data de Fecho do Contrato,Preço Total Efetivo,Causas das Alterações ao Prazo,Causas das Alterações ao Preço,Estado,N.º registo do Acordo Quadro,Descrição do Acordo Quadro,Procedimento Centralizado
Prestação de Serviços de Colocação e Fornecimento de Pessoal Administrativo - 1 Adm Patologia Clínica,Consulta Prévia,Aquisição de serviços,"79620000-6, Serviços de fornecimento de pessoal, inclusive temporário","Unidade Local de Saúde do Alto Minho, E. P. E. (508786193)","AHP - ALLIED HEALTHCARE PROFESSIONALS, LDA. (510095135)","1.316,85 €",07-09-2018,03-05-2018,150 dias,"Portugal, Viana do Castelo, Viana do Castelo","Artigo 20.º, n.º 1, alínea c) do Código dos Contratos Públicos","","",,"",,Não aplicável.,Não aplicável.,FALSE
Prestação de Serviços de Colocação e Fornecimento de Pessoal Administrativo - 1 Adm Serviço Social,Consulta Prévia,Aquisição de serviços,"79620000-6, Serviços de fornecimento de pessoal, inclusive temporário","Unidade Local de Saúde do Alto Minho, E. P. E. (508786193)","AHP - ALLIED HEALTHCARE PROFESSIONALS, LDA. (510095135)","1.176,94 €",07-09-2018,27-04-2018,240 dias,"Portugal, Viana do Castelo, Viana do Castelo","Artigo 20.º, n.º 1, alínea c) do Código dos Contratos Públicos","","",,"",,Não aplicável.,Não aplicável.,FALSE
"Prestação de Serviços Técnicos Especializados para apoiar na elaboração e implementação dos Contratos Programa a celebrar entre a ARSLVT,IP. e os Municípios - Área Jurídica.",Ajuste Direto Regime Geral,Aquisição de serviços,"71356000-8, Serviços técnicos","Administração Regional de Saúde de Lisboa e Vale do Tejo, I. P. (503148776)","AHP - ALLIED HEALTHCARE PROFESSIONALS, LDA. (510095135)","12.040,00 €",28-06-2017,14-06-2017,240 dias,"Portugal, Lisboa, Lisboa","Artigo 20.º, n.º 1, alínea a) do Código dos Contratos Públicos","","",,"",,Não aplicável.,Não aplicável.,FALSE
"Prestação de Serviços Técnicos Especializados para apoiar na elaboração e implementação dos Contratos Programa a celebrar entre a ARSLVT,IP. e os Municípios.",Ajuste Direto Regime Geral,Aquisição de serviços,"71356000-8, Serviços técnicos","Administração Regional de Saúde de Lisboa e Vale do Tejo, I. P. (503148776)","AHP - ALLIED HEALTHCARE PROFESSIONALS, LDA. (510095135)","69.582,62 €",07-06-2017,18-05-2017,270 dias,"Portugal, Lisboa, Lisboa","Artigo 20.º, n.º 1, alínea a) do Código dos Contratos Públicos","","",,"",,Não aplicável.,Não aplicável.,FALSE
Aquisição de serviços especializados de apoio à área das compras,Ajuste Direto Regime Geral,Aquisição de serviços,"79420000-4, Serviços relacionados com a gestão","SPMS - Serviços Partilhados do Ministério da Saúde, E. P. E. (509540716)","AHP - Allied Healthcare Professionals, Lda. (510095135)","72.000,00 €",10-04-2017,14-02-2017,365 dias,Portugal,"Artigo 20.º, n.º 1, alínea a) do Código dos Contratos Públicos","","",,"",,Não aplicável.,Não aplicável.,FALSE
"PRESTAÇÃO DE SERVIÇOS DE GESTÃO DE CONTACTOS PERSONALIZADOS COM UTENTES DO HGO, EPE - Aj. Directo nº 8406676",Ajuste Direto Regime Geral,Aquisição de serviços,"79000000-4, Serviços a empresas: direito, comercialização, consultoria, recrutamento, impressão e segurança","Hospital Garcia de Orta, E. P. E. (506361470)","AHP - Allied Healthcare Professionals, Lda. (510095135)","40.075,20 €",28-11-2016,22-09-2016,365 dias,"Portugal, Setúbal, Almada","Artigo 20.º, n.º 1, alínea a) do Código dos Contratos Públicos","","",,"",,Não aplicável.,Não aplicável.,FALSE
AQUISIÇÃO DE SERVIÇOS DE FORNECIMENTO E COLOCAÇÃO DE QUATRO ASSISTENTES OPERACIONAIS PARA O HSL DE VIANA DO CASTELO,Ajuste Direto Regime Geral,Aquisição de serviços,"85100000-0, Serviços de saúde","Unidade Local de Saúde do Alto Minho, E. P. E. (508786193)","AHP - Allied Healthcare Professionals, Lda. (510095135)","14.989,48 €",10-11-2016,16-10-2014,15 dias,"Portugal, Viana do Castelo, Viana do Castelo","Artigo 20.º, n.º 1, alínea a) do Código dos Contratos Públicos","","",,"",,Não aplicável.,Não aplicável.,FALSE
Aquisição de serviços para apoio à área das compras centralizadas,Concurso público,Aquisição de serviços,"79420000-4, Serviços relacionados com a gestão","SPMS - Serviços Partilhados do Ministério da Saúde, E. P. E. (509540716)","AHP – ALLIED HEALTHCARE PROFESSIONALS, LDA (510095135)","78.900,00 €",18-08-2016,15-07-2016,365 dias,Portugal,"Artigo 21.º, n.º 2 do Código dos Contratos Públicos",21-07-2017,"71.270,34 €",,Consumo efetivo,,Não aplicável.,Não aplicável.,FALSE
"Consiste na aquisição de serviços para assegurar a realização de um conjunto de ações nas áreas de Planeamento Urbanístico, Cultura e Turismo, no âmbito das atividades do Município de Ovar, durante o ano de 2016, mediante afetação à execução do contrato dos seguintes recursos humanos, por lote: Lote 1 - No âmbito da atividade Urbanística: Um técnico com habilitações superiores (licenciamento ou mestrado); Lote 2 - No âmbito da atividade Cultural e Turismo: Carnaval - Um técnico com habilitações superiores (licenciamento ou mestrado); Cultura e Espetáculos - Um técnico com habilitações superiores (licenciatura ou mestrado); Turismo - Um técnico com 12º ano de escolaridade.",Concurso público,Aquisição de serviços,"79620000-6, Serviços de fornecimento de pessoal, inclusive temporário",Município de Ovar (501306269),"AHP - ALLIED HEALTHCARE PROFESSIONALS, LDA (510095135)","69.777,84 €",20-04-2016,15-02-2016,345 dias,"Portugal, Aveiro, Ovar","Artigo 20.º, n.º 1, alínea b) do Código dos Contratos Públicos","","",,"",,Não aplicável.,Não aplicável.,FALSE
"Consiste na aquisição de serviços para assegurar a realização de um conjunto de ações nas áreas de Planeamento Urbanístico, Cultura e Turismo, no âmbito das atividades do Município de Ovar, durante o ano de 2016, mediante afetação à execução do contrato dos seguintes recursos humanos, por lote: Lote 1 - No âmbito da atividade Urbanística: Um técnico com habilitações superiores (licenciamento ou mestrado); Lote 2 - No âmbito da atividade Cultural e Turismo: Carnaval - Um técnico com habilitações superiores (licenciamento ou mestrado); Cultura e Espetáculos - Um técnico com habilitações superiores (licenciatura ou mestrado); Turismo - Um técnico com 12º ano de escolaridade.",Concurso público,Aquisição de serviços,"79620000-6, Serviços de fornecimento de pessoal, inclusive temporário",Município de Ovar (501306269),"AHP - ALLIED HEALTHCARE PROFESSIONALS, LDA (510095135)","33.945,12 €",20-04-2016,15-02-2016,345 dias,"Portugal, Aveiro, Ovar","Artigo 20.º, n.º 1, alínea b) do Código dos Contratos Públicos","","",,"",,Não aplicável.,Não aplicável.,FALSE
Aquisição de serviços de consultoria em matéria comercial e gestão,Concurso público,Aquisição de serviços,"79410000-1, Serviços de consultoria em matéria comercial e de gestão","SPMS - Serviços Partilhados do Ministério da Saúde, E. P. E. (509540716)","AHP – ALLIED HEALTHCARE PROFESSIONALS, LDA (510095135)","70.533,72 €",17-03-2016,11-02-2016,365 dias,Portugal,"Artigo 21.º, n.º 1, alínea b) do Código dos Contratos Públicos","","",,"",,Não aplicável.,Não aplicável.,FALSE
Aquisição De Serviços técnicos de Apoio ao Serviço de Certificação,Ajuste Direto Regime Geral,Aquisição de serviços,"79130000-4, Serviços de certificação e documentação legal","Centro Hospitalar de São João, E. P. E. (509821197)",AHP - Allied Healthcare Professionals Lda (510095135),"13.332,00 €",22-12-2015,10-08-2015,143 dias,"Portugal, Porto, Porto","Artigo 20.º, n.º 1, alínea a) do Código dos Contratos Públicos","","",,"",,Não aplicável.,Não aplicável.,FALSE
Aquisição da Prestação de Serviços Médicos _ Especialidade de Ginecologia/Obstetricia,Ao abrigo de acordo-quadro (art.º 258.º),Aquisição de serviços,"85121000-3, Serviços de prática médica",Centro Hospitalar do Oeste (510412009),"GS 24 - Healthcare Solutions, S.A (510095135)","134.264,29 €",11-05-2015,12-03-2014,180 dias,"Portugal, Leiria, Caldas da Rainha",Artigo 258.º do Código dos Contratos Públicos,31-12-2014,"134.264,29 €",,"",,454020,"CONCURSO PÚBLICO PARA A CELEBRAÇÃO DE CONTRATOS PÚBLICOS DE APROVISIONAMENTO PARA A ÁREA DA SAÚDE, COM VISTA À PRESTAÇÃO DE SERVIÇOS MÉDICOS ÀS INSTITUIÇÕES E SERVIÇOS DO SERVIÇO NACIONAL DE SAÚDE",FALSE
"Prestação de Serviços Médicos, na Especialidade de Obstetrícia e Ginecologia, na ULSNA, EPE (1 de Março a 31 de Dezembro de 2014)",Ao abrigo de acordo-quadro (art.º 259.º),Aquisição de serviços,"85100000-0, Serviços de saúde","Unidade Local de Saúde do Norte Alentejano, E. P. E. (508094461)","GS24 - Helathcare Solutions, S.A (510095135)","298.531,20 €",14-05-2014,10-04-2014,306 dias,"Portugal, Portalegre, Portalegre",Artigo 259.º do Código dos Contratos Públicos,10-04-2014,"298.531,20 €",,"",,454020,"CONCURSO PÚBLICO PARA A CELEBRAÇÃO DE CONTRATOS PÚBLICOS DE APROVISIONAMENTO PARA A ÁREA DA SAÚDE, COM VISTA À PRESTAÇÃO DE SERVIÇOS MÉDICOS ÀS INSTITUIÇÕES E SERVIÇOS DO SERVIÇO NACIONAL DE SAÚDE",FALSE
"Prestação de Serviços Médicos na VMER da ULSNA, EPE (ano de 2014)",Ao abrigo de acordo-quadro (art.º 259.º),Aquisição de serviços,"85100000-0, Serviços de saúde","Unidade Local de Saúde do Norte Alentejano, E. P. E. (508094461)","GS24 - Healthcare Solutions, S.A. (510095135)","95.103,20 €",21-03-2014,06-03-2014,306 dias,"Portugal, Portalegre",Artigo 259.º do Código dos Contratos Públicos,06-03-2014,"95.103,20 €",,"",,454020,"CONCURSO PÚBLICO PARA A CELEBRAÇÃO DE CONTRATOS PÚBLICOS DE APROVISIONAMENTO PARA A ÁREA DA SAÚDE, COM VISTA À PRESTAÇÃO DE SERVIÇOS MÉDICOS ÀS INSTITUIÇÕES E SERVIÇOS DO SERVIÇO NACIONAL DE SAÚDE",FALSE
"Prestação de Serviços Médicos, na Triagem Pediátrica do Serviço de Urgência do HDJMG (ano de 2014)",Ao abrigo de acordo-quadro (art.º 259.º),Aquisição de serviços,"85100000-0, Serviços de saúde","Unidade Local de Saúde do Norte Alentejano, E. P. E. (508094461)","GS24 - Healthcare Solutions, S.A. (510095135)","109.575,00 €",21-03-2014,06-03-2014,306 dias,"Portugal, Portalegre, Portalegre",Artigo 259.º do Código dos Contratos Públicos,06-03-2014,"109.575,00 €",,"",,454020,"CONCURSO PÚBLICO PARA A CELEBRAÇÃO DE CONTRATOS PÚBLICOS DE APROVISIONAMENTO PARA A ÁREA DA SAÚDE, COM VISTA À PRESTAÇÃO DE SERVIÇOS MÉDICOS ÀS INSTITUIÇÕES E SERVIÇOS DO SERVIÇO NACIONAL DE SAÚDE",FALSE
"Prestação de serviço de secretariado clínico para a área de influência da ARSLVT, IP – Zona de Sintra (ACES Cascais), em regime de Outsourcing - acréscimo de 35h/semanais. Período de 02/12/2013 a 31/12/2013.",Ajuste Direto Regime Geral,Aquisição de serviços,"75122000-7, Serviços administrativos na área da saúde","Administração Regional de Saúde de Lisboa e Vale do Tejo, I. P. (503148776)","AHP - Allied Healthcare Professionals, Lda. (510095135)","910,00 €",04-02-2014,30-01-2014,30 dias,"Portugal, Lisboa, Cascais","Artigo 24.º, n.º 1, alínea e) do Código dos Contratos Públicos","","",,"",,Não aplicável.,Não aplicável.,FALSE
