freguesia,acronym,validVotesPercentage,votes,dicofre
"União das freguesias de Barcel, Marmelos e Valverde da Gestosa",PPD/PSD.CDS-PP,44.44,52,040740
"União das freguesias de Barcel, Marmelos e Valverde da Gestosa",PS,35.04,41,040740
"União das freguesias de Barcel, Marmelos e Valverde da Gestosa",B.E.,6.84,8,040740
"União das freguesias de Barcel, Marmelos e Valverde da Gestosa",PCP-PEV,5.98,7,040740
"União das freguesias de Barcel, Marmelos e Valverde da Gestosa",PCTP/MRPP,2.56,3,040740
"União das freguesias de Barcel, Marmelos e Valverde da Gestosa",PND,1.71,2,040740
"União das freguesias de Barcel, Marmelos e Valverde da Gestosa",PPM,1.71,2,040740
"União das freguesias de Barcel, Marmelos e Valverde da Gestosa",L,0.85,1,040740
"União das freguesias de Barcel, Marmelos e Valverde da Gestosa",PDA,0.85,1,040740
"União das freguesias de Barcel, Marmelos e Valverde da Gestosa",MAS,0,0,040740
"União das freguesias de Barcel, Marmelos e Valverde da Gestosa",MPT,0,0,040740
"União das freguesias de Barcel, Marmelos e Valverde da Gestosa",PAN,0,0,040740
"União das freguesias de Barcel, Marmelos e Valverde da Gestosa",PNR,0,0,040740
"União das freguesias de Barcel, Marmelos e Valverde da Gestosa",POUS,0,0,040740
"União das freguesias de Barcel, Marmelos e Valverde da Gestosa",PPV,0,0,040740
"União das freguesias de Barcel, Marmelos e Valverde da Gestosa",PTP,0,0,040740
