freguesia,acronym,validVotesPercentage,votes,dicofre
São Cipriano,PPD/PSD,44.74,102,181312
São Cipriano,PS,37.72,86,181312
São Cipriano,CDS-PP,5.26,12,181312
São Cipriano,B.E.,3.95,9,181312
São Cipriano,PAN,2.19,5,181312
São Cipriano,PCP-PEV,1.75,4,181312
São Cipriano,A,0.88,2,181312
São Cipriano,L,0.88,2,181312
São Cipriano,PCTP/MRPP,0.88,2,181312
São Cipriano,IL,0.44,1,181312
São Cipriano,NC,0.44,1,181312
São Cipriano,PPM.PPV/CDC,0.44,1,181312
São Cipriano,PTP,0.44,1,181312
São Cipriano,MAS,0,0,181312
São Cipriano,PDR,0,0,181312
São Cipriano,PNR,0,0,181312
São Cipriano,PURP,0,0,181312
