freguesia,acronym,validVotesPercentage,votes,dicofre
Vila Facaia,PPD/PSD,48.95,70,101303
Vila Facaia,PS,32.17,46,101303
Vila Facaia,CDS-PP,4.9,7,101303
Vila Facaia,B.E.,3.5,5,101303
Vila Facaia,PCP-PEV,2.8,4,101303
Vila Facaia,A,2.1,3,101303
Vila Facaia,PAN,2.1,3,101303
Vila Facaia,PPM.PPV/CDC,1.4,2,101303
Vila Facaia,PCTP/MRPP,0.7,1,101303
Vila Facaia,PTP,0.7,1,101303
Vila Facaia,PURP,0.7,1,101303
Vila Facaia,IL,0,0,101303
Vila Facaia,L,0,0,101303
Vila Facaia,MAS,0,0,101303
Vila Facaia,NC,0,0,101303
Vila Facaia,PDR,0,0,101303
Vila Facaia,PNR,0,0,101303
