Objeto do Contrato,Tipo de Procedimento,Tipo(s) de Contrato,CPVs,Entidade(s) Adjudicante(s),Entidade(s) Adjudicatária(s),Preço Contratual,Data de Publicação,Data de Celebração do Contrato,Prazo de Execução,Local de Execução,Fundamentação,Data de Fecho do Contrato,Preço Total Efetivo,Causas das Alterações ao Prazo,Causas das Alterações ao Preço,Estado,N.º registo do Acordo Quadro,Descrição do Acordo Quadro,Procedimento Centralizado
4EXC0016/2015 - Impressos,Ajuste Direto Regime Geral,Aquisição de bens móveis,"30000000-9, Máquinas, equipamento e material de escritório e de informática, excepto mobiliário e pacotes de programas (software)","Centro Hospitalar Barreiro Montijo, E. P. E. (509186998)",Imprensa Nacional Casa da Moeda (500792887),"75,00 €",18-12-2015,08-01-2015,360 dias,"Portugal, Setúbal, Barreiro","Artigo 20.º, n.º 1, alínea a) do Código dos Contratos Públicos",30-11-2015,"75,00 €",,,,Não aplicável.,Não aplicável.,FALSE
4EXC0016/2015 - Impressos,Ajuste Direto Regime Geral,Aquisição de bens móveis,"30000000-9, Máquinas, equipamento e material de escritório e de informática, excepto mobiliário e pacotes de programas (software)","Centro Hospitalar Barreiro Montijo, E. P. E. (509186998)",A.R.S.L.V.T (503148776),"858,40 €",18-12-2015,08-01-2015,360 dias,"Portugal, Setúbal, Barreiro","Artigo 20.º, n.º 1, alínea a) do Código dos Contratos Públicos",14-12-2015,"858,40 €",,,,Não aplicável.,Não aplicável.,FALSE
