freguesia,acronym,validVotesPercentage,votes,dicofre
Rosais,CDS-PP,48.37,74,450203
Rosais,PS,33.99,52,450203
Rosais,PPD/PSD,6.54,10,450203
Rosais,PCP-PEV,3.27,5,450203
Rosais,B.E.,2.61,4,450203
Rosais,PAN,1.96,3,450203
Rosais,PDR,1.31,2,450203
Rosais,A,0.65,1,450203
Rosais,NC,0.65,1,450203
Rosais,PCTP/MRPP,0.65,1,450203
Rosais,IL,0,0,450203
Rosais,L,0,0,450203
Rosais,MAS,0,0,450203
Rosais,PNR,0,0,450203
Rosais,PPM.PPV/CDC,0,0,450203
Rosais,PTP,0,0,450203
Rosais,PURP,0,0,450203
