freguesia,acronym,validVotesPercentage,votes,dicofre
União das freguesias de Alcácer do Sal (Santa Maria do Castelo e Santiago) e Santa Susana,PS,39.23,849,150107
União das freguesias de Alcácer do Sal (Santa Maria do Castelo e Santiago) e Santa Susana,PCP-PEV,29.34,635,150107
União das freguesias de Alcácer do Sal (Santa Maria do Castelo e Santiago) e Santa Susana,B.E.,9.43,204,150107
União das freguesias de Alcácer do Sal (Santa Maria do Castelo e Santiago) e Santa Susana,PPD/PSD,7.81,169,150107
União das freguesias de Alcácer do Sal (Santa Maria do Castelo e Santiago) e Santa Susana,CDS-PP,3.56,77,150107
União das freguesias de Alcácer do Sal (Santa Maria do Castelo e Santiago) e Santa Susana,PCTP/MRPP,2.73,59,150107
União das freguesias de Alcácer do Sal (Santa Maria do Castelo e Santiago) e Santa Susana,PAN,2.36,51,150107
União das freguesias de Alcácer do Sal (Santa Maria do Castelo e Santiago) e Santa Susana,A,1.34,29,150107
União das freguesias de Alcácer do Sal (Santa Maria do Castelo e Santiago) e Santa Susana,PPM.PPV/CDC,0.88,19,150107
União das freguesias de Alcácer do Sal (Santa Maria do Castelo e Santiago) e Santa Susana,L,0.79,17,150107
União das freguesias de Alcácer do Sal (Santa Maria do Castelo e Santiago) e Santa Susana,NC,0.6,13,150107
União das freguesias de Alcácer do Sal (Santa Maria do Castelo e Santiago) e Santa Susana,PTP,0.51,11,150107
União das freguesias de Alcácer do Sal (Santa Maria do Castelo e Santiago) e Santa Susana,PNR,0.37,8,150107
União das freguesias de Alcácer do Sal (Santa Maria do Castelo e Santiago) e Santa Susana,PDR,0.32,7,150107
União das freguesias de Alcácer do Sal (Santa Maria do Castelo e Santiago) e Santa Susana,IL,0.28,6,150107
União das freguesias de Alcácer do Sal (Santa Maria do Castelo e Santiago) e Santa Susana,PURP,0.28,6,150107
União das freguesias de Alcácer do Sal (Santa Maria do Castelo e Santiago) e Santa Susana,MAS,0.18,4,150107
