Objeto do Contrato,Tipo de Procedimento,Tipo(s) de Contrato,CPVs,Entidade(s) Adjudicante(s),Entidade(s) Adjudicatária(s),Preço Contratual,Data de Publicação,Data de Celebração do Contrato,Prazo de Execução,Local de Execução,Fundamentação,Data de Fecho do Contrato,Preço Total Efetivo,Causas das Alterações ao Prazo,Causas das Alterações ao Preço,Estado,N.º registo do Acordo Quadro,Descrição do Acordo Quadro,Procedimento Centralizado
Aquisição de licenciamento do código Coloradd,Ajuste Direto Regime Geral,Aquisição de bens móveis,"48218000-9, Pacote de software para gestão de licenças","SPMS - Serviços Partilhados do Ministério da Saúde, E. P. E. (509540716)","Miguel Neiva e Associados - Design Gráfico, Lda (509382614)","3.600,00 €",07-06-2016,25-05-2016,1095 dias,Portugal,"Artigo 20.º, n.º 1, alínea a) do Código dos Contratos Públicos",31-12-2016,"3.600,00 €",,,,Não aplicável.,Não aplicável.,FALSE
Aquisição de equipamento multimédia diverso,Ajuste Direto Regime Geral,Aquisição de bens móveis,"32322000-6, Equipamento multimédia","SPMS- Serviços Partilhados do M. da Saúde, E.P.E. (509540716)","MAINVISION - MEDIA SOLUTIONS, UNIPESSOAL, LDA (508725135)","12.000,00 €",07-06-2016,29-04-2016,245 dias,Portugal,"Artigo 20.º, n.º 1, alínea a) do Código dos Contratos Públicos","","",,,,Não aplicável.,Não aplicável.,FALSE
Aquisição de serviços de gestão operacional das infraestruturas do datacenter,Ajuste Direto Regime Geral,Aquisição de serviços,"72500000-0, Serviços relacionados com a informática","SPMS - Serviços Partilhados do Ministério da Saúde, E. P. E. (509540716)","CapGemini Portugal – Serviços de Consultoria e Informática, SA (502829257)","6.998,40 €",07-06-2016,20-05-2016,90 dias,Portugal,"Artigo 20.º, n.º 1, alínea a) do Código dos Contratos Públicos",22-08-2016,"6.998,40 €",,,,Não aplicável.,Não aplicável.,FALSE
Aquisição de serviços de desenvolvimento e manutenção aplicacional do sistema de gestão de entidades de saúde,Ao abrigo de acordo-quadro (art.º 259.º),Aquisição de serviços,"72230000-6, Serviços de desenvolvimento de software à medida","SPMS- Serviços Partilhados do M. da Saúde, E.P.E. (509540716)","Altranportugal, S. A. (504272179)","27.302,80 €",07-06-2016,19-02-2016,365 dias,Portugal,Artigo 259.º do Código dos Contratos Públicos,"","",,,,425776,CONCURSO PÚBLICO n.º 20120117 -,FALSE
Aquisição de serviços de análise e padronização dos postos de trabalho nos cuidados de saúde primários e hospitais,Ajuste Direto Regime Geral,Aquisição de serviços,"72220000-3, Serviços de consultoria técnica e em matéria de sistemas","SPMS - Serviços Partilhados do Ministério da Saúde, E. P. E. (509540716)","GFI Portugal - Tecnologias de Informação, SA (502726890)","9.800,00 €",07-06-2016,25-05-2016,6 dias,Portugal,"Artigo 20.º, n.º 1, alínea a) do Código dos Contratos Públicos",31-05-2016,"9.800,00 €",,,,Não aplicável.,Não aplicável.,FALSE
Aquisição de serviços de testes de software do Sistema de Informação Clínico – Sclínico,Concurso público,Aquisição de serviços,"72500000-0, Serviços relacionados com a informática","SPMS - Serviços Partilhados do Ministério da Saúde, E. P. E. (509540716)","Olisipo - Formação e Consultoria em Tecnologias de Informação, S. A. (503169714)","129.744,00 €",07-06-2016,11-05-2016,900 dias,Portugal,"Artigo 21.º, n.º 1, alínea b) do Código dos Contratos Públicos","","",,,,Não aplicável.,Não aplicável.,FALSE
Aquisição de serviços de higiene limpeza com fornecimento de consumiveis,Ajuste Direto Regime Geral,Aquisição de serviços,"90911000-6, Serviços de limpeza de alojamentos, edifícios e janelas","SPMS - Serviços Partilhados do Ministério da Saúde, E. P. E. (509540716)","Garnica Faciliry Services, Lda (509909515)","13.550,00 €",07-06-2016,17-03-2016,60 dias,Portugal,"Artigo 20.º, n.º 1, alínea a) do Código dos Contratos Públicos","","",,,,Não aplicável.,Não aplicável.,FALSE
Aquisição de serviços de desenvolvimento e manutenção aplicacional e-Boletim,Ao abrigo de acordo-quadro (art.º 259.º),Aquisição de serviços,"72500000-0, Serviços relacionados com a informática","SPMS- Serviços Partilhados do M. da Saúde, E.P.E. (509540716)","Altranportugal, S. A. (504272179)","41.754,24 €",07-06-2016,16-05-2016,270 dias,Portugal,Artigo 259.º do Código dos Contratos Públicos,31-12-2017,"41.754,24 €",,,,425776,CONCURSO PÚBLICO n.º 20120117 -,FALSE
Aquisição de serviços de assessoria tecnológica e de gestão,Ajuste Direto Regime Geral,Aquisição de serviços,"72500000-0, Serviços relacionados com a informática","SPMS- Serviços Partilhados do M. da Saúde, E.P.E. (509540716)","GFI Portugal - Tecnologias de Informação, SA (502726890)","9.600,00 €",07-06-2016,02-06-2016,60 dias,Portugal,"Artigo 20.º, n.º 1, alínea a) do Código dos Contratos Públicos",02-08-2016,"9.600,00 €",,,,Não aplicável.,Não aplicável.,FALSE
Aquisição de mobiliário,Ajuste Direto Regime Geral,Aquisição de bens móveis,"39100000-3, Mobiliário","SPMS- Serviços Partilhados do M. da Saúde, E.P.E. (509540716)","Socidirect - Construções, Lda (505209470)","50.000,00 €",07-06-2016,17-05-2016,60 dias,Portugal,"Artigo 20.º, n.º 1, alínea a) do Código dos Contratos Públicos","","",,,,Não aplicável.,Não aplicável.,FALSE
Aquisição de serviços de manutenção preventiva e reativa de infraestruturas de suporte ao datacenter - Porto,Ajuste Direto Regime Geral,Aquisição de serviços,"50300000-8, Serviços de reparação e manutenção e serviços conexos relacionados com computadores pessoais e com equipamento burótico, audiovisual e para telecomunicações","SPMS- Serviços Partilhados do M. da Saúde, E.P.E. (509540716)","Piferdal - Instalações Especiais, Lda (508850339)","9.900,00 €",07-06-2016,07-04-2016,277 dias,Portugal,"Artigo 20.º, n.º 1, alínea a) do Código dos Contratos Públicos","","",,,,Não aplicável.,Não aplicável.,FALSE
Aquisição de serviços de manutenção de infraestruturas de suporte ao datacenter - Lisboa,Ajuste Direto Regime Geral,Aquisição de serviços,"50300000-8, Serviços de reparação e manutenção e serviços conexos relacionados com computadores pessoais e com equipamento burótico, audiovisual e para telecomunicações","SPMS- Serviços Partilhados do M. da Saúde, E.P.E. (509540716)","Piferdal - Instalações Especiais, Lda (508850339)","9.000,00 €",07-06-2016,07-04-2016,277 dias,Portugal,"Artigo 20.º, n.º 1, alínea a) do Código dos Contratos Públicos","","",,,,Não aplicável.,Não aplicável.,FALSE
Aquisição de Equipamento Informático para o NEPe UMC,Ajuste Direto Regime Geral,Aquisição de bens móveis,"30230000-0, Equipamento informático","SPMS - Serviços Partilhados do Ministério da Saúde, E. P. E. (509540716)","TCSI-DIGIBÉRIA Tecnologias de Informação, SA (502670355)","9.224,25 €",02-06-2016,26-05-2016,45 dias,Portugal,"Artigo 20.º, n.º 1, alínea a) do Código dos Contratos Públicos",31-07-2016,"9.224,25 €",,,,Não aplicável.,Não aplicável.,FALSE
