freguesia,acronym,validVotesPercentage,votes,dicofre
Reigoso,PPD/PSD.CDS-PP,48.81,41,170625
Reigoso,PS,46.43,39,170625
Reigoso,PCP-PEV,1.19,1,170625
Reigoso,PCTP/MRPP,1.19,1,170625
Reigoso,PND,1.19,1,170625
Reigoso,PTP,1.19,1,170625
Reigoso,B.E.,0,0,170625
Reigoso,L,0,0,170625
Reigoso,MAS,0,0,170625
Reigoso,MPT,0,0,170625
Reigoso,PAN,0,0,170625
Reigoso,PDA,0,0,170625
Reigoso,PNR,0,0,170625
Reigoso,POUS,0,0,170625
Reigoso,PPM,0,0,170625
Reigoso,PPV,0,0,170625
