Objeto do Contrato,Tipo de Procedimento,Tipo(s) de Contrato,CPVs,Entidade(s) Adjudicante(s),Entidade(s) Adjudicatária(s),Preço Contratual,Data de Publicação,Data de Celebração do Contrato,Prazo de Execução,Local de Execução,Fundamentação,Data de Fecho do Contrato,Preço Total Efetivo,Causas das Alterações ao Prazo,Causas das Alterações ao Preço,Estado,N.º registo do Acordo Quadro,Descrição do Acordo Quadro,Procedimento Centralizado
"Celebração de contrato de prestação de serviços, de consultoria técnica, em regime de avença, para a área de atuação da assessoria técnica e gestão, com intervenção específica ao nível do apoio transversal dos Programas Nacionais Prioritários, e na concretização de sistemas de monitorização de programas integrados no Plano Nacional de Saúde, ao nível da análise de informação de saúde",Ajuste Direto Regime Geral,Aquisição de serviços,"71621000-7, Serviços técnicos de análise ou consultoria",Direcção-Geral da Saúde (600037100),Matilde de Araújo e Sá Valente Rosa (243034911),"14.417,76 €",23-01-2013,01-01-2013,365 dias,"Portugal, Lisboa, Lisboa","Artigo 20.º, n.º 1, alínea a) do Código dos Contratos Públicos",01-01-2014,"14.417,76 €",,,,Não aplicável.,Não aplicável.,
"Renovação do contrato de prestação de serviços, de consultoria técnica, em regime de avença, para a área da psicopedagogia, com intervenção específica ao nível da saúde mental",Ajuste Direto Regime Geral,Aquisição de serviços,"71621000-7, Serviços técnicos de análise ou consultoria",Direcção-Geral da Saúde (600037100),Pedro Manuel Torres Rio Dias Mateus (212242962),"24.298,68 €",23-01-2013,01-01-2013,365 dias,"Portugal, Lisboa, Lisboa","Artigo 20.º, n.º 1, alínea a) do Código dos Contratos Públicos",31-12-2013,"24.298,68 €",,,,Não aplicável.,Não aplicável.,
"Renovação do contrato de prestação de serviços, de consultoria técnica, em regime de avença, para a área de assessoria e gestão com intervenção específica ao nível do VIH/Sida",Ajuste Direto Regime Geral,Aquisição de serviços,"71621000-7, Serviços técnicos de análise ou consultoria",Direcção-Geral da Saúde (600037100),Joana Mota Bettencourt Melo Fonseca (207526028),"24.298,68 €",23-01-2013,01-01-2013,365 dias,"Portugal, Lisboa, Lisboa","Artigo 20.º, n.º 1, alínea a) do Código dos Contratos Públicos",31-12-2013,"24.298,68 €",,,,Não aplicável.,Não aplicável.,
"Renovação do contrato de prestação de serviços, de consultoria técnica, em regime de avença, para a gestão de projetos com intervenção específica nas doenças oncológicas",Ajuste Direto Regime Geral,Aquisição de serviços,"71621000-7, Serviços técnicos de análise ou consultoria",Direcção-Geral da Saúde (600037100),Elisabeth Somsen (100727816),"24.298,68 €",23-01-2013,01-01-2013,365 dias,"Portugal, Lisboa, Lisboa","Artigo 20.º, n.º 1, alínea a) do Código dos Contratos Públicos",31-12-2013,"24.298,68 €",,,,Não aplicável.,Não aplicável.,
"Renovação do contrato de prestação de serviços, de consultoria técnica, em regime de avença, para a gestão de projetos com intervenção específica nas doenças oncológicas",Ajuste Direto Regime Geral,Aquisição de serviços,"71621000-7, Serviços técnicos de análise ou consultoria",Direcção-Geral da Saúde (600037100),Ana Cristina Urpina Portugal Cabrita Matias (193119005),"24.298,68 €",23-01-2013,01-01-2013,365 dias,"Portugal, Lisboa, Lisboa","Artigo 20.º, n.º 1, alínea a) do Código dos Contratos Públicos",31-12-2013,"24.298,68 €",,,,Não aplicável.,Não aplicável.,
"Renovação do contrato de prestação de serviços, de consultoria técnica, em regime de avença, para a área de atuação da assessoria técnica e gestão, com intervenção específica ao nível do VIH/Sida",Ajuste Direto Regime Geral,Aquisição de serviços,"71621000-7, Serviços técnicos de análise ou consultoria",Direcção-Geral da Saúde (600037100),Maria Teresa dos Santos Silva Correia de Melo (159339065),"24.298,68 €",23-01-2013,01-01-2013,365 dias,"Portugal, Lisboa, Lisboa","Artigo 20.º, n.º 1, alínea a) do Código dos Contratos Públicos",31-12-2013,"24.298,68 €",,,,Não aplicável.,Não aplicável.,
"Renovação do contrato de prestação de serviços, de consultoria técnica, em regime de avença, para a área de atuação da assessoria técnica e gestão, com intervenção específica ao nível do apoio transversal dos Programas Nacionais Prioritários, e na concretização de sistemas de monitorização de programas integrados no Plano Nacional de Saúde.",Ajuste Direto Regime Geral,Aquisição de serviços,"71621000-7, Serviços técnicos de análise ou consultoria",Direcção-Geral da Saúde (600037100),Maria Isabel Martins Alves (181444160),"16.800,00 €",23-01-2013,01-01-2013,365 dias,"Portugal, Lisboa, Lisboa","Artigo 20.º, n.º 1, alínea a) do Código dos Contratos Públicos",31-12-2013,"16.800,00 €",,,,Não aplicável.,Não aplicável.,
"Renovação do contrato de prestação de serviços, de consultoria técnica, em regime de avença, na área para funções consultivas e de gestão em projetos nacionais e europeus, protocolos e apoios financeiros e preparação e execução financeira de ações cofinanciadas",Ajuste Direto Regime Geral,Aquisição de serviços,"71621000-7, Serviços técnicos de análise ou consultoria",Direcção-Geral da Saúde (600037100),Telma Maria Monteiro Gaspar Dias (208594450),"24.298,68 €",23-01-2013,01-01-2013,365 dias,"Portugal, Lisboa, Lisboa","Artigo 20.º, n.º 1, alínea a) do Código dos Contratos Públicos",31-12-2013,"24.298,68 €",,,,Não aplicável.,Não aplicável.,
Disponibilização de software para instalação do Sistema de Informação de Suporte ao Tratamento de Dados de Pessoas Infetadas por VIH/SIDA (SI.VIDA) na DGS,Ajuste Direto Regime Geral,Aquisição de serviços,"72268000-1, Serviços de fornecimento de software",Direcção-Geral da Saúde (600037100),"SPMS - Serviços Partilhados do Ministério da Saúde, EPE (509540716)","250.000,00 €",21-01-2013,02-11-2012,66 dias,"Portugal, Lisboa, Lisboa","Artigo 24.º, n.º 1, alínea e) do Código dos Contratos Públicos",02-01-2013,"250.000,00 €",,,,Não aplicável.,Não aplicável.,
Disponibilização de software para integração do Sistema de Informação de Suporte ao Tratamento de Dados de Pessoas Infetadas por VIH/SIDA (SI.VIDA) com a plataforma de interoperabilidade,Ajuste Direto Regime Geral,Aquisição de serviços,"72268000-1, Serviços de fornecimento de software",Direcção-Geral da Saúde (600037100),"SPMS - Serviços Partilhados do Ministério da saúde, EPE (509540716)","250.000,00 €",21-01-2013,02-11-2012,66 dias,"Portugal, Lisboa, Lisboa","Artigo 24.º, n.º 1, alínea e) do Código dos Contratos Públicos",02-01-2013,"250.000,00 €",,,,Não aplicável.,Não aplicável.,
