Objeto do Contrato,Tipo de Procedimento,Tipo(s) de Contrato,CPVs,Entidade(s) Adjudicante(s),Entidade(s) Adjudicatária(s),Preço Contratual,Data de Publicação,Data de Celebração do Contrato,Prazo de Execução,Local de Execução,Fundamentação,Data de Fecho do Contrato,Preço Total Efetivo,Causas das Alterações ao Prazo,Causas das Alterações ao Preço,Estado,N.º registo do Acordo Quadro,Descrição do Acordo Quadro,Procedimento Centralizado
49001918-REPARAÇÃO DE EQUIPAMENTOS,Ajuste Direto Regime Geral,Aquisição de serviços,"50000000-5, Serviços de reparação e manutenção",Hospital Dr. Francisco Zagalo - Ovar (501510150),NETFLOW DESENVOL SIST INFORMACAO LDA (507596137),"82,00 €",11-12-2018,20-01-2018,30 dias,"Portugal, Aveiro, Ovar","Artigo 20.º, n.º 1, alínea d) do Código dos Contratos Públicos",11-12-2018,"82,00 €","","",,Não aplicável.,Não aplicável.,FALSE
49001918-REPARAÇÃO DE EQUIPAMENTOS,Ajuste Direto Regime Geral,Aquisição de serviços,"50000000-5, Serviços de reparação e manutenção",Hospital Dr. Francisco Zagalo - Ovar (501510150),"FLEX 2000 - PRODUTOS FLEXIVEIS, SA (504663232)","37,40 €",11-12-2018,20-01-2018,30 dias,"Portugal, Aveiro, Ovar","Artigo 20.º, n.º 1, alínea d) do Código dos Contratos Públicos",11-12-2018,"37,40 €","","",,Não aplicável.,Não aplicável.,FALSE
49001918-REPARAÇÃO DE EQUIPAMENTOS,Ajuste Direto Regime Geral,Aquisição de serviços,"50000000-5, Serviços de reparação e manutenção",Hospital Dr. Francisco Zagalo - Ovar (501510150),Eugénio Pereira Lda (503989525),"70,00 €",11-12-2018,20-01-2018,30 dias,"Portugal, Aveiro, Ovar","Artigo 20.º, n.º 1, alínea d) do Código dos Contratos Públicos",11-12-2018,"70,00 €","","",,Não aplicável.,Não aplicável.,FALSE
49001918-REPARAÇÃO DE EQUIPAMENTOS,Ajuste Direto Regime Geral,Aquisição de serviços,"50000000-5, Serviços de reparação e manutenção",Hospital Dr. Francisco Zagalo - Ovar (501510150),"ANTÃO MEDICAL, LDA (507754468)","218,98 €",11-12-2018,20-01-2018,30 dias,"Portugal, Aveiro, Ovar","Artigo 20.º, n.º 1, alínea d) do Código dos Contratos Públicos",11-12-2018,"218,98 €","","",,Não aplicável.,Não aplicável.,FALSE
49001918-REPARAÇÃO DE EQUIPAMENTOS,Ajuste Direto Regime Geral,Aquisição de serviços,"50000000-5, Serviços de reparação e manutenção",Hospital Dr. Francisco Zagalo - Ovar (501510150),BAUSCH  LOMB (980218764),"3.500,00 €",11-12-2018,20-01-2018,30 dias,"Portugal, Aveiro, Ovar","Artigo 20.º, n.º 1, alínea d) do Código dos Contratos Públicos",11-12-2018,"3.500,00 €","","",,Não aplicável.,Não aplicável.,FALSE
49001918-REPARAÇÃO DE EQUIPAMENTOS,Ajuste Direto Regime Geral,Aquisição de serviços,"50000000-5, Serviços de reparação e manutenção",Hospital Dr. Francisco Zagalo - Ovar (501510150),"Hipoteses & Teorias - Unipessoal, Lda. (513096027)","2.985,00 €",11-12-2018,20-01-2018,30 dias,"Portugal, Aveiro, Ovar","Artigo 20.º, n.º 1, alínea d) do Código dos Contratos Públicos",11-12-2018,"2.985,00 €","","",,Não aplicável.,Não aplicável.,FALSE
49001918-REPARAÇÃO DE EQUIPAMENTOS,Ajuste Direto Regime Geral,Aquisição de serviços,"50000000-5, Serviços de reparação e manutenção",Hospital Dr. Francisco Zagalo - Ovar (501510150),Electro Siluz - Artigos Eléctricos e Electrodomésticos S.A. (500600279),"21,33 €",11-12-2018,20-01-2018,30 dias,"Portugal, Aveiro, Ovar","Artigo 20.º, n.º 1, alínea d) do Código dos Contratos Públicos",11-12-2018,"21,33 €","","",,Não aplicável.,Não aplicável.,FALSE
49001918-REPARAÇÃO DE EQUIPAMENTOS,Ajuste Direto Regime Geral,Aquisição de serviços,"50000000-5, Serviços de reparação e manutenção",Hospital Dr. Francisco Zagalo - Ovar (501510150),EXTINVALE - SEGURANÇA CONTRA INCENDIOS LDA (505898977),"182,12 €",11-12-2018,20-01-2018,30 dias,"Portugal, Aveiro, Ovar","Artigo 20.º, n.º 1, alínea d) do Código dos Contratos Públicos",11-12-2018,"182,12 €","","",,Não aplicável.,Não aplicável.,FALSE
49001918-REPARAÇÃO DE EQUIPAMENTOS,Ajuste Direto Regime Geral,Aquisição de serviços,"50000000-5, Serviços de reparação e manutenção",Hospital Dr. Francisco Zagalo - Ovar (501510150),WTEC  Lda (504022172),"142,66 €",11-12-2018,20-01-2018,30 dias,"Portugal, Aveiro, Ovar","Artigo 20.º, n.º 1, alínea d) do Código dos Contratos Públicos",11-12-2018,"142,66 €","","",,Não aplicável.,Não aplicável.,FALSE
49001918-REPARAÇÃO DE EQUIPAMENTOS,Ajuste Direto Regime Geral,Aquisição de serviços,"50000000-5, Serviços de reparação e manutenção",Hospital Dr. Francisco Zagalo - Ovar (501510150),"General Electric Healthcare Portugal, Lda. (500357129)","793,33 €",11-12-2018,20-01-2018,30 dias,"Portugal, Aveiro, Ovar","Artigo 20.º, n.º 1, alínea d) do Código dos Contratos Públicos",11-12-2018,"793,33 €","","",,Não aplicável.,Não aplicável.,FALSE
49001918-REPARAÇÃO DE EQUIPAMENTOS,Ajuste Direto Regime Geral,Aquisição de serviços,"50000000-5, Serviços de reparação e manutenção",Hospital Dr. Francisco Zagalo - Ovar (501510150),SUCH | Serviço de Utilização Comum dos Hospitais (500900469),"3.182,03 €",11-12-2018,20-01-2018,30 dias,"Portugal, Aveiro, Ovar","Artigo 20.º, n.º 1, alínea d) do Código dos Contratos Públicos",11-12-2018,"3.182,03 €","","",,Não aplicável.,Não aplicável.,FALSE
49001918-REPARAÇÃO DE EQUIPAMENTOS,Ajuste Direto Regime Geral,Aquisição de serviços,"50000000-5, Serviços de reparação e manutenção",Hospital Dr. Francisco Zagalo - Ovar (501510150),"abo - Anastácio Bastos Oliveira, Lda. (513519661)","241,56 €",11-12-2018,20-01-2018,30 dias,"Portugal, Aveiro, Ovar","Artigo 20.º, n.º 1, alínea d) do Código dos Contratos Públicos",11-12-2018,"241,56 €","","",,Não aplicável.,Não aplicável.,FALSE
49001918-REPARAÇÃO DE EQUIPAMENTOS,Ajuste Direto Regime Geral,Aquisição de serviços,"50000000-5, Serviços de reparação e manutenção",Hospital Dr. Francisco Zagalo - Ovar (501510150),lablad (502629703),"1.385,72 €",11-12-2018,20-01-2018,30 dias,"Portugal, Aveiro, Ovar","Artigo 20.º, n.º 1, alínea d) do Código dos Contratos Públicos",11-12-2018,"1.385,72 €","","",,Não aplicável.,Não aplicável.,FALSE
49001918-REPARAÇÃO DE EQUIPAMENTOS,Ajuste Direto Regime Geral,Aquisição de serviços,"50000000-5, Serviços de reparação e manutenção",Hospital Dr. Francisco Zagalo - Ovar (501510150),"TAVARESAUTO,LDA. (502880740)","207,31 €",11-12-2018,20-01-2018,30 dias,"Portugal, Aveiro, Ovar","Artigo 20.º, n.º 1, alínea d) do Código dos Contratos Públicos",11-12-2018,"207,31 €","","",,Não aplicável.,Não aplicável.,FALSE
49001918-REPARAÇÃO DE EQUIPAMENTOS,Ajuste Direto Regime Geral,Aquisição de serviços,"50000000-5, Serviços de reparação e manutenção",Hospital Dr. Francisco Zagalo - Ovar (501510150),"António Sá Pacheco & Ca.,Lda. (500314594)","134,45 €",11-12-2018,20-01-2018,30 dias,"Portugal, Aveiro, Ovar","Artigo 20.º, n.º 1, alínea d) do Código dos Contratos Públicos",11-12-2018,"134,45 €","","",,Não aplicável.,Não aplicável.,FALSE
49001918-REPARAÇÃO DE EQUIPAMENTOS,Ajuste Direto Regime Geral,Aquisição de serviços,"50000000-5, Serviços de reparação e manutenção",Hospital Dr. Francisco Zagalo - Ovar (501510150),DROGARIA SILVA - JOSE EDUARDO FERREIRA DA SILVA (105049700),"271,98 €",11-12-2018,20-01-2018,30 dias,"Portugal, Aveiro, Ovar","Artigo 20.º, n.º 1, alínea d) do Código dos Contratos Públicos",11-12-2018,"271,98 €","","",,Não aplicável.,Não aplicável.,FALSE
49001918-REPARAÇÃO DE EQUIPAMENTOS,Ajuste Direto Regime Geral,Aquisição de serviços,"50000000-5, Serviços de reparação e manutenção",Hospital Dr. Francisco Zagalo - Ovar (501510150),"ESQUEMAQUER UNIPESSOAL, LDA. (509372813)","689,32 €",11-12-2018,20-01-2018,30 dias,"Portugal, Aveiro, Ovar","Artigo 20.º, n.º 1, alínea d) do Código dos Contratos Públicos",11-12-2018,"689,32 €","","",,Não aplicável.,Não aplicável.,FALSE
49001918-REPARAÇÃO DE EQUIPAMENTOS,Ajuste Direto Regime Geral,Aquisição de serviços,"50000000-5, Serviços de reparação e manutenção",Hospital Dr. Francisco Zagalo - Ovar (501510150),Antonio Cesar Santos Duarte (207266247),"625,00 €",11-12-2018,20-01-2018,30 dias,"Portugal, Aveiro, Ovar","Artigo 20.º, n.º 1, alínea d) do Código dos Contratos Públicos",11-12-2018,"625,00 €","","",,Não aplicável.,Não aplicável.,FALSE
49001918-REPARAÇÃO DE EQUIPAMENTOS,Ajuste Direto Regime Geral,Aquisição de serviços,"50000000-5, Serviços de reparação e manutenção",Hospital Dr. Francisco Zagalo - Ovar (501510150),NOVA ERA -LUCIANO D. DA SILVA (115264540),"2.273,57 €",11-12-2018,20-01-2018,30 dias,"Portugal, Aveiro, Ovar","Artigo 20.º, n.º 1, alínea d) do Código dos Contratos Públicos",11-12-2018,"2.273,57 €","","",,Não aplicável.,Não aplicável.,FALSE
49001918-REPARAÇÃO DE EQUIPAMENTOS,Ajuste Direto Regime Geral,Aquisição de serviços,"50000000-5, Serviços de reparação e manutenção",Hospital Dr. Francisco Zagalo - Ovar (501510150),"IMO - Indústria Metalúrgicas, SA (500136939)","326,25 €",11-12-2018,20-01-2018,30 dias,"Portugal, Aveiro, Ovar","Artigo 20.º, n.º 1, alínea d) do Código dos Contratos Públicos",11-12-2018,"326,25 €","","",,Não aplicável.,Não aplicável.,FALSE
49001918-REPARAÇÃO DE EQUIPAMENTOS,Ajuste Direto Regime Geral,Aquisição de serviços,"50000000-5, Serviços de reparação e manutenção",Hospital Dr. Francisco Zagalo - Ovar (501510150),IRMAOS BRAGA LDA (500363412),"740,00 €",11-12-2018,20-01-2018,30 dias,"Portugal, Aveiro, Ovar","Artigo 20.º, n.º 1, alínea d) do Código dos Contratos Públicos",11-12-2018,"740,00 €","","",,Não aplicável.,Não aplicável.,FALSE
próteses de ortopedia diversas,Consulta Prévia,Aquisição de bens móveis,"33183200-8, Próteses ortopédicas",Hospital Dr. Francisco Zagalo - Ovar (501510150),"MBA PORTUGAL, S.A. (504445960)","8.900,00 €",10-12-2018,01-02-2018,210 dias,"Portugal, Aveiro, Ovar","Artigo 20.º, n.º 1, alínea c) do Código dos Contratos Públicos",28-12-2018,"8.900,00 €","","",,Não aplicável.,Não aplicável.,FALSE
próteses de ortopedia diversas,Consulta Prévia,Aquisição de bens móveis,"33183200-8, Próteses ortopédicas",Hospital Dr. Francisco Zagalo - Ovar (501510150),HERAEUS MEDICAL PORTUGAL LDA (508322227),"500,00 €",10-12-2018,01-02-2018,210 dias,"Portugal, Aveiro, Ovar","Artigo 20.º, n.º 1, alínea c) do Código dos Contratos Públicos",28-12-2018,"500,00 €","","",,Não aplicável.,Não aplicável.,FALSE
próteses de ortopedia diversas,Consulta Prévia,Aquisição de bens móveis,"33183200-8, Próteses ortopédicas",Hospital Dr. Francisco Zagalo - Ovar (501510150),LINEAMEDICA DISPOSITIVOS MEDICO CIRURGICOS SA (505148676),"195,00 €",10-12-2018,01-02-2018,210 dias,"Portugal, Aveiro, Ovar","Artigo 20.º, n.º 1, alínea c) do Código dos Contratos Públicos",28-12-2018,"195,00 €","","",,Não aplicável.,Não aplicável.,FALSE
próteses de ortopedia diversas,Consulta Prévia,Aquisição de bens móveis,"33183200-8, Próteses ortopédicas",Hospital Dr. Francisco Zagalo - Ovar (501510150),ARTUR SALGADO SA (503612600),"58.370,80 €",10-12-2018,01-02-2018,210 dias,"Portugal, Aveiro, Ovar","Artigo 20.º, n.º 1, alínea c) do Código dos Contratos Públicos",28-12-2018,"58.285,00 €","",Aquisição inferior à quantidade prevista,,Não aplicável.,Não aplicável.,FALSE
Material de consumo clínico diverso,Ajuste Direto Regime Geral,Aquisição de bens móveis,"33140000-3, Material médico de consumo",Hospital Dr. Francisco Zagalo - Ovar (501510150),GASIN II GASES INDUSTRIAIS UNIPESSOAL LDA (510183751),"214,16 €",07-12-2018,31-01-2018,330 dias,"Portugal, Aveiro, Ovar","Artigo 20.º, n.º 1, alínea d) do Código dos Contratos Públicos",28-12-2018,"214,16 €","","",,Não aplicável.,Não aplicável.,FALSE
Material de consumo clínico diverso,Ajuste Direto Regime Geral,Aquisição de bens móveis,"33140000-3, Material médico de consumo",Hospital Dr. Francisco Zagalo - Ovar (501510150),lablad (502629703),"2.094,15 €",07-12-2018,31-01-2018,330 dias,"Portugal, Aveiro, Ovar","Artigo 20.º, n.º 1, alínea d) do Código dos Contratos Públicos",28-12-2018,"2.094,15 €","","",,Não aplicável.,Não aplicável.,FALSE
Material de consumo clínico diverso,Ajuste Direto Regime Geral,Aquisição de bens móveis,"33140000-3, Material médico de consumo",Hospital Dr. Francisco Zagalo - Ovar (501510150),LINDE SAUDE SOCIEDADE UNIP LDA (500125546),"1.089,00 €",07-12-2018,31-01-2018,330 dias,"Portugal, Aveiro, Ovar","Artigo 20.º, n.º 1, alínea d) do Código dos Contratos Públicos",28-12-2018,"1.089,00 €","","",,Não aplicável.,Não aplicável.,FALSE
Material de consumo clínico diverso,Ajuste Direto Regime Geral,Aquisição de bens móveis,"33140000-3, Material médico de consumo",Hospital Dr. Francisco Zagalo - Ovar (501510150),"SMITH & NEPHEW, LDA. (503552461)","586,00 €",07-12-2018,31-01-2018,330 dias,"Portugal, Aveiro, Ovar","Artigo 20.º, n.º 1, alínea d) do Código dos Contratos Públicos",28-12-2018,"586,00 €","","",,Não aplicável.,Não aplicável.,FALSE
Material de consumo clínico diverso,Ajuste Direto Regime Geral,Aquisição de bens móveis,"33140000-3, Material médico de consumo",Hospital Dr. Francisco Zagalo - Ovar (501510150),Acail Gás (503789151),"284,80 €",07-12-2018,31-01-2018,330 dias,"Portugal, Aveiro, Ovar","Artigo 20.º, n.º 1, alínea d) do Código dos Contratos Públicos",28-12-2018,"284,80 €","","",,Não aplicável.,Não aplicável.,FALSE
Material de consumo clínico diverso,Ajuste Direto Regime Geral,Aquisição de bens móveis,"33140000-3, Material médico de consumo",Hospital Dr. Francisco Zagalo - Ovar (501510150),VIQUIMICA IMPORTAÇÕES E MANUFACTURAS LDA (500039720),"94,50 €",07-12-2018,31-01-2018,330 dias,"Portugal, Aveiro, Ovar","Artigo 20.º, n.º 1, alínea d) do Código dos Contratos Públicos",28-12-2018,"94,50 €","","",,Não aplicável.,Não aplicável.,FALSE
Material de consumo clínico diverso,Ajuste Direto Regime Geral,Aquisição de bens móveis,"33140000-3, Material médico de consumo",Hospital Dr. Francisco Zagalo - Ovar (501510150),"MALAQUIAS-Distribuição Alimentar, Lda. (500221510)","79,60 €",07-12-2018,31-01-2018,330 dias,"Portugal, Aveiro, Ovar","Artigo 20.º, n.º 1, alínea d) do Código dos Contratos Públicos",28-12-2018,"79,60 €","","",,Não aplicável.,Não aplicável.,FALSE
Hormonas e outros medicamentos usados no tratamento doenças endócrinas,Ao abrigo de acordo-quadro (art.º 259.º),Aquisição de bens móveis,"33652200-7, Medicamentos usados na terapêutica endócrina",Hospital Dr. Francisco Zagalo - Ovar (501510150),DLA Farmacêutica SA (503894427),"17,10 €",07-12-2018,30-11-2017,1080 dias,"Portugal, Aveiro, Ovar",Artigo 259.º do Código dos Contratos Públicos,"","","","",,1415640,CP 2015/7 - ACORDO QUADRO PARA FORNECIMENTO DE HORMONAS E OUTROS MEDICAMENTOS USADOS NO TRATAMENTO DAS DOENÇAS ENDÓCRINAS ÀS INSTITUIÇÕES E SERVIÇOS DO SERVIÇO NACIONAL DE SAÚDE,FALSE
Hormonas e outros medicamentos usados no tratamento doenças endócrinas,Ao abrigo de acordo-quadro (art.º 259.º),Aquisição de bens móveis,"33652200-7, Medicamentos usados na terapêutica endócrina",Hospital Dr. Francisco Zagalo - Ovar (501510150),"GENERIS FARMACÊUTICA, S.A. (508107997)","1.712,88 €",07-12-2018,30-11-2017,1080 dias,"Portugal, Aveiro, Ovar",Artigo 259.º do Código dos Contratos Públicos,"","","","",,1415640,CP 2015/7 - ACORDO QUADRO PARA FORNECIMENTO DE HORMONAS E OUTROS MEDICAMENTOS USADOS NO TRATAMENTO DAS DOENÇAS ENDÓCRINAS ÀS INSTITUIÇÕES E SERVIÇOS DO SERVIÇO NACIONAL DE SAÚDE,FALSE
Hormonas e outros medicamentos usados no tratamento doenças endócrinas,Ao abrigo de acordo-quadro (art.º 259.º),Aquisição de bens móveis,"33652200-7, Medicamentos usados na terapêutica endócrina",Hospital Dr. Francisco Zagalo - Ovar (501510150),SANOFI PRODUTOS FARMACEUTICOS LDA (500134960),"7.689,18 €",07-12-2018,30-11-2017,1080 dias,"Portugal, Aveiro, Ovar",Artigo 259.º do Código dos Contratos Públicos,"","","","",,1415640,CP 2015/7 - ACORDO QUADRO PARA FORNECIMENTO DE HORMONAS E OUTROS MEDICAMENTOS USADOS NO TRATAMENTO DAS DOENÇAS ENDÓCRINAS ÀS INSTITUIÇÕES E SERVIÇOS DO SERVIÇO NACIONAL DE SAÚDE,FALSE
Hormonas e outros medicamentos usados no tratamento doenças endócrinas,Ao abrigo de acordo-quadro (art.º 259.º),Aquisição de bens móveis,"33652200-7, Medicamentos usados na terapêutica endócrina",Hospital Dr. Francisco Zagalo - Ovar (501510150),NOVO NORDISK LDA (501485210),"40,95 €",07-12-2018,30-11-2017,1080 dias,"Portugal, Aveiro, Ovar",Artigo 259.º do Código dos Contratos Públicos,"","","","",,1415640,CP 2015/7 - ACORDO QUADRO PARA FORNECIMENTO DE HORMONAS E OUTROS MEDICAMENTOS USADOS NO TRATAMENTO DAS DOENÇAS ENDÓCRINAS ÀS INSTITUIÇÕES E SERVIÇOS DO SERVIÇO NACIONAL DE SAÚDE,FALSE
Hormonas e outros medicamentos usados no tratamento doenças endócrinas,Ao abrigo de acordo-quadro (art.º 259.º),Aquisição de bens móveis,"33652200-7, Medicamentos usados na terapêutica endócrina",Hospital Dr. Francisco Zagalo - Ovar (501510150),"LILLY PORTUGAL PROD FARMACEUTICOS, LDA (500165602)","476,28 €",07-12-2018,30-11-2017,1080 dias,"Portugal, Aveiro, Ovar",Artigo 259.º do Código dos Contratos Públicos,"","","","",,1415640,CP 2015/7 - ACORDO QUADRO PARA FORNECIMENTO DE HORMONAS E OUTROS MEDICAMENTOS USADOS NO TRATAMENTO DAS DOENÇAS ENDÓCRINAS ÀS INSTITUIÇÕES E SERVIÇOS DO SERVIÇO NACIONAL DE SAÚDE,FALSE
Hormonas e outros medicamentos usados no tratamento doenças endócrinas,Ao abrigo de acordo-quadro (art.º 259.º),Aquisição de bens móveis,"33652200-7, Medicamentos usados na terapêutica endócrina",Hospital Dr. Francisco Zagalo - Ovar (501510150),MERCK SHARP & DOHME LDA (500191360),"38,94 €",07-12-2018,30-11-2017,1080 dias,"Portugal, Aveiro, Ovar",Artigo 259.º do Código dos Contratos Públicos,"","","","",,1415640,CP 2015/7 - ACORDO QUADRO PARA FORNECIMENTO DE HORMONAS E OUTROS MEDICAMENTOS USADOS NO TRATAMENTO DAS DOENÇAS ENDÓCRINAS ÀS INSTITUIÇÕES E SERVIÇOS DO SERVIÇO NACIONAL DE SAÚDE,FALSE
Medicamentos em CHNM,Ajuste Direto Regime Geral,Aquisição de bens móveis,"33600000-6, Produtos farmacêuticos",Hospital Dr. Francisco Zagalo - Ovar (501510150),"LABORATÓRIOS URGO, S.L.U. (B-83608604)","765,74 €",07-12-2018,31-01-2018,360 dias,"Portugal, Aveiro, Ovar","Artigo 21.º, n.º 1, alínea c) do Código dos Contratos Públicos","","","","",,Não aplicável.,Não aplicável.,FALSE
42000518 - AQUISIÇÃO MATERIAL PENSO,Ajuste Direto Regime Geral,Aquisição de bens móveis,"33140000-3, Material médico de consumo",Hospital Dr. Francisco Zagalo - Ovar (501510150),"Dimor Lusitânia, Lda. (500730741)","122,00 €",06-12-2018,30-01-2018,360 dias,"Portugal, Aveiro, Ovar","Artigo 20.º, n.º 1, alínea d) do Código dos Contratos Públicos",28-12-2018,"158,25 €","",Aquisição superior à quantidade prevista,,Não aplicável.,Não aplicável.,FALSE
42000518 - AQUISIÇÃO MATERIAL PENSO,Ajuste Direto Regime Geral,Aquisição de bens móveis,"33140000-3, Material médico de consumo",Hospital Dr. Francisco Zagalo - Ovar (501510150),"MICRO MEDICA EQUIPAMENTOS  MEDICOS HOSPIT., LDA (501904956)","388,00 €",06-12-2018,30-01-2018,360 dias,"Portugal, Aveiro, Ovar","Artigo 20.º, n.º 1, alínea d) do Código dos Contratos Públicos",28-12-2018,"388,00 €","","",,Não aplicável.,Não aplicável.,FALSE
47000118-Equipamento de Hardware-Discos,Ajuste Direto Regime Geral,Sociedade<br/>Aquisição de bens móveis,"30200000-1, Equipamento e material informático",Hospital Dr. Francisco Zagalo (501510150),"MAINCAPITAL-INFRASTRUCTURES & MANAGED SERVICES, SA (510093833)","1.450,00 €",06-12-2018,30-01-2018,30 dias,"Portugal, Aveiro, Ovar","Artigo 20.º, n.º 1, alínea d) do Código dos Contratos Públicos","","","","",,Não aplicável.,Não aplicável.,FALSE
Medicamentos sem CHNM,Ajuste Direto Regime Geral,Aquisição de bens móveis,"33600000-6, Produtos farmacêuticos",Hospital Dr. Francisco Zagalo - Ovar (501510150),"BIOTORAX, LDA (508761913)","117,80 €",06-12-2018,31-01-2018,360 dias,"Portugal, Aveiro, Ovar","Artigo 21.º, n.º 1, alínea c) do Código dos Contratos Públicos","","","","",,Não aplicável.,Não aplicável.,FALSE
Medicamentos sem CHNM,Ajuste Direto Regime Geral,Aquisição de bens móveis,"33600000-6, Produtos farmacêuticos",Hospital Dr. Francisco Zagalo - Ovar (501510150),"KVTECH Portugal- Produtos Médicos Unipessoal, Lda (508671531)","548,20 €",06-12-2018,31-01-2018,360 dias,"Portugal, Aveiro, Ovar","Artigo 21.º, n.º 1, alínea c) do Código dos Contratos Públicos","","","","",,Não aplicável.,Não aplicável.,FALSE
Medicamentos sem CHNM,Ajuste Direto Regime Geral,Aquisição de bens móveis,"33600000-6, Produtos farmacêuticos",Hospital Dr. Francisco Zagalo - Ovar (501510150),MEDICINALIA CORMEDICA LDA (500684324),"536,00 €",06-12-2018,31-01-2018,360 dias,"Portugal, Aveiro, Ovar","Artigo 21.º, n.º 1, alínea c) do Código dos Contratos Públicos","","","","",,Não aplicável.,Não aplicável.,FALSE
Medicamentos sem CHNM,Ajuste Direto Regime Geral,Aquisição de bens móveis,"33600000-6, Produtos farmacêuticos",Hospital Dr. Francisco Zagalo - Ovar (501510150),OVERPHARMA PROD MEDICOS FARMACEUTICOS (505792362),"76,39 €",06-12-2018,31-01-2018,360 dias,"Portugal, Aveiro, Ovar","Artigo 21.º, n.º 1, alínea c) do Código dos Contratos Públicos","","","","",,Não aplicável.,Não aplicável.,FALSE
Medicamentos sem CHNM,Ajuste Direto Regime Geral,Aquisição de bens móveis,"33600000-6, Produtos farmacêuticos",Hospital Dr. Francisco Zagalo - Ovar (501510150),"PROCLINICA-Equipamentos e Produtos Clínicos, Lda (500222665)","1.300,00 €",06-12-2018,31-01-2018,360 dias,"Portugal, Aveiro, Ovar","Artigo 21.º, n.º 1, alínea c) do Código dos Contratos Públicos","","","","",,Não aplicável.,Não aplicável.,FALSE
Medicamentos sem CHNM,Ajuste Direto Regime Geral,Aquisição de bens móveis,"33600000-6, Produtos farmacêuticos",Hospital Dr. Francisco Zagalo - Ovar (501510150),SMITH E NEPHEW LDA (503552461),"905,28 €",06-12-2018,31-01-2018,360 dias,"Portugal, Aveiro, Ovar","Artigo 21.º, n.º 1, alínea c) do Código dos Contratos Públicos","","","","",,Não aplicável.,Não aplicável.,FALSE
Medicamentos sem CHNM,Ajuste Direto Regime Geral,Aquisição de bens móveis,"33600000-6, Produtos farmacêuticos",Hospital Dr. Francisco Zagalo - Ovar (501510150),JMV PRODUTOS HOSPITALARES (501887148),"1.263,20 €",06-12-2018,31-01-2018,360 dias,"Portugal, Aveiro, Ovar","Artigo 21.º, n.º 1, alínea c) do Código dos Contratos Públicos","","","","",,Não aplicável.,Não aplicável.,FALSE
Medicamentos sem CHNM,Ajuste Direto Regime Geral,Aquisição de bens móveis,"33600000-6, Produtos farmacêuticos",Hospital Dr. Francisco Zagalo - Ovar (501510150),B BRAUN MEDICAL LDA (501506543),"310,60 €",06-12-2018,31-01-2018,360 dias,"Portugal, Aveiro, Ovar","Artigo 21.º, n.º 1, alínea c) do Código dos Contratos Públicos","","","","",,Não aplicável.,Não aplicável.,FALSE
Medicamentos sem CHNM,Ajuste Direto Regime Geral,Aquisição de bens móveis,"33600000-6, Produtos farmacêuticos",Hospital Dr. Francisco Zagalo - Ovar (501510150),MOLNLYCKE HEALTH CARE LDA (511101066),"2.530,10 €",06-12-2018,31-01-2018,360 dias,"Portugal, Aveiro, Ovar","Artigo 21.º, n.º 1, alínea c) do Código dos Contratos Públicos","","","","",,Não aplicável.,Não aplicável.,FALSE
Medicamentos sem CHNM,Ajuste Direto Regime Geral,Aquisição de bens móveis,"33600000-6, Produtos farmacêuticos",Hospital Dr. Francisco Zagalo - Ovar (501510150),BASTOS E VIEGAS SA (500042772),"479,04 €",06-12-2018,31-01-2018,360 dias,"Portugal, Aveiro, Ovar","Artigo 21.º, n.º 1, alínea c) do Código dos Contratos Públicos","","","","",,Não aplicável.,Não aplicável.,FALSE
47001118-EQUIPAMENTO INFORMATICO - SERVIDORES,Ajuste Direto Regime Geral,Aquisição de bens móveis,"30000000-9, Máquinas, equipamento e material de escritório e de informática, excepto mobiliário e pacotes de programas (software)",Hospital Dr. Francisco Zagalo - Ovar (501510150),"INFORLANDIA, S.A. (502425296)","7.456,00 €",06-12-2018,17-08-2018,30 dias,"Portugal, Aveiro, Ovar","Artigo 20.º, n.º 1, alínea d) do Código dos Contratos Públicos",31-10-2018,"7.456,00 €","","",,Não aplicável.,Não aplicável.,FALSE
Medicamentos sem CHNM,Ajuste Direto Regime Geral,Aquisição de bens móveis,"33600000-6, Produtos farmacêuticos",Hospital Dr. Francisco Zagalo - Ovar (501510150),"LABORATÓRIOS INIBSA, S.A. (500139571)","141,36 €",06-12-2018,31-01-2018,360 dias,"Portugal, Aveiro, Ovar","Artigo 21.º, n.º 1, alínea c) do Código dos Contratos Públicos","","","","",,Não aplicável.,Não aplicável.,FALSE
42000418 - AQUISIÇÃO MATERIAL CONSUMO CLINICO - 22,Ajuste Direto Regime Geral,Aquisição de bens móveis,"33141121-4, Suturas cirúrgicas",Hospital Dr. Francisco Zagalo - Ovar (501510150),MEDICINÁLIA CORMEDICA (500684324),"972,00 €",06-12-2018,01-02-2018,330 dias,"Portugal, Aveiro, Ovar","Artigo 20.º, n.º 1, alínea d) do Código dos Contratos Públicos",28-12-2018,"302,00 €","",Aquisição inferior às quantidades previstas,,Não aplicável.,Não aplicável.,FALSE
42000418 - AQUISIÇÃO MATERIAL CONSUMO CLINICO - 22,Ajuste Direto Regime Geral,Aquisição de bens móveis,"33141121-4, Suturas cirúrgicas",Hospital Dr. Francisco Zagalo - Ovar (501510150),"J.M.V. - Produtos Hospitalares, Lda (501887148)","2.160,00 €",06-12-2018,01-02-2018,330 dias,"Portugal, Aveiro, Ovar","Artigo 20.º, n.º 1, alínea d) do Código dos Contratos Públicos",28-12-2018,"1.620,00 €","",Aquisição inferior às quantidades previstas,,Não aplicável.,Não aplicável.,FALSE
Medicamentos sem CHNM,Ajuste Direto Regime Geral,Aquisição de bens móveis,"33600000-6, Produtos farmacêuticos",Hospital Dr. Francisco Zagalo - Ovar (501510150),JOHNSON & JOHNSON LDA (500153370),"701,49 €",06-12-2018,31-01-2018,360 dias,"Portugal, Aveiro, Ovar","Artigo 21.º, n.º 1, alínea c) do Código dos Contratos Públicos","","","","",,Não aplicável.,Não aplicável.,FALSE
Medicamentos sem CHNM,Ajuste Direto Regime Geral,Aquisição de bens móveis,"33600000-6, Produtos farmacêuticos",Hospital Dr. Francisco Zagalo - Ovar (501510150),VYGON LDA (503232785),"736,50 €",06-12-2018,31-01-2018,360 dias,"Portugal, Aveiro, Ovar","Artigo 21.º, n.º 1, alínea c) do Código dos Contratos Públicos","","","","",,Não aplicável.,Não aplicável.,FALSE
42000418 - AQUISIÇÃO MATERIAL CONSUMO CLINICO - 22,Ajuste Direto Regime Geral,Aquisição de bens móveis,"33141121-4, Suturas cirúrgicas",Hospital Dr. Francisco Zagalo - Ovar (501510150),"B BRAUN MEDICAL, LDA. (501506543)","11.344,53 €",06-12-2018,01-02-2018,330 dias,"Portugal, Aveiro, Ovar","Artigo 20.º, n.º 1, alínea d) do Código dos Contratos Públicos",28-12-2018,"11.550,54 €","",Aquisição superior às quantidades previstas,,Não aplicável.,Não aplicável.,FALSE
Hormonas e outros medicamentos usados em doenças endócrinas,Ao abrigo de acordo-quadro (art.º 259.º),Aquisição de bens móveis,"33652200-7, Medicamentos usados na terapêutica endócrina",Hospital Dr. Francisco Zagalo - Ovar (501510150),LABORATORIOS PFIZER LDA (500162166),"1.525,41 €",06-12-2018,30-11-2017,1080 dias,"Portugal, Aveiro, Ovar",Artigo 259.º do Código dos Contratos Públicos,"","","","",,1415640,CP 2015/7 - ACORDO QUADRO PARA FORNECIMENTO DE HORMONAS E OUTROS MEDICAMENTOS USADOS NO TRATAMENTO DAS DOENÇAS ENDÓCRINAS ÀS INSTITUIÇÕES E SERVIÇOS DO SERVIÇO NACIONAL DE SAÚDE,FALSE
42000418 - AQUISIÇÃO MATERIAL CONSUMO CLINICO - 22,Ajuste Direto Regime Geral,Aquisição de bens móveis,"33141121-4, Suturas cirúrgicas",Hospital Dr. Francisco Zagalo - Ovar (501510150),"HR Hospitalar, Lda. (501895558)","550,56 €",06-12-2018,01-02-2018,330 dias,"Portugal, Aveiro, Ovar","Artigo 20.º, n.º 1, alínea d) do Código dos Contratos Públicos",28-12-2018,"129,72 €","",Aquisição inferior às quantidades previstas,,Não aplicável.,Não aplicável.,FALSE
42000418 - AQUISIÇÃO MATERIAL CONSUMO CLINICO - 22,Ajuste Direto Regime Geral,Aquisição de bens móveis,"33141121-4, Suturas cirúrgicas",Hospital Dr. Francisco Zagalo - Ovar (501510150),"JOHNSON  & JOHNSON, Lda. (500153370)","295,80 €",06-12-2018,01-02-2018,330 dias,"Portugal, Aveiro, Ovar","Artigo 20.º, n.º 1, alínea d) do Código dos Contratos Públicos",28-12-2018,"59,16 €","",Aquisição inferior às quantidades previstas,,Não aplicável.,Não aplicável.,FALSE
Hormonas e outros medicamentos usados em doenças endócrinas,Ao abrigo de acordo-quadro (art.º 259.º),Aquisição de bens móveis,"33652200-7, Medicamentos usados na terapêutica endócrina",Hospital Dr. Francisco Zagalo - Ovar (501510150),"Labesfal, Laboratorios Almiro SA (501169580)","313,05 €",06-12-2018,30-11-2017,1080 dias,"Portugal, Aveiro, Ovar",Artigo 259.º do Código dos Contratos Públicos,"","","","",,1415640,CP 2015/7 - ACORDO QUADRO PARA FORNECIMENTO DE HORMONAS E OUTROS MEDICAMENTOS USADOS NO TRATAMENTO DAS DOENÇAS ENDÓCRINAS ÀS INSTITUIÇÕES E SERVIÇOS DO SERVIÇO NACIONAL DE SAÚDE,FALSE
Medicamentos SN Cerebroespinal: exceto anestésicos e relaxantes musculares,Ao abrigo de acordo-quadro (art.º 259.º),Aquisição de bens móveis,"33661000-1, Medicamentos para o sistema nervoso",Hospital Dr. Francisco Zagalo - Ovar (501510150),PHARMAKERN PORTUGAL-PROD. FARMACEUTICOS (507002571),"531,30 €",06-12-2018,30-11-2017,1080 dias,"Portugal, Aveiro, Ovar",Artigo 259.º do Código dos Contratos Públicos,"","","","",,2528670,"CP 2017/2 - Acordo Quadro para fornecimento de Medicamentos do Sistema Nervoso Cerebrospinal, exceto: anestésicos, relaxantes musculares, analgésicos, antipiréticos, antidepressivos e antipsicóticos  às Instituições e Serviços do Serviço Nacional de Saúde",FALSE
Medicamentos SN Cerebroespinal: exceto anestésicos e relaxantes musculares,Ao abrigo de acordo-quadro (art.º 259.º),Aquisição de bens móveis,"33661000-1, Medicamentos para o sistema nervoso",Hospital Dr. Francisco Zagalo - Ovar (501510150),"ACCORD HEALTHCARE, UNIPESSOAL LDA (508622263)","21,60 €",06-12-2018,30-11-2017,1080 dias,"Portugal, Aveiro, Ovar",Artigo 259.º do Código dos Contratos Públicos,"","","","",,2528670,"CP 2017/2 - Acordo Quadro para fornecimento de Medicamentos do Sistema Nervoso Cerebrospinal, exceto: anestésicos, relaxantes musculares, analgésicos, antipiréticos, antidepressivos e antipsicóticos  às Instituições e Serviços do Serviço Nacional de Saúde",FALSE
Medicamentos SN Cerebroespinal: exceto anestésicos e relaxantes musculares,Ao abrigo de acordo-quadro (art.º 259.º),Aquisição de bens móveis,"33661000-1, Medicamentos para o sistema nervoso",Hospital Dr. Francisco Zagalo - Ovar (501510150),"GENERIS FARMACÊUTICA, S.A. (508107997)","1.109,16 €",06-12-2018,30-11-2017,1080 dias,"Portugal, Aveiro, Ovar",Artigo 259.º do Código dos Contratos Públicos,"","","","",,2528670,"CP 2017/2 - Acordo Quadro para fornecimento de Medicamentos do Sistema Nervoso Cerebrospinal, exceto: anestésicos, relaxantes musculares, analgésicos, antipiréticos, antidepressivos e antipsicóticos  às Instituições e Serviços do Serviço Nacional de Saúde",FALSE
Medicamentos SN Cerebroespinal: exceto anestésicos e relaxantes musculares,Ao abrigo de acordo-quadro (art.º 259.º),Aquisição de bens móveis,"33661000-1, Medicamentos para o sistema nervoso",Hospital Dr. Francisco Zagalo - Ovar (501510150),"TEVA PHARMA-Prod.Farmacêuticos, Lda (507045491)","183,60 €",06-12-2018,30-11-2017,1080 dias,"Portugal, Aveiro, Ovar",Artigo 259.º do Código dos Contratos Públicos,"","","","",,2528670,"CP 2017/2 - Acordo Quadro para fornecimento de Medicamentos do Sistema Nervoso Cerebrospinal, exceto: anestésicos, relaxantes musculares, analgésicos, antipiréticos, antidepressivos e antipsicóticos  às Instituições e Serviços do Serviço Nacional de Saúde",FALSE
Medicamentos SN Cerebroespinal: exceto anestésicos e relaxantes musculares,Ao abrigo de acordo-quadro (art.º 259.º),Aquisição de bens móveis,"33661000-1, Medicamentos para o sistema nervoso",Hospital Dr. Francisco Zagalo - Ovar (501510150),RATIOPHARM (502414910),"237,63 €",06-12-2018,30-11-2017,1080 dias,"Portugal, Aveiro, Ovar",Artigo 259.º do Código dos Contratos Públicos,"","","","",,2528670,"CP 2017/2 - Acordo Quadro para fornecimento de Medicamentos do Sistema Nervoso Cerebrospinal, exceto: anestésicos, relaxantes musculares, analgésicos, antipiréticos, antidepressivos e antipsicóticos  às Instituições e Serviços do Serviço Nacional de Saúde",FALSE
42000417 - AQUISIÇÃO MATERIAL OFTALMOLOGIA,Ajuste Direto Regime Geral,Aquisição de bens móveis,"33730000-6, Produtos para o cuidado dos olhos e lentes de correcção",Hospital Dr. Francisco Zagalo - Ovar (501510150),BAUSCH  LOMB (980218764),"10.000,00 €",06-12-2018,28-12-2017,720 dias,"Portugal, Aveiro, Ovar","Artigo 24.º, n.º 1, alínea e) do Código dos Contratos Públicos",28-12-2018,"8.920,00 €","",Aquisição inferior às quantidades previstas,,Não aplicável.,Não aplicável.,FALSE
47002117-AQUISIÇAÕ DE IMPLEMENTAÇÃO DE SOFTWAREP/MONITORIZ. CONTRATUAL. INTERNA,Ajuste Direto Regime Geral,Aquisição de bens móveis,"48330000-0, Pacote de software para gestão de tarefas e produtividade",Hospital Dr. Francisco Zagalo (501510150),"Prológica - Sistemas Informáticos, SA (501432507)","3.000,00 €",06-12-2018,06-12-2017,150 dias,"Portugal, Aveiro, Ovar","Artigo 20.º, n.º 1, alínea a) do Código dos Contratos Públicos",31-05-2018,"3.000,00 €","","",,Não aplicável.,Não aplicável.,FALSE
Medicamentos SN Cerebroespinal: exceto anestésicos e relaxantes musculares,Ao abrigo de acordo-quadro (art.º 259.º),Aquisição de bens móveis,"33661000-1, Medicamentos para o sistema nervoso",Hospital Dr. Francisco Zagalo - Ovar (501510150),HIKMA FARMACEUTICA PORTUGAL (502266791),"325,68 €",06-12-2018,30-11-2017,1080 dias,"Portugal, Aveiro, Ovar",Artigo 259.º do Código dos Contratos Públicos,"","","","",,2528670,"CP 2017/2 - Acordo Quadro para fornecimento de Medicamentos do Sistema Nervoso Cerebrospinal, exceto: anestésicos, relaxantes musculares, analgésicos, antipiréticos, antidepressivos e antipsicóticos  às Instituições e Serviços do Serviço Nacional de Saúde",FALSE
42000318 - AQUISIÇÃO SISTEMAS ALIMENTAÇÃO,Ajuste Direto Regime Geral,Aquisição de bens móveis,"33194120-3, Material de infusão",Hospital Dr. Francisco Zagalo - Ovar (501510150),"Nutricia Advanced Medical Nutrition Unipessoal, Lda (507558286)","2.388,00 €",06-12-2018,30-01-2018,360 dias,"Portugal, Aveiro, Ovar","Artigo 20.º, n.º 1, alínea d) do Código dos Contratos Públicos",28-12-2018,"2.163,00 €","",Aquisição inferior à quantidade prevista,,Não aplicável.,Não aplicável.,FALSE
Medicamentos SN Cerebroespinal: exceto anestésicos e relaxantes musculares,Ao abrigo de acordo-quadro (art.º 259.º),Aquisição de bens móveis,"33661000-1, Medicamentos para o sistema nervoso",Hospital Dr. Francisco Zagalo - Ovar (501510150),LABORATORIO MEDINFAR (500384045),"32,67 €",06-12-2018,30-11-2017,1080 dias,"Portugal, Aveiro, Ovar",Artigo 259.º do Código dos Contratos Públicos,"","","","",,2528670,"CP 2017/2 - Acordo Quadro para fornecimento de Medicamentos do Sistema Nervoso Cerebrospinal, exceto: anestésicos, relaxantes musculares, analgésicos, antipiréticos, antidepressivos e antipsicóticos  às Instituições e Serviços do Serviço Nacional de Saúde",FALSE
Medicamentos SN Cerebroespinal: exceto anestésicos e relaxantes musculares,Ao abrigo de acordo-quadro (art.º 259.º),Aquisição de bens móveis,"33661000-1, Medicamentos para o sistema nervoso",Hospital Dr. Francisco Zagalo - Ovar (501510150),ROCHE FARMACEUTICA QUIMICA LDA (500233810),"22,44 €",06-12-2018,30-11-2017,1080 dias,"Portugal, Aveiro, Ovar",Artigo 259.º do Código dos Contratos Públicos,"","","","",,2528670,"CP 2017/2 - Acordo Quadro para fornecimento de Medicamentos do Sistema Nervoso Cerebrospinal, exceto: anestésicos, relaxantes musculares, analgésicos, antipiréticos, antidepressivos e antipsicóticos  às Instituições e Serviços do Serviço Nacional de Saúde",FALSE
Medicamentos SN Cerebroespinal: exceto anestésicos e relaxantes musculares,Ao abrigo de acordo-quadro (art.º 259.º),Aquisição de bens móveis,"33661000-1, Medicamentos para o sistema nervoso",Hospital Dr. Francisco Zagalo - Ovar (501510150),MERCK SHARP & DOHME LDA (500191360),"445,35 €",06-12-2018,30-11-2017,1080 dias,"Portugal, Aveiro, Ovar",Artigo 259.º do Código dos Contratos Públicos,"","","","",,2528670,"CP 2017/2 - Acordo Quadro para fornecimento de Medicamentos do Sistema Nervoso Cerebrospinal, exceto: anestésicos, relaxantes musculares, analgésicos, antipiréticos, antidepressivos e antipsicóticos  às Instituições e Serviços do Serviço Nacional de Saúde",FALSE
Medicamentos SN Cerebroespinal: exceto anestésicos e relaxantes musculares,Ao abrigo de acordo-quadro (art.º 259.º),Aquisição de bens móveis,"33661000-1, Medicamentos para o sistema nervoso",Hospital Dr. Francisco Zagalo - Ovar (501510150),GLAXO SMITHKLINE PROD FARMACEUTICOS (500139962),"7,56 €",06-12-2018,30-11-2017,1080 dias,"Portugal, Aveiro, Ovar",Artigo 259.º do Código dos Contratos Públicos,"","","","",,2528670,"CP 2017/2 - Acordo Quadro para fornecimento de Medicamentos do Sistema Nervoso Cerebrospinal, exceto: anestésicos, relaxantes musculares, analgésicos, antipiréticos, antidepressivos e antipsicóticos  às Instituições e Serviços do Serviço Nacional de Saúde",FALSE
Medicamentos SN Cerebroespinal: exceto anestésicos e relaxantes musculares,Ao abrigo de acordo-quadro (art.º 259.º),Aquisição de bens móveis,"33661000-1, Medicamentos para o sistema nervoso",Hospital Dr. Francisco Zagalo - Ovar (501510150),"Labesfal, Laboratorios Almiro SA (501169580)","2.469,15 €",06-12-2018,30-11-2017,1080 dias,"Portugal, Aveiro, Ovar",Artigo 259.º do Código dos Contratos Públicos,"","","","",,2528670,"CP 2017/2 - Acordo Quadro para fornecimento de Medicamentos do Sistema Nervoso Cerebrospinal, exceto: anestésicos, relaxantes musculares, analgésicos, antipiréticos, antidepressivos e antipsicóticos  às Instituições e Serviços do Serviço Nacional de Saúde",FALSE
Medicamentos SN Cerebroespina: exceto anestésicos e relaxantes musculares,Ao abrigo de acordo-quadro (art.º 259.º),Aquisição de bens móveis,"33661000-1, Medicamentos para o sistema nervoso",Hospital Dr. Francisco Zagalo - Ovar (501510150),NOVARTIS FARMA (500063524),"32,01 €",06-12-2018,30-11-2017,1080 dias,"Portugal, Aveiro, Ovar",Artigo 259.º do Código dos Contratos Públicos,"","","","",,2528670,"CP 2017/2 - Acordo Quadro para fornecimento de Medicamentos do Sistema Nervoso Cerebrospinal, exceto: anestésicos, relaxantes musculares, analgésicos, antipiréticos, antidepressivos e antipsicóticos  às Instituições e Serviços do Serviço Nacional de Saúde",FALSE
47002217-EMPREITADA-REVESTIMENTO E PAVIMENTO VINIL,Ajuste Direto Regime Geral,Empreitadas de obras públicas,"45200000-9, Obras de construção total ou parcial e de engenharia civil",Hospital Dr. Francisco Zagalo (501510150),"Constrovar, Lda (504314629)","3.459,00 €",06-12-2018,14-12-2017,120 dias,"Portugal, Aveiro, Ovar","Artigo 19.º, alínea a) do Código dos Contratos Públicos","","3.459,00 €",nao,"",,Não aplicável.,Não aplicável.,FALSE
Medicamentos do Aparelho Geniturinário,Ajuste Direto Regime Geral,Aquisição de bens móveis,"33640000-8, Medicamentos para o aparelho geniturinário e hormonas",Hospital Dr. Francisco Zagalo - Ovar (501510150),OVERPHARMA PROD MEDICOS FARMACEUTICOS (505792362),"248,25 €",06-12-2018,22-01-2018,360 dias,"Portugal, Aveiro, Ovar","Artigo 20.º, n.º 1, alínea a) do Código dos Contratos Públicos","","","","",,Não aplicável.,Não aplicável.,FALSE
PAGAMENTO DE PENSÕES VITALICIAS,Ajuste Direto Regime Geral,Aquisição de serviços,"75320000-5, Regimes de pensões dos funcionários públicos",Hospital Dr. Francisco Zagalo - Ovar (501510150),Caixa Geral de Aposentações (500792968),"3.385,57 €",06-12-2018,21-02-2018,360 dias,"Portugal, Aveiro, Ovar","Artigo 27.º, n.º 1, alínea b) do Código dos Contratos Públicos",06-12-2018,"3.385,57 €","","",,Não aplicável.,Não aplicável.,FALSE
Medicamentos do Aparelho Geniturinário,Ajuste Direto Regime Geral,Aquisição de bens móveis,"33640000-8, Medicamentos para o aparelho geniturinário e hormonas",Hospital Dr. Francisco Zagalo - Ovar (501510150),FARMOZ SA DIVISAO HOSPITALAR (501505334),"4,08 €",06-12-2018,22-01-2018,360 dias,"Portugal, Aveiro, Ovar","Artigo 20.º, n.º 1, alínea a) do Código dos Contratos Públicos","","","","",,Não aplicável.,Não aplicável.,FALSE
42000218 - MATERIAL P/ ORTOPEDIA,Ajuste Direto Regime Geral,Aquisição de bens móveis,"33141770-8, Alfinetes, placas e material para fracturas",Hospital Dr. Francisco Zagalo - Ovar (501510150),"MBA PORTUGAL, S.A. (504445960)","1.100,00 €",06-12-2018,30-01-2018,360 dias,"Portugal, Aveiro, Ovar","Artigo 21.º, n.º 1, alínea c) do Código dos Contratos Públicos",30-11-2018,"1.100,00 €","","",,Não aplicável.,Não aplicável.,FALSE
42000218 - MATERIAL P/ ORTOPEDIA,Ajuste Direto Regime Geral,Aquisição de bens móveis,"33141770-8, Alfinetes, placas e material para fracturas",Hospital Dr. Francisco Zagalo - Ovar (501510150),Grupo MUC/BONECARE (505899914),"974,00 €",06-12-2018,30-01-2018,360 dias,"Portugal, Aveiro, Ovar","Artigo 21.º, n.º 1, alínea c) do Código dos Contratos Públicos",30-11-2018,"974,00 €","","",,Não aplicável.,Não aplicável.,FALSE
Medicamentos do Aparelho Geniturinário,Ajuste Direto Regime Geral,Aquisição de bens móveis,"33640000-8, Medicamentos para o aparelho geniturinário e hormonas",Hospital Dr. Francisco Zagalo - Ovar (501510150),SANOFI PRODUTOS FARMACEUTICOS LDA (500134960),"90,36 €",06-12-2018,22-01-2018,360 dias,"Portugal, Aveiro, Ovar","Artigo 20.º, n.º 1, alínea a) do Código dos Contratos Públicos","","","","",,Não aplicável.,Não aplicável.,FALSE
42000218 - MATERIAL P/ ORTOPEDIA,Ajuste Direto Regime Geral,Aquisição de bens móveis,"33141770-8, Alfinetes, placas e material para fracturas",Hospital Dr. Francisco Zagalo - Ovar (501510150),"PHO - PRODUTOS HOSPITALARES P/ ORTOPEDIA, LDA. (504980580)","5.345,40 €",06-12-2018,30-01-2018,360 dias,"Portugal, Aveiro, Ovar","Artigo 21.º, n.º 1, alínea c) do Código dos Contratos Públicos",30-11-2018,"5.345,40 €","","",,Não aplicável.,Não aplicável.,FALSE
42000218 - MATERIAL P/ ORTOPEDIA,Ajuste Direto Regime Geral,Aquisição de bens móveis,"33141770-8, Alfinetes, placas e material para fracturas",Hospital Dr. Francisco Zagalo - Ovar (501510150),"STRYKER PORTUGAL - PRODUTOS MEDICOS, UNIPESSOAL,LDA. (504594214)","1.446,66 €",06-12-2018,30-01-2018,360 dias,"Portugal, Aveiro, Ovar","Artigo 21.º, n.º 1, alínea c) do Código dos Contratos Públicos",30-11-2018,"1.446,66 €","","",,Não aplicável.,Não aplicável.,FALSE
Medicamentos do Aparelho Geniturinário,Ajuste Direto Regime Geral,Aquisição de bens móveis,"33640000-8, Medicamentos para o aparelho geniturinário e hormonas",Hospital Dr. Francisco Zagalo - Ovar (501510150),JABA RECORDATI SA (500492867),"129,01 €",06-12-2018,22-01-2018,360 dias,"Portugal, Aveiro, Ovar","Artigo 20.º, n.º 1, alínea a) do Código dos Contratos Públicos","","","","",,Não aplicável.,Não aplicável.,FALSE
42000218 - MATERIAL P/ ORTOPEDIA,Ajuste Direto Regime Geral,Aquisição de bens móveis,"33141770-8, Alfinetes, placas e material para fracturas",Hospital Dr. Francisco Zagalo - Ovar (501510150),"SMITH & NEPHEW, LDA. (503552461)","1.848,00 €",06-12-2018,30-01-2018,360 dias,"Portugal, Aveiro, Ovar","Artigo 21.º, n.º 1, alínea c) do Código dos Contratos Públicos",30-11-2018,"1.848,00 €","","",,Não aplicável.,Não aplicável.,FALSE
42000317 - AQUISIÇÃO LENTES P/ OFTALMOLOGIA,Ajuste Direto Regime Geral,Aquisição de bens móveis,"33731110-7, Lentes intraoculares",Hospital Dr. Francisco Zagalo - Ovar (501510150),BAUSCH  LOMB (980218764),"5.692,00 €",06-12-2018,28-12-2017,720 dias,"Portugal, Aveiro, Ovar","Artigo 24.º, n.º 1, alínea e) do Código dos Contratos Públicos",28-12-2018,"4.187,00 €","",Aquisição inferior às previsões,,Não aplicável.,Não aplicável.,FALSE
42000217 - AQUISIÇÃO SISTEMAS ALIMENTAÇÃO,Ajuste Direto Regime Geral,Aquisição de bens móveis,"33194120-3, Material de infusão",Hospital Dr. Francisco Zagalo - Ovar (501510150),"Nutricia Advanced Medical Nutrition Unipessoal, Lda (507558286)","2.232,47 €",06-12-2018,28-12-2017,720 dias,"Portugal, Aveiro, Ovar","Artigo 24.º, n.º 1, alínea e) do Código dos Contratos Públicos",28-12-2018,"800,73 €","",Aquisição inferior ao previsto,,Não aplicável.,Não aplicável.,FALSE
42000117 - AQUISIÇÃO ALGALIAS TUBOS E SONDAS,Ajuste Direto Regime Geral,Aquisição de bens móveis,"33141600-6, Tubos e sacos de drenagem e respectivos kits",Hospital Dr. Francisco Zagalo - Ovar (501510150),"TELEFLEX MEDICAL, S.A. (980249783)","500,00 €",06-12-2018,28-12-2017,720 dias,"Portugal, Aveiro, Ovar","Artigo 20.º, n.º 1, alínea a) do Código dos Contratos Públicos","","","","",,Não aplicável.,Não aplicável.,FALSE
42000117 - AQUISIÇÃO ALGALIAS TUBOS E SONDAS,Ajuste Direto Regime Geral,Aquisição de bens móveis,"33141600-6, Tubos e sacos de drenagem e respectivos kits",Hospital Dr. Francisco Zagalo - Ovar (501510150),MEDTRONIC PORTUGAL LDA (504223933),"500,00 €",06-12-2018,28-12-2017,720 dias,"Portugal, Aveiro, Ovar","Artigo 20.º, n.º 1, alínea a) do Código dos Contratos Públicos","","","","",,Não aplicável.,Não aplicável.,FALSE
42000117 - AQUISIÇÃO ALGALIAS TUBOS E SONDAS,Ajuste Direto Regime Geral,Aquisição de bens móveis,"33141600-6, Tubos e sacos de drenagem e respectivos kits",Hospital Dr. Francisco Zagalo - Ovar (501510150),"INTERSURGICAL PORTUGAL, LDA (503480045)","2.000,00 €",06-12-2018,28-12-2017,720 dias,"Portugal, Aveiro, Ovar","Artigo 20.º, n.º 1, alínea a) do Código dos Contratos Públicos","","","","",,Não aplicável.,Não aplicável.,FALSE
42000117 - AQUISIÇÃO ALGALIAS TUBOS E SONDAS,Ajuste Direto Regime Geral,Aquisição de bens móveis,"33141600-6, Tubos e sacos de drenagem e respectivos kits",Hospital Dr. Francisco Zagalo - Ovar (501510150),"B BRAUN MEDICAL, LDA. (501506543)","200,00 €",06-12-2018,28-12-2017,720 dias,"Portugal, Aveiro, Ovar","Artigo 20.º, n.º 1, alínea a) do Código dos Contratos Públicos","","","","",,Não aplicável.,Não aplicável.,FALSE
42000117 - AQUISIÇÃO ALGALIAS TUBOS E SONDAS,Ajuste Direto Regime Geral,Aquisição de bens móveis,"33141600-6, Tubos e sacos de drenagem e respectivos kits",Hospital Dr. Francisco Zagalo - Ovar (501510150),"C.R. BARD PORTUGAL, LDA (502438274)","300,00 €",06-12-2018,28-12-2017,720 dias,"Portugal, Aveiro, Ovar","Artigo 20.º, n.º 1, alínea a) do Código dos Contratos Públicos","","","","",,Não aplicável.,Não aplicável.,FALSE
42000117 - AQUISIÇÃO ALGALIAS TUBOS E SONDAS,Ajuste Direto Regime Geral,Aquisição de bens móveis,"33141600-6, Tubos e sacos de drenagem e respectivos kits",Hospital Dr. Francisco Zagalo - Ovar (501510150),VYGON PORTUGAL (503232785),"6.500,00 €",06-12-2018,28-12-2017,720 dias,"Portugal, Aveiro, Ovar","Artigo 20.º, n.º 1, alínea a) do Código dos Contratos Públicos","","","","",,Não aplicável.,Não aplicável.,FALSE
42003018 - AQUISIÇÃO MATERIAL TRATAMENTO - 23,Ajuste Direto Regime Geral,Aquisição de bens móveis,"33141000-0, Material médico não químico descartável e produtos hematológicos",Hospital Dr. Francisco Zagalo - Ovar (501510150),"Nosbet Equipamentos, Lda. (513514872)","50,00 €",05-12-2018,01-02-2018,300 dias,"Portugal, Aveiro, Ovar","Artigo 20.º, n.º 1, alínea d) do Código dos Contratos Públicos",30-11-2018,"50,00 €","","",,Não aplicável.,Não aplicável.,FALSE
42003018 - AQUISIÇÃO MATERIAL TRATAMENTO - 23,Ajuste Direto Regime Geral,Aquisição de bens móveis,"33141000-0, Material médico não químico descartável e produtos hematológicos",Hospital Dr. Francisco Zagalo - Ovar (501510150),ROCHE SISTEMAS DIAGNOSTICOS LDA (504282921),"28,80 €",05-12-2018,01-02-2018,300 dias,"Portugal, Aveiro, Ovar","Artigo 20.º, n.º 1, alínea d) do Código dos Contratos Públicos",30-11-2018,"28,80 €","","",,Não aplicável.,Não aplicável.,FALSE
42003018 - AQUISIÇÃO MATERIAL TRATAMENTO - 23,Ajuste Direto Regime Geral,Aquisição de bens móveis,"33141000-0, Material médico não químico descartável e produtos hematológicos",Hospital Dr. Francisco Zagalo - Ovar (501510150),BAUSCH  LOMB (980218764),"42,00 €",05-12-2018,01-02-2018,300 dias,"Portugal, Aveiro, Ovar","Artigo 20.º, n.º 1, alínea d) do Código dos Contratos Públicos",30-11-2018,"42,00 €","","",,Não aplicável.,Não aplicável.,FALSE
42003018 - AQUISIÇÃO MATERIAL TRATAMENTO - 23,Ajuste Direto Regime Geral,Aquisição de bens móveis,"33141000-0, Material médico não químico descartável e produtos hematológicos",Hospital Dr. Francisco Zagalo - Ovar (501510150),Radiometer Ibérica SL (980201667),"160,00 €",05-12-2018,01-02-2018,300 dias,"Portugal, Aveiro, Ovar","Artigo 20.º, n.º 1, alínea d) do Código dos Contratos Públicos",30-11-2018,"160,00 €","","",,Não aplicável.,Não aplicável.,FALSE
42003018 - AQUISIÇÃO MATERIAL TRATAMENTO - 23,Ajuste Direto Regime Geral,Aquisição de bens móveis,"33141000-0, Material médico não químico descartável e produtos hematológicos",Hospital Dr. Francisco Zagalo - Ovar (501510150),"Sarstedt, SA (503019461)","4.646,40 €",05-12-2018,01-02-2018,300 dias,"Portugal, Aveiro, Ovar","Artigo 20.º, n.º 1, alínea d) do Código dos Contratos Públicos",30-11-2018,"4.646,40 €","","",,Não aplicável.,Não aplicável.,FALSE
42003018 - AQUISIÇÃO MATERIAL TRATAMENTO - 23,Ajuste Direto Regime Geral,Aquisição de bens móveis,"33141000-0, Material médico não químico descartável e produtos hematológicos",Hospital Dr. Francisco Zagalo - Ovar (501510150),"INTERSURGICAL PORTUGAL, LDA (503480045)","1.333,75 €",05-12-2018,01-02-2018,300 dias,"Portugal, Aveiro, Ovar","Artigo 20.º, n.º 1, alínea d) do Código dos Contratos Públicos",30-11-2018,"1.333,75 €","","",,Não aplicável.,Não aplicável.,FALSE
42003018 - AQUISIÇÃO MATERIAL TRATAMENTO - 23,Ajuste Direto Regime Geral,Aquisição de bens móveis,"33141000-0, Material médico não químico descartável e produtos hematológicos",Hospital Dr. Francisco Zagalo - Ovar (501510150),"Feiramédica. Imp. com Equipa, Hospitalar, Lda (503731900)","82,34 €",05-12-2018,01-02-2018,300 dias,"Portugal, Aveiro, Ovar","Artigo 20.º, n.º 1, alínea d) do Código dos Contratos Públicos",30-11-2018,"82,34 €","","",,Não aplicável.,Não aplicável.,FALSE
47002317-OBRAS CONDUTA VERTICAL AGUAS RESIDUAIS,Ajuste Direto Regime Geral,Empreitadas de obras públicas,"45200000-9, Obras de construção total ou parcial e de engenharia civil",Hospital Dr. Francisco Zagalo (501510150),"Constrovar, Lda (504314629)","3.730,00 €",05-12-2018,14-12-2017,90 dias,"Portugal, Aveiro, Ovar","Artigo 19.º, alínea a) do Código dos Contratos Públicos","","","","",,Não aplicável.,Não aplicável.,FALSE
Medicamentos usados nas afeções oculares e ORL,Ajuste Direto Regime Geral,Aquisição de bens móveis,"33662000-8, Medicamentos para os órgãos sensoriais",Hospital Dr. Francisco Zagalo - Ovar (501510150),DAVI II FARMACEUTICA SA (508309450),"252,90 €",05-12-2018,22-01-2018,360 dias,"Portugal, Aveiro, Ovar","Artigo 20.º, n.º 1, alínea a) do Código dos Contratos Públicos","","","","",,Não aplicável.,Não aplicável.,FALSE
Medicamentos usados nas afeções oculares e ORL,Ajuste Direto Regime Geral,Aquisição de bens móveis,"33662000-8, Medicamentos para os órgãos sensoriais",Hospital Dr. Francisco Zagalo - Ovar (501510150),LABORATORIO EDOL-S.A. (507072642),"611,70 €",05-12-2018,22-01-2018,360 dias,"Portugal, Aveiro, Ovar","Artigo 20.º, n.º 1, alínea a) do Código dos Contratos Públicos","","","","",,Não aplicável.,Não aplicável.,FALSE
42003018 - AQUISIÇÃO MATERIAL TRATAMENTO - 23,Ajuste Direto Regime Geral,Aquisição de bens móveis,"33141000-0, Material médico não químico descartável e produtos hematológicos",Hospital Dr. Francisco Zagalo - Ovar (501510150),"PMH PRODUTOS MEDIC. HOSPITAL, SA (502376899)","1.158,00 €",05-12-2018,01-02-2018,300 dias,"Portugal, Aveiro, Ovar","Artigo 20.º, n.º 1, alínea d) do Código dos Contratos Públicos",30-11-2018,"1.158,00 €","","",,Não aplicável.,Não aplicável.,FALSE
Medicamentos usados nas afeções oculares e ORL,Ajuste Direto Regime Geral,Aquisição de bens móveis,"33662000-8, Medicamentos para os órgãos sensoriais",Hospital Dr. Francisco Zagalo - Ovar (501510150),GLAXO SMITHKLINE PROD FARMACEUTICOS (500139962),"78,80 €",05-12-2018,22-01-2018,360 dias,"Portugal, Aveiro, Ovar","Artigo 20.º, n.º 1, alínea a) do Código dos Contratos Públicos","","","","",,Não aplicável.,Não aplicável.,FALSE
49012718-AQUISIÇÃO SERVIÇOS NA AREA CONTRATAÇÃO PUBLICA,Ajuste Direto Regime Geral,Aquisição de serviços,"79000000-4, Serviços a empresas: direito, comercialização, consultoria, recrutamento, impressão e segurança",Hospital Dr. Francisco Zagalo - Ovar (501510150),Sérgio Filomeno Nunes da Silva Araújo (159888115),"2.800,00 €",05-12-2018,19-09-2018,120 dias,"Portugal, Aveiro, Ovar","Artigo 20.º, n.º 1, alínea d) do Código dos Contratos Públicos","","","","",,Não aplicável.,Não aplicável.,FALSE
Imiglucerase 400U Pó Conc.Sol Inj Fr IV,Ao abrigo de acordo-quadro (art.º 259.º),Aquisição de bens móveis,"33600000-6, Produtos farmacêuticos",Hospital Dr. Francisco Zagalo - Ovar (501510150),SANOFI PRODUTOS FARMACEUTICOS LDA (500134960),"159.611,75 €",05-12-2018,31-01-2018,330 dias,"Portugal, Aveiro, Ovar",Artigo 259.º do Código dos Contratos Públicos,"","","","",,2658382,CP 2017/58 - Acordo Quadro para fornecimento de Medicamentos para Doenças Lisossomais de Sobrecarga às Instituições e Serviços do Serviço Nacional de Saúde,FALSE
Medicamentos Anti-Infeciosos: Excepto antivíricos e antifúngicos,Ajuste Direto Regime Geral,Aquisição de bens móveis,"33650000-1, Anti-infecciosos gerais de uso sistémico, vacinas, antineoplásicos e imunomoduladores",Hospital Dr. Francisco Zagalo - Ovar (501510150),"GENERIS FARMACÊUTICA, S.A. (508107997)","1.285,79 €",05-12-2018,22-01-2018,360 dias,"Portugal, Aveiro, Ovar","Artigo 20.º, n.º 1, alínea a) do Código dos Contratos Públicos","","","","",,Não aplicável.,Não aplicável.,FALSE
Medicamentos Anti-Infeciosos: Excepto antivíricos e antifúngicos,Ajuste Direto Regime Geral,Aquisição de bens móveis,"33650000-1, Anti-infecciosos gerais de uso sistémico, vacinas, antineoplásicos e imunomoduladores",Hospital Dr. Francisco Zagalo - Ovar (501510150),SANDOZ FARMACEUTICA LDA (506985261),"26,11 €",05-12-2018,22-01-2018,360 dias,"Portugal, Aveiro, Ovar","Artigo 20.º, n.º 1, alínea a) do Código dos Contratos Públicos","","","","",,Não aplicável.,Não aplicável.,FALSE
49009818-SERVIÇOS ESPECIALIZADOS AREA JURIDICA,Ajuste Direto Regime Geral,Aquisição de serviços,"79100000-5, Serviços jurídicos",Hospital Dr. Francisco Zagalo - Ovar (501510150),VIEIRA CONDE & ASSOCIADOS (503611824),"6.105,04 €",05-12-2018,01-05-2018,240 dias,"Portugal, Aveiro, Ovar","Artigo 20.º, n.º 1, alínea d) do Código dos Contratos Públicos",05-12-2018,"6.105,04 €","","",,Não aplicável.,Não aplicável.,FALSE
Medicamentos Anti-Infeciosos: Excepto antivíricos e antifúngicos,Ajuste Direto Regime Geral,Aquisição de bens móveis,"33650000-1, Anti-infecciosos gerais de uso sistémico, vacinas, antineoplásicos e imunomoduladores",Hospital Dr. Francisco Zagalo - Ovar (501510150),"TEVA PHARMA-Prod.Farmacêuticos, Lda (507045491)","116,00 €",05-12-2018,22-01-2018,360 dias,"Portugal, Aveiro, Ovar","Artigo 20.º, n.º 1, alínea a) do Código dos Contratos Públicos","","","","",,Não aplicável.,Não aplicável.,FALSE
Medicamentos Anti-Infeciosos: Excepto antivíricos e antifúngicos,Ajuste Direto Regime Geral,Aquisição de bens móveis,"33650000-1, Anti-infecciosos gerais de uso sistémico, vacinas, antineoplásicos e imunomoduladores",Hospital Dr. Francisco Zagalo - Ovar (501510150),LABORATORIOS ATRAL SA (500162085),"600,00 €",05-12-2018,22-01-2018,360 dias,"Portugal, Aveiro, Ovar","Artigo 20.º, n.º 1, alínea a) do Código dos Contratos Públicos","","","","",,Não aplicável.,Não aplicável.,FALSE
Medicamentos Anti-Infeciosos: Excepto antivíricos e antifúngicos,Ajuste Direto Regime Geral,Aquisição de bens móveis,"33650000-1, Anti-infecciosos gerais de uso sistémico, vacinas, antineoplásicos e imunomoduladores",Hospital Dr. Francisco Zagalo - Ovar (501510150),OVERPHARMA PROD MEDICOS FARMACEUTICOS (505792362),"61,15 €",05-12-2018,22-01-2018,360 dias,"Portugal, Aveiro, Ovar","Artigo 20.º, n.º 1, alínea a) do Código dos Contratos Públicos","","","","",,Não aplicável.,Não aplicável.,FALSE
Medicamentos Anti-Infeciosos: Excepto antivíricos e antifúngicos,Ajuste Direto Regime Geral,Aquisição de bens móveis,"33650000-1, Anti-infecciosos gerais de uso sistémico, vacinas, antineoplásicos e imunomoduladores",Hospital Dr. Francisco Zagalo - Ovar (501510150),RATIOPHARM (502414910),"174,18 €",05-12-2018,22-01-2018,360 dias,"Portugal, Aveiro, Ovar","Artigo 20.º, n.º 1, alínea a) do Código dos Contratos Públicos","","","","",,Não aplicável.,Não aplicável.,FALSE
Medicamentos Anti-Infeciosos: Excepto antivíricos e antifúngicos,Ajuste Direto Regime Geral,Aquisição de bens móveis,"33650000-1, Anti-infecciosos gerais de uso sistémico, vacinas, antineoplásicos e imunomoduladores",Hospital Dr. Francisco Zagalo - Ovar (501510150),"FRESENIUS KABI PHARMA PORTUGAL, LDA (504293753)","363,00 €",05-12-2018,22-01-2018,360 dias,"Portugal, Aveiro, Ovar","Artigo 20.º, n.º 1, alínea a) do Código dos Contratos Públicos","","","","",,Não aplicável.,Não aplicável.,FALSE
Medicamentos Anti-Infeciosos: Excepto antivíricos e antifúngicos,Ajuste Direto Regime Geral,Aquisição de bens móveis,"33650000-1, Anti-infecciosos gerais de uso sistémico, vacinas, antineoplásicos e imunomoduladores",Hospital Dr. Francisco Zagalo - Ovar (501510150),HIKMA FARMACEUTICA PORTUGAL (502266791),"6.769,45 €",05-12-2018,22-01-2018,360 dias,"Portugal, Aveiro, Ovar","Artigo 20.º, n.º 1, alínea a) do Código dos Contratos Públicos","","","","",,Não aplicável.,Não aplicável.,FALSE
Medicamentos Anti-Infeciosos: Excepto antivíricos e antifúngicos,Ajuste Direto Regime Geral,Aquisição de bens móveis,"33650000-1, Anti-infecciosos gerais de uso sistémico, vacinas, antineoplásicos e imunomoduladores",Hospital Dr. Francisco Zagalo - Ovar (501510150),B BRAUN MEDICAL LDA (501506543),"60,00 €",05-12-2018,22-01-2018,360 dias,"Portugal, Aveiro, Ovar","Artigo 20.º, n.º 1, alínea a) do Código dos Contratos Públicos","","","","",,Não aplicável.,Não aplicável.,FALSE
Medicamentos Anti-Infeciosos: Excepto antivíricos e antifúngicos,Ajuste Direto Regime Geral,Aquisição de bens móveis,"33650000-1, Anti-infecciosos gerais de uso sistémico, vacinas, antineoplásicos e imunomoduladores",Hospital Dr. Francisco Zagalo - Ovar (501510150),LABORATORIOS PFIZER LDA (500162166),"28,48 €",05-12-2018,22-01-2018,360 dias,"Portugal, Aveiro, Ovar","Artigo 20.º, n.º 1, alínea a) do Código dos Contratos Públicos","","","","",,Não aplicável.,Não aplicável.,FALSE
Medicamentos Anti-Infeciosos: Excepto antivíricos e antifúngicos,Ajuste Direto Regime Geral,Aquisição de bens móveis,"33650000-1, Anti-infecciosos gerais de uso sistémico, vacinas, antineoplásicos e imunomoduladores",Hospital Dr. Francisco Zagalo - Ovar (501510150),"Labesfal, Laboratorios Almiro SA (501169580)","1.000,00 €",05-12-2018,22-01-2018,360 dias,"Portugal, Aveiro, Ovar","Artigo 20.º, n.º 1, alínea a) do Código dos Contratos Públicos","","","","",,Não aplicável.,Não aplicável.,FALSE
80000118-regularização de IVA intracomunitário referente á compra de material de penso ao fornecedor URGO,Ajuste Direto Regime Geral,Aquisição de bens móveis,"33600000-6, Produtos farmacêuticos",Hospital Dr. Francisco Zagalo - Ovar (501510150),AGENCIA DE GESTÃO DA TESOUR. E DIVIDA PUBLICA-EPE (503756237),"70,00 €",05-12-2018,13-04-2018,270 dias,"Portugal, Aveiro, Ovar","Artigo 21.º, n.º 1, alínea c) do Código dos Contratos Públicos","","","","",,Não aplicável.,Não aplicável.,FALSE
42003018 - AQUISIÇÃO MATERIAL TRATAMENTO - 23,Ajuste Direto Regime Geral,Aquisição de bens móveis,"33141000-0, Material médico não químico descartável e produtos hematológicos",Hospital Dr. Francisco Zagalo - Ovar (501510150),VYGON PORTUGAL (503232785),"123,75 €",05-12-2018,01-02-2018,300 dias,"Portugal, Aveiro, Ovar","Artigo 20.º, n.º 1, alínea d) do Código dos Contratos Públicos",30-11-2018,"123,75 €","","",,Não aplicável.,Não aplicável.,FALSE
48000318-Outros produtos farmacêuticos á farmácia de oficina,Ajuste Direto Regime Geral,Aquisição de bens móveis,"33600000-6, Produtos farmacêuticos",Hospital Dr. Francisco Zagalo - Ovar (501510150),FARM CARMINDO LAMY-MANUELA DAV ROD CASTRO-HER INDI (745373224),"38,92 €",05-12-2018,31-01-2018,330 dias,"Portugal, Aveiro, Ovar","Artigo 20.º, n.º 1, alínea d) do Código dos Contratos Públicos","","","","",,Não aplicável.,Não aplicável.,FALSE
48000318-Outros produtos farmacêuticos á farmácia de oficina,Ajuste Direto Regime Geral,Aquisição de bens móveis,"33600000-6, Produtos farmacêuticos",Hospital Dr. Francisco Zagalo - Ovar (501510150),FARMACIA CARMINDO LAMY (173097618),"66,60 €",05-12-2018,31-01-2018,330 dias,"Portugal, Aveiro, Ovar","Artigo 20.º, n.º 1, alínea d) do Código dos Contratos Públicos","","","","",,Não aplicável.,Não aplicável.,FALSE
Medicamentos sem CHNM a farmacia de oficina,Ajuste Direto Regime Geral,Aquisição de bens móveis,"33690000-3, Medicamentos vários",Hospital Dr. Francisco Zagalo - Ovar (501510150),FARM CARMINDO LAMY-MANUELA DAV ROD CASTRO-HER INDI (745373224),"67,75 €",05-12-2018,31-01-2018,330 dias,"Portugal, Aveiro, Ovar","Artigo 20.º, n.º 1, alínea d) do Código dos Contratos Públicos","","","","",,Não aplicável.,Não aplicável.,FALSE
Medicamentos sem CHNM a farmacia de oficina,Ajuste Direto Regime Geral,Aquisição de bens móveis,"33690000-3, Medicamentos vários",Hospital Dr. Francisco Zagalo - Ovar (501510150),FARMACIA CARMINDO LAMY (173097618),"727,15 €",05-12-2018,31-01-2018,330 dias,"Portugal, Aveiro, Ovar","Artigo 20.º, n.º 1, alínea d) do Código dos Contratos Públicos","","","","",,Não aplicável.,Não aplicável.,FALSE
"42000118 - Aquisição suturas, clips, máquinas agrafes de pele",Ajuste Direto Regime Geral,Aquisição de bens móveis,"33141121-4, Suturas cirúrgicas",Hospital Dr. Francisco Zagalo - Ovar (501510150),Socime (504453939),"2.318,04 €",05-12-2018,29-08-2018,850 dias,"Portugal, Aveiro, Ovar","Artigo 20.º, n.º 1, alínea d) do Código dos Contratos Públicos","","","","",,Não aplicável.,Não aplicável.,FALSE
"42000118 - Aquisição suturas, clips, máquinas agrafes de pele",Ajuste Direto Regime Geral,Aquisição de bens móveis,"33141121-4, Suturas cirúrgicas",Hospital Dr. Francisco Zagalo - Ovar (501510150),"MEDTRONIC PORTUGAL, LDA (504223933)","756,00 €",05-12-2018,29-08-2018,850 dias,"Portugal, Aveiro, Ovar","Artigo 20.º, n.º 1, alínea d) do Código dos Contratos Públicos","","","","",,Não aplicável.,Não aplicável.,FALSE
"42000118 - Aquisição suturas, clips, máquinas agrafes de pele",Ajuste Direto Regime Geral,Aquisição de bens móveis,"33141121-4, Suturas cirúrgicas",Hospital Dr. Francisco Zagalo - Ovar (501510150),"B BRAUN MEDICAL, LDA. (501506543)","2.686,88 €",05-12-2018,29-08-2018,850 dias,"Portugal, Aveiro, Ovar","Artigo 20.º, n.º 1, alínea d) do Código dos Contratos Públicos","","","","",,Não aplicável.,Não aplicável.,FALSE
"42000118 - Aquisição suturas, clips, máquinas agrafes de pele",Ajuste Direto Regime Geral,Aquisição de bens móveis,"33141121-4, Suturas cirúrgicas",Hospital Dr. Francisco Zagalo - Ovar (501510150),"H. R. - Hospitalar, Lda (501895558)","713,52 €",05-12-2018,29-08-2018,850 dias,"Portugal, Aveiro, Ovar","Artigo 20.º, n.º 1, alínea d) do Código dos Contratos Públicos","","","","",,Não aplicável.,Não aplicável.,FALSE
medicamentos com CHNM á farmácia de oficina,Ajuste Direto Regime Geral,Aquisição de bens móveis,"33690000-3, Medicamentos vários",Hospital Dr. Francisco Zagalo - Ovar (501510150),FARM CARMINDO LAMY-MANUELA DAV ROD CASTRO-HER INDI (745373224),"1.286,86 €",04-12-2018,31-01-2018,330 dias,"Portugal, Aveiro, Ovar","Artigo 20.º, n.º 1, alínea d) do Código dos Contratos Públicos","","","","",,Não aplicável.,Não aplicável.,FALSE
medicamentos com CHNM á farmácia de oficina,Ajuste Direto Regime Geral,Aquisição de bens móveis,"33690000-3, Medicamentos vários",Hospital Dr. Francisco Zagalo - Ovar (501510150),FARMACIA CARMINDO LAMY (173097618),"2.501,28 €",04-12-2018,31-01-2018,330 dias,"Portugal, Aveiro, Ovar","Artigo 20.º, n.º 1, alínea d) do Código dos Contratos Públicos","","","","",,Não aplicável.,Não aplicável.,FALSE
Corretivos da Volémia e outras soluções estéreis c/CHNM,Ajuste Direto Regime Geral,Aquisição de bens móveis,"33690000-3, Medicamentos vários",Hospital Dr. Francisco Zagalo - Ovar (501510150),OVERPHARMA PROD MEDICOS FARMACEUTICOS (505792362),"2.860,12 €",04-12-2018,22-01-2018,360 dias,"Portugal, Aveiro, Ovar","Artigo 20.º, n.º 1, alínea a) do Código dos Contratos Públicos","","","","",,Não aplicável.,Não aplicável.,FALSE
Corretivos da Volémia e outras soluções estéreis c/CHNM,Ajuste Direto Regime Geral,Aquisição de bens móveis,"33690000-3, Medicamentos vários",Hospital Dr. Francisco Zagalo - Ovar (501510150),GRIFOLS PORTUGAL (502041285),"320,00 €",04-12-2018,22-01-2018,360 dias,"Portugal, Aveiro, Ovar","Artigo 20.º, n.º 1, alínea a) do Código dos Contratos Públicos","","","","",,Não aplicável.,Não aplicável.,FALSE
Corretivos da Volémia e outras soluções estéreis c/CHNM,Ajuste Direto Regime Geral,Aquisição de bens móveis,"33690000-3, Medicamentos vários",Hospital Dr. Francisco Zagalo - Ovar (501510150),B BRAUN MEDICAL LDA (501506543),"8.906,34 €",04-12-2018,22-01-2018,360 dias,"Portugal, Aveiro, Ovar","Artigo 20.º, n.º 1, alínea a) do Código dos Contratos Públicos","","","","",,Não aplicável.,Não aplicável.,FALSE
Corretivos da Volémia e outras soluções estéreis c/CHNM,Ajuste Direto Regime Geral,Aquisição de bens móveis,"33690000-3, Medicamentos vários",Hospital Dr. Francisco Zagalo - Ovar (501510150),BAXTER (503347345),"861,39 €",04-12-2018,22-01-2018,360 dias,"Portugal, Aveiro, Ovar","Artigo 20.º, n.º 1, alínea a) do Código dos Contratos Públicos","","","","",,Não aplicável.,Não aplicável.,FALSE
Corretivos da Volémia e outras soluções estéreis c/CHNM,Ajuste Direto Regime Geral,Aquisição de bens móveis,"33690000-3, Medicamentos vários",Hospital Dr. Francisco Zagalo - Ovar (501510150),"Labesfal, Laboratorios Almiro SA (501169580)","598,00 €",04-12-2018,22-01-2018,360 dias,"Portugal, Aveiro, Ovar","Artigo 20.º, n.º 1, alínea a) do Código dos Contratos Públicos","","","","",,Não aplicável.,Não aplicável.,FALSE
Dietas e suplementos alimentares,Ajuste Direto Regime Geral,Aquisição de bens móveis,"33692300-0, Alimentos enterais",Hospital Dr. Francisco Zagalo - Ovar (501510150),"Nutricia Advanced Medical Nutrition Unipessoal, Lda (507558286)","8.258,80 €",04-12-2018,22-01-2018,360 dias,"Portugal, Aveiro, Ovar","Artigo 20.º, n.º 1, alínea a) do Código dos Contratos Públicos","","","","",,Não aplicável.,Não aplicável.,FALSE
Dietas e suplementos alimentares,Ajuste Direto Regime Geral,Aquisição de bens móveis,"33692300-0, Alimentos enterais",Hospital Dr. Francisco Zagalo - Ovar (501510150),"FRESENIUS KABI PHARMA PORTUGAL, LDA (504293753)","3.733,80 €",04-12-2018,22-01-2018,360 dias,"Portugal, Aveiro, Ovar","Artigo 20.º, n.º 1, alínea a) do Código dos Contratos Públicos","","","","",,Não aplicável.,Não aplicável.,FALSE
dietas e suplementos alimentares,Ajuste Direto Regime Geral,Aquisição de bens móveis,"33692300-0, Alimentos enterais",Hospital Dr. Francisco Zagalo - Ovar (501510150),NESTLE PORTUGAL SA (500201307),"2.156,62 €",04-12-2018,22-01-2018,360 dias,"Portugal, Aveiro, Ovar","Artigo 20.º, n.º 1, alínea a) do Código dos Contratos Públicos","","","","",,Não aplicável.,Não aplicável.,FALSE
Medicamentos c/ CHNM,Ajuste Direto Regime Geral,Aquisição de bens móveis,"33620000-2, Medicamentos para o sangue, para os órgãos hematopoiéticos e para o aparelho cardiovascular",Hospital Dr. Francisco Zagalo - Ovar (501510150),OM PHARMA (500207410),"1.100,00 €",04-12-2018,22-01-2018,360 dias,"Portugal, Aveiro, Ovar","Artigo 20.º, n.º 1, alínea a) do Código dos Contratos Públicos","","","","",,Não aplicável.,Não aplicável.,FALSE
Medicamentos c/ CHNM,Ajuste Direto Regime Geral,Aquisição de bens móveis,"33620000-2, Medicamentos para o sangue, para os órgãos hematopoiéticos e para o aparelho cardiovascular",Hospital Dr. Francisco Zagalo - Ovar (501510150),"GENERIS FARMACÊUTICA, S.A. (508107997)","69,00 €",04-12-2018,22-01-2018,360 dias,"Portugal, Aveiro, Ovar","Artigo 20.º, n.º 1, alínea a) do Código dos Contratos Públicos","","","","",,Não aplicável.,Não aplicável.,FALSE
Medicamentos c/ CHNM,Ajuste Direto Regime Geral,Aquisição de bens móveis,"33620000-2, Medicamentos para o sangue, para os órgãos hematopoiéticos e para o aparelho cardiovascular",Hospital Dr. Francisco Zagalo - Ovar (501510150),SANOFI PRODUTOS FARMACEUTICOS LDA (500134960),"16.791,49 €",04-12-2018,22-01-2018,360 dias,"Portugal, Aveiro, Ovar","Artigo 20.º, n.º 1, alínea a) do Código dos Contratos Públicos","","","","",,Não aplicável.,Não aplicável.,FALSE
Medicamentos c/ CHNM,Ajuste Direto Regime Geral,Aquisição de bens móveis,"33620000-2, Medicamentos para o sangue, para os órgãos hematopoiéticos e para o aparelho cardiovascular",Hospital Dr. Francisco Zagalo - Ovar (501510150),B BRAUN MEDICAL LDA (501506543),"14,00 €",04-12-2018,22-01-2018,360 dias,"Portugal, Aveiro, Ovar","Artigo 20.º, n.º 1, alínea a) do Código dos Contratos Públicos","","","","",,Não aplicável.,Não aplicável.,FALSE
Medicamentos c/ CHNM,Ajuste Direto Regime Geral,Aquisição de bens móveis,"33620000-2, Medicamentos para o sangue, para os órgãos hematopoiéticos e para o aparelho cardiovascular",Hospital Dr. Francisco Zagalo - Ovar (501510150),UNILFARMA (500293023),"2.080,68 €",04-12-2018,22-01-2018,360 dias,"Portugal, Aveiro, Ovar","Artigo 20.º, n.º 1, alínea a) do Código dos Contratos Públicos","","","","",,Não aplicável.,Não aplicável.,FALSE
Medicamentos c/ CHNM,Ajuste Direto Regime Geral,Aquisição de bens móveis,"33620000-2, Medicamentos para o sangue, para os órgãos hematopoiéticos e para o aparelho cardiovascular",Hospital Dr. Francisco Zagalo - Ovar (501510150),ROCHE FARMACEUTICA QUIMICA LDA (500233810),"35,00 €",04-12-2018,22-01-2018,360 dias,"Portugal, Aveiro, Ovar","Artigo 20.º, n.º 1, alínea a) do Código dos Contratos Públicos","","","","",,Não aplicável.,Não aplicável.,FALSE
"42000118 - Aquisição suturas, clips, máquinas agrafes de pele",Ajuste Direto Regime Geral,Aquisição de bens móveis,"33141121-4, Suturas cirúrgicas",Hospital Dr. Francisco Zagalo - Ovar (501510150),"J.M.V. - Produtos Hospitalares, Lda (501887148)","504,00 €",04-12-2018,29-08-2018,850 dias,"Portugal, Aveiro, Ovar","Artigo 20.º, n.º 1, alínea d) do Código dos Contratos Públicos","","","","",,Não aplicável.,Não aplicável.,FALSE
Medicamentos do aparelho cardiovascular,Ao abrigo de acordo-quadro (art.º 259.º),Aquisição de bens móveis,"33620000-2, Medicamentos para o sangue, para os órgãos hematopoiéticos e para o aparelho cardiovascular",Hospital Dr. Francisco Zagalo - Ovar (501510150),BLUEMED UNIP. LDA (509912060),"58,80 €",04-12-2018,22-01-2018,360 dias,"Portugal, Aveiro, Ovar",Artigo 259.º do Código dos Contratos Públicos,"","","","",,2335591,CP 2016/01 - Acordo Quadro para fornecimento de Medicamentos do Aparelho Cardiovascular   às Instituições e Serviços do Serviço Nacional de Saúde,FALSE
Medicamentos do Aparelho Cardiovascular,Ao abrigo de acordo-quadro (art.º 259.º),Aquisição de bens móveis,"33620000-2, Medicamentos para o sangue, para os órgãos hematopoiéticos e para o aparelho cardiovascular",Hospital Dr. Francisco Zagalo - Ovar (501510150),"GENERIS FARMACÊUTICA, S.A. (508107997)","314,56 €",04-12-2018,22-01-2018,360 dias,"Portugal, Aveiro, Ovar",Artigo 259.º do Código dos Contratos Públicos,"","","","",,2335591,CP 2016/01 - Acordo Quadro para fornecimento de Medicamentos do Aparelho Cardiovascular   às Instituições e Serviços do Serviço Nacional de Saúde,FALSE
Medicamentos do aparelho cardiovascular,Ao abrigo de acordo-quadro (art.º 259.º),Aquisição de bens móveis,"33620000-2, Medicamentos para o sangue, para os órgãos hematopoiéticos e para o aparelho cardiovascular",Hospital Dr. Francisco Zagalo - Ovar (501510150),SANDOZ FARMACEUTICA LDA (506985261),"141,61 €",04-12-2018,22-01-2018,360 dias,"Portugal, Aveiro, Ovar",Artigo 259.º do Código dos Contratos Públicos,"","","","",,2335591,CP 2016/01 - Acordo Quadro para fornecimento de Medicamentos do Aparelho Cardiovascular   às Instituições e Serviços do Serviço Nacional de Saúde,FALSE
Medicamentos do aparelho cardiovascular,Ao abrigo de acordo-quadro (art.º 259.º),Aquisição de bens móveis,"33620000-2, Medicamentos para o sangue, para os órgãos hematopoiéticos e para o aparelho cardiovascular",Hospital Dr. Francisco Zagalo - Ovar (501510150),"Overpharma, Lda (505792362)","54,00 €",04-12-2018,22-01-2018,360 dias,"Portugal, Aveiro, Ovar",Artigo 259.º do Código dos Contratos Públicos,"","","","",,2335591,CP 2016/01 - Acordo Quadro para fornecimento de Medicamentos do Aparelho Cardiovascular   às Instituições e Serviços do Serviço Nacional de Saúde,FALSE
42001816 - Aquisição de luvas,Ajuste Direto Regime Geral,Aquisição de bens móveis,"33141420-0, Luvas para cirurgia",Hospital Dr. Francisco Zagalo - Ovar (501510150),EZEQUIEL PANAO JORGE LDA      (501412727),"30,07 €",04-12-2018,28-12-2017,350 dias,"Portugal, Aveiro, Ovar","Artigo 20.º, n.º 1, alínea a) do Código dos Contratos Públicos",28-12-2018,"30,20 €","",Aquisição superior à quantidade prevista,,Não aplicável.,Não aplicável.,FALSE
42001816 - Aquisição de luvas,Ajuste Direto Regime Geral,Aquisição de bens móveis,"33141420-0, Luvas para cirurgia",Hospital Dr. Francisco Zagalo - Ovar (501510150),H.R.-PRODUTOS QUIMICOS LDA (501895558),"10,78 €",04-12-2018,28-12-2017,350 dias,"Portugal, Aveiro, Ovar","Artigo 20.º, n.º 1, alínea a) do Código dos Contratos Públicos",28-12-2018,"130,78 €","",Aquisição superior à quantidade prevista,,Não aplicável.,Não aplicável.,FALSE
42001816 - Aquisição de luvas,Ajuste Direto Regime Geral,Aquisição de bens móveis,"33141420-0, Luvas para cirurgia",Hospital Dr. Francisco Zagalo - Ovar (501510150),MEDECINALIA CORMÉDICA (500684324),"1.932,00 €",04-12-2018,28-12-2017,350 dias,"Portugal, Aveiro, Ovar","Artigo 20.º, n.º 1, alínea a) do Código dos Contratos Públicos",28-12-2018,"12.239,00 €","",aquisição superior à quantidade prevista,,Não aplicável.,Não aplicável.,FALSE
42001816 - Aquisição de luvas,Ajuste Direto Regime Geral,Aquisição de bens móveis,"33141420-0, Luvas para cirurgia",Hospital Dr. Francisco Zagalo - Ovar (501510150),MEDECINALIA CORMÉDICA (500684324),"5.796,00 €",04-12-2018,28-12-2017,350 dias,"Portugal, Aveiro, Ovar","Artigo 20.º, n.º 1, alínea a) do Código dos Contratos Públicos",28-12-2018,"6.072,00 €","",aquisição superior à previsão,,Não aplicável.,Não aplicável.,FALSE
42001816 - Aquisição de luvas,Ajuste Direto Regime Geral,Aquisição de bens móveis,"33141420-0, Luvas para cirurgia",Hospital Dr. Francisco Zagalo - Ovar (501510150),MEDECINALIA CORMÉDICA (500684324),"4.193,00 €",04-12-2018,28-12-2017,350 dias,"Portugal, Aveiro, Ovar","Artigo 20.º, n.º 1, alínea a) do Código dos Contratos Públicos",28-12-2018,"3.358,00 €","",Aquisição inferior às quantidades previstas,,Não aplicável.,Não aplicável.,FALSE
42001816 - Aquisição de luvas,Ajuste Direto Regime Geral,Aquisição de bens móveis,"33141420-0, Luvas para cirurgia",Hospital Dr. Francisco Zagalo - Ovar (501510150),MEDECINALIA CORMÉDICA (500684324),"50,00 €",04-12-2018,28-12-2017,350 dias,"Portugal, Aveiro, Ovar","Artigo 20.º, n.º 1, alínea a) do Código dos Contratos Públicos","","","","",,Não aplicável.,Não aplicável.,FALSE
42001816 - Aquisição de luvas,Ajuste Direto Regime Geral,Aquisição de bens móveis,"33141420-0, Luvas para cirurgia",Hospital Dr. Francisco Zagalo - Ovar (501510150),MEDECINALIA CORMÉDICA (500684324),"210,00 €",04-12-2018,28-12-2017,350 dias,"Portugal, Aveiro, Ovar","Artigo 20.º, n.º 1, alínea a) do Código dos Contratos Públicos",28-12-2018,"210,00 €","","",,Não aplicável.,Não aplicável.,FALSE
42001816 - Aquisição de luvas,Ajuste Direto Regime Geral,Aquisição de bens móveis,"33141420-0, Luvas para cirurgia",Hospital Dr. Francisco Zagalo - Ovar (501510150),MEDECINALIA CORMÉDICA (500684324),"575,00 €",04-12-2018,28-12-2017,350 dias,"Portugal, Aveiro, Ovar","Artigo 20.º, n.º 1, alínea a) do Código dos Contratos Públicos",28-12-2018,"575,00 €","","",,Não aplicável.,Não aplicável.,FALSE
42001816 - Aquisição de luvas,Ajuste Direto Regime Geral,Aquisição de bens móveis,"33141420-0, Luvas para cirurgia",Hospital Dr. Francisco Zagalo - Ovar (501510150),"MEDTRONIC PORTUGAL, LDA (504223933)","608,00 €",04-12-2018,28-12-2017,350 dias,"Portugal, Aveiro, Ovar","Artigo 20.º, n.º 1, alínea a) do Código dos Contratos Públicos",28-12-2018,"608,00 €","","",,Não aplicável.,Não aplicável.,FALSE
42001816 - Aquisição de luvas,Ajuste Direto Regime Geral,Aquisição de bens móveis,"33141420-0, Luvas para cirurgia",Hospital Dr. Francisco Zagalo - Ovar (501510150),"MEDTRONIC PORTUGAL, LDA (504223933)","494,00 €",04-12-2018,28-12-2017,350 dias,"Portugal, Aveiro, Ovar","Artigo 20.º, n.º 1, alínea a) do Código dos Contratos Públicos",28-12-2018,"304,00 €","",Aquisição inferior à quantidade prevista,,Não aplicável.,Não aplicável.,FALSE
42001816 - Aquisição de luvas,Ajuste Direto Regime Geral,Aquisição de bens móveis,"33141420-0, Luvas para cirurgia",Hospital Dr. Francisco Zagalo - Ovar (501510150),"MEDTRONIC PORTUGAL, LDA (504223933)","912,00 €",04-12-2018,28-12-2017,350 dias,"Portugal, Aveiro, Ovar","Artigo 20.º, n.º 1, alínea a) do Código dos Contratos Públicos",28-12-2018,"912,00 €","","",,Não aplicável.,Não aplicável.,FALSE
42001816 - Aquisição de luvas,Ajuste Direto Regime Geral,Aquisição de bens móveis,"33141420-0, Luvas para cirurgia",Hospital Dr. Francisco Zagalo - Ovar (501510150),"MEDTRONIC PORTUGAL, LDA (504223933)","304,00 €",04-12-2018,28-12-2017,350 dias,"Portugal, Aveiro, Ovar","Artigo 20.º, n.º 1, alínea a) do Código dos Contratos Públicos","","","","",,Não aplicável.,Não aplicável.,FALSE
42001816 - Aquisição de luvas,Ajuste Direto Regime Geral,Aquisição de bens móveis,"33141420-0, Luvas para cirurgia",Hospital Dr. Francisco Zagalo - Ovar (501510150),"Docworld - Dispositivos Médicos, Lda (508592909)","21,02 €",04-12-2018,28-12-2017,350 dias,"Portugal, Aveiro, Ovar","Artigo 20.º, n.º 1, alínea a) do Código dos Contratos Públicos",28-12-2018,"31,50 €","",Aquisição superior à quantidade prevista,,Não aplicável.,Não aplicável.,FALSE
42001816 - Aquisição de luvas,Ajuste Direto Regime Geral,Aquisição de bens móveis,"33141420-0, Luvas para cirurgia",Hospital Dr. Francisco Zagalo - Ovar (501510150),"Docworld - Dispositivos Médicos, Lda (508592909)","94,51 €",04-12-2018,28-12-2017,350 dias,"Portugal, Aveiro, Ovar","Artigo 20.º, n.º 1, alínea a) do Código dos Contratos Públicos",28-12-2018,"105,00 €","",Aquisição superior à quantidade prevista,,Não aplicável.,Não aplicável.,FALSE
42001816 - Aquisição de luvas,Ajuste Direto Regime Geral,Aquisição de bens móveis,"33141420-0, Luvas para cirurgia",Hospital Dr. Francisco Zagalo - Ovar (501510150),"Docworld - Dispositivos Médicos, Lda (508592909)","115,51 €",04-12-2018,28-12-2017,350 dias,"Portugal, Aveiro, Ovar","Artigo 20.º, n.º 1, alínea a) do Código dos Contratos Públicos",28-12-2018,"115,51 €","","",,Não aplicável.,Não aplicável.,FALSE
42001816 - Aquisição de luvas,Ajuste Direto Regime Geral,Aquisição de bens móveis,"33141420-0, Luvas para cirurgia",Hospital Dr. Francisco Zagalo - Ovar (501510150),"Docworld - Dispositivos Médicos, Lda (508592909)","21,00 €",04-12-2018,28-12-2017,350 dias,"Portugal, Aveiro, Ovar","Artigo 20.º, n.º 1, alínea a) do Código dos Contratos Públicos",28-12-2018,"21,00 €","","",,Não aplicável.,Não aplicável.,FALSE
42001816 - Aquisição de luvas,Ajuste Direto Regime Geral,Aquisição de bens móveis,"33141420-0, Luvas para cirurgia",Hospital Dr. Francisco Zagalo - Ovar (501510150),"Docworld - Dispositivos Médicos, Lda (508592909)","170,00 €",04-12-2018,28-12-2017,350 dias,"Portugal, Aveiro, Ovar","Artigo 20.º, n.º 1, alínea a) do Código dos Contratos Públicos","","","","",,Não aplicável.,Não aplicável.,FALSE
42001816 - Aquisição de luvas,Ajuste Direto Regime Geral,Aquisição de bens móveis,"33141420-0, Luvas para cirurgia",Hospital Dr. Francisco Zagalo - Ovar (501510150),"Docworld - Dispositivos Médicos, Lda (508592909)","340,00 €",04-12-2018,28-12-2017,350 dias,"Portugal, Aveiro, Ovar","Artigo 20.º, n.º 1, alínea a) do Código dos Contratos Públicos","","","","",,Não aplicável.,Não aplicável.,FALSE
42001816 - Aquisição de luvas,Ajuste Direto Regime Geral,Aquisição de bens móveis,"33141420-0, Luvas para cirurgia",Hospital Dr. Francisco Zagalo - Ovar (501510150),"Docworld - Dispositivos Médicos, Lda (508592909)","34,00 €",04-12-2018,28-12-2017,350 dias,"Portugal, Aveiro, Ovar","Artigo 20.º, n.º 1, alínea a) do Código dos Contratos Públicos",28-12-2018,"8,50 €","",Aquisição inferior à quantidade prevista,,Não aplicável.,Não aplicável.,FALSE
42001816 - Aquisição de luvas,Ajuste Direto Regime Geral,Aquisição de bens móveis,"33141420-0, Luvas para cirurgia",Hospital Dr. Francisco Zagalo - Ovar (501510150),"Docworld - Dispositivos Médicos, Lda (508592909)","94,11 €",04-12-2018,28-12-2017,350 dias,"Portugal, Aveiro, Ovar","Artigo 20.º, n.º 1, alínea a) do Código dos Contratos Públicos",28-12-2018,"42,50 €","",Aquisição inferior à quantidade prevista,,Não aplicável.,Não aplicável.,FALSE
39001018 - Aquisição proteses ortopedicas,Consulta Prévia,Aquisição de bens móveis,"33183200-8, Próteses ortopédicas",Hospital Dr. Francisco Zagalo - Ovar (501510150),Artur Salgado (503612600),"39.580,00 €",03-12-2018,17-08-2018,150 dias,"Portugal, Aveiro, Ovar","Artigo 20.º, n.º 1, alínea c) do Código dos Contratos Públicos",28-12-2018,"46.095,00 €","",Aquisição superior à quantidade prevista,,Não aplicável.,Não aplicável.,FALSE
39001018 - Aquisição proteses ortopedicas,Consulta Prévia,Aquisição de bens móveis,"33183200-8, Próteses ortopédicas",Hospital Dr. Francisco Zagalo - Ovar (501510150),"Lima Implantes, Portugal (508634784)","4.685,00 €",03-12-2018,17-08-2018,150 dias,"Portugal, Aveiro, Ovar","Artigo 20.º, n.º 1, alínea c) do Código dos Contratos Públicos",28-12-2018,"9.093,00 €","",Aquisição superior à quantidade prevista,,Não aplicável.,Não aplicável.,FALSE
39001018 - Aquisição proteses ortopedicas,Consulta Prévia,Aquisição de bens móveis,"33183200-8, Próteses ortopédicas",Hospital Dr. Francisco Zagalo - Ovar (501510150),Grupo MUC/BONECARE (505899914),"483,45 €",03-12-2018,17-08-2018,150 dias,"Portugal, Aveiro, Ovar","Artigo 20.º, n.º 1, alínea c) do Código dos Contratos Públicos",28-12-2018,"","",Contrato efetuado mas não houve lugar a aquisição,,Não aplicável.,Não aplicável.,FALSE
39001018 - Aquisição proteses ortopedicas,Consulta Prévia,Aquisição de bens móveis,"33183200-8, Próteses ortopédicas",Hospital Dr. Francisco Zagalo - Ovar (501510150),heraeus (508322227),"790,00 €",03-12-2018,17-08-2018,150 dias,"Portugal, Aveiro, Ovar","Artigo 20.º, n.º 1, alínea c) do Código dos Contratos Públicos",28-12-2018,"790,00 €","","",,Não aplicável.,Não aplicável.,FALSE
Medicamento do aparelho cardiovascular,Ao abrigo de acordo-quadro (art.º 259.º),Aquisição de bens móveis,"33620000-2, Medicamentos para o sangue, para os órgãos hematopoiéticos e para o aparelho cardiovascular",Hospital Dr. Francisco Zagalo - Ovar (501510150),RATIOPHARM (502414910),"809,03 €",03-12-2018,22-01-2018,360 dias,"Portugal, Aveiro, Ovar",Artigo 259.º do Código dos Contratos Públicos,"","","","",,2335591,CP 2016/01 - Acordo Quadro para fornecimento de Medicamentos do Aparelho Cardiovascular   às Instituições e Serviços do Serviço Nacional de Saúde,FALSE
Medicamento do aparelho cardiovascular,Ao abrigo de acordo-quadro (art.º 259.º),Aquisição de bens móveis,"33620000-2, Medicamentos para o sangue, para os órgãos hematopoiéticos e para o aparelho cardiovascular",Hospital Dr. Francisco Zagalo - Ovar (501510150),ASTRA ZENECA PRO FARMACEUTICOS LDA (502942240),"652,74 €",03-12-2018,22-01-2018,360 dias,"Portugal, Aveiro, Ovar",Artigo 259.º do Código dos Contratos Públicos,"","","","",,2335591,CP 2016/01 - Acordo Quadro para fornecimento de Medicamentos do Aparelho Cardiovascular   às Instituições e Serviços do Serviço Nacional de Saúde,FALSE
Medicamentos aparelho cardiovascular,Ao abrigo de acordo-quadro (art.º 259.º),Aquisição de bens móveis,"33620000-2, Medicamentos para o sangue, para os órgãos hematopoiéticos e para o aparelho cardiovascular",Hospital Dr. Francisco Zagalo - Ovar (501510150),HIKMA FARMACEUTICA PORTUGAL (502266791),"83,60 €",03-12-2018,22-01-2018,360 dias,"Portugal, Aveiro, Ovar",Artigo 259.º do Código dos Contratos Públicos,"","","","",,2335591,CP 2016/01 - Acordo Quadro para fornecimento de Medicamentos do Aparelho Cardiovascular   às Instituições e Serviços do Serviço Nacional de Saúde,FALSE
Medicamentos aparelho cardiovascular,Ao abrigo de acordo-quadro (art.º 259.º),Aquisição de bens móveis,"33620000-2, Medicamentos para o sangue, para os órgãos hematopoiéticos e para o aparelho cardiovascular",Hospital Dr. Francisco Zagalo - Ovar (501510150),B BRAUN MEDICAL LDA (501506543),"280,50 €",03-12-2018,22-01-2018,360 dias,"Portugal, Aveiro, Ovar",Artigo 259.º do Código dos Contratos Públicos,"","","","",,2335591,CP 2016/01 - Acordo Quadro para fornecimento de Medicamentos do Aparelho Cardiovascular   às Instituições e Serviços do Serviço Nacional de Saúde,FALSE
Medicamentos do Aparelho Cardiovascular,Ao abrigo de acordo-quadro (art.º 259.º),Aquisição de bens móveis,"33620000-2, Medicamentos para o sangue, para os órgãos hematopoiéticos e para o aparelho cardiovascular",Hospital Dr. Francisco Zagalo - Ovar (501510150),Unilfarma (500293023),"19,87 €",03-12-2018,22-01-2018,360 dias,"Portugal, Aveiro, Ovar",Artigo 259.º do Código dos Contratos Públicos,"","","","",,2335591,CP 2016/01 - Acordo Quadro para fornecimento de Medicamentos do Aparelho Cardiovascular   às Instituições e Serviços do Serviço Nacional de Saúde,FALSE
Medicamentos do aparelho cardiovascular,Ao abrigo de acordo-quadro (art.º 259.º),Aquisição de bens móveis,"33620000-2, Medicamentos para o sangue, para os órgãos hematopoiéticos e para o aparelho cardiovascular",Hospital Dr. Francisco Zagalo - Ovar (501510150),"Labesfal, Laboratorios Almiro SA (501169580)","2.302,27 €",03-12-2018,22-01-2018,360 dias,"Portugal, Aveiro, Ovar",Artigo 259.º do Código dos Contratos Públicos,"","","","",,2335591,CP 2016/01 - Acordo Quadro para fornecimento de Medicamentos do Aparelho Cardiovascular   às Instituições e Serviços do Serviço Nacional de Saúde,FALSE
Aquisição de luvas,Ajuste Direto Regime Geral,Aquisição de bens móveis,"33141420-0, Luvas para cirurgia",Hospital Dr. Francisco Zagalo - Ovar (501510150),"DOCWORLD, Lda (508592909)","255,00 €",03-12-2018,28-12-2017,350 dias,"Portugal, Aveiro, Ovar","Artigo 20.º, n.º 1, alínea a) do Código dos Contratos Públicos","","","","",,Não aplicável.,Não aplicável.,FALSE
Corretivos da Volémia s/ CHNM,Ajuste Direto Regime Geral,Aquisição de bens móveis,"33690000-3, Medicamentos vários",Hospital Dr. Francisco Zagalo - Ovar (501510150),OVERPHARMA PROD MEDICOS FARMACEUTICOS (505792362),"4.073,60 €",03-12-2018,22-01-2018,360 dias,"Portugal, Aveiro, Ovar","Artigo 20.º, n.º 1, alínea a) do Código dos Contratos Públicos","","","","",,Não aplicável.,Não aplicável.,FALSE
Corretivos da Volémia s/ CHNM,Ajuste Direto Regime Geral,Aquisição de bens móveis,"33690000-3, Medicamentos vários",Hospital Dr. Francisco Zagalo - Ovar (501510150),B BRAUN MEDICAL LDA (501506543),"4.087,00 €",03-12-2018,22-01-2018,360 dias,"Portugal, Aveiro, Ovar","Artigo 20.º, n.º 1, alínea a) do Código dos Contratos Públicos","","","","",,Não aplicável.,Não aplicável.,FALSE
Corretivos da Volémia s/ CHNM,Ajuste Direto Regime Geral,Aquisição de bens móveis,"33690000-3, Medicamentos vários",Hospital Dr. Francisco Zagalo - Ovar (501510150),"Labesfal, Laboratorios Almiro SA (501169580)","1.328,40 €",03-12-2018,22-01-2018,360 dias,"Portugal, Aveiro, Ovar","Artigo 20.º, n.º 1, alínea a) do Código dos Contratos Públicos","","","","",,Não aplicável.,Não aplicável.,FALSE
42002818 - AQUISIÇÃO MATERIAL CIRURGICO,Ajuste Direto Regime Geral,Aquisição de bens móveis,"33141125-2, Material de sutura cirúrgica",Hospital Dr. Francisco Zagalo - Ovar (501510150),"DOCWORLD, Lda (508592909)","294,00 €",03-12-2018,01-02-2018,330 dias,"Portugal, Aveiro, Ovar","Artigo 20.º, n.º 1, alínea d) do Código dos Contratos Públicos",28-12-2018,"252,00 €","",Aquisição inferior à quantidade prevista,,Não aplicável.,Não aplicável.,FALSE
42002818 - AQUISIÇÃO MATERIAL CIRURGICO,Ajuste Direto Regime Geral,Aquisição de bens móveis,"33141125-2, Material de sutura cirúrgica",Hospital Dr. Francisco Zagalo - Ovar (501510150),"MICRO MEDICA EQUIPAMENTOS  MEDICOS HOSPIT., LDA (501904956)","201,60 €",03-12-2018,01-02-2018,330 dias,"Portugal, Aveiro, Ovar","Artigo 20.º, n.º 1, alínea d) do Código dos Contratos Públicos",28-12-2018,"","",Montante total do lote não adquirido,,Não aplicável.,Não aplicável.,FALSE
42002818 - AQUISIÇÃO MATERIAL CIRURGICO,Ajuste Direto Regime Geral,Aquisição de bens móveis,"33141125-2, Material de sutura cirúrgica",Hospital Dr. Francisco Zagalo - Ovar (501510150),"MEDTRONIC PORTUGAL, LDA. (504223933)","2.614,00 €",03-12-2018,01-02-2018,330 dias,"Portugal, Aveiro, Ovar","Artigo 20.º, n.º 1, alínea d) do Código dos Contratos Públicos",28-12-2018,"1.307,00 €","",Aquisição inferior às quantidades previstas,,Não aplicável.,Não aplicável.,FALSE
42002818 - AQUISIÇÃO MATERIAL CIRURGICO,Ajuste Direto Regime Geral,Aquisição de bens móveis,"33141125-2, Material de sutura cirúrgica",Hospital Dr. Francisco Zagalo - Ovar (501510150),"FILSAT - EQUIPAMENTOS MÉDICO-CIENTÍFICOS, LDA. (506708616)","12,50 €",03-12-2018,01-02-2018,330 dias,"Portugal, Aveiro, Ovar","Artigo 20.º, n.º 1, alínea d) do Código dos Contratos Públicos",28-12-2018,"","",Montante total do lote não adquirido,,Não aplicável.,Não aplicável.,FALSE
42002818 - AQUISIÇÃO MATERIAL CIRURGICO,Ajuste Direto Regime Geral,Aquisição de bens móveis,"33141125-2, Material de sutura cirúrgica",Hospital Dr. Francisco Zagalo - Ovar (501510150),"ALCON PORTUGAL, LDA. (501251685)","252,00 €",03-12-2018,01-02-2018,330 dias,"Portugal, Aveiro, Ovar","Artigo 20.º, n.º 1, alínea d) do Código dos Contratos Públicos",28-12-2018,"252,00 €","","",,Não aplicável.,Não aplicável.,FALSE
42002818 - AQUISIÇÃO MATERIAL CIRURGICO,Ajuste Direto Regime Geral,Aquisição de bens móveis,"33141125-2, Material de sutura cirúrgica",Hospital Dr. Francisco Zagalo - Ovar (501510150),"SMITH & NEPHEW, LDA (503552461)","7.742,00 €",03-12-2018,01-02-2018,330 dias,"Portugal, Aveiro, Ovar","Artigo 20.º, n.º 1, alínea d) do Código dos Contratos Públicos",28-12-2018,"4.034,00 €","",Aquisição inferior às previsões,,Não aplicável.,Não aplicável.,FALSE
42002818 - AQUISIÇÃO MATERIAL CIRURGICO,Ajuste Direto Regime Geral,Aquisição de bens móveis,"33141125-2, Material de sutura cirúrgica",Hospital Dr. Francisco Zagalo - Ovar (501510150),H.R.-PRODUTOS QUIMICOS LDA (501895558),"629,52 €",03-12-2018,01-02-2018,330 dias,"Portugal, Aveiro, Ovar","Artigo 20.º, n.º 1, alínea d) do Código dos Contratos Públicos",28-12-2018,"423,72 €","",aquisição inferior às necessidades,,Não aplicável.,Não aplicável.,FALSE
