freguesia,acronym,validVotesPercentage,votes,dicofre
Sapardos,PPD/PSD.CDS-PP,48.28,70,161012
Sapardos,PS,44.14,64,161012
Sapardos,MPT,2.76,4,161012
Sapardos,PAN,1.38,2,161012
Sapardos,PND,1.38,2,161012
Sapardos,B.E.,0.69,1,161012
Sapardos,PCP-PEV,0.69,1,161012
Sapardos,PTP,0.69,1,161012
Sapardos,L,0,0,161012
Sapardos,MAS,0,0,161012
Sapardos,PCTP/MRPP,0,0,161012
Sapardos,PDA,0,0,161012
Sapardos,PNR,0,0,161012
Sapardos,POUS,0,0,161012
Sapardos,PPM,0,0,161012
Sapardos,PPV,0,0,161012
