Objeto do Contrato,Tipo de Procedimento,Tipo(s) de Contrato,CPVs,Entidade(s) Adjudicante(s),Entidade(s) Adjudicatária(s),Preço Contratual,Data de Publicação,Data de Celebração do Contrato,Prazo de Execução,Local de Execução,Fundamentação,Data de Fecho do Contrato,Preço Total Efetivo,Causas das Alterações ao Prazo,Causas das Alterações ao Preço,Estado,N.º registo do Acordo Quadro,Descrição do Acordo Quadro,Procedimento Centralizado
20170612 - Aquisição Reagentes p/ Projeto,Ajuste Direto Regime Geral,Aquisição de bens móveis,"33696500-0, Reagentes de laboratório",Instituto Nacional de Saúde Dr.Ricardo Jorge(INSA) (501427511),VWR International - Material de Laboratório Lda (503842770),"5.307,20 €",11-09-2017,08-09-2017,90 dias,"Portugal, Porto, Porto","Artigo 26.º, n.º 1, alínea b) do Código dos Contratos Públicos",12-09-2017,"5.307,20 €",,"",,Não aplicável.,Não aplicável.,FALSE
20170613 - Aquisição Mat. Cons. Clinico p/ Projeto,Ajuste Direto Regime Geral,Aquisição de bens móveis,"33140000-3, Material médico de consumo",Instituto Nacional de Saúde Dr.Ricardo Jorge(INSA) (501427511),VWR International - Material de Laboratório Lda (503842770),"1.376,80 €",11-09-2017,08-09-2017,90 dias,"Portugal, Porto, Porto","Artigo 26.º, n.º 1, alínea b) do Código dos Contratos Públicos",12-09-2017,"1.376,80 €",,"",,Não aplicável.,Não aplicável.,FALSE
20170549 - Aquisição de serviços de calibração de sondas,Ajuste Direto Regime Geral,Aquisição de serviços,"50433000-9, Serviços de calibragem","Instituto Nacional de Saúde Doutor Ricardo Jorge, I. P. (501427511)",Young Calibration (673900720),"1.200,00 €",11-09-2017,07-09-2017,90 dias,"Portugal, Porto, Porto","Artigo 20.º, n.º 1, alínea a) do Código dos Contratos Públicos",18-10-2017,"1.200,00 €",,"",,Não aplicável.,Não aplicável.,FALSE
20170431 - Meios de Cultura para Microbiologia,Ajuste Direto Regime Geral,Aquisição de bens móveis,"33696500-0, Reagentes de laboratório","Instituto Nacional de Saúde Doutor Ricardo Jorge, I. P. (501427511)","FISHER SCIENTIFIC, UNIPESSOAL, LDA (506429210)","262,00 €",08-09-2017,29-06-2017,186 dias,"Portugal, Lisboa, Lisboa","Artigo 24.º, n.º 1, alínea a) do Código dos Contratos Públicos",31-12-2017,"262,00 €",,"",,Não aplicável.,Não aplicável.,FALSE
20170650 - Aquisição de reagentes para diagnóstico molecular,Ajuste Direto Regime Geral,Aquisição de bens móveis,"33696500-0, Reagentes de laboratório",Instituto Nacional de Saúde Dr.Ricardo Jorge(INSA) (501427511),"ENZIFARMA - DIAGNÓSTICA E FARMACÊUTICA, S.A. (503636975)","2.850,00 €",08-09-2017,05-09-2017,90 dias,"Portugal, Porto, Porto","Artigo 20.º, n.º 1, alínea a) do Código dos Contratos Públicos",18-10-2017,"2.850,00 €",,"",,Não aplicável.,Não aplicável.,FALSE
20170111 - Material de consumo clínico,Ajuste Direto Regime Geral,Aquisição de bens móveis,"33000000-0, Equipamento médico, medicamentos e produtos para cuidados pessoais","Instituto Nacional de Saúde Doutor Ricardo Jorge, I. P. (501427511)","Bio-Rad Laboratories, Lda. (501301321)","140,08 €",08-09-2017,22-02-2017,323 dias,"Portugal, Lisboa, Lisboa","Artigo 26.º, n.º 1, alínea b) do Código dos Contratos Públicos",22-03-2017,"140,08 €",,"",,Não aplicável.,Não aplicável.,FALSE
20170110 - Aquisição de reagentes,Ajuste Direto Regime Geral,Aquisição de bens móveis,"33696000-5, Reagentes e meios de contraste","Instituto Nacional de Saúde Doutor Ricardo Jorge, I. P. (501427511)",Soquímica  (500274231),"1.048,00 €",08-09-2017,05-04-2017,283 dias,"Portugal, Lisboa, Lisboa","Artigo 26.º, n.º 1, alínea b) do Código dos Contratos Públicos",13-04-2017,"1.048,00 €",,"",,Não aplicável.,Não aplicável.,FALSE
20170109 - Aquisição de reagentes,Ajuste Direto Regime Geral,Aquisição de bens móveis,"33696000-5, Reagentes e meios de contraste","Instituto Nacional de Saúde Doutor Ricardo Jorge, I. P. (501427511)"," SIGMA ALDRICH QUIMICA, SL - SUCURSAL EM PORTUGAL (980148820)","323,80 €",08-09-2017,22-02-2017,323 dias,"Portugal, Lisboa, Lisboa","Artigo 26.º, n.º 1, alínea b) do Código dos Contratos Públicos",06-03-2017,"323,80 €",,"",,Não aplicável.,Não aplicável.,FALSE
20170099 - Aquisição de reagentes,Ajuste Direto Regime Geral,Aquisição de bens móveis,"33696000-5, Reagentes e meios de contraste","Instituto Nacional de Saúde Doutor Ricardo Jorge, I. P. (501427511)"," VWR INTERNATIONAL- MATERIAL DE LABORATORIO, LDA (503842770)","874,00 €",08-09-2017,22-02-2017,323 dias,"Portugal, Lisboa, Lisboa","Artigo 26.º, n.º 1, alínea b) do Código dos Contratos Públicos",27-03-2017,"874,00 €",,"",,Não aplicável.,Não aplicável.,FALSE
20170098 - Aquisição de reagentes,Ajuste Direto Regime Geral,Aquisição de bens móveis,"33696000-5, Reagentes e meios de contraste","Instituto Nacional de Saúde Doutor Ricardo Jorge, I. P. (501427511)","Alfagene, Novas Tecnologias Ciencias Vida Ldª (503387398)","71,62 €",07-09-2017,06-03-2017,322 dias,"Portugal, Lisboa, Lisboa","Artigo 26.º, n.º 1, alínea b) do Código dos Contratos Públicos",16-03-2017,"71,62 €",,"",,Não aplicável.,Não aplicável.,FALSE
20170086 - Aquisição de reagentes,Ajuste Direto Regime Geral,Aquisição de bens móveis,"33696000-5, Reagentes e meios de contraste","Instituto Nacional de Saúde Doutor Ricardo Jorge, I. P. (501427511)","ENZIFARMA - DIAGNÓSTICA E FARMACÊUTICA, S.A. (503636975)","413,75 €",07-09-2017,16-02-2017,323 dias,"Portugal, Lisboa, Lisboa","Artigo 26.º, n.º 1, alínea b) do Código dos Contratos Públicos",06-03-2017,"413,75 €",,"",,Não aplicável.,Não aplicável.,FALSE
20170083 - Aquisição de reagentes,Ajuste Direto Regime Geral,Aquisição de bens móveis,"33696000-5, Reagentes e meios de contraste","Instituto Nacional de Saúde Doutor Ricardo Jorge, I. P. (501427511)","FISHER SCIENTIFIC, UNIPESSOAL, LDA (506429210)","42,30 €",07-09-2017,24-02-2017,323 dias,"Portugal, Lisboa, Lisboa","Artigo 26.º, n.º 1, alínea b) do Código dos Contratos Públicos",10-03-2017,"42,30 €",,"",,Não aplicável.,Não aplicável.,FALSE
20170082 - Aquisição de reagentes,Ajuste Direto Regime Geral,Aquisição de bens móveis,"33696000-5, Reagentes e meios de contraste","Instituto Nacional de Saúde Doutor Ricardo Jorge, I. P. (501427511)"," SIGMA ALDRICH QUIMICA, SL - SUCURSAL EM PORTUGAL (980148820)","245,40 €",07-09-2017,24-02-2017,326 dias,"Portugal, Lisboa, Lisboa","Artigo 26.º, n.º 1, alínea b) do Código dos Contratos Públicos","","",,"",,Não aplicável.,Não aplicável.,FALSE
20170047 - Aquisição de reagentes,Ajuste Direto Regime Geral,Aquisição de bens móveis,"33696000-5, Reagentes e meios de contraste","Instituto Nacional de Saúde Doutor Ricardo Jorge, I. P. (501427511)","BIOMERIEUX PORTUGAL, LDA. (501524177)","1.890,00 €",07-09-2017,07-02-2017,330 dias,"Portugal, Lisboa, Lisboa","Artigo 26.º, n.º 1, alínea b) do Código dos Contratos Públicos",16-03-2017,"1.890,00 €",,"",,Não aplicável.,Não aplicável.,FALSE
20170046 - Aquisição de reagentes,Ajuste Direto Regime Geral,Aquisição de bens móveis,"33696000-5, Reagentes e meios de contraste","Instituto Nacional de Saúde Doutor Ricardo Jorge, I. P. (501427511)",Know-how Lda (509884296),"72,00 €",07-09-2017,06-02-2017,330 dias,"Portugal, Lisboa, Lisboa","Artigo 26.º, n.º 1, alínea b) do Código dos Contratos Públicos",18-01-2018,"72,00 €",,"",,Não aplicável.,Não aplicável.,FALSE
20170112 - Aquisição de reagentes,Ajuste Direto Regime Geral,Aquisição de bens móveis,"33696000-5, Reagentes e meios de contraste","Instituto Nacional de Saúde Doutor Ricardo Jorge, I. P. (501427511)","Bio-Rad Laboratories, Lda. (501301321)","592,00 €",07-09-2017,22-02-2017,323 dias,"Portugal, Lisboa, Lisboa","Artigo 26.º, n.º 1, alínea b) do Código dos Contratos Públicos","","",,"",,Não aplicável.,Não aplicável.,FALSE
20170121 - Aquisição de reagentes,Ajuste Direto Regime Geral,Aquisição de bens móveis,"33696000-5, Reagentes e meios de contraste","Instituto Nacional de Saúde Doutor Ricardo Jorge, I. P. (501427511)"," SIGMA ALDRICH QUIMICA, SL - SUCURSAL EM PORTUGAL (980148820)","1.002,60 €",07-09-2017,22-02-2017,322 dias,"Portugal, Lisboa, Lisboa","Artigo 26.º, n.º 1, alínea b) do Código dos Contratos Públicos",08-03-2017,"1.002,60 €",,"",,Não aplicável.,Não aplicável.,FALSE
20170156 - Material de consumo clínico,Ajuste Direto Regime Geral,Aquisição de bens móveis,"33000000-0, Equipamento médico, medicamentos e produtos para cuidados pessoais","Instituto Nacional de Saúde Doutor Ricardo Jorge, I. P. (501427511)","Alfagene, Novas Tecnologias Ciencias Vida Ldª (503387398)","101,20 €",06-09-2017,06-03-2017,314 dias,"Portugal, Lisboa, Lisboa","Artigo 26.º, n.º 1, alínea b) do Código dos Contratos Públicos",11-04-2017,"101,20 €",,"",,Não aplicável.,Não aplicável.,FALSE
20170155 - Aquisição de reagentes,Ajuste Direto Regime Geral,Aquisição de bens móveis,"33696500-0, Reagentes de laboratório","Instituto Nacional de Saúde Doutor Ricardo Jorge, I. P. (501427511)","Alfagene, Novas Tecnologias Ciencias Vida Ldª (503387398)","295,00 €",06-09-2017,08-03-2017,314 dias,"Portugal, Lisboa, Lisboa","Artigo 26.º, n.º 1, alínea b) do Código dos Contratos Públicos",22-03-2017,"295,00 €",,"",,Não aplicável.,Não aplicável.,FALSE
20170157 - Aquisição de reagentes,Ajuste Direto Regime Geral,Aquisição de bens móveis,"33696000-5, Reagentes e meios de contraste","Instituto Nacional de Saúde Doutor Ricardo Jorge, I. P. (501427511)","Alfagene, Novas Tecnologias Ciencias Vida Ldª (503387398)","1.145,28 €",06-09-2017,10-03-2017,314 dias,"Portugal, Lisboa, Lisboa","Artigo 26.º, n.º 1, alínea b) do Código dos Contratos Públicos",04-07-2017,"1.145,28 €",,"",,Não aplicável.,Não aplicável.,FALSE
20170168 - Aquisição de reagentes,Ajuste Direto Regime Geral,Aquisição de bens móveis,"33696000-5, Reagentes e meios de contraste","Instituto Nacional de Saúde Doutor Ricardo Jorge, I. P. (501427511)","ROCHE SISTEMAS DE DIAGNOSTICOS, LDA (504282921)","1.320,00 €",06-09-2017,24-03-2017,285 dias,"Portugal, Lisboa, Lisboa","Artigo 26.º, n.º 1, alínea b) do Código dos Contratos Públicos",31-03-2017,"1.320,00 €",,"",,Não aplicável.,Não aplicável.,FALSE
20170181 - Aquisição de reagentes,Ajuste Direto Regime Geral,Aquisição de bens móveis,"33696000-5, Reagentes e meios de contraste","Instituto Nacional de Saúde Doutor Ricardo Jorge, I. P. (501427511)","Alfagene, Novas Tecnologias Ciencias Vida Ldª (503387398)","3.368,20 €",06-09-2017,10-03-2017,322 dias,"Portugal, Lisboa, Lisboa","Artigo 26.º, n.º 1, alínea b) do Código dos Contratos Públicos","","",,"",,Não aplicável.,Não aplicável.,FALSE
20170182 - Material de consumo clínico,Ajuste Direto Regime Geral,Aquisição de bens móveis,"33000000-0, Equipamento médico, medicamentos e produtos para cuidados pessoais","Instituto Nacional de Saúde Doutor Ricardo Jorge, I. P. (501427511)"," SIGMA ALDRICH QUIMICA, SL - SUCURSAL EM PORTUGAL (980148820)","222,20 €",06-09-2017,14-03-2017,322 dias,"Portugal, Lisboa, Lisboa","Artigo 26.º, n.º 1, alínea b) do Código dos Contratos Públicos",27-03-2017,"222,20 €",,"",,Não aplicável.,Não aplicável.,FALSE
20170255 - Aquisição de reagentes,Ajuste Direto Regime Geral,Aquisição de bens móveis,"33696000-5, Reagentes e meios de contraste","Instituto Nacional de Saúde Doutor Ricardo Jorge, I. P. (501427511)"," TEBU-BIO, UNIPESSOAL, LDA (509036171)","330,00 €",06-09-2017,23-03-2017,280 dias,"Portugal, Lisboa, Lisboa","Artigo 26.º, n.º 1, alínea b) do Código dos Contratos Públicos",11-04-2017,"330,00 €",,"",,Não aplicável.,Não aplicável.,FALSE
20170254 - Aquisição de reagentes,Ajuste Direto Regime Geral,Aquisição de bens móveis,"33696000-5, Reagentes e meios de contraste","Instituto Nacional de Saúde Doutor Ricardo Jorge, I. P. (501427511)","Alfagene, Novas Tecnologias Ciencias Vida Ldª (503387398)","1.776,86 €",06-09-2017,27-03-2017,277 dias,"Portugal, Lisboa, Lisboa","Artigo 26.º, n.º 1, alínea b) do Código dos Contratos Públicos","","",,"",,Não aplicável.,Não aplicável.,FALSE
20170244 - Aquisição de reagentes,Ajuste Direto Regime Geral,Aquisição de bens móveis,"33696000-5, Reagentes e meios de contraste","Instituto Nacional de Saúde Doutor Ricardo Jorge, I. P. (501427511)","FISHER SCIENTIFIC, UNIPESSOAL, LDA (506429210)","77,00 €",06-09-2017,29-03-2017,273 dias,"Portugal, Lisboa, Lisboa","Artigo 26.º, n.º 1, alínea b) do Código dos Contratos Públicos",11-04-2017,"77,00 €",,"",,Não aplicável.,Não aplicável.,FALSE
Concurso Público 37-2017,Concurso público,Aquisição de bens móveis,"33696500-0, Reagentes de laboratório","Instituto Nacional de Saúde Doutor Ricardo Jorge, I. P. (501427511)","CSP SAUDE - CENTRO DE SERVICOS PARTILHADOS, SA. (508440246)","868,64 €",06-09-2017,01-09-2017,122 dias,"Portugal, Lisboa, Lisboa","Artigo 20.º, n.º 1, alínea b) do Código dos Contratos Públicos",07-11-2017,"868,64 €",,"",,Não aplicável.,Não aplicável.,FALSE
Concurso Público 37-2017,Concurso público,Aquisição de bens móveis,"33696500-0, Reagentes de laboratório","Instituto Nacional de Saúde Doutor Ricardo Jorge, I. P. (501427511)","Werfen Portugal, Ldª (501086110)","799,95 €",06-09-2017,01-09-2017,122 dias,"Portugal, Lisboa, Lisboa","Artigo 20.º, n.º 1, alínea b) do Código dos Contratos Públicos",18-10-2017,"799,95 €",,"",,Não aplicável.,Não aplicável.,FALSE
Concurso Público 37-2017,Concurso público,Aquisição de bens móveis,"33696500-0, Reagentes de laboratório","Instituto Nacional de Saúde Doutor Ricardo Jorge, I. P. (501427511)","VWR INTERNACIONAL - MATERIAL DE LABORATÓRIO, LDA. (503842770)","338,10 €",06-09-2017,01-09-2017,122 dias,"Portugal, Lisboa, Lisboa","Artigo 20.º, n.º 1, alínea b) do Código dos Contratos Públicos",21-09-2017,"338,10 €",,"",,Não aplicável.,Não aplicável.,FALSE
Concurso Público 37-2017,Concurso público,Aquisição de bens móveis,"33696500-0, Reagentes de laboratório","Instituto Nacional de Saúde Doutor Ricardo Jorge, I. P. (501427511)","LABORSPIRIT, LDA (507485149)","1.271,02 €",06-09-2017,01-09-2017,122 dias,"Portugal, Lisboa, Lisboa","Artigo 20.º, n.º 1, alínea b) do Código dos Contratos Públicos",12-10-2017,"1.271,02 €",,"",,Não aplicável.,Não aplicável.,FALSE
20170241 - Aquisição de reagentes,Ajuste Direto Regime Geral,Aquisição de bens móveis,"33696000-5, Reagentes e meios de contraste","Instituto Nacional de Saúde Doutor Ricardo Jorge, I. P. (501427511)"," SIGMA ALDRICH QUIMICA, SL - SUCURSAL EM PORTUGAL (980148820)","661,50 €",06-09-2017,31-03-2017,271 dias,"Portugal, Lisboa, Lisboa","Artigo 26.º, n.º 1, alínea b) do Código dos Contratos Públicos",10-04-2017,"661,50 €",,"",,Não aplicável.,Não aplicável.,FALSE
20170238 - Aquisição de reagentes,Ajuste Direto Regime Geral,Aquisição de bens móveis,"33696000-5, Reagentes e meios de contraste","Instituto Nacional de Saúde Doutor Ricardo Jorge, I. P. (501427511)","Specanalica, Equipamentos Cientificos Lda (507350871)","325,80 €",06-09-2017,21-03-2017,316 dias,"Portugal, Lisboa, Lisboa","Artigo 26.º, n.º 1, alínea b) do Código dos Contratos Públicos",10-01-2018,"325,80 €",,"",,Não aplicável.,Não aplicável.,FALSE
20170237 - Aquisição de reagentes,Ajuste Direto Regime Geral,Aquisição de bens móveis,"33696000-5, Reagentes e meios de contraste","Instituto Nacional de Saúde Doutor Ricardo Jorge, I. P. (501427511)","Alfagene, Novas Tecnologias Ciencias Vida Ldª (503387398)","748,00 €",06-09-2017,29-03-2017,243 dias,"Portugal, Lisboa, Lisboa","Artigo 26.º, n.º 1, alínea b) do Código dos Contratos Públicos",04-05-2017,"748,00 €",,"",,Não aplicável.,Não aplicável.,FALSE
20170236 - Aquisição de reagentes,Ajuste Direto Regime Geral,Aquisição de bens móveis,"33696000-5, Reagentes e meios de contraste","Instituto Nacional de Saúde Doutor Ricardo Jorge, I. P. (501427511)"," SIGMA ALDRICH QUIMICA, SL - SUCURSAL EM PORTUGAL (980148820)","169,00 €",06-09-2017,21-03-2017,315 dias,"Portugal, Lisboa, Lisboa","Artigo 26.º, n.º 1, alínea b) do Código dos Contratos Públicos",10-04-2017,"169,00 €",,"",,Não aplicável.,Não aplicável.,FALSE
20170235 - Aquisição de reagentes,Ajuste Direto Regime Geral,Aquisição de bens móveis,"33696000-5, Reagentes e meios de contraste","Instituto Nacional de Saúde Doutor Ricardo Jorge, I. P. (501427511)","IZASA Scientific, Lda. (513252088)","278,00 €",06-09-2017,21-03-2017,315 dias,"Portugal, Lisboa, Lisboa","Artigo 26.º, n.º 1, alínea b) do Código dos Contratos Públicos",18-05-2017,"278,00 €",,"",,Não aplicável.,Não aplicável.,FALSE
20170123 - Material de consumo clínico,Ajuste Direto Regime Geral,Aquisição de bens móveis,"33000000-0, Equipamento médico, medicamentos e produtos para cuidados pessoais","Instituto Nacional de Saúde Doutor Ricardo Jorge, I. P. (501427511)","Bio-Rad Laboratories, Lda. (501301321)","270,32 €",06-09-2017,21-04-2017,352 dias,"Portugal, Lisboa, Lisboa","Artigo 26.º, n.º 1, alínea b) do Código dos Contratos Públicos",21-04-2017,"270,32 €",,"",,Não aplicável.,Não aplicável.,FALSE
20170124 - Aquisição de reagentes,Ajuste Direto Regime Geral,Aquisição de bens móveis,"33696000-5, Reagentes e meios de contraste","Instituto Nacional de Saúde Doutor Ricardo Jorge, I. P. (501427511)","ILC - INSTRUMENTOS DE LABORAT. E CIENTIFICOS, LDA (500948208)","1.005,00 €",06-09-2017,10-03-2017,314 dias,"Portugal, Lisboa, Lisboa","Artigo 26.º, n.º 1, alínea b) do Código dos Contratos Públicos",22-03-2017,"1.005,00 €",,"",,Não aplicável.,Não aplicável.,FALSE
20170125 - Aquisição de reagentes,Ajuste Direto Regime Geral,Aquisição de bens móveis,"33696000-5, Reagentes e meios de contraste","Instituto Nacional de Saúde Doutor Ricardo Jorge, I. P. (501427511)"," BIOPORTUGAL QUIMICO, FARMACEUTICA, LDA (502380543)","646,30 €",06-09-2017,08-03-2017,314 dias,"Portugal, Lisboa, Lisboa","Artigo 26.º, n.º 1, alínea b) do Código dos Contratos Públicos",14-03-2017,"646,30 €",,"",,Não aplicável.,Não aplicável.,FALSE
CP 39-2017,Concurso público,Aquisição de serviços,"50730000-1, Serviços de reparação e manutenção de grupos de refrigeração","Instituto Nacional de Saúde Doutor Ricardo Jorge, I. P. (501427511)","Estec-Engenharia Gest.S.Técnicas,Ld (502423250)","12.558,67 €",06-09-2017,30-08-2017,123 dias,"Portugal, Lisboa, Lisboa","Artigo 20.º, n.º 1, alínea b) do Código dos Contratos Públicos",15-12-2017,"12.558,67 €",,"",,Não aplicável.,Não aplicável.,FALSE
Material de Manutenção e Conservação de Cromatografia,Concurso público,Aquisição de bens móveis,"33140000-3, Material médico de consumo","Instituto Nacional de Saúde Doutor Ricardo Jorge, I. P. (501427511)","VWR INTERNACIONAL - MATERIAL DE LABORATÓRIO, LDA. (503842770)","3.829,04 €",05-09-2017,24-05-2017,221 dias,"Portugal, Lisboa, Lisboa","Artigo 20.º, n.º 1, alínea b) do Código dos Contratos Públicos",25-08-2017,"3.829,04 €",,"",,Não aplicável.,Não aplicável.,FALSE
Material de Manutenção e Conservação de Cromatografia,Concurso público,Aquisição de bens móveis,"33140000-3, Material médico de consumo","Instituto Nacional de Saúde Doutor Ricardo Jorge, I. P. (501427511)"," UNICAM - SISTEMAS ANALITICOS, LDA (502614625)","2.011,08 €",05-09-2017,20-06-2017,221 dias,"Portugal, Lisboa, Lisboa","Artigo 20.º, n.º 1, alínea b) do Código dos Contratos Públicos",05-07-2017,"1.993,48 €",,Não foram adquiridas as quantidades inicialmente previstas,,Não aplicável.,Não aplicável.,FALSE
Material de Manutenção e Conservação de Cromatografia,Concurso público,Aquisição de bens móveis,"33140000-3, Material médico de consumo","Instituto Nacional de Saúde Doutor Ricardo Jorge, I. P. (501427511)",Soquímica  (500274231),"2.893,20 €",05-09-2017,20-06-2017,221 dias,"Portugal, Lisboa, Lisboa","Artigo 20.º, n.º 1, alínea b) do Código dos Contratos Públicos",12-10-2017,"2.893,20 €",,"",,Não aplicável.,Não aplicável.,FALSE
Material de Manutenção e Conservação de Cromatografia,Concurso público,Aquisição de bens móveis,"33140000-3, Material médico de consumo","Instituto Nacional de Saúde Doutor Ricardo Jorge, I. P. (501427511)","SOLITICA - Soluções Analíticas, Unipessoal, Lda (510824641)","3.096,00 €",05-09-2017,20-06-2017,221 dias,"Portugal, Lisboa, Lisboa","Artigo 20.º, n.º 1, alínea b) do Código dos Contratos Públicos",06-11-2017,"3.096,00 €",,"",,Não aplicável.,Não aplicável.,FALSE
Material de Manutenção e Conservação de Cromatografia,Concurso público,Aquisição de bens móveis,"33140000-3, Material médico de consumo","Instituto Nacional de Saúde Doutor Ricardo Jorge, I. P. (501427511)","MALDRAL, S.A (503315869)","1.623,26 €",05-09-2017,20-06-2017,221 dias,"Portugal, Lisboa, Lisboa","Artigo 20.º, n.º 1, alínea b) do Código dos Contratos Públicos",30-10-2017,"1.623,26 €",,"",,Não aplicável.,Não aplicável.,FALSE
Material de Manutenção e Conservação de Cromatografia,Concurso público,Aquisição de bens móveis,"33140000-3, Material médico de consumo","Instituto Nacional de Saúde Doutor Ricardo Jorge, I. P. (501427511)","IZASA Scientific, Lda. (513252088)","1.528,00 €",05-09-2017,20-06-2017,221 dias,"Portugal, Lisboa, Lisboa","Artigo 20.º, n.º 1, alínea b) do Código dos Contratos Públicos",06-11-2017,"1.528,00 €",,"",,Não aplicável.,Não aplicável.,FALSE
Material de Manutenção e Conservação de Cromatografia,Concurso público,Aquisição de bens móveis,"33140000-3, Material médico de consumo","Instituto Nacional de Saúde Doutor Ricardo Jorge, I. P. (501427511)","ILC - INSTRUMENTOS DE LABORAT. E CIENTIFICOS, LDA (500948208)","6.726,26 €",05-09-2017,20-06-2017,221 dias,"Portugal, Lisboa, Lisboa","Artigo 20.º, n.º 1, alínea b) do Código dos Contratos Públicos",02-08-2017,"6.726,26 €",,"",,Não aplicável.,Não aplicável.,FALSE
Material de Manutenção e Conservação de Cromatografia,Concurso público,Aquisição de bens móveis,"33140000-3, Material médico de consumo","Instituto Nacional de Saúde Doutor Ricardo Jorge, I. P. (501427511)"," AMBICONTROL - CONTROLO DE POLUICAO, LDA (502715464)","5.495,00 €",05-09-2017,24-05-2017,221 dias,"Portugal, Lisboa, Lisboa","Artigo 20.º, n.º 1, alínea b) do Código dos Contratos Públicos",28-06-2017,"5.495,00 €",,"",,Não aplicável.,Não aplicável.,FALSE
20170578 - Aquisição de reagentes,Ajuste Direto Regime Geral,Aquisição de bens móveis,"33696500-0, Reagentes de laboratório","Instituto Nacional de Saúde Doutor Ricardo Jorge, I. P. (501427511)","Alfagene, Novas Tecnologias Ciencias Vida Ldª (503387398)","225,50 €",05-09-2017,25-08-2017,128 dias,"Portugal, Lisboa, Lisboa","Artigo 24.º, n.º 1, alínea a) do Código dos Contratos Públicos",12-09-2017,"225,50 €",,"",,Não aplicável.,Não aplicável.,FALSE
20170585 - Aquisição de reagentes para diagnóstico de Legionella,Ajuste Direto Regime Geral,Aquisição de bens móveis,"33696500-0, Reagentes de laboratório","Instituto Nacional de Saúde Doutor Ricardo Jorge, I. P. (501427511)"," BIOPORTUGAL QUIMICO, FARMACEUTICA, LDA (502380543)","4.030,00 €",05-09-2017,07-08-2017,150 dias,"Portugal, Lisboa, Lisboa","Artigo 24.º, n.º 1, alínea a) do Código dos Contratos Públicos",19-12-2017,"4.030,00 €",,"",,Não aplicável.,Não aplicável.,FALSE
CP 36-2017,Concurso público,Aquisição de bens móveis,"33140000-3, Material médico de consumo","Instituto Nacional de Saúde Doutor Ricardo Jorge, I. P. (501427511)","Waters Technologies LC-MS Portugal, Lda (510433669)","7.888,85 €",05-09-2017,23-08-2017,160 dias,"Portugal, Lisboa, Lisboa","Artigo 20.º, n.º 1, alínea b) do Código dos Contratos Públicos",29-08-2017,"7.888,85 €",,"",,Não aplicável.,Não aplicável.,FALSE
CP 36-2017,Concurso público,Aquisição de bens móveis,"33140000-3, Material médico de consumo","Instituto Nacional de Saúde Doutor Ricardo Jorge, I. P. (501427511)"," VWR INTERNATIONAL- MATERIAL DE LABORATORIO, LDA (503842770)","1.153,60 €",05-09-2017,22-08-2017,160 dias,"Portugal, Lisboa, Lisboa","Artigo 20.º, n.º 1, alínea b) do Código dos Contratos Públicos",13-10-2017,"1.153,60 €",,"",,Não aplicável.,Não aplicável.,FALSE
CP 36-2017,Concurso público,Aquisição de bens móveis,"33140000-3, Material médico de consumo","Instituto Nacional de Saúde Doutor Ricardo Jorge, I. P. (501427511)",Soquímica  (500274231),"1.726,80 €",05-09-2017,23-08-2017,160 dias,"Portugal, Lisboa, Lisboa","Artigo 20.º, n.º 1, alínea b) do Código dos Contratos Públicos",04-10-2017,"1.726,80 €",,"",,Não aplicável.,Não aplicável.,FALSE
CP 36-2017,Concurso público,Aquisição de bens móveis,"33140000-3, Material médico de consumo","Instituto Nacional de Saúde Doutor Ricardo Jorge, I. P. (501427511)","REAGENTE 5 - QUIMICA E ELECTRONICA, LDA (501194053)","150,00 €",05-09-2017,23-08-2017,160 dias,"Portugal, Lisboa, Lisboa","Artigo 20.º, n.º 1, alínea b) do Código dos Contratos Públicos",23-08-2017,"150,00 €",,"",,Não aplicável.,Não aplicável.,FALSE
CP 36-2017,Concurso público,Aquisição de bens móveis,"33140000-3, Material médico de consumo","Instituto Nacional de Saúde Doutor Ricardo Jorge, I. P. (501427511)",Menarini diagnosticos Lda. (502610069),"54,64 €",05-09-2017,23-08-2017,160 dias,"Portugal, Lisboa, Lisboa","Artigo 20.º, n.º 1, alínea b) do Código dos Contratos Públicos",05-09-2017,"54,64 €",,"",,Não aplicável.,Não aplicável.,FALSE
CP 36-2017,Concurso público,Aquisição de bens móveis,"33140000-3, Material médico de consumo","Instituto Nacional de Saúde Doutor Ricardo Jorge, I. P. (501427511)","Laborspirit, Ldª (507485149)","2.478,18 €",05-09-2017,23-08-2017,160 dias,"Portugal, Lisboa, Lisboa","Artigo 20.º, n.º 1, alínea b) do Código dos Contratos Públicos",04-10-2017,"2.478,18 €",,"",,Não aplicável.,Não aplicável.,FALSE
CP 36-2017,Concurso público,Aquisição de bens móveis,"33140000-3, Material médico de consumo","Instituto Nacional de Saúde Doutor Ricardo Jorge, I. P. (501427511)","ILC - INSTRUMENTOS DE LABORAT. E CIENTIFICOS, LDA (500948208)","1.959,10 €",05-09-2017,23-08-2017,160 dias,"Portugal, Lisboa, Lisboa","Artigo 20.º, n.º 1, alínea b) do Código dos Contratos Públicos",27-09-2017,"1.959,10 €",,"",,Não aplicável.,Não aplicável.,FALSE
CP 36-2017,Concurso público,Aquisição de bens móveis,"33140000-3, Material médico de consumo","Instituto Nacional de Saúde Doutor Ricardo Jorge, I. P. (501427511)"," AMBICONTROL - CONTROLO DE POLUICAO, LDA (502715464)","2.560,00 €",05-09-2017,23-08-2017,160 dias,"Portugal, Lisboa, Lisboa","Artigo 20.º, n.º 1, alínea b) do Código dos Contratos Públicos",07-12-2017,"2.560,00 €",,"",,Não aplicável.,Não aplicável.,FALSE
CP 36-2017,Concurso público,Aquisição de bens móveis,"33140000-3, Material médico de consumo","Instituto Nacional de Saúde Doutor Ricardo Jorge, I. P. (501427511)","AMBERGO - EST. E. EQ. CONTROLO AMBIENTAL, LDA (503741353)","1.030,00 €",05-09-2017,23-08-2017,160 dias,"Portugal, Lisboa, Lisboa","Artigo 20.º, n.º 1, alínea b) do Código dos Contratos Públicos",29-09-2017,"1.030,00 €",,"",,Não aplicável.,Não aplicável.,FALSE
Concurso Público nº 24-2017,Concurso público,Aquisição de serviços,"77310000-6, Serviços de plantação e manutenção de áreas verdes","Instituto Nacional de Saúde Doutor Ricardo Jorge, I. P. (501427511)","Espaços Verdes Projetos e Construção, Lda (501188568)","25.110,00 €",05-09-2017,19-05-2017,956 dias,"Portugal, Lisboa, Lisboa","Artigo 20.º, n.º 1, alínea b) do Código dos Contratos Públicos","","",,"",,Não aplicável.,Não aplicável.,FALSE
Concurso Público nº 12-2017,Concurso público,Aquisição de bens móveis,"33140000-3, Material médico de consumo","Instituto Nacional de Saúde Doutor Ricardo Jorge, I. P. (501427511)"," VWR INTERNATIONAL- MATERIAL DE LABORATORIO, LDA (503842770)","46.689,36 €",04-09-2017,14-07-2017,170 dias,"Portugal, Lisboa, Lisboa","Artigo 20.º, n.º 1, alínea b) do Código dos Contratos Públicos",19-12-2017,"46.689,36 €",,"",,Não aplicável.,Não aplicável.,FALSE
Concurso Público nº 12-2017,Concurso público,Aquisição de bens móveis,"33140000-3, Material médico de consumo","Instituto Nacional de Saúde Doutor Ricardo Jorge, I. P. (501427511)","SARSTEDT TECNOL.DE LABORATORIO, LDA (503019461)","29.440,23 €",04-09-2017,14-07-2017,170 dias,"Portugal, Lisboa, Lisboa","Artigo 20.º, n.º 1, alínea b) do Código dos Contratos Públicos",18-12-2017,"26.269,63 €",,Não foram adquiridas as quantidades inicialmente previstas,,Não aplicável.,Não aplicável.,FALSE
Concurso Público nº 12-2017,Concurso público,Aquisição de bens móveis,"33140000-3, Material médico de consumo","Instituto Nacional de Saúde Doutor Ricardo Jorge, I. P. (501427511)","Z-MED Equipamentos Médicos e Hospitalares, Lda (508531535)","32,40 €",04-09-2017,24-08-2017,129 dias,"Portugal, Lisboa, Lisboa","Artigo 20.º, n.º 1, alínea b) do Código dos Contratos Públicos",24-08-2017,"32,40 €",,"",,Não aplicável.,Não aplicável.,FALSE
Concurso Público nº 12-2017,Concurso público,Aquisição de bens móveis,"33140000-3, Material médico de consumo","Instituto Nacional de Saúde Doutor Ricardo Jorge, I. P. (501427511)","SOLITICA - Soluções Analíticas, Unipessoal, Lda (510824641)","971,00 €",04-09-2017,26-07-2017,158 dias,"Portugal, Lisboa, Lisboa","Artigo 20.º, n.º 1, alínea b) do Código dos Contratos Públicos",09-10-2017,"971,00 €",,"",,Não aplicável.,Não aplicável.,FALSE
Concurso Público nº 12-2017,Concurso público,Aquisição de bens móveis,"33140000-3, Material médico de consumo","Instituto Nacional de Saúde Doutor Ricardo Jorge, I. P. (501427511)"," PVL - PRODUTOS PARA LABORATORIO, LDA. (501411852)","1.492,80 €",04-09-2017,26-07-2017,158 dias,"Portugal, Lisboa, Lisboa","Artigo 20.º, n.º 1, alínea b) do Código dos Contratos Públicos",28-07-2017,"1.492,80 €",,"",,Não aplicável.,Não aplicável.,FALSE
Concurso Público nº 12-2017,Concurso público,Aquisição de bens móveis,"33140000-3, Material médico de consumo","Instituto Nacional de Saúde Doutor Ricardo Jorge, I. P. (501427511)","Normax - Fábrica de Vidros Científicos, Lda (500203130)","1.639,00 €",04-09-2017,26-07-2017,158 dias,"Portugal, Lisboa, Lisboa","Artigo 20.º, n.º 1, alínea b) do Código dos Contratos Públicos",23-10-2017,"1.639,00 €",,"",,Não aplicável.,Não aplicável.,FALSE
Concurso Público nº 12-2017,Concurso público,Aquisição de bens móveis,"33140000-3, Material médico de consumo","Instituto Nacional de Saúde Doutor Ricardo Jorge, I. P. (501427511)","Laborspirit, Ldª (507485149)","95,88 €",04-09-2017,20-07-2017,164 dias,"Portugal, Lisboa, Lisboa","Artigo 20.º, n.º 1, alínea b) do Código dos Contratos Públicos",02-11-2017,"95,88 €",,"",,Não aplicável.,Não aplicável.,FALSE
Concurso Público nº 12-2017,Concurso público,Aquisição de bens móveis,"33140000-3, Material médico de consumo","Instituto Nacional de Saúde Doutor Ricardo Jorge, I. P. (501427511)",IBERLAB- EQUIPAMENTOS DE LABORATORIO LDA (503406694),"455,25 €",04-09-2017,26-07-2017,158 dias,"Portugal, Lisboa, Lisboa","Artigo 20.º, n.º 1, alínea b) do Código dos Contratos Públicos",28-07-2017,"455,25 €",,"",,Não aplicável.,Não aplicável.,FALSE
Concurso Público nº 12-2017,Concurso público,Aquisição de bens móveis,"33140000-3, Material médico de consumo","Instituto Nacional de Saúde Doutor Ricardo Jorge, I. P. (501427511)","Frilabo, Biotecnologia e Assitência Técnica Ldª (507958861)","4.169,80 €",04-09-2017,26-07-2017,158 dias,"Portugal, Lisboa, Lisboa","Artigo 20.º, n.º 1, alínea b) do Código dos Contratos Públicos",10-11-2017,"4.169,80 €",,"",,Não aplicável.,Não aplicável.,FALSE
Concurso Público nº 12-2017,Concurso público,Aquisição de bens móveis,"33140000-3, Material médico de consumo","Instituto Nacional de Saúde Doutor Ricardo Jorge, I. P. (501427511)","ESTERIPLAS - PRODUTOS AREA SAUDE, LDA (502020776)","217,50 €",04-09-2017,21-07-2017,163 dias,"Portugal, Lisboa, Lisboa","Artigo 20.º, n.º 1, alínea b) do Código dos Contratos Públicos",19-12-2017,"217,50 €",,"",,Não aplicável.,Não aplicável.,FALSE
Concurso Público nº 12-2017,Concurso público,Aquisição de bens móveis,"33140000-3, Material médico de consumo","Instituto Nacional de Saúde Doutor Ricardo Jorge, I. P. (501427511)","ENZIFARMA - DIAGNÓSTICA E FARMACÊUTICA, S.A. (503636975)","164,27 €",04-09-2017,07-08-2017,146 dias,"Portugal, Lisboa, Lisboa","Artigo 20.º, n.º 1, alínea b) do Código dos Contratos Públicos",07-12-2017,"164,27 €",,"",,Não aplicável.,Não aplicável.,FALSE
Concurso Público nº 12-2017,Concurso público,Aquisição de bens móveis,"33140000-3, Material médico de consumo","Instituto Nacional de Saúde Doutor Ricardo Jorge, I. P. (501427511)","CSP SAUDE - CENTRO DE SERVICOS PARTILHADOS, SA. (508440246)","36,00 €",04-09-2017,17-07-2017,170 dias,"Portugal, Lisboa, Lisboa","Artigo 20.º, n.º 1, alínea b) do Código dos Contratos Públicos",17-07-2017,"36,00 €",,"",,Não aplicável.,Não aplicável.,FALSE
Concurso Público nº 12-2017,Concurso público,Aquisição de bens móveis,"33140000-3, Material médico de consumo","Instituto Nacional de Saúde Doutor Ricardo Jorge, I. P. (501427511)","Bio-Rad Laboratories, Lda. (501301321)","1.638,80 €",04-09-2017,26-07-2017,177 dias,"Portugal, Lisboa, Lisboa","Artigo 20.º, n.º 1, alínea b) do Código dos Contratos Públicos",03-10-2017,"1.638,80 €",,"",,Não aplicável.,Não aplicável.,FALSE
Concurso Público nº 12-2017,Concurso público,Aquisição de bens móveis,"33140000-3, Material médico de consumo","Instituto Nacional de Saúde Doutor Ricardo Jorge, I. P. (501427511)","Alfagene, Novas Tecnologias Ciencias Vida, Ldª (503387398)","848,73 €",04-09-2017,26-07-2017,177 dias,"Portugal, Lisboa, Lisboa","Artigo 20.º, n.º 1, alínea b) do Código dos Contratos Públicos",26-12-2017,"848,73 €",,"",,Não aplicável.,Não aplicável.,FALSE
CP 28-2017 - Reagentes para Bioquímica Genética,Concurso público,Aquisição de bens móveis,"33696500-0, Reagentes de laboratório","Instituto Nacional de Saúde Doutor Ricardo Jorge, I. P. (501427511)","MALDRAL, S.A (503315869)","4.604,99 €",04-09-2017,11-05-2017,234 dias,"Portugal, Lisboa, Lisboa","Artigo 20.º, n.º 1, alínea b) do Código dos Contratos Públicos",05-12-2017,"4.604,99 €",,"",,Não aplicável.,Não aplicável.,FALSE
CP 28-2017 - Reagentes para Bioquímica Genética,Concurso público,Aquisição de bens móveis,"33696500-0, Reagentes de laboratório","Instituto Nacional de Saúde Doutor Ricardo Jorge, I. P. (501427511)","Bioportugal Química Farmacêutica, Ldª (502380543)","450,00 €",04-09-2017,11-05-2017,234 dias,"Portugal, Lisboa, Lisboa","Artigo 20.º, n.º 1, alínea b) do Código dos Contratos Públicos",21-11-2017,"450,00 €",,"",,Não aplicável.,Não aplicável.,FALSE
20170515 - Aquisição de material de consumo administrativo,Ajuste Direto Regime Geral,Aquisição de bens móveis,"30100000-0, Máquinas, equipamento e material de escritório, excepto computadores, impressoras e mobiliário","Instituto Nacional de Saúde Doutor Ricardo Jorge, I. P. (501427511)",OHM Tecnica (504059521),"788,40 €",01-09-2017,24-07-2017,180 dias,"Portugal, Lisboa, Lisboa","Artigo 20.º, n.º 1, alínea a) do Código dos Contratos Públicos",31-12-2017,"",,Produto não entregue pelo fornecedor,,Não aplicável.,Não aplicável.,FALSE
20170515 - Aquisição de material de consumo administrativo,Ajuste Direto Regime Geral,Aquisição de bens móveis,"30100000-0, Máquinas, equipamento e material de escritório, excepto computadores, impressoras e mobiliário","Instituto Nacional de Saúde Doutor Ricardo Jorge, I. P. (501427511)","OLMAR - Artigos de Papelaria, Ldª (508831989)","3.678,10 €",01-09-2017,24-07-2017,180 dias,"Portugal, Lisboa, Lisboa","Artigo 20.º, n.º 1, alínea a) do Código dos Contratos Públicos",03-10-2017,"3.678,10 €",,"",,Não aplicável.,Não aplicável.,FALSE
20170515 - Aquisição de material de consumo administrativo,Ajuste Direto Regime Geral,Aquisição de bens móveis,"30100000-0, Máquinas, equipamento e material de escritório, excepto computadores, impressoras e mobiliário","Instituto Nacional de Saúde Doutor Ricardo Jorge, I. P. (501427511)","BIOMERIEUX PORTUGAL, LDA. (501524177)","238,80 €",01-09-2017,24-07-2017,180 dias,"Portugal, Lisboa, Lisboa","Artigo 20.º, n.º 1, alínea a) do Código dos Contratos Públicos",18-09-2017,"238,80 €",,"",,Não aplicável.,Não aplicável.,FALSE
20170301 - Aquisição de reagentes,Ajuste Direto Regime Geral,Aquisição de bens móveis,"33696000-5, Reagentes e meios de contraste","Instituto Nacional de Saúde Doutor Ricardo Jorge, I. P. (501427511)","Frilabo, Lda. (507958861)","57,90 €",01-09-2017,18-04-2017,265 dias,"Portugal, Lisboa, Lisboa","Artigo 26.º, n.º 1, alínea b) do Código dos Contratos Públicos",23-08-2017,"57,90 €",,"",,Não aplicável.,Não aplicável.,FALSE
20170299 - Material de consumo clínico,Ajuste Direto Regime Geral,Aquisição de bens móveis,"33000000-0, Equipamento médico, medicamentos e produtos para cuidados pessoais","Instituto Nacional de Saúde Doutor Ricardo Jorge, I. P. (501427511)","DIAS DE SOUSA, S.A. (504080857)","202,00 €",01-09-2017,18-04-2017,265 dias,"Portugal, Lisboa, Lisboa","Artigo 26.º, n.º 1, alínea b) do Código dos Contratos Públicos",21-06-2017,"202,00 €",,"",,Não aplicável.,Não aplicável.,FALSE
20170298 - Aquisição de reagentes,Ajuste Direto Regime Geral,Aquisição de bens móveis,"33696000-5, Reagentes e meios de contraste","Instituto Nacional de Saúde Doutor Ricardo Jorge, I. P. (501427511)",Sigma-Aldricht Química SL (980148820),"90,70 €",01-09-2017,10-04-2017,267 dias,"Portugal, Lisboa, Lisboa","Artigo 26.º, n.º 1, alínea b) do Código dos Contratos Públicos",22-05-2017,"90,70 €",,"",,Não aplicável.,Não aplicável.,FALSE
20170296 - Aquisição de reagentes,Ajuste Direto Regime Geral,Aquisição de bens móveis,"33696000-5, Reagentes e meios de contraste","Instituto Nacional de Saúde Doutor Ricardo Jorge, I. P. (501427511)",Sigma-Aldricht Química SL (980148820),"368,00 €",01-09-2017,17-04-2017,296 dias,"Portugal, Lisboa, Lisboa","Artigo 26.º, n.º 1, alínea b) do Código dos Contratos Públicos",02-05-2017,"368,00 €",,"",,Não aplicável.,Não aplicável.,FALSE
20170294 - Material de laboratório,Ajuste Direto Regime Geral,Aquisição de bens móveis,"33000000-0, Equipamento médico, medicamentos e produtos para cuidados pessoais","Instituto Nacional de Saúde Doutor Ricardo Jorge, I. P. (501427511)",Sigma-Aldricht Química SL (980148820),"983,00 €",01-09-2017,10-04-2017,277 dias,"Portugal, Lisboa, Lisboa","Artigo 26.º, n.º 1, alínea b) do Código dos Contratos Públicos",22-05-2018,"983,00 €",,"",,Não aplicável.,Não aplicável.,FALSE
20170261 - Material de consumo clínico,Ajuste Direto Regime Geral,Aquisição de bens móveis,"33000000-0, Equipamento médico, medicamentos e produtos para cuidados pessoais","Instituto Nacional de Saúde Doutor Ricardo Jorge, I. P. (501427511)","Frilabo, Lda. (507958861)","743,00 €",01-09-2017,03-04-2017,273 dias,"Portugal, Lisboa, Lisboa","Artigo 26.º, n.º 1, alínea b) do Código dos Contratos Públicos",21-04-2017,"743,00 €",,"",,Não aplicável.,Não aplicável.,FALSE
20170260 - Aquisição de reagentes,Ajuste Direto Regime Geral,Aquisição de bens móveis,"33696000-5, Reagentes e meios de contraste","Instituto Nacional de Saúde Doutor Ricardo Jorge, I. P. (501427511)","Frilabo, Lda. (507958861)","111,00 €",01-09-2017,03-04-2017,273 dias,"Portugal, Lisboa, Lisboa","Artigo 26.º, n.º 1, alínea b) do Código dos Contratos Públicos",21-04-2017,"111,00 €",,"",,Não aplicável.,Não aplicável.,FALSE
20170257 - Aquisição de reagentes,Ajuste Direto Regime Geral,Aquisição de bens móveis,"33696000-5, Reagentes e meios de contraste","Instituto Nacional de Saúde Doutor Ricardo Jorge, I. P. (501427511)",Sigma-Aldricht Química SL (980148820),"604,40 €",01-09-2017,31-03-2017,271 dias,"Portugal, Lisboa, Lisboa","Artigo 26.º, n.º 1, alínea b) do Código dos Contratos Públicos",11-04-2017,"604,40 €",,"",,Não aplicável.,Não aplicável.,FALSE
