Objeto do Contrato,Tipo de Procedimento,Tipo(s) de Contrato,CPVs,Entidade(s) Adjudicante(s),Entidade(s) Adjudicatária(s),Preço Contratual,Data de Publicação,Data de Celebração do Contrato,Prazo de Execução,Local de Execução,Fundamentação,Data de Fecho do Contrato,Preço Total Efetivo,Causas das Alterações ao Prazo,Causas das Alterações ao Preço,Estado,N.º registo do Acordo Quadro,Descrição do Acordo Quadro,Procedimento Centralizado
" Prestação de Serviços Médicos de Urgência Geral, Pediátrica e Vmer",Ajuste Direto Regime Geral,Aquisição de serviços,"85121100-4, Serviços de médicos de clínica geral","Centro Hospitalar Universitário do Algarve, E. P. E. (510745997)","NATUROSPA, LDA (507566351)","15.600,00 €",27-03-2018,09-01-2018,90 dias,"Portugal, Faro, Portimão<BR/>Portugal, Faro, Albufeira","Artigo 24.º, n.º 1, alínea e), subalínea ii) do Código dos Contratos Públicos",,,,,,Não aplicável.,Não aplicável.,FALSE
Aquisição de Equipamentos de Cópia e Impressão para várias entidades do SNS,Concurso público,Aquisição de bens móveis,"30120000-6, Equipamento para fotocópia e impressão em offset","Centro Hospitalar Universitário do Algarve, E.P.E. (510745997)","MEGASOFT, Equipamentos Informáticos, LDA. (501748156)","3.160,00 €",26-03-2018,16-03-2018,30 dias,"Portugal, Faro, Faro<BR/>Portugal, Faro, Portimão",Artigo 259.º do Código dos Contratos Públicos,,,,,,Não aplicável.,Não aplicável.,TRUE
Eletrodos para cardiologia,Ajuste Direto Regime Geral,Aquisição de bens móveis,"33140000-3, Material médico de consumo","Centro Hospitalar Universitário do Algarve, E. P. E. (510745997)",St. Jude Medical (504180746),"24.765,00 €",26-03-2018,02-03-2018,303 dias,"Portugal, Faro, Faro","Artigo 20.º, n.º 1, alínea a) do Código dos Contratos Públicos",,,,,,Não aplicável.,Não aplicável.,FALSE
Prótese Total do Joelho e Revisão do Joelho,Concurso público,Aquisição de bens móveis,"33183200-8, Próteses ortopédicas","Centro Hospitalar Universitário do Algarve, E. P. E. (510745997)","JOHNSON & JOHNSON, MEDICAL (500153370)","207.158,00 €",26-03-2018,15-03-2018,280 dias,"Portugal, Faro, Portimão<BR/>Portugal, Faro, Faro","Artigo 20.º, n.º 1, alínea b) do Código dos Contratos Públicos",,,,,,Não aplicável.,Não aplicável.,FALSE
