Objeto do Contrato,Tipo de Procedimento,Tipo(s) de Contrato,CPVs,Entidade(s) Adjudicante(s),Entidade(s) Adjudicatária(s),Preço Contratual,Data de Publicação,Data de Celebração do Contrato,Prazo de Execução,Local de Execução,Fundamentação,Data de Fecho do Contrato,Preço Total Efetivo,Causas das Alterações ao Prazo,Causas das Alterações ao Preço,Estado,N.º registo do Acordo Quadro,Descrição do Acordo Quadro,Procedimento Centralizado
Procedimento nº 34/2018/CRI Porto Ocidental/DICAD/ARSN - Aquisição de serviços médicos sem especialidade - Cristina Mendes,Ajuste Direto Regime Geral,Aquisição de serviços,"85121000-3, Serviços de prática médica","Administração Regional de Saúde do Norte, I. P. (503135593)",Cristina Raquel Vieira Mendes (227189477),"4.554,00 €",28-11-2018,01-08-2018,152 dias,"Portugal, Porto, Porto","Artigo 20.º, n.º 1, alínea d) do Código dos Contratos Públicos",31-12-2018,"4.532,00 €",,Numero de horas realizadas inferiores ao numero de horas contratadas,,Não aplicável.,Não aplicável.,FALSE
"Prestação de serviços médicos sem especialidade/clínica geral, no âmbito das actividades do serviço de urgência e outras actividades do CHPVVC; EPE",Ajuste Direto Regime Geral,Aquisição de serviços,"85121100-4, Serviços de médicos de clínica geral","Centro Hospitalar Póvoa de Varzim - Vila do Conde, E. P. E. (508741823)",Cristina Raquel Vieira Mendes (227189477),"21.120,00 €",17-04-2017,04-04-2017,306 dias,"Portugal, Porto, Póvoa de Varzim","Artigo 24.º, n.º 1, alínea e) do Código dos Contratos Públicos","","",,"",,Não aplicável.,Não aplicável.,FALSE
