freguesia,acronym,validVotesPercentage,votes,dicofre
Faia,PS,44.29,31,181806
Faia,PPD/PSD.CDS-PP,42.86,30,181806
Faia,MPT,7.14,5,181806
Faia,B.E.,1.43,1,181806
Faia,L,1.43,1,181806
Faia,PCP-PEV,1.43,1,181806
Faia,PTP,1.43,1,181806
Faia,MAS,0,0,181806
Faia,PAN,0,0,181806
Faia,PCTP/MRPP,0,0,181806
Faia,PDA,0,0,181806
Faia,PND,0,0,181806
Faia,PNR,0,0,181806
Faia,POUS,0,0,181806
Faia,PPM,0,0,181806
Faia,PPV,0,0,181806
