freguesia,acronym,validVotesPercentage,votes,dicofre
São Mateus,PS,66.67,164,440103
São Mateus,PPD/PSD.CDS-PP,27.64,68,440103
São Mateus,PCTP/MRPP,1.22,3,440103
São Mateus,B.E.,0.81,2,440103
São Mateus,L,0.81,2,440103
São Mateus,PAN,0.81,2,440103
São Mateus,PCP-PEV,0.81,2,440103
São Mateus,MPT,0.41,1,440103
São Mateus,PDA,0.41,1,440103
São Mateus,PPM,0.41,1,440103
São Mateus,MAS,0,0,440103
São Mateus,PND,0,0,440103
São Mateus,PNR,0,0,440103
São Mateus,POUS,0,0,440103
São Mateus,PPV,0,0,440103
São Mateus,PTP,0,0,440103
