Objeto do Contrato,Tipo de Procedimento,Tipo(s) de Contrato,CPVs,Entidade(s) Adjudicante(s),Entidade(s) Adjudicatária(s),Preço Contratual,Data de Publicação,Data de Celebração do Contrato,Prazo de Execução,Local de Execução,Fundamentação,Data de Fecho do Contrato,Preço Total Efetivo,Causas das Alterações ao Prazo,Causas das Alterações ao Preço,Estado,N.º registo do Acordo Quadro,Descrição do Acordo Quadro,Procedimento Centralizado
"Contratação de serviços de apoio técnico e manutenção preventiva aos equipamentos automáticos para ensaios de dissolução da marca SOTAX, por 2 anos_NPD5493002925.",Ajuste Direto Regime Geral,Aquisição de serviços,"50410000-2, Serviços de reparação e manutenção de aparelhos de medição, ensaio e controlo",INFARMED - Autoridade Nacional do Medicamento e Produtos de Saúde I.P. (600037002),"NORLEQ – Equipamentos e Serviços, Lda. (509880509)","29.817,60 €",29-05-2018,18-05-2018,730 dias,Portugal,"Artigo 24.º, n.º 1, alínea e), subalínea iii) do Código dos Contratos Públicos",,,,,,Não aplicável.,Não aplicável.,FALSE
"Aquisição de um equipamento de contador de partículas portátil, para a DCQ_NPD5493002858",Ajuste Direto Regime Geral,Locação de bens móveis,"38550000-5, Contadores","INFARMED - Autoridade Nacional do Medicamento e Produtos de Saúde, I. P. (600037002)","TYPE SOLUTION – Projectos e Soluções para Laboratório, S.A (508400317)","15.297,00 €",29-05-2018,18-05-2018,90 dias,Portugal,"Artigo 24.º, n.º 1, alínea e), subalínea iii) do Código dos Contratos Públicos",,,,,,Não aplicável.,Não aplicável.,FALSE
"Aquisição de um equipamento espectrofotómetro leitor de microplacas, para a DCQ_NPD5493002866.",Ajuste Direto Regime Geral,Locação de bens móveis,"38000000-5, Equipamento laboratorial, óptico e de precisão (exc. óculos)","INFARMED - Autoridade Nacional do Medicamento e Produtos de Saúde, I. P. (600037002)","Izasa Scientific, Lda. (513252088)","16.540,00 €",29-05-2018,23-05-2018,365 dias,Portugal,"Artigo 24.º, n.º 1, alínea e), subalínea iii) do Código dos Contratos Públicos",,,,,,Não aplicável.,Não aplicável.,FALSE
