freguesia,acronym,validVotesPercentage,votes,dicofre
Longomel,PS,62.8,211,121305
Longomel,PCP-PEV,16.37,55,121305
Longomel,B.E.,6.55,22,121305
Longomel,PPD/PSD,3.27,11,121305
Longomel,CDS-PP,2.68,9,121305
Longomel,PCTP/MRPP,2.38,8,121305
Longomel,PAN,2.08,7,121305
Longomel,PPM.PPV/CDC,1.49,5,121305
Longomel,PURP,0.89,3,121305
Longomel,L,0.6,2,121305
Longomel,MAS,0.6,2,121305
Longomel,PNR,0.3,1,121305
Longomel,A,0,0,121305
Longomel,IL,0,0,121305
Longomel,NC,0,0,121305
Longomel,PDR,0,0,121305
Longomel,PTP,0,0,121305
