Objeto do Contrato,Tipo de Procedimento,Tipo(s) de Contrato,CPVs,Entidade(s) Adjudicante(s),Entidade(s) Adjudicatária(s),Preço Contratual,Data de Publicação,Data de Celebração do Contrato,Prazo de Execução,Local de Execução,Fundamentação,Data de Fecho do Contrato,Preço Total Efetivo,Causas das Alterações ao Prazo,Causas das Alterações ao Preço,Estado,N.º registo do Acordo Quadro,Descrição do Acordo Quadro,Procedimento Centralizado
"51001517 - P259-AC-2017-121 - AQUISIÇÃO DE MEDICAMENTOS DESENCADEADA PELA SPMS,EPE NO ÂMBITO DO DESPACHO 1571/B 2016 -B240 BACILOS CALMETTE; - F179 - FLUOROURACILO",Ao abrigo de acordo-quadro (art.º 259.º),Aquisição de bens móveis,"33000000-0, Equipamento médico, medicamentos e produtos para cuidados pessoais","Unidade Local de Saúde do Norte Alentejano, E. P. E. (508094461)","Accord Healthcare, Unipessoal, Lda. (508622263)","1.560,60 €",30-10-2017,27-10-2017,90 dias,"Portugal, Portalegre, Portalegre<BR/>Portugal, Portalegre, Elvas",Artigo 259.º do Código dos Contratos Públicos,31-12-2017,"979,71 €",,Não foram adquiridas a totalidade da quantidade estimada.,,2559183,CONCURSO PUBLICO 2015/06 MEDICAMENTOS FORO ONCOLOGICO ABERTO PELA SPMS - P259-AC-21016-165,FALSE
"51001517 - P259-AC-2017-121 - AQUISIÇÃO DE MEDICAMENTOS DESENCADEADA PELA SPMS,EPE NO ÂMBITO DO DESPACHO 1571/B 2016 -B240 BACILOS CALMETTE; - F179 - FLUOROURACILO",Ao abrigo de acordo-quadro (art.º 259.º),Aquisição de bens móveis,"33000000-0, Equipamento médico, medicamentos e produtos para cuidados pessoais","Unidade Local de Saúde do Norte Alentejano, E. P. E. (508094461)",Medac Sucursal em Portugal (980369959),"1.596,80 €",30-10-2017,27-10-2017,90 dias,"Portugal, Portalegre, Portalegre<BR/>Portugal, Portalegre, Elvas",Artigo 259.º do Código dos Contratos Públicos,31-12-2017,"848,30 €",,Não foi adquirida a totalidade estimada.,,2559183,CONCURSO PUBLICO 2015/06 MEDICAMENTOS FORO ONCOLOGICO ABERTO PELA SPMS - P259-AC-21016-165,FALSE
MEDICAMENTOS,Ajuste Direto Regime Geral,Aquisição de bens móveis,"33000000-0, Equipamento médico, medicamentos e produtos para cuidados pessoais","Unidade Local de Saúde do Norte Alentejano, E. P. E. (508094461)","PFIZER BIOFARMACEUTICA, SOCIEDADE UNIPESSOAL, LDA (513300376)","10.264,80 €",27-10-2017,31-07-2017,365 dias,"Portugal, Portalegre, Elvas<BR/>Portugal, Portalegre, Portalegre","Artigo 20.º, n.º 1, alínea a) do Código dos Contratos Públicos","","",,"",,Não aplicável.,Não aplicável.,FALSE
"Aquisição de Exames ao Exterior de Medicina Nuclear para a ULSNA, EPE ",Ajuste Direto Regime Geral,Aquisição de serviços,"85100000-0, Serviços de saúde","Unidade Local de Saúde do Norte Alentejano, E. P. E. (508094461)",quadrantes (500753636),"78.035,80 €",25-10-2017,28-09-2017,181 dias,"Portugal, Portalegre","Artigo 24.º, n.º 1, alínea c) do Código dos Contratos Públicos","","",,"",,Não aplicável.,Não aplicável.,FALSE
"Prestação de Serviços de Alimentação, para as Instituições da Unidade Local de Saúde do Norte Alentejano, EPE (Período máximo 1 de Julho a 31 de Julho de 2017",Ajuste Direto Regime Geral,Aquisição de serviços,"55100000-1, Serviços de hotelaria","Unidade Local de Saúde do Norte Alentejano, E. P. E. (508094461)",uniself (501323325),"104.401,13 €",25-10-2017,26-09-2017,30 dias,"Portugal, Portalegre","Artigo 24.º, n.º 1, alínea a) do Código dos Contratos Públicos","","",,"",,Não aplicável.,Não aplicável.,FALSE
Revisão de Prótese do Joelho,Ajuste Direto Regime Geral,Aquisição de bens móveis,"33140000-3, Material médico de consumo","Unidade Local de Saúde do Norte Alentejano, E. P. E. (508094461)","JOHNSON & JOHNSON, LDA (500153370)","11.398,18 €",25-10-2017,06-10-2017,1 dias,"Portugal, Portalegre, Portalegre","Artigo 20.º, n.º 1, alínea a) do Código dos Contratos Públicos",25-10-2017,"11.398,18 €",,"",,Não aplicável.,Não aplicável.,FALSE
MEDICAMENTOS,Ajuste Direto Regime Geral,Aquisição de bens móveis,"33000000-0, Equipamento médico, medicamentos e produtos para cuidados pessoais","Unidade Local de Saúde do Norte Alentejano, E. P. E. (508094461)",GRIFOLS PORTUGAL                                   (502041285),"6.157,00 €",25-10-2017,31-07-2017,365 dias,"Portugal, Portalegre, Portalegre<BR/>Portugal, Portalegre, Elvas","Artigo 20.º, n.º 1, alínea a) do Código dos Contratos Públicos","","",,"",,Não aplicável.,Não aplicável.,FALSE
MEDICAMENTOS,Ajuste Direto Regime Geral,Aquisição de bens móveis,"33000000-0, Equipamento médico, medicamentos e produtos para cuidados pessoais","Unidade Local de Saúde do Norte Alentejano, E. P. E. (508094461)","PFIZER BIOFARMACEUTICA, SOCIEDADE UNIPESSOAL, LDA (513300376)","10.439,95 €",25-10-2017,31-07-2017,365 dias,"Portugal, Portalegre, Portalegre<BR/>Portugal, Portalegre, Elvas","Artigo 20.º, n.º 1, alínea a) do Código dos Contratos Públicos","","",,"",,Não aplicável.,Não aplicável.,FALSE
"51001417 - P259-AC-2016-197 AQUISIÇÃO DE MEDICAMENTOS DESENCADEADA PLA SPMS,EPE, NO ÂMBITO DO DESPACHO 1571/B 2016",Ao abrigo de acordo-quadro (art.º 259.º),Aquisição de bens móveis,"33000000-0, Equipamento médico, medicamentos e produtos para cuidados pessoais","Unidade Local de Saúde do Norte Alentejano, E. P. E. (508094461)","ROCHE Farmacêutica Quimica, Lda (500233810)","226.703,86 €",25-10-2017,03-02-2017,365 dias,"Portugal, Portalegre, Elvas<BR/>Portugal, Portalegre, Portalegre",Artigo 259.º do Código dos Contratos Públicos,31-12-2017,"139.314,19 €",,Não foram adquiridas as totalidades das quantidades estimadas.			,,1771819,CP 2015/6 - Acordo quadro para o fornecimento de Medicamentos do Foro Oncológico,FALSE
Revisão de Prótese de Joelho,Ajuste Direto Regime Geral,Aquisição de bens móveis,"33140000-3, Material médico de consumo","Unidade Local de Saúde do Norte Alentejano, E. P. E. (508094461)","JOHNSON & JOHNSON, LDA (500153370)","5.745,20 €",24-10-2017,06-10-2017,1 dias,"Portugal, Portalegre, Portalegre","Artigo 20.º, n.º 1, alínea a) do Código dos Contratos Públicos",24-10-2017,"5.745,20 €",,"",,Não aplicável.,Não aplicável.,FALSE
