Objeto do Contrato,Tipo de Procedimento,Tipo(s) de Contrato,CPVs,Entidade(s) Adjudicante(s),Entidade(s) Adjudicatária(s),Preço Contratual,Data de Publicação,Data de Celebração do Contrato,Prazo de Execução,Local de Execução,Fundamentação,Data de Fecho do Contrato,Preço Total Efetivo,Causas das Alterações ao Prazo,Causas das Alterações ao Preço,Estado,N.º registo do Acordo Quadro,Descrição do Acordo Quadro,Procedimento Centralizado
AQUISIÇÃO DE DETERGENTES DURANTE O ANO DE 2011,Ajuste Direto Regime Geral,Aquisição de bens móveis,"39831200-8, Detergentes",Centro Hospitalar Psiquiatrico de Lisboa (508338476),"RIOQUIMICA - Produtos Químicos Manutenção Industrial (502388501), JODEL - Produtos Químicos, SA (500618860), Alvaro Henriques & Filhos (502031875)","3.702,54 €",11-01-2012,01-02-2011,120 dias,"Portugal, Lisboa, Lisboa","Artigo 20.º, n.º 1, alínea a) do Código dos Contratos Públicos",31-12-2011,"3.702,54 €",,,,Não aplicável.,Não aplicável.,
AQUISIÇÃO DE SACOS PLÁSTICOS PARA 2011,Ajuste Direto Regime Geral,Aquisição de bens móveis,"19640000-4, Sacos de polietileno para recolha de lixo e resíduos",Centro Hospitalar Psiquiatrico de Lisboa (508338476),"IBEROHIGIENE - Comérc. Produtos Higiene Vestuário Hospitalar, Lda. (507218612), ALVARO HENRIQUES & FLHOS,LDA (502031875), PLÁSTICOS F. MATOS, LDA. (502885661)","17.741,00 €",11-01-2012,28-06-2011,90 dias,"Portugal, Lisboa, Lisboa","Artigo 20.º, n.º 1, alínea a) do Código dos Contratos Públicos",28-06-2011,"17.741,00 €",,,,Não aplicável.,Não aplicável.,
AQUISIÇÃO DE DIVERSO EQUIPAMENTO HOTELEIRO,Ajuste Direto Regime Geral,Aquisição de bens móveis,"39222200-6, Tabuleiros para produtos alimentares",Centro Hospitalar Psiquiatrico de Lisboa (508338476),"TECNOZIM, SA (500769370)","22.352,00 €",11-01-2012,28-01-2011,120 dias,"Portugal, Lisboa, Lisboa","Artigo 20.º, n.º 1, alínea a) do Código dos Contratos Públicos",15-03-2011,"22.352,00 €",,,,Não aplicável.,Não aplicável.,
MATERIAL DESCARTAVEL,Ajuste Direto Regime Geral,Aquisição de bens móveis,"39222110-8, Pratos e talheres descartáveis",Centro Hospitalar Psiquiatrico de Lisboa (508338476),"ALVARO HENRIQUES & FILHOS (502031875), BASTOS VIEGAS (500042772)","5.223,45 €",11-01-2012,10-02-2011,3 dias,"Portugal, Lisboa, Lisboa","Artigo 20.º, n.º 1, alínea a) do Código dos Contratos Públicos",31-12-2011,"5.223,45 €",,,,Não aplicável.,Não aplicável.,
REAGENTES,Ajuste Direto Regime Geral,Aquisição de bens móveis,"33696500-0, Reagentes de laboratório",Centro Hospitalar Psiquiatrico de Lisboa (508338476),BIOMERIEUX (501524177),"1.881,00 €",10-01-2012,09-12-2011,0 dias,"Portugal, Lisboa, Lisboa","Artigo 24.º, n.º 1, alínea e) do Código dos Contratos Públicos",09-12-2011,"1.881,00 €",,,,Não aplicável.,Não aplicável.,
REAGENTES,Ajuste Direto Regime Geral,Aquisição de bens móveis,"33696500-0, Reagentes de laboratório",Centro Hospitalar Psiquiatrico de Lisboa (508338476),BATISTA MARQUES (501439110),"61,80 €",10-01-2012,13-12-2011,1 dias,"Portugal, Lisboa, Lisboa","Artigo 24.º, n.º 1, alínea e) do Código dos Contratos Públicos",13-12-2011,"61,80 €",,,,Não aplicável.,Não aplicável.,
QUETIAPINA,Ajuste Direto Regime Geral,Aquisição de bens móveis,"33690000-3, Medicamentos vários",Centro Hospitalar Psiquiatrico de Lisboa (508338476),ASTRAZENECA (502942240),"15.241,45 €",09-01-2012,28-12-2011,1 dias,"Portugal, Lisboa, Lisboa","Artigo 24.º, n.º 1, alínea e) do Código dos Contratos Públicos",28-12-2011,"15.241,45 €",,,,Não aplicável.,Não aplicável.,
REAGENTES,Ajuste Direto Regime Geral,Aquisição de bens móveis,"33696500-0, Reagentes de laboratório",Centro Hospitalar Psiquiatrico de Lisboa (508338476),HORIBA ABX (980158583),"1.005,00 €",09-01-2012,05-12-2011,3 dias,"Portugal, Lisboa, Lisboa","Artigo 24.º, n.º 1, alínea e) do Código dos Contratos Públicos",05-12-2011,"1.005,00 €",,,,Não aplicável.,Não aplicável.,
Artigos de Higiene Durante o ano de 2011,Ajuste Direto Regime Geral,Aquisição de bens móveis,"39224300-1, Vassouras, escovas e outros artigos para limpeza doméstica",Centro Hospitalar Psiquiatrico de Lisboa (508338476),"Alvaro Henriques & Filhos, Lda. (502031875), Iberohigiene (507218612)","8.526,80 €",05-01-2012,27-01-2011,90 dias,"Portugal, Lisboa, Lisboa","Artigo 20.º, n.º 1, alínea a) do Código dos Contratos Públicos",27-01-2011,"8.526,80 €",,,,Não aplicável.,Não aplicável.,
Vitamina B12,Ajuste Direto Regime Geral,Aquisição de bens móveis,"33696500-0, Reagentes de laboratório",Centro Hospitalar Psiquiatrico de Lisboa (508338476),"Siemens Healthcare Diagnostica, Lda (507925173)","1.035,00 €",05-01-2012,31-10-2011,3 dias,"Portugal, Lisboa, Lisboa","Artigo 24.º, n.º 1, alínea e) do Código dos Contratos Públicos",31-10-2011,"1.035,00 €",,,,Não aplicável.,Não aplicável.,
Hemoblobina A 1C,Ajuste Direto Regime Geral,Aquisição de bens móveis,"33696500-0, Reagentes de laboratório",Centro Hospitalar Psiquiatrico de Lisboa (508338476),"Menarini Diagnósticos, Lda (502610069)","1.050,00 €",05-01-2012,22-11-2011,3 dias,"Portugal, Lisboa, Lisboa","Artigo 24.º, n.º 1, alínea e) do Código dos Contratos Públicos",22-11-2011,"1.050,00 €",,,,Não aplicável.,Não aplicável.,
Reagentes,Ajuste Direto Regime Geral,Aquisição de bens móveis,"33696500-0, Reagentes de laboratório",Centro Hospitalar Psiquiatrico de Lisboa (508338476),"BIOMERIEUX PORTUGAL, LDA. (501524177)","5.641,17 €",05-01-2012,17-10-2011,1 dias,"Portugal, Lisboa, Lisboa","Artigo 24.º, n.º 1, alínea e) do Código dos Contratos Públicos",17-10-2011,"5.641,17 €",,,,Não aplicável.,Não aplicável.,
