freguesia,acronym,validVotesPercentage,votes,dicofre
Tronco,PPD/PSD.CDS-PP,45.33,34,170340
Tronco,PS,38.67,29,170340
Tronco,MPT,8,6,170340
Tronco,PCP-PEV,2.67,2,170340
Tronco,B.E.,1.33,1,170340
Tronco,PCTP/MRPP,1.33,1,170340
Tronco,PDA,1.33,1,170340
Tronco,PTP,1.33,1,170340
Tronco,L,0,0,170340
Tronco,MAS,0,0,170340
Tronco,PAN,0,0,170340
Tronco,PND,0,0,170340
Tronco,PNR,0,0,170340
Tronco,POUS,0,0,170340
Tronco,PPM,0,0,170340
Tronco,PPV,0,0,170340
