Objeto do Contrato,Tipo de Procedimento,Tipo(s) de Contrato,CPVs,Entidade(s) Adjudicante(s),Entidade(s) Adjudicatária(s),Preço Contratual,Data de Publicação,Data de Celebração do Contrato,Prazo de Execução,Local de Execução,Fundamentação,Data de Fecho do Contrato,Preço Total Efetivo,Causas das Alterações ao Prazo,Causas das Alterações ao Preço,Estado,N.º registo do Acordo Quadro,Descrição do Acordo Quadro,Procedimento Centralizado
Fornecimento de cadeiras ultar leves Quasar e cadeiras de banho Ocean,Ajuste Direto Regime Geral,Aquisição de bens móveis,"33193120-6, Cadeiras de rodas",Centro de Medicina de Reabilitação da Região Centro - Rovisco Pais (503767336),"Mobilitec, Lda (506343910)","5.832,21 €",21-10-2011,24-06-2011,90 dias,"Portugal, Coimbra, Cantanhede","Artigo 26.º, n.º 1, alínea a) do Código dos Contratos Públicos",,,,,,Não aplicável.,Não aplicável.,
Consumo de agua da Instituição no mes de Setembro/2011,Ajuste Direto Regime Geral,Aquisição de serviços,"90733400-8, Serviços de tratamento de águas superficiais",Centro de Medicina de Reabilitação da Região Centro - Rovisco Pais (503767336),Inova (506091481),"5.712,31 €",20-10-2011,01-01-2011,30 dias,"Portugal, Coimbra, Cantanhede","Artigo 27.º, n.º 1, alínea a) do Código dos Contratos Públicos",,,,,,Não aplicável.,Não aplicável.,
"Prestação de serviços de Assistentes Operacionais - 13 profissionais, de Setembro a Outubro/2011",Ajuste Direto Regime Geral,Aquisição de serviços,"85140000-2, Serviços de saúde diversos",Centro de Medicina de Reabilitação da Região Centro - Rovisco Pais (503767336),"Iberico Ferreira Saude, Ldª. (505646200)","8.515,39 €",20-10-2011,31-08-2011,30 dias,"Portugal, Coimbra, Cantanhede","Artigo 27.º, n.º 1, alínea a) do Código dos Contratos Públicos",,,,,,Não aplicável.,Não aplicável.,
Prestação de serviços de Enfermagem- 11 Enfermeiros,Ajuste Direto Regime Geral,Aquisição de serviços,"85141200-1, Serviços prestados pelo pessoal de enfermagem",Centro de Medicina de Reabilitação da Região Centro - Rovisco Pais (503767336),"Iberico Ferreira Saude, Ldª. (505646200)","15.076,88 €",12-10-2011,20-09-2011,30 dias,"Portugal, Coimbra, Cantanhede","Artigo 27.º, n.º 1, alínea a) do Código dos Contratos Públicos",,,,,,Não aplicável.,Não aplicável.,
Prestação de serviços de Assistentes Operacionais - 28 Assistentes,Ajuste Direto Regime Geral,Aquisição de serviços,"85140000-2, Serviços de saúde diversos",Centro de Medicina de Reabilitação da Região Centro - Rovisco Pais (503767336),"Iberico Ferreira Saude, Ldª. (505646200)","17.030,78 €",12-10-2011,26-08-2011,30 dias,"Portugal, Coimbra, Cantanhede","Artigo 27.º, n.º 1, alínea a) do Código dos Contratos Públicos",,,,,,Não aplicável.,Não aplicável.,
Prestação de serviços de Fisioterapia - 3 Fisioterapeutas,Ajuste Direto Regime Geral,Aquisição de serviços,"85142100-7, Serviços de fisioterapia",Centro de Medicina de Reabilitação da Região Centro - Rovisco Pais (503767336),"Iberico Ferreira Saude, Ldª. (505646200)","3.289,68 €",12-10-2011,26-08-2011,30 dias,"Portugal, Coimbra, Cantanhede","Artigo 27.º, n.º 1, alínea a) do Código dos Contratos Públicos",,,,,,Não aplicável.,Não aplicável.,
Prestação de Serviços de Enfermagem - 11 Enfermeiros,Ajuste Direto Regime Geral,Aquisição de serviços,"85141200-1, Serviços prestados pelo pessoal de enfermagem",Centro de Medicina de Reabilitação da Região Centro - Rovisco Pais (503767336),"Iberico Ferreira Saude, Ldª. (505646200)","15.076,88 €",12-10-2011,26-08-2011,30 dias,"Portugal, Coimbra, Cantanhede","Artigo 27.º, n.º 1, alínea a) do Código dos Contratos Públicos",,,,,,Não aplicável.,Não aplicável.,
Consumo de agua da Instituição no mes de Agosto/2011,Ajuste Direto Regime Geral,Aquisição de serviços,"90733400-8, Serviços de tratamento de águas superficiais",Centro de Medicina de Reabilitação da Região Centro - Rovisco Pais (503767336),Inova (506091481),"7.051,38 €",12-10-2011,01-01-2011,30 dias,"Portugal, Coimbra, Cantanhede","Artigo 27.º, n.º 1, alínea a) do Código dos Contratos Públicos",,,,,,Não aplicável.,Não aplicável.,
