Objeto do Contrato,Tipo de Procedimento,Tipo(s) de Contrato,CPVs,Entidade(s) Adjudicante(s),Entidade(s) Adjudicatária(s),Preço Contratual,Data de Publicação,Data de Celebração do Contrato,Prazo de Execução,Local de Execução,Fundamentação,Data de Fecho do Contrato,Preço Total Efetivo,Causas das Alterações ao Prazo,Causas das Alterações ao Preço,Estado,N.º registo do Acordo Quadro,Descrição do Acordo Quadro,Procedimento Centralizado
"Aquisição de dois Módulos PICCO para a Unidade Cuidados Intensivos Neurocríticos do CHSJ, EPE",Ajuste Direto Regime Geral,Aquisição de bens móveis,"33195000-3, Sistema de monitorização dos doentes","Centro Hospitalar de São João, E. P. E. (509821197)",Philips Portuguesa SA (500216843),"7.000,00 €",18-09-2014,08-09-2014,45 dias,"Portugal, Porto, Porto","Artigo 24.º, n.º 1, alínea e) do Código dos Contratos Públicos",,,,,,Não aplicável.,Não aplicável.,FALSE
"Empreitada de Substituição da Impermeabilização da Cobertura do Corredor do Bloco Operatório Central - Ala Norte do CHSJ, EPE",Ajuste Direto Regime Geral,Concessão de obras públicas,"45113000-2, Obras no local","Centro Hospitalar de São João, E. P. E. (509821197)","Arestasignus Construções Unipessoal, Lda. (510803768)","7.706,25 €",18-09-2014,18-09-2014,15 dias,"Portugal, Porto, Porto","Artigo 19.º, alínea a) do Código dos Contratos Públicos",,,,,,Não aplicável.,Não aplicável.,FALSE
"Empreitada de Renovação da UCIP Geral do CHSJ, EPE",Ajuste Direto Regime Geral,Concessão de obras públicas,"45113000-2, Obras no local","Centro Hospitalar de São João, E. P. E. (509821197)","Espiralnor - Reabilitação e Construções, Lda. (510891810)","35.888,20 €",17-09-2014,06-08-2014,30 dias,"Portugal, Porto, Porto","Artigo 19.º, alínea a) do Código dos Contratos Públicos",,,,,,Não aplicável.,Não aplicável.,FALSE
"Aquisição de Sonda Ecocardiográfica Transesofágica de Adolescentes/Adultos para Serviço de Cardiologia Pediátrica do CHSJ, EPE",Ajuste Direto Regime Geral,Aquisição de bens móveis,"33112000-8, Equipamento de imagiologia por ecos, ultra-sons e doppler","Centro Hospitalar de São João, E. P. E. (509821197)","General Electric Portuguesa, SA (500357129)","15.800,00 €",17-09-2014,14-08-2014,23 dias,"Portugal, Porto, Porto","Artigo 24.º, n.º 1, alínea e) do Código dos Contratos Públicos",,,,,,Não aplicável.,Não aplicável.,FALSE
"Aquisição de 116 Mesas-de-Cabeceira para diversos Serviços da UAG Cirurgia do CHSJ, EPE",Ajuste Direto Regime Geral,Aquisição de bens móveis,"33192000-2, Mobiliário para fins médicos","Centro Hospitalar de São João, E. P. E. (509821197)","IMO Indústrias Metalúrgicas, SA (500136939)","39.999,12 €",17-09-2014,04-08-2014,30 dias,"Portugal, Porto, Porto","Artigo 26.º, n.º 1, alínea a) do Código dos Contratos Públicos",,,,,,Não aplicável.,Não aplicável.,FALSE
"Aquisição de 157 Computadores e Monitores para Diversos Serviços do Centro Hospitalar de São João, E.P.E.",Concurso público,Aquisição de bens móveis,"30213300-8, Computadores de secretária (desktop computers)","Centro Hospitalar de São João, E. P. E. (509821197)","Base2, Lda. (501333401)","88.391,00 €",16-09-2014,04-08-2014,30 dias,"Portugal, Porto, Porto","Artigo 20.º, n.º 1, alínea b) do Código dos Contratos Públicos",,,,,,Não aplicável.,Não aplicável.,FALSE
"Empreitada de Construção de Front Office do Corpo nº 4 do CAM do CHSJ, EPE",Ajuste Direto Regime Geral,Concessão de obras públicas,"45113000-2, Obras no local","Centro Hospitalar de São João, E. P. E. (509821197)","Rebigran - Reabilitação e Construções, Lda. (510891721)","97.425,62 €",16-09-2014,04-09-2014,90 dias,"Portugal, Porto, Porto","Artigo 19.º, alínea a) do Código dos Contratos Públicos",,,,,,Não aplicável.,Não aplicável.,FALSE
"Empreitada para instalação de sistema de climatização para o corpo nº 6 do CAM do CHSJ, EPE",Ajuste Direto Regime Geral,Concessão de obras públicas,"45113000-2, Obras no local","Centro Hospitalar de São João, E. P. E. (509821197)","Arcotubo, Lda. (503508675)","72.509,00 €",16-09-2014,13-08-2014,70 dias,"Portugal, Porto, Porto","Artigo 19.º, alínea a) do Código dos Contratos Públicos",,,,,,Não aplicável.,Não aplicável.,FALSE
"Empreitada para instalação de sistema de climatização para o corpo nº 3 do CAM do  CHSJ, EPE",Ajuste Direto Regime Geral,Concessão de obras públicas,"45113000-2, Obras no local","Centro Hospitalar de São João, E. P. E. (509821197)","Pinto & Cruz Serviços Manutenção, SA (510134980)","47.454,00 €",16-09-2014,13-08-2014,90 dias,"Portugal, Porto, Porto","Artigo 19.º, alínea a) do Código dos Contratos Públicos",,,,,,Não aplicável.,Não aplicável.,FALSE
"Empreitada de beneficiação do interior e da cobertura do corpo nº 3 do CAM do CHSJ, EPE",Ajuste Direto Regime Geral,Concessão de obras públicas,"45113000-2, Obras no local","Centro Hospitalar de São João, E. P. E. (509821197)","Rebigran, Lda (510891721)","54.613,99 €",16-09-2014,08-08-2014,30 dias,"Portugal, Porto, Porto","Artigo 19.º, alínea a) do Código dos Contratos Públicos",,,,,,Não aplicável.,Não aplicável.,FALSE
