Objeto do Contrato,Tipo de Procedimento,Tipo(s) de Contrato,CPVs,Entidade(s) Adjudicante(s),Entidade(s) Adjudicatária(s),Preço Contratual,Data de Publicação,Data de Celebração do Contrato,Prazo de Execução,Local de Execução,Fundamentação,Data de Fecho do Contrato,Preço Total Efetivo,Causas das Alterações ao Prazo,Causas das Alterações ao Preço,Estado,N.º registo do Acordo Quadro,Descrição do Acordo Quadro,Procedimento Centralizado
Serviços Médicos - Anestesiologia,Ajuste Direto Regime Geral,Aquisição de serviços,"85100000-0, Serviços de saúde","Centro Hospitalar do Médio Tejo, E. P. E. (506361608)","Fátima Belo Figueiredo, Lda (510267858)","72.500,00 €",27-07-2016,15-07-2016,246 dias,"Portugal, Santarém, Tomar","Artigo 20.º, n.º 1, alínea a) do Código dos Contratos Públicos",,,,,,Não aplicável.,Não aplicável.,FALSE
Serviços Jurídicos,Ajuste Direto Regime Geral,Aquisição de serviços,"85100000-0, Serviços de saúde","Centro Hospitalar do Médio Tejo, E. P. E. (506361608)","Gião Falcato & Associados, Sociedade de Advogados, S.P., RL (513858482)","40.800,00 €",27-07-2016,11-07-2016,246 dias,"Portugal, Santarém, Torres Novas","Artigo 20.º, n.º 1, alínea a) do Código dos Contratos Públicos",,,,,,Não aplicável.,Não aplicável.,FALSE
Aquisição de Serviços de Patologia Clinica,Concurso público,Aquisição de serviços,"85111800-8, Serviços de patologia","Centro Hospitalar do Médio Tejo, E. P. E. (506361608)","Dr. Joaquim Chaves - Laboratório de Análises Clínicas, S.A. (500753636)","48.183,71 €",25-07-2016,12-07-2016,365 dias,"Portugal, Santarém, Tomar<BR/>Portugal, Santarém, Abrantes<BR/>Portugal, Santarém, Torres Novas","Artigo 20.º, n.º 1, alínea b) do Código dos Contratos Públicos",,,,,,Não aplicável.,Não aplicável.,FALSE
Artigos Bloco Operatório,Ajuste Direto Regime Geral,Aquisição de bens móveis,"33100000-1, Equipamento médico","Centro Hospitalar do Médio Tejo, E.P.E. (CHMT) (506361608)",Oasipor SA (502260750),"22.920,00 €",25-07-2016,08-07-2016,365 dias,"Portugal, Santarém, Abrantes","Artigo 20.º, n.º 1, alínea a) do Código dos Contratos Públicos",,,,,,Não aplicável.,Não aplicável.,FALSE
Fios de sutura,Ajuste Direto Regime Geral,Aquisição de bens móveis,"33100000-1, Equipamento médico","Centro Hospitalar do Médio Tejo, E.P.E. (CHMT) (506361608)","Anastácio Saldanha unipl, Lda (505804441)","13.334,48 €",25-07-2016,29-06-2016,365 dias,"Portugal, Santarém, Abrantes","Artigo 20.º, n.º 1, alínea a) do Código dos Contratos Públicos",,,,,,Não aplicável.,Não aplicável.,FALSE
Serviços Médicos - VMER,Ajuste Direto Regime Geral,Aquisição de serviços,"85100000-0, Serviços de saúde","Centro Hospitalar do Médio Tejo, E. P. E. (506361608)","RFSS - Rogério Fanha e Sílvia Santos, Lda (506684687)","9.000,00 €",22-07-2016,19-05-2016,246 dias,"Portugal, Santarém, Abrantes","Artigo 20.º, n.º 1, alínea a) do Código dos Contratos Públicos",,,,,,Não aplicável.,Não aplicável.,FALSE
