Objeto do Contrato,Tipo de Procedimento,Tipo(s) de Contrato,CPVs,Entidade(s) Adjudicante(s),Entidade(s) Adjudicatária(s),Preço Contratual,Data de Publicação,Data de Celebração do Contrato,Prazo de Execução,Local de Execução,Fundamentação,Data de Fecho do Contrato,Preço Total Efetivo,Causas das Alterações ao Prazo,Causas das Alterações ao Preço,Estado,N.º registo do Acordo Quadro,Descrição do Acordo Quadro,Procedimento Centralizado
CAVILHA PROXIMAL DO FEMUR PFN-A - 2 UNIDAES  FIO GUIA PARA ENCAVILHAMENTO PFN-A T/REF356.830 - 1 UNIDADE  CAVILHA TIBIAL COM PARAFUSOS PROXIMAIS ETN - 1 UNIDADE  FIO GUIA PARA CAVILHA ETN T/REF 357.399 - 1 UNIDADE,Ajuste Direto Regime Geral,Aquisição de bens móveis,"33000000-0, Equipamento médico, medicamentos e produtos para cuidados pessoais","Centro Hospitalar e Universitário de Coimbra, E. P. E. (510103448)","SYNTHES - COM. DISPOSITIVOS MEDICOS, LDA (501212191)","3.014,37 €",21-07-2014,25-11-2013,30 dias,"Portugal, Coimbra, Coimbra","Artigo 24.º, n.º 1, alínea e) do Código dos Contratos Públicos","","","","",,Não aplicável.,Não aplicável.,FALSE
PROTESES MAMARIAS ANATÓMICAS - 2 UNIDADES,Ajuste Direto Regime Geral,Aquisição de bens móveis,"33000000-0, Equipamento médico, medicamentos e produtos para cuidados pessoais","Centro Hospitalar e Universitário de Coimbra, E. P. E. (510103448)","EXPOMEDICA SOC. EXPORTAÇAO IMPORT.MAT. MEDIC., LDA (501886621)","1.211,24 €",21-07-2014,25-11-2013,30 dias,"Portugal, Coimbra, Coimbra","Artigo 24.º, n.º 1, alínea e) do Código dos Contratos Públicos","","","","",,Não aplicável.,Não aplicável.,FALSE
IMPLANTE INTER-ESPINHOSO COLUNA - 2 UNIDADE,Ajuste Direto Regime Geral,Aquisição de bens móveis,"33000000-0, Equipamento médico, medicamentos e produtos para cuidados pessoais","Centro Hospitalar e Universitário de Coimbra, E. P. E. (510103448)",SURGYLINE - DISPOSITIVOS MEDICOS CIRURGICOS LDA (509811663),"1.500,00 €",21-07-2014,25-11-2013,30 dias,"Portugal, Coimbra, Coimbra","Artigo 24.º, n.º 1, alínea e) do Código dos Contratos Públicos","","","","",,Não aplicável.,Não aplicável.,FALSE
PROTESE DE SUBSTITUIÇÃO DO FEMUR DUSTAL - MUTARS - 1 UNIDADE,Ajuste Direto Regime Geral,Aquisição de bens móveis,"33000000-0, Equipamento médico, medicamentos e produtos para cuidados pessoais","Centro Hospitalar e Universitário de Coimbra, E. P. E. (510103448)","MBA PORTUGAL, S.A. (504445960)","18.122,00 €",21-07-2014,11-12-2013,30 dias,"Portugal, Coimbra, Coimbra","Artigo 24.º, n.º 1, alínea e) do Código dos Contratos Públicos","","","","",,Não aplicável.,Não aplicável.,FALSE
MATERIAL DE COLUNA EM FRACTURAS - 1 UNIDADE  FIO GUIA REF. - 4 UNIDADES  AGULHA PERCUTANEA TRANSPEDICULAR SEXTANT - 2 UNIDADE,Ajuste Direto Regime Geral,Aquisição de bens móveis,"33000000-0, Equipamento médico, medicamentos e produtos para cuidados pessoais","Centro Hospitalar e Universitário de Coimbra, E. P. E. (510103448)","JOHNSON & JOHNSON, LDA (500153370)","2.455,70 €",21-07-2014,22-01-2014,30 dias,"Portugal, Coimbra, Coimbra","Artigo 24.º, n.º 1, alínea e) do Código dos Contratos Públicos","","","","",,Não aplicável.,Não aplicável.,FALSE
TAMPAO HEMOSTATICO NASAL C/ TUBO DE 80MM 450410 - 400 UNIDADES,Ajuste Direto Regime Geral,Aquisição de bens móveis,"33000000-0, Equipamento médico, medicamentos e produtos para cuidados pessoais","Centro Hospitalar e Universitário de Coimbra, E. P. E. (510103448)","MEDTRONIC PORTUGAL, LDA (504223933)","2.000,00 €",21-07-2014,15-11-2013,90 dias,"Portugal, Coimbra, Coimbra","Artigo 24.º, n.º 1, alínea e) do Código dos Contratos Públicos","","","","",,Não aplicável.,Não aplicável.,FALSE
PLACA DE RADIO DISTAL EM TITANIO - 1 UNIDADE  FIO DE KIRSCHENER C/PONTA TRIANGULAR T/P 292.200 - 10 UNIDADES  PLACA AO AUTO-ESTAVEIS CERVICAIS - 1 UNIDADE  CAVILHA TIBIAL COM PARAFUSOS PROXIMAIS ETN - 1 UNIDADE  CAVILHA RETROGRADAS DO FEMUR -  1 UNIDADE  FIO GUIA CALIBRADO DFN DA AO T/P 357.129 - 1 UNIDADE,Ajuste Direto Regime Geral,Aquisição de bens móveis,"33000000-0, Equipamento médico, medicamentos e produtos para cuidados pessoais","Centro Hospitalar e Universitário de Coimbra, E. P. E. (510103448)","SYNTHES - COM. DISPOSITIVOS MEDICOS, LDA (501212191)","3.781,73 €",21-07-2014,02-12-2013,60 dias,"Portugal, Coimbra, Coimbra","Artigo 24.º, n.º 1, alínea e) do Código dos Contratos Públicos","","","","",,Não aplicável.,Não aplicável.,FALSE
"PLACA LCP T/REF 02.224.224 - 3 UNIDADES  PARAFUSO P/PLACA DHS T/P 280.900 - 1 UNIDADE  FIOS GUIA DHS/DCS DE 2,5MM DIAMETRO T/P 338.00 - 3 UNIDADES  PARAFUSO CORTICAL DIAM.4,5MM AUTOROSC.T/P 214.836 - 1 UNIDADE  PARAFUSO CORTICAL DIAM.4,5MM AUTOROSC.T/P 214.838 - 5 UNIDADES  PARAFUSO DHS T/P 280.000 - 1 UNIDADES  PARAFUSO CORTICAL DHS T/P 280.990 - 2 UNIDADES  PARAFUSO LCP TIBIAL PROXIMAL T/REF 212.213 - 3 UNIDADES  PARAFUSO DE BLOQUEIO LCP STARDRIVE T/REF 212.215 - 1 UNIDADE  PARAFUSO P/PLACA DHS T/P 280.100 - 1 UNIDADE  PARAFUSO CORTICAL DIAM.4,5MM AUTOROSC.T/P 214.842 - 2 UNIDADES",Ajuste Direto Regime Geral,Aquisição de bens móveis,"33000000-0, Equipamento médico, medicamentos e produtos para cuidados pessoais","Centro Hospitalar e Universitário de Coimbra, E. P. E. (510103448)","SYNTHES - COM. DISPOSITIVOS MEDICOS, LDA (501212191)","1.631,81 €",21-07-2014,25-11-2013,60 dias,"Portugal, Coimbra, Coimbra","Artigo 24.º, n.º 1, alínea e) do Código dos Contratos Públicos","","","","",,Não aplicável.,Não aplicável.,FALSE
BOMBA DE PERFUSÃO IMPLNTÁVEL - 1 UNIDADE,Ajuste Direto Regime Geral,Aquisição de bens móveis,"33000000-0, Equipamento médico, medicamentos e produtos para cuidados pessoais","Centro Hospitalar e Universitário de Coimbra, E. P. E. (510103448)","MEDTRONIC PORTUGAL, LDA (504223933)","8.500,00 €",21-07-2014,09-10-2013,30 dias,"Portugal, Coimbra, Coimbra","Artigo 24.º, n.º 1, alínea e) do Código dos Contratos Públicos","","","","",,Não aplicável.,Não aplicável.,FALSE
BOMBA DE PERFUSÃO IMPLANTAVEL - 1 UNIDADE,Ajuste Direto Regime Geral,Aquisição de bens móveis,"33000000-0, Equipamento médico, medicamentos e produtos para cuidados pessoais","Centro Hospitalar e Universitário de Coimbra, E. P. E. (510103448)","MEDTRONIC PORTUGAL, LDA (504223933)","8.500,00 €",21-07-2014,09-10-2013,30 dias,"Portugal, Coimbra, Coimbra","Artigo 24.º, n.º 1, alínea e) do Código dos Contratos Públicos","","","","",,Não aplicável.,Não aplicável.,FALSE
Cortinas para a Ortopedia do HP,Ajuste Direto Regime Geral,Aquisição de bens móveis,"39000000-2, Mobiliário (incl. de escritório), acessórios, aparelhos domésticos (excl. iluminação) e produtos de limpeza","Centro Hospitalar e Universitário de Coimbra, E. P. E. (510103448)","Bacelar e Irmão, Lda. (500532818)","1.022,00 €",21-07-2014,21-07-2014,30 dias,"Portugal, Coimbra, Coimbra","Artigo 20.º, n.º 1, alínea a) do Código dos Contratos Públicos","","","","",,Não aplicável.,Não aplicável.,FALSE
Cortinas para a Ortopedia do HP,Ajuste Direto Regime Geral,Aquisição de bens móveis,"39000000-2, Mobiliário (incl. de escritório), acessórios, aparelhos domésticos (excl. iluminação) e produtos de limpeza","Centro Hospitalar e Universitário de Coimbra, E. P. E. (510103448)","Jorge Mendes, Lda. (500154015)","85,00 €",21-07-2014,21-07-2014,30 dias,"Portugal, Coimbra, Coimbra","Artigo 20.º, n.º 1, alínea a) do Código dos Contratos Públicos","","","","",,Não aplicável.,Não aplicável.,FALSE
Reagentes para o Serviço de Sangue e Medicina Transfusional,Ajuste Direto Regime Geral,Aquisição de bens móveis,"33696500-0, Reagentes de laboratório","Centro Hospitalar e Universitário de Coimbra, E. P. E. (510103448)",Abbott Laboratórios (500006148),"18.600,00 €",18-07-2014,22-07-2013,365 dias,"Portugal, Coimbra, Coimbra","Artigo 20.º, n.º 1, alínea a) do Código dos Contratos Públicos","","","","",,Não aplicável.,Não aplicável.,FALSE
Reagentes para o Serviço de Sangue e Medicina Transfusional,Ajuste Direto Regime Geral,Aquisição de bens móveis,"33696000-5, Reagentes e meios de contraste","Centro Hospitalar e Universitário de Coimbra, E. P. E. (510103448)",diamed prtuguesa diagnostica (501675809),"1.753,40 €",18-07-2014,18-07-2013,365 dias,"Portugal, Coimbra, Coimbra","Artigo 26.º, n.º 1, alínea a) do Código dos Contratos Públicos","","","","",,Não aplicável.,Não aplicável.,FALSE
Proteses do Joelho-Stryker,Ajuste Direto Regime Geral,Aquisição de bens móveis,"33000000-0, Equipamento médico, medicamentos e produtos para cuidados pessoais","Centro Hospitalar e Universitário de Coimbra, E. P. E. (510103448)",STRYKER PORTUGAL PROD.MED.LDA (974913863),"6.390,00 €",17-07-2014,25-06-2014,20 dias,"Portugal, Coimbra, Coimbra","Artigo 24.º, n.º 1, alínea e) do Código dos Contratos Públicos",17-07-2014,"6.390,00 €","","",,Não aplicável.,Não aplicável.,FALSE
Proteses da Anca-Stryker,Ajuste Direto Regime Geral,Aquisição de bens móveis,"33000000-0, Equipamento médico, medicamentos e produtos para cuidados pessoais","Centro Hospitalar e Universitário de Coimbra, E. P. E. (510103448)",STRYKER PORTUGAL PROD.MED.LDA (974913863),"37.585,14 €",17-07-2014,25-06-2014,20 dias,"Portugal, Coimbra, Coimbra","Artigo 24.º, n.º 1, alínea e) do Código dos Contratos Públicos",17-07-2014,"37.585,14 €","","",,Não aplicável.,Não aplicável.,FALSE
Ajuste Directo nº5400020/2013-Reagentes para Diagnostico Laboratorial Hepatite B-Serv. Imun.,Ajuste Direto Regime Geral,Aquisição de bens móveis,"33696500-0, Reagentes de laboratório","Centro Hospitalar e Universitário de Coimbra, E. P. E. (510103448)",Abbott Laboratorios (500006148),"2.016,00 €",17-07-2014,13-02-2013,365 dias,"Portugal, Coimbra, Coimbra","Artigo 20.º, n.º 1, alínea a) do Código dos Contratos Públicos",31-12-2013,"2.016,00 €","","",,Não aplicável.,Não aplicável.,FALSE
juste Directo nº5400019/2013-Reagentes para Diagnostico Laboratorial Hepatite B-Serv. Imun.,Ajuste Direto Regime Geral,Aquisição de bens móveis,"33696500-0, Reagentes de laboratório","Centro Hospitalar e Universitário de Coimbra, E. P. E. (510103448)",Abbott Laboratorios (500006148),"8.910,00 €",17-07-2014,02-05-2013,92 dias,"Portugal, Coimbra, Coimbra","Artigo 26.º, n.º 1, alínea a) do Código dos Contratos Públicos",31-12-2013,"8.910,00 €","","",,Não aplicável.,Não aplicável.,FALSE
Ajuste Directo nº5400017/2013-Reagentes para Diagnóstico Laboratorial Hepatite B-Serv. Imun.,Ajuste Direto Regime Geral,Aquisição de bens móveis,"33696500-0, Reagentes de laboratório","Centro Hospitalar e Universitário de Coimbra, E. P. E. (510103448)",Abbott Lab. (500006148),"7.800,00 €",17-07-2014,02-05-2013,182 dias,"Portugal, Coimbra, Coimbra","Artigo 26.º, n.º 1, alínea a) do Código dos Contratos Públicos","","","","",,Não aplicável.,Não aplicável.,FALSE
Reagentes para o Serviço de Anatomia Patologica,Ajuste Direto Regime Geral,Aquisição de bens móveis,"33696000-5, Reagentes e meios de contraste","Centro Hospitalar e Universitário de Coimbra, E.P.E. (510103448)",Lusopalex - Soc. Dist. Prod. Hospitalares (503531588),"9.520,00 €",17-07-2014,02-02-2013,365 dias,"Portugal, Coimbra, Coimbra","Artigo 26.º, n.º 1, alínea a) do Código dos Contratos Públicos","","","","",,Não aplicável.,Não aplicável.,FALSE
Ajuste Directo nº5400017/2013-Reagentes para Diagnóstico Laboratorial Hepatite B-Serv. Imun.,Ajuste Direto Regime Geral,Aquisição de bens móveis,"33696500-0, Reagentes de laboratório","Centro Hospitalar e Universitário de Coimbra, E. P. E. (510103448)",Bio-Rad (501301321),"13.848,63 €",17-07-2014,02-05-2013,182 dias,"Portugal, Coimbra, Coimbra","Artigo 26.º, n.º 1, alínea a) do Código dos Contratos Públicos","","","","",,Não aplicável.,Não aplicável.,FALSE
Aquisição de 2 motores de colchão de pressão alterna- CRI Psiquiatria e Saude Mental (392),Ajuste Direto Regime Geral,Aquisição de bens móveis,"39000000-2, Mobiliário (incl. de escritório), acessórios, aparelhos domésticos (excl. iluminação) e produtos de limpeza","Centro Hospitalar e Universitário de Coimbra, E. P. E. (510103448)",Dispofarma (503778699),"65,00 €",16-07-2014,14-07-2014,8 dias,"Portugal, Coimbra, Coimbra","Artigo 20.º, n.º 1, alínea a) do Código dos Contratos Públicos","","","","",,Não aplicável.,Não aplicável.,FALSE
Aquisição de 1 ressuscitador Manual de Adulto para a Cirurgia Vascular (441),Ajuste Direto Regime Geral,Aquisição de bens móveis,"33000000-0, Equipamento médico, medicamentos e produtos para cuidados pessoais","Centro Hospitalar e Universitário de Coimbra, E. P. E. (510103448)","Mundinter, SA (500199906)","51,63 €",16-07-2014,14-07-2014,30 dias,"Portugal, Coimbra, Coimbra","Artigo 20.º, n.º 1, alínea a) do Código dos Contratos Públicos","","","","",,Não aplicável.,Não aplicável.,FALSE
Aquisição de material para a unidade de Aférese e Terapia Celular (171),Ajuste Direto Regime Geral,Aquisição de bens móveis,"33000000-0, Equipamento médico, medicamentos e produtos para cuidados pessoais","Centro Hospitalar e Universitário de Coimbra, E. P. E. (510103448)","Ezequiel Panão Jorge, Lda (501412727)","20,29 €",16-07-2014,14-07-2014,8 dias,"Portugal, Coimbra, Coimbra","Artigo 20.º, n.º 1, alínea a) do Código dos Contratos Públicos","","","","",,Não aplicável.,Não aplicável.,FALSE
Aquisição de material para a unidade de Aférese e Terapia Celular (171),Ajuste Direto Regime Geral,Aquisição de bens móveis,"33000000-0, Equipamento médico, medicamentos e produtos para cuidados pessoais","Centro Hospitalar e Universitário de Coimbra, E. P. E. (510103448)",Eurocasmédica (503322105),"41,00 €",16-07-2014,14-07-2014,30 dias,"Portugal, Coimbra, Coimbra","Artigo 20.º, n.º 1, alínea a) do Código dos Contratos Públicos","","","","",,Não aplicável.,Não aplicável.,FALSE
Aquisição de diverso material informático- dievrsos serviços,Ajuste Direto Regime Geral,Aquisição de bens móveis,"30000000-9, Máquinas, equipamento e material de escritório e de informática, excepto mobiliário e pacotes de programas (software)","Centro Hospitalar e Universitário de Coimbra, E. P. E. (510103448)","Iten solutions, sistemas  de informação, SA (510728189)","595,00 €",16-07-2014,16-06-2014,15 dias,"Portugal, Coimbra, Coimbra","Artigo 20.º, n.º 1, alínea a) do Código dos Contratos Públicos","","","","",,Não aplicável.,Não aplicável.,FALSE
Reagentes para o Serviço de Sangue e Medicina Transfusional,Ajuste Direto Regime Geral,Aquisição de bens móveis,"33696500-0, Reagentes de laboratório","Centro Hospitalar e Universitário de Coimbra, E. P. E. (510103448)","Beckman Coulter Portugal Unipessoal, Lda. (509035167)","19.915,74 €",16-07-2014,12-08-2013,210 dias,"Portugal, Coimbra, Coimbra","Artigo 26.º, n.º 1, alínea a) do Código dos Contratos Públicos",31-12-2013,"25.681,74 €",Necessidade de aumento de quantidades em função do aumento de consumos,Ás indicadas no ponto anterior,,Não aplicável.,Não aplicável.,FALSE
Nutrição Artificial Entérica,Concurso público,Aquisição de bens móveis,"33690000-3, Medicamentos vários","Centro Hospitalar e Universitário de Coimbra, E.P.E. (510103448)","Fresenius Kabi Pharma Portugal, Ld.ª (504293753), B. Braun Medical, Ld.ª (501506543)","113.756,07 €",16-07-2014,16-07-2014,365 dias,"Portugal, Coimbra, Coimbra","Artigo 20.º, n.º 1, alínea b) do Código dos Contratos Públicos",31-12-2013,"113.756,07 €","","",,Não aplicável.,Não aplicável.,FALSE
"Prestação de serviços de alimentação ao Hospital Geral, Hospital Pediátrico e Maternidade Bissaya Barreto, ano de 2014 (2ª renovação)",Ajuste Direto Regime Geral,Aquisição de serviços,"55500000-5, Serviços de cantinas e de fornecimento de refeições (catering)","Centro Hospitalar e Universitário de Coimbra, E. P. E. (510103448)",EUREST (500347506),"1.487.865,51 €",16-07-2014,11-07-2014,182 dias,"Portugal, Coimbra, Coimbra","Artigo 27.º, n.º 1, alínea a) do Código dos Contratos Públicos","","","","",,Não aplicável.,Não aplicável.,FALSE
Aquisição de um Frigorífico,Ajuste Direto Regime Geral,Aquisição de bens móveis,"39000000-2, Mobiliário (incl. de escritório), acessórios, aparelhos domésticos (excl. iluminação) e produtos de limpeza","Centro Hospitalar e Universitário de Coimbra, E. P. E. (510103448)","Norconcessus, Lda (504907808)","569,80 €",15-07-2014,15-07-2014,30 dias,"Portugal, Coimbra, Coimbra","Artigo 20.º, n.º 1, alínea a) do Código dos Contratos Públicos","","","","",,Não aplicável.,Não aplicável.,FALSE
Aquisição de Biombos Rodados,Ajuste Direto Regime Geral,Aquisição de bens móveis,"39000000-2, Mobiliário (incl. de escritório), acessórios, aparelhos domésticos (excl. iluminação) e produtos de limpeza","Centro Hospitalar e Universitário de Coimbra, E. P. E. (510103448)","Bacelar & Irmão, Lda. (500532818)","1.507,50 €",15-07-2014,15-07-2014,30 dias,"Portugal, Coimbra, Coimbra","Artigo 20.º, n.º 1, alínea a) do Código dos Contratos Públicos","","","","",,Não aplicável.,Não aplicável.,FALSE
Equipamento Informático,Ajuste Direto Regime Geral,Aquisição de bens móveis,"30000000-9, Máquinas, equipamento e material de escritório e de informática, excepto mobiliário e pacotes de programas (software)","Centro Hospitalar e Universitário de Coimbra, E. P. E. (510103448)","Cesário & Cesário, Lda. (503133329)","1.600,00 €",15-07-2014,15-07-2014,8 dias,"Portugal, Coimbra, Coimbra","Artigo 20.º, n.º 1, alínea a) do Código dos Contratos Públicos","","","","",,Não aplicável.,Não aplicável.,FALSE
Equipamento Informático,Ajuste Direto Regime Geral,Aquisição de bens móveis,"30000000-9, Máquinas, equipamento e material de escritório e de informática, excepto mobiliário e pacotes de programas (software)","Centro Hospitalar e Universitário de Coimbra, E. P. E. (510103448)","Espectro - Sistemas de Informação, S.A. (503115231)","265,20 €",15-07-2014,15-07-2014,30 dias,"Portugal, Coimbra, Coimbra","Artigo 20.º, n.º 1, alínea a) do Código dos Contratos Públicos","","","","",,Não aplicável.,Não aplicável.,FALSE
BOSENTANO 125 MG COMP,Ajuste Direto Regime Geral,Aquisição de bens móveis,"33698000-9, Produtos para fins clínicos","Centro Hospitalar e Universitário de Coimbra, E.P. (510103448)","Actelion Pharmaceuticals, Sociedade Unipessoal Lda (507336488)","347.670,40 €",11-07-2014,06-06-2014,365 dias,"Portugal, Coimbra, Coimbra","Artigo 24.º, n.º 1, alínea e) do Código dos Contratos Públicos",31-12-2014,"347.670,40 €","","",,Não aplicável.,Não aplicável.,FALSE
040103072014 - Gliclazida 30mg comp LM,Ajuste Direto Regime Geral,Aquisição de bens móveis,"33698000-9, Produtos para fins clínicos","Centro Hospitalar e Universitário de Coimbra, E. P. E. (510103448)",Sandoz Farmaceutica Lda (506985261),"157,24 €",11-07-2014,18-06-2014,365 dias,"Portugal, Coimbra, Coimbra","Artigo 20.º, n.º 1, alínea a) do Código dos Contratos Públicos",31-12-2014,"157,24 €","","",,Não aplicável.,Não aplicável.,FALSE
"HIALURONATO DE SODIO 16 MG/ML SER 0,8 ML",Ajuste Direto Regime Geral,Aquisição de bens móveis,"33698000-9, Produtos para fins clínicos","Centro Hospitalar e Universitário de Coimbra, E. P. E. (510103448)",Bausch & Lomb SA Sucursal Portugal (980218764),"8.388,00 €",11-07-2014,29-01-2014,365 dias,"Portugal, Coimbra, Coimbra","Artigo 20.º, n.º 1, alínea a) do Código dos Contratos Públicos",31-12-2014,"8.388,00 €","","",,Não aplicável.,Não aplicável.,FALSE
Aquisição de diverso material informático para implementação da cirurgia segura- Oftalmologia (463),Ajuste Direto Regime Geral,Aquisição de bens móveis,"30000000-9, Máquinas, equipamento e material de escritório e de informática, excepto mobiliário e pacotes de programas (software)","Centro Hospitalar e Universitário de Coimbra, E. P. E. (510103448)","iten solutions, lda (510728189)","1.279,66 €",11-07-2014,10-07-2014,15 dias,"Portugal, Coimbra, Coimbra","Artigo 20.º, n.º 1, alínea a) do Código dos Contratos Públicos","","","","",,Não aplicável.,Não aplicável.,FALSE
AMIDOTRIZOATO DE MEGLUMINA 660 MG/ML + AMIDOTRIZOATO DE SÓDIO 100 MG/ML SOL GAST,Ajuste Direto Regime Geral,Aquisição de bens móveis,"33698000-9, Produtos para fins clínicos","Centro Hospitalar e Universitário de Coimbra, E.P. (510103448)",Bayer Portugal SA (500043256),"8.878,80 €",11-07-2014,12-11-2013,365 dias,"Portugal, Coimbra, Coimbra","Artigo 24.º, n.º 1, alínea e) do Código dos Contratos Públicos",31-12-2014,"8.878,80 €","","",,Não aplicável.,Não aplicável.,FALSE
Aquisição de diverso material informático para implementação da cirurgia segura- Oftalmologia (463),Ajuste Direto Regime Geral,Aquisição de bens móveis,"30000000-9, Máquinas, equipamento e material de escritório e de informática, excepto mobiliário e pacotes de programas (software)","Centro Hospitalar e Universitário de Coimbra, E. P. E. (510103448)","Espectro,lda (503115231)","1.257,60 €",11-07-2014,10-07-2014,20 dias,"Portugal, Coimbra, Coimbra","Artigo 20.º, n.º 1, alínea a) do Código dos Contratos Públicos","","","","",,Não aplicável.,Não aplicável.,FALSE
EPTACOG ALFA (ACTIVADO) 50 K.U.I. PÓ SOL INJ FR IV,Ajuste Direto Regime Geral,Aquisição de bens móveis,"33698000-9, Produtos para fins clínicos","Centro Hospitalar e Universitário de Coimbra, E.P. (510103448)",Novo Nordisk - Comercio de Produtos Farmaceuricos Lda (501485210),"10.462,92 €",11-07-2014,24-01-2014,365 dias,"Portugal, Coimbra, Coimbra","Artigo 24.º, n.º 1, alínea e) do Código dos Contratos Públicos",31-12-2014,"10.462,92 €","","",,Não aplicável.,Não aplicável.,FALSE
Aquisição de diverso material informático para implementação da cirurgia segura- Oftalmologia (463),Ajuste Direto Regime Geral,Aquisição de bens móveis,"30000000-9, Máquinas, equipamento e material de escritório e de informática, excepto mobiliário e pacotes de programas (software)","Centro Hospitalar e Universitário de Coimbra, E. P. E. (510103448)","Cesário e Cesário,Lda (503133329)","270,00 €",11-07-2014,10-07-2014,8 dias,"Portugal, Coimbra, Coimbra","Artigo 20.º, n.º 1, alínea a) do Código dos Contratos Públicos","","","","",,Não aplicável.,Não aplicável.,FALSE
Aquisição de diverso material informático para implementação da cirurgia no B.O do serviço ORL,Ajuste Direto Regime Geral,Aquisição de bens móveis,"30000000-9, Máquinas, equipamento e material de escritório e de informática, excepto mobiliário e pacotes de programas (software)","Centro Hospitalar e Universitário de Coimbra, E. P. E. (510103448)","ITEN SOLUTIONS, S.A (510728189)","787,00 €",11-07-2014,10-07-2014,15 dias,"Portugal, Coimbra, Coimbra","Artigo 20.º, n.º 1, alínea a) do Código dos Contratos Públicos","","","","",,Não aplicável.,Não aplicável.,FALSE
Aquisição de diverso material informático para implementação da cirurgia no B.O do serviço ORL,Ajuste Direto Regime Geral,Aquisição de bens móveis,"30000000-9, Máquinas, equipamento e material de escritório e de informática, excepto mobiliário e pacotes de programas (software)","Centro Hospitalar e Universitário de Coimbra, E. P. E. (510103448)","ESPECTRO, SA (503115231)","1.100,20 €",11-07-2014,10-07-2014,20 dias,"Portugal, Coimbra, Coimbra","Artigo 20.º, n.º 1, alínea a) do Código dos Contratos Públicos","","","","",,Não aplicável.,Não aplicável.,FALSE
Aquisição de diverso material informático  para implementação da cirurgia no B.O,Ajuste Direto Regime Geral,Aquisição de bens móveis,"30000000-9, Máquinas, equipamento e material de escritório e de informática, excepto mobiliário e pacotes de programas (software)","Centro Hospitalar e Universitário de Coimbra, E. P. E. (510103448)","Cesário e Cesário , Lda (503133329)","180,00 €",11-07-2014,10-07-2014,8 dias,"Portugal, Coimbra, Coimbra","Artigo 20.º, n.º 1, alínea a) do Código dos Contratos Públicos","","","","",,Não aplicável.,Não aplicável.,FALSE
Obras de Beneficiação em unidade de internamento do serviço de Queimados (618),Ajuste Direto Regime Geral,Empreitadas de obras públicas,"50000000-5, Serviços de reparação e manutenção","Centro Hospitalar e Universitário de Coimbra, E. P. E. (510103448)","POPICEL, LDA (504010735)","9.710,00 €",11-07-2014,10-07-2014,10 dias,"Portugal, Coimbra, Coimbra","Artigo 19.º, alínea a) do Código dos Contratos Públicos","","","","",,Não aplicável.,Não aplicável.,FALSE
040101952014 - Drosperinona 3mg+Etinilestradiol 0.02mg comp,Ajuste Direto Regime Geral,Aquisição de bens móveis,"33698000-9, Produtos para fins clínicos","Centro Hospitalar e Universitário de Coimbra, E. P. E. (510103448)",Sandoz Farmaceutica Lda (506985261),"338,00 €",11-07-2014,19-06-2014,365 dias,"Portugal, Coimbra, Coimbra","Artigo 20.º, n.º 1, alínea a) do Código dos Contratos Públicos","","","","",,Não aplicável.,Não aplicável.,FALSE
Perindopril 10 mg comp,Ajuste Direto Regime Geral,Aquisição de bens móveis,"33698000-9, Produtos para fins clínicos","Centro Hospitalar e Universitário de Coimbra, E.P. (510103448)",Teva Pharma - Produtos Farmaceuticos Lda (507045491),"435,60 €",11-07-2014,19-06-2014,365 dias,"Portugal, Coimbra, Coimbra","Artigo 20.º, n.º 1, alínea a) do Código dos Contratos Públicos",31-12-2014,"435,60 €","","",,Não aplicável.,Não aplicável.,FALSE
CAPECITABINA COMP,Ajuste Direto Regime Geral,Aquisição de bens móveis,"33698000-9, Produtos para fins clínicos","Centro Hospitalar e Universitário de Coimbra, E.P. (510103448)",Farmoz - Sociedade Técnico Medicinal SA (501505334),"13.941,00 €",11-07-2014,20-06-2014,365 dias,"Portugal, Coimbra, Coimbra","Artigo 20.º, n.º 1, alínea a) do Código dos Contratos Públicos",31-12-2014,"13.941,00 €","","",,Não aplicável.,Não aplicável.,FALSE
SOMATROPINA 8 MG/ML SOL INJ CARTU 1.5 ML SC,Ajuste Direto Regime Geral,Aquisição de bens móveis,"33698000-9, Produtos para fins clínicos","Centro Hospitalar e Universitário de Coimbra, E.P. (510103448)",Merck SA (500650870),"68.516,68 €",11-07-2014,25-06-2014,365 dias,"Portugal, Coimbra, Coimbra","Artigo 24.º, n.º 1, alínea e) do Código dos Contratos Públicos",31-12-2014,"100.139,76 €","","",,Não aplicável.,Não aplicável.,FALSE
5410155/2014 - Sulfadiazina 500mg comp,Ajuste Direto Regime Geral,Aquisição de bens móveis,"33698000-9, Produtos para fins clínicos","Centro Hospitalar e Universitário de Coimbra, E. P. E. (510103448)",Sidefarma - Sociedade Industrial de Expansão Farmaceutica SA (500717419),"142,00 €",11-07-2014,14-11-2013,365 dias,"Portugal, Coimbra, Coimbra","Artigo 24.º, n.º 1, alínea e) do Código dos Contratos Públicos",31-12-2014,"142,00 €","","",,Não aplicável.,Não aplicável.,FALSE
"040104542014 - Cafeína 0,01mg/ml sol inj",Ajuste Direto Regime Geral,Aquisição de bens móveis,"33698000-9, Produtos para fins clínicos","Centro Hospitalar e Universitário de Coimbra, E. P. E. (510103448)",Labesfal Laboratorios Almiro SA (501169580),"6.138,00 €",11-07-2014,08-07-2014,365 dias,"Portugal, Coimbra, Coimbra","Artigo 20.º, n.º 1, alínea a) do Código dos Contratos Públicos",31-12-2014,"6.138,00 €","","",,Não aplicável.,Não aplicável.,FALSE
040103682014 - Cloro Hexidina 2mg/ml sol lav boca fr 300ml,Ajuste Direto Regime Geral,Aquisição de bens móveis,"33698000-9, Produtos para fins clínicos","Centro Hospitalar e Universitário de Coimbra, E. P. E. (510103448)",Laboratorios Inibsa SA (500139571),"16.522,00 €",11-07-2014,20-06-2014,365 dias,"Portugal, Coimbra, Coimbra","Artigo 20.º, n.º 1, alínea a) do Código dos Contratos Públicos",31-12-2014,"16.522,00 €","","",,Não aplicável.,Não aplicável.,FALSE
