Objeto do Contrato,Tipo de Procedimento,Tipo(s) de Contrato,CPVs,Entidade(s) Adjudicante(s),Entidade(s) Adjudicatária(s),Preço Contratual,Data de Publicação,Data de Celebração do Contrato,Prazo de Execução,Local de Execução,Fundamentação,Data de Fecho do Contrato,Preço Total Efetivo,Causas das Alterações ao Prazo,Causas das Alterações ao Preço,Estado,N.º registo do Acordo Quadro,Descrição do Acordo Quadro,Procedimento Centralizado
Actualização do Sistema de Gestão Técnica do CHCB,Consulta Prévia,Aquisição de bens móveis,"48000000-8, Pacotes de software e sistemas de informação","Centro Hospitalar Cova da Beira, E. P. E. (506361659)","Honeywell (Portugal) - Automação e Controlo, S.A. (500908680)","41.258,00 €",09-08-2018,27-07-2018,60 dias,"Portugal, Castelo Branco, Covilhã","Artigo 20.º, n.º 1, alínea c) do Código dos Contratos Públicos",,,,,,Não aplicável.,Não aplicável.,FALSE
Medicamentos antirretrovíricos para tratamento da infecção por VIH.,Ao abrigo de acordo-quadro (art.º 259.º),Aquisição de bens móveis,"33600000-6, Produtos farmacêuticos","Centro Hospitalar Cova da Beira, E. P. E. (506361659)","Abbvie, Lda (510229050)","16.679,24 €",09-08-2018,25-07-2018,153 dias,"Portugal, Castelo Branco, Covilhã",Artigo 259.º do Código dos Contratos Públicos,,,,,,345900,CONCURSO PÚBLICO PARA A CELEBRAÇÃO DE CONTRATOS PÚBLICOS DE APROVISIONAMENTO PARA AQUISIÇÃO MEDICAMENTOS DO FORO ONCOLÓGICO,FALSE
Medicamentos antirretrovíricos para tratamento da infecção por VIH.,Ao abrigo de acordo-quadro (art.º 259.º),Aquisição de bens móveis,"33600000-6, Produtos farmacêuticos","Centro Hospitalar Cova da Beira, E. P. E. (506361659)","Farmoz - Sociedade Técnico Medicinal, S.A. (501505334)","3.918,60 €",09-08-2018,25-07-2018,153 dias,"Portugal, Castelo Branco, Covilhã",Artigo 259.º do Código dos Contratos Públicos,,,,,,345900,CONCURSO PÚBLICO PARA A CELEBRAÇÃO DE CONTRATOS PÚBLICOS DE APROVISIONAMENTO PARA AQUISIÇÃO MEDICAMENTOS DO FORO ONCOLÓGICO,FALSE
Medicamentos antirretrovíricos para tratamento da infecção por VIH.,Ao abrigo de acordo-quadro (art.º 259.º),Aquisição de bens móveis,"33600000-6, Produtos farmacêuticos","Centro Hospitalar Cova da Beira, E. P. E. (506361659)","VIIVHIV Healthcare, Unipessoal, Lda. (509117961)","414,60 €",09-08-2018,25-07-2018,153 dias,"Portugal, Castelo Branco, Covilhã",Artigo 259.º do Código dos Contratos Públicos,,,,,,345900,CONCURSO PÚBLICO PARA A CELEBRAÇÃO DE CONTRATOS PÚBLICOS DE APROVISIONAMENTO PARA AQUISIÇÃO MEDICAMENTOS DO FORO ONCOLÓGICO,FALSE
Aquisição e montagem de ar condicionado para os Serviços Farmacêuticos,Ajuste Direto Regime Geral,Aquisição de bens móveis,"42500000-1, Equipamento de refrigeração e ventilação","Centro Hospitalar Cova da Beira, E. P. E. (506361659)","Traçoinox - Equipamentos e Climatização, Lda. (510221440)","16.830,00 €",08-08-2018,17-07-2018,30 dias,"Portugal, Castelo Branco, Covilhã","Artigo 20.º, n.º 1, alínea a) do Código dos Contratos Públicos",,,,,,Não aplicável.,Não aplicável.,FALSE
"Filtros de Bolsa, Filtros Absolutos e Mantas Pré-Filtro",Consulta Prévia,Aquisição de bens móveis,"39714000-0, Campânulas de ventilação ou reciclagem de ar","Centro Hospitalar Cova da Beira, E. P. E. (506361659)","Optar OCF Comércio de Filtros, Unipessoal, Lda. (514325313)","5.144,78 €",08-08-2018,17-04-2018,270 dias,"Portugal, Castelo Branco, Covilhã","Artigo 20.º, n.º 1, alínea c) do Código dos Contratos Públicos",,,,,,Não aplicável.,Não aplicável.,FALSE
"Filtros de Bolsa, Filtros Absolutos e Mantas Pré-Filtro",Consulta Prévia,Aquisição de bens móveis,"39714000-0, Campânulas de ventilação ou reciclagem de ar","Centro Hospitalar Cova da Beira, E. P. E. (506361659)","Luis Geada - Equipamentos de Climatização, Lda. (505975300)","2.504,00 €",08-08-2018,17-04-2018,270 dias,"Portugal, Castelo Branco, Covilhã","Artigo 20.º, n.º 1, alínea c) do Código dos Contratos Públicos",,,,,,Não aplicável.,Não aplicável.,FALSE
"Filtros de Bolsa, Filtros Absolutos e Mantas Pré-Filtro",Consulta Prévia,Aquisição de bens móveis,"39714000-0, Campânulas de ventilação ou reciclagem de ar","Centro Hospitalar Cova da Beira, E. P. E. (506361659)","CML - Comercio e equipamentos Industriais, Lda. (514242655)","25.606,45 €",08-08-2018,17-04-2018,270 dias,"Portugal, Castelo Branco, Covilhã","Artigo 20.º, n.º 1, alínea c) do Código dos Contratos Públicos",,,,,,Não aplicável.,Não aplicável.,FALSE
Aquisição de Batas Descartáveis ao abrigo do CP 2016/24,Ao abrigo de acordo-quadro (art.º 259.º),Aquisição de bens móveis,"33140000-3, Material médico de consumo","Centro Hospitalar Cova da Beira, E. P. E. (506361659)","Barna Imprt Médica Portugal, Lda. (513468994)","30,60 €",07-08-2018,02-08-2018,153 dias,"Portugal, Castelo Branco, Covilhã",Artigo 259.º do Código dos Contratos Públicos,,,,,,2078840,CP 2016/24 - Acordo quadro para fornecimento de Material disposable de bloco operatório - Parte I-A às Instituições e Serviços do Serviço Nacional de Saúde,FALSE
Aquisição de Batas Descartáveis ao abrigo do CP 2016/24,Ao abrigo de acordo-quadro (art.º 259.º),Aquisição de bens móveis,"33140000-3, Material médico de consumo","Centro Hospitalar Cova da Beira, E. P. E. (506361659)","Docword, Lda. (508592909)","1.890,00 €",07-08-2018,02-08-2018,153 dias,"Portugal, Castelo Branco, Covilhã",Artigo 259.º do Código dos Contratos Públicos,,,,,,2078840,CP 2016/24 - Acordo quadro para fornecimento de Material disposable de bloco operatório - Parte I-A às Instituições e Serviços do Serviço Nacional de Saúde,FALSE
Aquisição de Batas Descartáveis ao abrigo do CP 2016/24,Ao abrigo de acordo-quadro (art.º 259.º),Aquisição de bens móveis,"33140000-3, Material médico de consumo","Centro Hospitalar Cova da Beira, E. P. E. (506361659)",Anástacio da Costa Saldanha (505804441),"4.642,50 €",07-08-2018,06-08-2018,150 dias,"Portugal, Castelo Branco, Covilhã",Artigo 259.º do Código dos Contratos Públicos,,,,,,2078840,CP 2016/24 - Acordo quadro para fornecimento de Material disposable de bloco operatório - Parte I-A às Instituições e Serviços do Serviço Nacional de Saúde,FALSE
"Aquisição de Seringas, Agulhas e Contentores ao abrigo do Acordo Quadro CP 2014/22",Ao abrigo de acordo-quadro (art.º 259.º),Aquisição de bens móveis,"33100000-1, Equipamento médico","Centro Hospitalar Cova da Beira, EPE (506361659)","Quilaban - Quimica Laboratorial Analitica, S.A. (500399670)","2.983,72 €",07-08-2018,03-08-2018,153 dias,"Portugal, Castelo Branco, Covilhã","Artigo 20.º, n.º 1, alínea b) do Código dos Contratos Públicos",,,,,,1341769,"ACORDO QUADRO PARA FORNECIMENTO DE SERINGAS, AGULHAS E CONTENTORES ÀS INSTITUIÇÕES E SERVIÇOS DO SERVIÇO NACIONAL DE SAÚDE PROGRAMA DE CONCURSO",FALSE
"Aquisição de Seringas, Agulhas e Contentores ao abrigo do Acordo Quadro CP 2014/22",Ao abrigo de acordo-quadro (art.º 259.º),Aquisição de bens móveis,"33100000-1, Equipamento médico","Centro Hospitalar Cova da Beira, EPE (506361659)","Overpharma, Produtos Médicos e Farmacêuticos, Lda. (505792362)","2.021,55 €",07-08-2018,01-08-2018,153 dias,"Portugal, Castelo Branco, Covilhã","Artigo 20.º, n.º 1, alínea b) do Código dos Contratos Públicos",,,,,,1341769,"ACORDO QUADRO PARA FORNECIMENTO DE SERINGAS, AGULHAS E CONTENTORES ÀS INSTITUIÇÕES E SERVIÇOS DO SERVIÇO NACIONAL DE SAÚDE PROGRAMA DE CONCURSO",FALSE
"Aquisição de Seringas, Agulhas e Contentores ao abrigo do Acordo Quadro CP 2014/22",Ao abrigo de acordo-quadro (art.º 259.º),Aquisição de bens móveis,"33100000-1, Equipamento médico","Centro Hospitalar Cova da Beira, EPE (506361659)","Normax, Lda. (500203130)","4.418,02 €",07-08-2018,03-08-2018,153 dias,"Portugal, Castelo Branco, Covilhã","Artigo 20.º, n.º 1, alínea b) do Código dos Contratos Públicos",,,,,,1341769,"ACORDO QUADRO PARA FORNECIMENTO DE SERINGAS, AGULHAS E CONTENTORES ÀS INSTITUIÇÕES E SERVIÇOS DO SERVIÇO NACIONAL DE SAÚDE PROGRAMA DE CONCURSO",FALSE
"Aquisição de Seringas, Agulhas e Contentores ao abrigo do Acordo Quadro CP 2014/22",Ao abrigo de acordo-quadro (art.º 259.º),Aquisição de bens móveis,"33100000-1, Equipamento médico","Centro Hospitalar Cova da Beira, EPE (506361659)","Docworld, Lda. (508592909)","432,48 €",07-08-2018,02-08-2018,153 dias,"Portugal, Castelo Branco, Covilhã","Artigo 20.º, n.º 1, alínea b) do Código dos Contratos Públicos",,,,,,1341769,"ACORDO QUADRO PARA FORNECIMENTO DE SERINGAS, AGULHAS E CONTENTORES ÀS INSTITUIÇÕES E SERVIÇOS DO SERVIÇO NACIONAL DE SAÚDE PROGRAMA DE CONCURSO",FALSE
"Aquisição de Seringas, Agulhas e Contentores ao abrigo do Acordo Quadro CP 2014/22",Ao abrigo de acordo-quadro (art.º 259.º),Aquisição de bens móveis,"33100000-1, Equipamento médico","Centro Hospitalar Cova da Beira, EPE (506361659)","B. Braun Medical, Lda. (501506543)","7.780,75 €",07-08-2018,01-08-2018,153 dias,"Portugal, Castelo Branco, Covilhã","Artigo 20.º, n.º 1, alínea b) do Código dos Contratos Públicos",,,,,,1341769,"ACORDO QUADRO PARA FORNECIMENTO DE SERINGAS, AGULHAS E CONTENTORES ÀS INSTITUIÇÕES E SERVIÇOS DO SERVIÇO NACIONAL DE SAÚDE PROGRAMA DE CONCURSO",FALSE
Aquisição de medicamentos: Pemetrexedo,Concurso público,Aquisição de bens móveis,"33600000-6, Produtos farmacêuticos","Centro Hospitalar Cova da Beira, EPE (506361659)","LILLY PORTUGAL-PROD.FARMACEUTICOS, LDA (500165602)","175.384,20 €",07-08-2018,04-07-2018,213 dias,"Portugal, Castelo Branco, Covilhã","Artigo 20.º, n.º 1, alínea b) do Código dos Contratos Públicos",,,,,,Não aplicável.,Não aplicável.,FALSE
Instalação de Sistema de Desinfecção de água de controlo de cloro activo,Ajuste Direto Regime Geral,Aquisição de bens móveis,"42990000-2, Máquinas diversas para usos específicos","Centro Hospitalar Cova da Beira, E. P. E. (506361659)","Enkrott, Gestão e Tratamento de Águas, S.A. (500103461)","17.340,60 €",01-08-2018,29-06-2018,30 dias,"Portugal, Castelo Branco, Covilhã","Artigo 24.º, n.º 1, alínea c) do Código dos Contratos Públicos",,,,,,Não aplicável.,Não aplicável.,FALSE
