Objeto do Contrato,Tipo de Procedimento,Tipo(s) de Contrato,CPVs,Entidade(s) Adjudicante(s),Entidade(s) Adjudicatária(s),Preço Contratual,Data de Publicação,Data de Celebração do Contrato,Prazo de Execução,Local de Execução,Fundamentação,Data de Fecho do Contrato,Preço Total Efetivo,Causas das Alterações ao Prazo,Causas das Alterações ao Preço,Estado,N.º registo do Acordo Quadro,Descrição do Acordo Quadro,Procedimento Centralizado
Serviços de Manutenção Equipamentos da VIGIE,Ajuste Direto Regime Geral,Aquisição de serviços,"50000000-5, Serviços de reparação e manutenção",Hospital Prof. Doutor Fernando Fonseca E.P.E. (503035416),"ViGIE Solutions, Lda. (509041108)","5.141,80 €",10-05-2018,10-05-2018,365 dias,"Portugal, Lisboa, Amadora","Artigo 20.º, n.º 1, alínea a) do Código dos Contratos Públicos",,,,,,Não aplicável.,Não aplicável.,FALSE
Convida-se a apresentar proposta para a Aquisição de Serviços de Elaboração de Projetos de Execução para a Implementação de Medidas de Eficiência Energética – remodelação da instalação do AVAC do HFF,Consulta Prévia,Aquisição de serviços,"71000000-8, Serviços de arquitectura, construção, engenharia e inspecção","Hospital Professor Doutor Fernando Fonseca, E. P. E. (503035416)",SUCH - Serviço de Utilização Comum dos Hospitais (500900469),"72.000,00 €",03-05-2018,28-03-2018,270 dias,"Portugal, Lisboa, Amadora","Artigo 20.º, n.º 1, alínea c) do Código dos Contratos Públicos",,,,,,Não aplicável.,Não aplicável.,FALSE
