Objeto do Contrato,Tipo de Procedimento,Tipo(s) de Contrato,CPVs,Entidade(s) Adjudicante(s),Entidade(s) Adjudicatária(s),Preço Contratual,Data de Publicação,Data de Celebração do Contrato,Prazo de Execução,Local de Execução,Fundamentação,Data de Fecho do Contrato,Preço Total Efetivo,Causas das Alterações ao Prazo,Causas das Alterações ao Preço,Estado,N.º registo do Acordo Quadro,Descrição do Acordo Quadro,Procedimento Centralizado
Aquisição de Hemoculturas,Ajuste Direto Regime Geral,Aquisição de bens móveis,"33696000-5, Reagentes e meios de contraste","Centro Hospitalar Lisboa Norte, E. P. E. (508481287)",QUILABAN QUIMICA LABORATORIAL ANALITICA S.A. (500399670),"5.700,00 €",11-08-2015,11-08-2015,1 dias,"Portugal, Lisboa, Lisboa","Artigo 24.º, n.º 1, alínea e) do Código dos Contratos Públicos",,,,,,Não aplicável.,Não aplicável.,FALSE
Aquisição de rotulas,Ajuste Direto Regime Geral,Aquisição de bens móveis,"33140000-3, Material médico de consumo","Centro Hospitalar Lisboa Norte, E. P. E. (508481287)",JOHNSON & JOHNSON LDA (500153370),"6.461,16 €",11-08-2015,11-08-2015,1 dias,"Portugal, Lisboa, Lisboa","Artigo 20.º, n.º 1, alínea a) do Código dos Contratos Públicos",,,,,,Não aplicável.,Não aplicável.,FALSE
Aquisição de bolsa para alimentação parenterica 3000 ML,Ajuste Direto Regime Geral,Aquisição de bens móveis,"33190000-8, Dispositivos e produtos médicos variados","CENTRO HOSPITALAR LISBOA NORTE, EPE (508481287)",GRIFOLS PORTUGAL LDA (502041285),"1.316,00 €",11-08-2015,11-08-2015,142 dias,"Portugal, Lisboa, Lisboa","Artigo 20.º, n.º 1, alínea a) do Código dos Contratos Públicos",,,,,,Não aplicável.,Não aplicável.,FALSE
Fornecimento e instalação de sistema de monitorização de temperaturas nas câmaras frigoríficos,Ajuste Direto Regime Geral,Empreitadas de obras públicas,"50700000-2, Serviços de reparação e manutenção de equipamento em edifícios","Centro Hospitalar Lisboa Norte, E. P. E. (508481287)",VIGIE SOLUTIONS LDA (509041108),"1.473,28 €",11-08-2015,11-08-2015,15 dias,"Portugal, Lisboa, Lisboa","Artigo 19.º, alínea a) do Código dos Contratos Públicos",,,,,,Não aplicável.,Não aplicável.,FALSE
Fornecimento e Instalação  de sistema de monitorização de temperaturas nas diversas câmaras da cozinha,Ajuste Direto Regime Geral,Empreitadas de obras públicas,"50700000-2, Serviços de reparação e manutenção de equipamento em edifícios","Centro Hospitalar Lisboa Norte, E. P. E. (508481287)",VIGIE SOLUTIONS LDA (509041108),"2.971,63 €",11-08-2015,11-08-2015,60 dias,"Portugal, Lisboa, Lisboa","Artigo 19.º, alínea a) do Código dos Contratos Públicos",,,,,,Não aplicável.,Não aplicável.,FALSE
Fornecimento e Instalação de sistema de controlo de temperatura no congelador do Hospital de Dia  de Pneumologia,Ajuste Direto Regime Geral,Empreitadas de obras públicas,"50700000-2, Serviços de reparação e manutenção de equipamento em edifícios","Centro Hospitalar Lisboa Norte, E. P. E. (508481287)",VIGIE SOLUTIONS LDA (509041108),"1.617,16 €",11-08-2015,11-08-2015,15 dias,"Portugal, Lisboa, Lisboa","Artigo 19.º, alínea a) do Código dos Contratos Públicos",,,,,,Não aplicável.,Não aplicável.,FALSE
Aquisição de material ortopedico,Ajuste Direto Regime Geral,Aquisição de bens móveis,"33190000-8, Dispositivos e produtos médicos variados","Centro Hospitalar Lisboa Norte, E. P. E. (508481287)",JOHNSON & JOHNSON LDA (500153370),"7.283,19 €",11-08-2015,11-08-2015,1 dias,"Portugal, Lisboa, Lisboa","Artigo 20.º, n.º 1, alínea a) do Código dos Contratos Públicos",,,,,,Não aplicável.,Não aplicável.,FALSE
Aquisição de endoprotese para aneurisma da aorta,Ajuste Direto Regime Geral,Aquisição de bens móveis,"33184200-5, Próteses vasculares","Centro Hospitalar Lisboa Norte, E. P. E. (508481287)",Medtronic Portugal Lda (504223933),"25.500,00 €",11-08-2015,11-08-2015,1 dias,"Portugal, Lisboa, Lisboa","Artigo 20.º, n.º 1, alínea a) do Código dos Contratos Públicos",,,,,,Não aplicável.,Não aplicável.,FALSE
Aquisição de CDI,Ajuste Direto Regime Geral,Aquisição de bens móveis,"33182100-0, Desfibrilhador","Centro Hospitalar Lisboa Norte, E. P. E. (508481287)",BIOTRONIK PORTUGAL UNIPESSOAL LDA (510726941),"14.330,00 €",11-08-2015,11-08-2015,1 dias,"Portugal, Lisboa, Lisboa","Artigo 20.º, n.º 1, alínea a) do Código dos Contratos Públicos",,,,,,Não aplicável.,Não aplicável.,FALSE
Aquisição de endoprotese para aneurisma da aorta,Ajuste Direto Regime Geral,Aquisição de bens móveis,"33184200-5, Próteses vasculares","Centro Hospitalar Lisboa Norte, E. P. E. (508481287)",MEDTRONIC PORTUGAL LDA (504223933),"34.000,00 €",11-08-2015,11-08-2015,1 dias,"Portugal, Lisboa, Lisboa","Artigo 20.º, n.º 1, alínea a) do Código dos Contratos Públicos",,,,,,Não aplicável.,Não aplicável.,FALSE
Aquisição de oxido nitrico,Ajuste Direto Regime Geral,Aquisição de bens móveis,"24111000-5, Hidrogénio, árgon, gases raros, azoto e oxigénio","Centro Hospitalar Lisboa Norte, E. P. E. (508481287)",AIR LIQUIDE MEDICINAL SA (501576436),"11.240,00 €",11-08-2015,10-08-2015,1 dias,"Portugal, Lisboa, Lisboa","Artigo 24.º, n.º 1, alínea e) do Código dos Contratos Públicos",,,,,,Não aplicável.,Não aplicável.,FALSE
Aquisição de arquivador de laminas metal,Ajuste Direto Regime Geral,Aquisição de bens móveis,"33140000-3, Material médico de consumo","Centro Hospitalar Lisboa Norte, E. P. E. (508481287)",ENZIFARMA DIAGNOSTICA E FARMACÊUTICA SA (503636975),"440,91 €",10-08-2015,10-08-2015,30 dias,"Portugal, Lisboa, Lisboa","Artigo 20.º, n.º 1, alínea a) do Código dos Contratos Públicos",,,,,,Não aplicável.,Não aplicável.,FALSE
Aquisição de pulseira de identificação de doentes de cor azul,Ajuste Direto Regime Geral,Aquisição de bens móveis,"22455100-5, Pulseiras de identificação","CENTRO HOSPITALAR LISBOA NORTE, EPE (508481287)",AVIQUIMICA IMPORTAÇÕES E MANUFACTURAS LDA (500039720),"80,00 €",07-08-2015,07-08-2015,140 dias,"Portugal, Lisboa, Lisboa","Artigo 20.º, n.º 1, alínea a) do Código dos Contratos Públicos",,,,,,Não aplicável.,Não aplicável.,FALSE
Obras de reparação no Serviço de Cirurgia Cardiotoracica,Ajuste Direto Regime Geral,Empreitadas de obras públicas,"45450000-6, Outras obras de acabamento de edifícios","Centro Hospitalar Lisboa Norte, E. P. E. (508481287)",FRANCISCO JOSE VIEIRA MARQUES (128779799),"120,00 €",07-08-2015,07-08-2015,1 dias,"Portugal, Lisboa, Lisboa","Artigo 19.º, alínea a) do Código dos Contratos Públicos",,,,,,Não aplicável.,Não aplicável.,FALSE
Empreitada para execução da obra de fornecimento e montagem de aparelho de ar condicionado,Ajuste Direto Regime Geral,Empreitadas de obras públicas,"45331200-8, Instalação de ventilação e de ar condicionado","Centro Hospitalar Lisboa Norte, E. P. E. (508481287)",TERMOTERMICA INSTALAÇÕES ESPECIAIS LDA (504013432),"2.110,50 €",07-08-2015,07-08-2015,30 dias,"Portugal, Lisboa, Lisboa","Artigo 19.º, alínea a) do Código dos Contratos Públicos",,,,,,Não aplicável.,Não aplicável.,FALSE
Reparação de Videogastroscópio para o Serviço de Pediatria,Ajuste Direto Regime Geral,Aquisição de serviços,"50420000-5, Serviços de reparação e manutenção de equipamento médico e cirúrgico","Centro Hospitalar Lisboa Norte, E. P. E. (508481287)",OLYMPUS IBERIA - SUCURSAL EM PORTUGAL LDA (980474710),"9.078,87 €",07-08-2015,07-08-2015,30 dias,"Portugal, Lisboa, Lisboa","Artigo 20.º, n.º 1, alínea a) do Código dos Contratos Públicos",,,,,,Não aplicável.,Não aplicável.,FALSE
Fornecimento e colocação de cantoneiras e reparação da porta do Serviço de Imagiologia,Ajuste Direto Regime Geral,Empreitadas de obras públicas,"45450000-6, Outras obras de acabamento de edifícios","Centro Hospitalar Lisboa Norte, E. P. E. (508481287)",FRANCISCO JOSE VIEIRA MARQUES (128779799),"823,00 €",07-08-2015,07-08-2015,30 dias,"Portugal, Lisboa, Lisboa","Artigo 19.º, alínea a) do Código dos Contratos Públicos",,,,,,Não aplicável.,Não aplicável.,FALSE
Aquisição de sistema entrega disp. apendice e dispositivo de encerramento,Ajuste Direto Regime Geral,Aquisição de bens móveis,"33140000-3, Material médico de consumo","Centro Hospitalar Lisboa Norte, E. P. E. (508481287)",BOSTON SCIENTIFIC PORTUGAL LDA (504988964),"5.790,00 €",07-08-2015,07-08-2015,1 dias,"Portugal, Lisboa, Lisboa","Artigo 20.º, n.º 1, alínea a) do Código dos Contratos Públicos",,,,,,Não aplicável.,Não aplicável.,FALSE
Aquisição de valvula aortica  sem sutura 21 mm,Ajuste Direto Regime Geral,Aquisição de bens móveis,"33182220-7, Válvulas cardíacas","Centro Hospitalar Lisboa Norte, E. P. E. (508481287)",EDWARDS LIFESCIENCES PORTUGAL LDA (508014832),"6.500,00 €",06-08-2015,06-08-2015,1 dias,"Portugal, Lisboa, Lisboa","Artigo 20.º, n.º 1, alínea a) do Código dos Contratos Públicos",,,,,,Não aplicável.,Não aplicável.,FALSE
Aquisição de valvula aortica sem sutura 21 mm,Ajuste Direto Regime Geral,Aquisição de bens móveis,"33182220-7, Válvulas cardíacas","Centro Hospitalar Lisboa Norte, E. P. E. (508481287)",EDWARDS LIFESCIENCES LDA (508014832),"6.500,00 €",06-08-2015,06-08-2015,1 dias,"Portugal, Lisboa, Lisboa","Artigo 20.º, n.º 1, alínea a) do Código dos Contratos Públicos",,,,,,Não aplicável.,Não aplicável.,FALSE
Aquisição de FACTOR VIII PLASMA DEFICIENTE 1 ML,Ajuste Direto Regime Geral,Aquisição de bens móveis,"33696200-7, Reagentes para análises ao sangue","Centro Hospitalar Lisboa Norte, E. P. E. (508481287)",WERFEN PORTUGAL LDA (501086110),"9.000,00 €",06-08-2015,06-08-2015,1 dias,"Portugal, Lisboa, Lisboa","Artigo 24.º, n.º 1, alínea e) do Código dos Contratos Públicos",,,,,,Não aplicável.,Não aplicável.,FALSE
Aquisição de FACTOR VII PLASMA DEFICIENTE 1 ML,Ajuste Direto Regime Geral,Aquisição de bens móveis,"33696200-7, Reagentes para análises ao sangue","Centro Hospitalar Lisboa Norte, E. P. E. (508481287)",WERFEN PORTUGAL LDA (501086110),"7.800,00 €",06-08-2015,06-08-2015,1 dias,"Portugal, Lisboa, Lisboa","Artigo 24.º, n.º 1, alínea e) do Código dos Contratos Públicos",,,,,,Não aplicável.,Não aplicável.,FALSE
Aquisição de FACTOR V PLASMA DEFICIENTE 1 ML,Ajuste Direto Regime Geral,Aquisição de bens móveis,"33696200-7, Reagentes para análises ao sangue","Centro Hospitalar Lisboa Norte, E. P. E. (508481287)",WERFEN PORTUGAL LDA (501086110),"7.200,00 €",06-08-2015,06-08-2015,1 dias,"Portugal, Lisboa, Lisboa","Artigo 24.º, n.º 1, alínea e) do Código dos Contratos Públicos",,,,,,Não aplicável.,Não aplicável.,FALSE
Aquisição de OXIGENIO GASOSO MEDICINAL GRFA 0.6 M3,Ajuste Direto Regime Geral,Aquisição de bens móveis,"33652000-5, Antineoplásicos e imunomoduladores","Centro Hospitalar Lisboa Norte, E. P. E. (508481287)",LINDE PORTUGAL LDA (500266344),"1.052,00 €",06-08-2015,06-08-2015,1 dias,"Portugal, Lisboa, Lisboa","Artigo 24.º, n.º 1, alínea e) do Código dos Contratos Públicos",,,,,,Não aplicável.,Não aplicável.,FALSE
Aquisição de IRINOTECANO SOL INJ 20 MG/ML AMP 5 ML,Ajuste Direto Regime Geral,Aquisição de bens móveis,"33652000-5, Antineoplásicos e imunomoduladores","Centro Hospitalar Lisboa Norte, E. P. E. (508481287)",AUROVITAS UNIPESSOAL LDA (513053239),"637,50 €",06-08-2015,06-08-2015,2 dias,"Portugal, Lisboa, Lisboa","Artigo 24.º, n.º 1, alínea e) do Código dos Contratos Públicos",,,,,,Não aplicável.,Não aplicável.,FALSE
Aquisição de FLUOROURACILO 5 G/ 100 ML INJ,Ajuste Direto Regime Geral,Aquisição de bens móveis,"33651520-9, Imunoglobulinas","Centro Hospitalar Lisboa Norte, E. P. E. (508481287)",ACCORD HEALTHCARE UNIPESSOAL LDA (508622263),"2.625,00 €",06-08-2015,06-08-2015,1 dias,"Portugal, Lisboa, Lisboa","Artigo 24.º, n.º 1, alínea e) do Código dos Contratos Públicos",,,,,,Não aplicável.,Não aplicável.,FALSE
Aquisição de AMOXICILINA CÁPS 500 MG,Ajuste Direto Regime Geral,Aquisição de bens móveis,"33651100-9, Antibacterianos de uso sistémico","Centro Hospitalar Lisboa Norte, E. P. E. (508481287)",GLAXO SMITHKLINE - PROD. FARMACEUTICOS LDA (500139962),"490,68 €",06-08-2015,06-08-2015,2 dias,"Portugal, Lisboa, Lisboa","Artigo 20.º, n.º 1, alínea a) do Código dos Contratos Públicos",,,,,,Não aplicável.,Não aplicável.,FALSE
Aquisição de Tromboplastina 5 x 20 ML,Ajuste Direto Regime Geral,Aquisição de bens móveis,"33696500-0, Reagentes de laboratório","Centro Hospitalar Lisboa Norte, E. P. E. (508481287)",WERFEN  PORTUGAL LDA (501086110),"9.000,00 €",05-08-2015,05-08-2015,1 dias,"Portugal, Lisboa, Lisboa","Artigo 24.º, n.º 1, alínea e) do Código dos Contratos Públicos",,,,,,Não aplicável.,Não aplicável.,FALSE
Aquisição de D-DIMERO IL TESTE DET 115 T,Ajuste Direto Regime Geral,Aquisição de bens móveis,"33696500-0, Reagentes de laboratório","Centro Hospitalar Lisboa Norte, E. P. E. (508481287)",WERFEN PORTUGAL (501086110),"7.500,00 €",04-08-2015,04-08-2015,1 dias,"Portugal, Lisboa, Lisboa","Artigo 24.º, n.º 1, alínea e) do Código dos Contratos Públicos",,,,,,Não aplicável.,Não aplicável.,FALSE
Aquisição de LIDOCAINA 20 MG/ML SOL INJ FRS 20 ML,Ajuste Direto Regime Geral,Aquisição de bens móveis,"33661100-2, Anestésicos","Centro Hospitalar Lisboa Norte, E. P. E. (508481287)",LABESFAL - LABORATORIOS ALMIRO S.A. (501169580),"9.568,80 €",04-08-2015,04-08-2015,1 dias,"Portugal, Lisboa, Lisboa","Artigo 24.º, n.º 1, alínea e) do Código dos Contratos Públicos",,,,,,Não aplicável.,Não aplicável.,FALSE
Substituição da sonda phased array da marca philips,Ajuste Direto Regime Geral,Aquisição de serviços,"50420000-5, Serviços de reparação e manutenção de equipamento médico e cirúrgico","Centro Hospitalar Lisboa Norte, E. P. E. (508481287)",PHILIPS PORTUGUESA S. A. (500216843),"7.888,00 €",03-08-2015,03-08-2015,30 dias,"Portugal, Lisboa, Lisboa","Artigo 20.º, n.º 1, alínea a) do Código dos Contratos Públicos",,,,,,Não aplicável.,Não aplicável.,FALSE
Aquisição de Sor anti cadeias lambda 150 T,Ajuste Direto Regime Geral,Aquisição de bens móveis,"33690000-3, Medicamentos vários","Centro Hospitalar Lisboa Norte, E. P. E. (508481287)",WERFEN PORTUGAL LDA (501086110),"6.000,00 €",03-08-2015,03-08-2015,3 dias,"Portugal, Lisboa, Lisboa","Artigo 24.º, n.º 1, alínea e) do Código dos Contratos Públicos",,,,,,Não aplicável.,Não aplicável.,FALSE
Aquisição de ENDOPR. P/ANEUR.AORTA TORÁCICA PROXIMAL,Ajuste Direto Regime Geral,Aquisição de bens móveis,"33190000-8, Dispositivos e produtos médicos variados","Centro Hospitalar Lisboa Norte, E. P. E. (508481287)",BIOSONDA COMERCIO DE MATERIAL HOSPITALAR LDA (501463313),"8.500,00 €",03-08-2015,03-08-2015,1 dias,"Portugal, Lisboa, Lisboa","Artigo 20.º, n.º 1, alínea a) do Código dos Contratos Públicos",,,,,,Não aplicável.,Não aplicável.,FALSE
Aquisição de Proteina S livre Conj. det,Ajuste Direto Regime Geral,Aquisição de bens móveis,"33696500-0, Reagentes de laboratório","Centro Hospitalar Lisboa Norte, E. P. E. (508481287)",WERFEN PORTUGAL LDA (501086110),"7.800,00 €",03-08-2015,03-08-2015,3 dias,"Portugal, Lisboa, Lisboa","Artigo 24.º, n.º 1, alínea e) do Código dos Contratos Públicos",,,,,,Não aplicável.,Não aplicável.,FALSE
Aquisição de STENT INTRACR.SEMI COB. NITINOL 3.5X25MM,Ajuste Direto Regime Geral,Aquisição de bens móveis,"33190000-8, Dispositivos e produtos médicos variados","Centro Hospitalar Lisboa Norte, E. P. E. (508481287)",BIOMEDICA - SOCIEDADE DE PRODUTOS MEDICOS LDA (501745459),"9.300,00 €",03-08-2015,03-08-2015,1 dias,"Portugal, Lisboa, Lisboa","Artigo 20.º, n.º 1, alínea a) do Código dos Contratos Públicos",,,,,,Não aplicável.,Não aplicável.,FALSE
