freguesia,acronym,validVotesPercentage,votes,dicofre
Valdreu,PPD/PSD.CDS-PP,63.94,133,031355
Valdreu,PS,24.04,50,031355
Valdreu,PCP-PEV,4.81,10,031355
Valdreu,MPT,3.37,7,031355
Valdreu,PND,1.44,3,031355
Valdreu,MAS,0.96,2,031355
Valdreu,PCTP/MRPP,0.48,1,031355
Valdreu,PDA,0.48,1,031355
Valdreu,PPM,0.48,1,031355
Valdreu,B.E.,0,0,031355
Valdreu,L,0,0,031355
Valdreu,PAN,0,0,031355
Valdreu,PNR,0,0,031355
Valdreu,POUS,0,0,031355
Valdreu,PPV,0,0,031355
Valdreu,PTP,0,0,031355
