Objeto do Contrato,Tipo de Procedimento,Tipo(s) de Contrato,CPVs,Entidade(s) Adjudicante(s),Entidade(s) Adjudicatária(s),Preço Contratual,Data de Publicação,Data de Celebração do Contrato,Prazo de Execução,Local de Execução,Fundamentação,Data de Fecho do Contrato,Preço Total Efetivo,Causas das Alterações ao Prazo,Causas das Alterações ao Preço,Estado,N.º registo do Acordo Quadro,Descrição do Acordo Quadro,Procedimento Centralizado
"Aquisição de Filtros AVAC HEPA H13 para o Serviço de Instalações e Equipamentos do CHSJ, EPE.",Ajuste Direto Regime Geral,Aquisição de bens móveis,"42514310-8, Filtros de ar","Centro Hospitalar de São João, E. P. E. (509821197)","Iberconcept, Lda (507212738)","8.540,26 €",20-05-2016,13-11-2015,30 dias,"Portugal, Porto, Porto","Artigo 20.º, n.º 1, alínea a) do Código dos Contratos Públicos",,,,,,Não aplicável.,Não aplicável.,FALSE
"Aquisição de Filtros AVAC HEPA H13 para o Serviço de Instalações e Equipamentos do CHSJ, EPE.",Ajuste Direto Regime Geral,Aquisição de bens móveis,"42514310-8, Filtros de ar","Centro Hospitalar de São João, E. P. E. (509821197)","AAF, S.A. (980246083)","1.572,02 €",20-05-2016,13-11-2015,30 dias,"Portugal, Porto, Porto","Artigo 20.º, n.º 1, alínea a) do Código dos Contratos Públicos",,,,,,Não aplicável.,Não aplicável.,FALSE
"Contrato Manutenção aos equipamentos de ventilação e cuidados intensivos do CHSJ, EPE para o ano 2016",Ajuste Direto Regime Geral,Aquisição de serviços,"50000000-5, Serviços de reparação e manutenção","Centro Hospitalar de São João, E. P. E. (509821197)","Pulmocor - Equipamentos Médico, S.A. (501402578)","20.196,00 €",20-05-2016,16-05-2016,365 dias,"Portugal, Porto, Porto","Artigo 24.º, n.º 1, alínea e) do Código dos Contratos Públicos",,,,,,Não aplicável.,Não aplicável.,FALSE
"Contrato de Manutenção e Assistência Técnica aos equipamentos """"Leica"""" do CHSJ, EPE para o ano 2016",Ajuste Direto Regime Geral,Aquisição de serviços,"50000000-5, Serviços de reparação e manutenção","Centro Hospitalar de São João, E. P. E. (509821197)","Leica Microsistemas - Instrumentos de Precisão S.U.,Lda (500301921)","18.970,86 €",20-05-2016,16-05-2016,365 dias,"Portugal, Porto, Porto","Artigo 24.º, n.º 1, alínea e) do Código dos Contratos Públicos",,,,,,Não aplicável.,Não aplicável.,FALSE
"Aquisição de Diversos Filtros AVAC constantes no PC 80993/15 solicitados pelo Serviço de Instalações e Equipamentos do CHSJ, EPE.",Ajuste Direto Regime Geral,Aquisição de bens móveis,"42514310-8, Filtros de ar","Centro Hospitalar de São João, E. P. E. (509821197)","Iberconcept, Lda (507212738)","15.339,33 €",20-05-2016,11-12-2015,30 dias,"Portugal, Porto, Porto","Artigo 20.º, n.º 1, alínea a) do Código dos Contratos Públicos",,,,,,Não aplicável.,Não aplicável.,FALSE
"Aquisição de Diversos Filtros AVAC constantes no PC 80993/15 solicitados pelo Serviço de Instalações e Equipamentos do CHSJ, EPE.",Ajuste Direto Regime Geral,Aquisição de bens móveis,"42514310-8, Filtros de ar","Centro Hospitalar de São João, E. P. E. (509821197)","Dico Filtro, Lda (504647377)","1.861,03 €",20-05-2016,30-11-2015,30 dias,"Portugal, Porto, Porto","Artigo 20.º, n.º 1, alínea a) do Código dos Contratos Públicos",,,,,,Não aplicável.,Não aplicável.,FALSE
"Aquisição de Diversos Filtros AVAC constantes no PC 80993/15 solicitados pelo Serviço de Instalações e Equipamentos do CHSJ, EPE.",Ajuste Direto Regime Geral,Aquisição de bens móveis,"42514310-8, Filtros de ar","Centro Hospitalar de São João, E. P. E. (509821197)","AAF, SA (980246083)","30.411,91 €",20-05-2016,11-12-2015,30 dias,"Portugal, Porto, Porto","Artigo 20.º, n.º 1, alínea a) do Código dos Contratos Públicos",,,,,,Não aplicável.,Não aplicável.,FALSE
"Aquisição de Acessorios para Gases Medicinais para o serviço de Instalações e equipamentos do CHSJ,EPE durante o ano 2016",Ajuste Direto Regime Geral,Aquisição de bens móveis,"24100000-5, Gases","Centro Hospitalar de São João, E. P. E. (509821197)",Joaquim Antonio G. Luz (505443112),"1.550,00 €",19-05-2016,22-04-2016,30 dias,"Portugal, Porto, Porto","Artigo 20.º, n.º 1, alínea a) do Código dos Contratos Públicos",,,,,,Não aplicável.,Não aplicável.,FALSE
"Aquisição do material de carpintaria e serralharia para o serviço de instalações e equipamentos do CHSJ,EPE, durante o ano de 2016",Ajuste Direto Regime Geral,Aquisição de bens móveis,"44100000-1, Materiais de construção e artigos afins","Centro Hospitalar de São João, E. P. E. (509821197)","Carvalho, Batista & Companhia, Sa. (500056773)","4.896,69 €",19-05-2016,22-04-2016,30 dias,"Portugal, Porto, Porto","Artigo 20.º, n.º 1, alínea a) do Código dos Contratos Públicos",,,,,,Não aplicável.,Não aplicável.,FALSE
"Aquisição de material de pichelaria para o serviço de instalações e equipamentos do CHSJ,EPE, durante o ano de 2016",Ajuste Direto Regime Geral,Aquisição de bens móveis,"44100000-1, Materiais de construção e artigos afins","Centro Hospitalar de São João, E. P. E. (509821197)","Mário Gonçalves, Lda (500183872)","9.543,33 €",19-05-2016,22-04-2016,30 dias,"Portugal, Porto, Porto","Artigo 20.º, n.º 1, alínea a) do Código dos Contratos Públicos",,,,,,Não aplicável.,Não aplicável.,FALSE
"Contrato de Manutenção e Assistência Técnica aos vários equipamentos da General Electric existentes no CHSJ, EPE, para o ano de 2015.",Ajuste Direto Regime Geral,Aquisição de serviços,"50000000-5, Serviços de reparação e manutenção","Centro Hospitalar de São João, E. P. E. (509821197)","General Electric Portuguesa, S.A. (500357129)","115.644,22 €",18-05-2016,10-07-2015,365 dias,"Portugal, Porto, Porto","Artigo 24.º, n.º 1, alínea e) do Código dos Contratos Públicos",,,,,,Não aplicável.,Não aplicável.,FALSE
"Renovação do Contrato de Manutenção aos Monitores de Hemodiálise do CHSJ, EPE, para o ano de 2016.",Ajuste Direto Regime Geral,Aquisição de serviços,"50000000-5, Serviços de reparação e manutenção","Centro Hospitalar de São João, E. P. E. (509821197)","Hemotécnica, Sociedade de Produtos Médicos, Lda (501744010)","15.515,12 €",18-05-2016,17-03-2016,365 dias,"Portugal, Porto, Porto","Artigo 24.º, n.º 1, alínea e) do Código dos Contratos Públicos",,,,,,Não aplicável.,Não aplicável.,FALSE
"Contrato de Manutenção e Assistência Técnica aos Eletrobisturis marca """"Erbe"""" do CHSJ, EPE, durante o ano de 2016",Ajuste Direto Regime Geral,Aquisição de serviços,"50000000-5, Serviços de reparação e manutenção","Centro Hospitalar de São João, E. P. E. (509821197)","Angosaúde, S.A. (507016882)","2.075,04 €",18-05-2016,12-01-2016,365 dias,"Portugal, Porto, Porto","Artigo 24.º, n.º 1, alínea e) do Código dos Contratos Públicos",,,,,,Não aplicável.,Não aplicável.,FALSE
"Renovação do Contrato de Manutenção e Assistência Técnica aos Equipamentos da Central Telefónica do CHSJ, EPE, para o ano de 2016",Ajuste Direto Regime Geral,Aquisição de serviços,"50000000-5, Serviços de reparação e manutenção","Centro Hospitalar de São João, E. P. E. (509821197)","Dimension Data Portugal, S.A. (505134195)","13.190,00 €",17-05-2016,21-01-2016,365 dias,"Portugal, Porto, Porto","Artigo 20.º, n.º 1, alínea a) do Código dos Contratos Públicos",,,,,,Não aplicável.,Não aplicável.,FALSE
": Aquisição de Serviços de Limpeza para o Centro Hospitalar de S. João, E.P.E. (CHSJ, E.P.E.)",Ajuste Direto Regime Geral,Aquisição de serviços,"90910000-9, Serviços de limpeza","Centro Hospitalar de São João, E. P. E. (509821197)","Clece, S.A. (980359759)","1.883.632,56 €",12-05-2016,06-01-2016,360 dias,"Portugal, Porto, Porto","Artigo 27.º, n.º 1, alínea a) do Código dos Contratos Públicos",,,,,,Não aplicável.,Não aplicável.,FALSE
"Contrato de Manutenção ao Equipamento Carestream DRX-1 e Duplo Detector do Serviço de Radiologia do CHSJ, EPE, para o ano de 2016.",Ajuste Direto Regime Geral,Aquisição de serviços,"50000000-5, Serviços de reparação e manutenção","Centro Hospitalar de São João, E. P. E. (509821197)","Carestream, Lda (508054320)","26.700,00 €",11-05-2016,21-01-2016,365 dias,"Portugal, Porto, Porto","Artigo 24.º, n.º 1, alínea e) do Código dos Contratos Públicos",,,,,,Não aplicável.,Não aplicável.,FALSE
"Contrato de Manutenção ao Equipamento de Citologia Líquida do Serviço de Anatomia Patológica do CHSJ, EPE, para o ano de 2016.",Ajuste Direto Regime Geral,Aquisição de serviços,"50000000-5, Serviços de reparação e manutenção","Centro Hospitalar de São João, E. P. E. (509821197)","HOLOGIC IBERIA ,SL (980277230)","2.560,25 €",11-05-2016,08-01-2016,365 dias,"Portugal, Porto, Porto","Artigo 24.º, n.º 1, alínea e) do Código dos Contratos Públicos",,,,,,Não aplicável.,Não aplicável.,FALSE
"Contrato de Manutenção aos Equipamentos representados pela Garal, do Serviço de Anatomia Patológica do CHSJ, EPE, para o ano de 2016.",Ajuste Direto Regime Geral,Aquisição de serviços,"50000000-5, Serviços de reparação e manutenção","Centro Hospitalar de São João, E. P. E. (509821197)","Garal - Gabinete Técnico Comercial, Lda. (500777314)","5.019,72 €",11-05-2016,08-01-2016,365 dias,"Portugal, Porto, Porto","Artigo 24.º, n.º 1, alínea e) do Código dos Contratos Públicos",,,,,,Não aplicável.,Não aplicável.,FALSE
"Contrato de Manutenção e Assistência Técnica às cadeiras do Serviço de Estomatologia marca """"Kavo"""", do CHSJ, EPE, para o ano de 2016",Ajuste Direto Regime Geral,Aquisição de serviços,"50000000-5, Serviços de reparação e manutenção","Centro Hospitalar de São João, E. P. E. (509821197)","Leonel Ferreira & Guedes, Lda (507811321)","7.200,00 €",11-05-2016,08-01-2016,365 dias,"Portugal, Porto, Porto","Artigo 20.º, n.º 1, alínea a) do Código dos Contratos Públicos",,,,,,Não aplicável.,Não aplicável.,FALSE
"Contrato de Manutenção e Assistência Técnica aos equipamentos marca Siemens do CHSJ, EPE, para o ano de 2016",Ajuste Direto Regime Geral,Aquisição de serviços,"50000000-5, Serviços de reparação e manutenção","Centro Hospitalar de São João, E. P. E. (509821197)","Siemens Healthcare, Lda (507925173)","460.968,49 €",11-05-2016,17-03-2016,365 dias,"Portugal, Porto, Porto","Artigo 24.º, n.º 1, alínea e) do Código dos Contratos Públicos",,,,,,Não aplicável.,Não aplicável.,FALSE
