Objeto do Contrato,Tipo de Procedimento,Tipo(s) de Contrato,CPVs,Entidade(s) Adjudicante(s),Entidade(s) Adjudicatária(s),Preço Contratual,Data de Publicação,Data de Celebração do Contrato,Prazo de Execução,Local de Execução,Fundamentação,Data de Fecho do Contrato,Preço Total Efetivo,Causas das Alterações ao Prazo,Causas das Alterações ao Preço,Estado,N.º registo do Acordo Quadro,Descrição do Acordo Quadro,Procedimento Centralizado
Concurso Público Internacional 1516/2012,Concurso público,Aquisição de serviços,"98390000-3, Outros serviços<BR/>90520000-8, Serviços de resíduos radioactivos, tóxicos, médicos e perigosos","Administração Regional de Saúde de Lisboa e Vale do Tejo, I.P. (503148776)",SUCH - SERVIÇO DE UTILIZAÇÃO COMUM HOSPITAIS (600002446),"343.395,83 €",11-12-2012,06-12-2012,365 dias,"Portugal, Lisboa","Artigo 155.º, alínea b) do Código dos Contratos Públicos",,,,,,Não aplicável.,Não aplicável.,
Prestação de Serviços Médicos no ACES 18 (Oeste Sul),Ajuste Direto Regime Geral,Aquisição de serviços,"85141000-9, Serviços prestados pelo pessoal médico","Administração Regional de Saúde de Lisboa e Vale do Tejo, I.P. (503148776)","GENTE SAUDÁVEL, SERVIÇOS MÉDICOS, LDA. (508385644)","46.656,00 €",11-12-2012,28-08-2012,59 dias,"Portugal, Lisboa, Torres Vedras","Artigo 24.º, n.º 1, alínea e) do Código dos Contratos Públicos",,,,,,Não aplicável.,Não aplicável.,
Prestação de Serviços Médicos no ACES 12 (Vila Franca Xira) e no ACES 13 (Almada),Ajuste Direto Regime Geral,Aquisição de serviços,"85141000-9, Serviços prestados pelo pessoal médico","Administração Regional de Saúde de Lisboa e Vale do Tejo, I.P. (503148776)","SOLID PHASE, GESTÃO E CONSULTORIA, LDA. (504137000)","472.668,00 €",11-12-2012,19-11-2012,60 dias,"Portugal, Setúbal, Almada<BR/>Portugal, Lisboa, Vila Franca de Xira","Artigo 24.º, n.º 1, alínea e) do Código dos Contratos Públicos",,,,,,Não aplicável.,Não aplicável.,
"1 válvula expansora Danfoss chiller 2, grupo 1<br/>1 válvula expansora Danfoss chiller 1, grupo 2<br/>1 filtro de soldar de 5/8, Danfoss chiller 2, grupo 1<br/>1 filtro de soldar de 5/8, Danfoss chiller 1, grupo 2<br/>18 Kg refrigerante R422D",Ajuste Direto Regime Geral,Aquisição de serviços,"50000000-5, Serviços de reparação e manutenção","Administração Regional de Saúde de Lisboa e Vale do Tejo, I.P. (503148776)",SUCH (500900469),"1.357,76 €",11-12-2012,29-11-2012,10 dias,"Portugal, Santarém, Ferreira do Zezere","Artigo 24.º, n.º 1, alínea e) do Código dos Contratos Públicos",,,,,,Não aplicável.,Não aplicável.,
"Prestação de Serviços Médicos no ACES 06 (Loures), no ACES 08 (Sintra/Mafra), no ACES 09 (Algueirão/Rio Mouro) e no ACES 10 (Cacém/Queluz)",Ajuste Direto Regime Geral,Aquisição de serviços,"85141000-9, Serviços prestados pelo pessoal médico","Administração Regional de Saúde de Lisboa e Vale do Tejo, I.P. (503148776)","SUCESSO 24 HORAS, LDA. (507328310)","133.650,00 €",11-12-2012,19-11-2012,60 dias,"Portugal, Lisboa, Loures<BR/>Portugal, Lisboa, Sintra<BR/>Portugal, Lisboa, Sintra<BR/>Portugal, Lisboa, Sintra","Artigo 24.º, n.º 1, alínea e) do Código dos Contratos Públicos",,,,,,Não aplicável.,Não aplicável.,
Prestação de Serviços Médicos no ACES 14 (Seixal/Sesimbra) e no ACES 19 (Serra d Aire),Ajuste Direto Regime Geral,Aquisição de serviços,"85141000-9, Serviços prestados pelo pessoal médico","Administração Regional de Saúde de Lisboa e Vale do Tejo, I.P. (503148776)","SUCESSO 24 HORAS, LDA. (507328310)","136.125,00 €",11-12-2012,19-11-2012,60 dias,"Portugal, Braganca, Bragança<BR/>Portugal, Setúbal, Sesimbra","Artigo 24.º, n.º 1, alínea e) do Código dos Contratos Públicos",,,,,,Não aplicável.,Não aplicável.,
"Prestação de Serviços Médicos no ACES 05 (Odivelas), no ACES 11 (Cascais), no ACES 15 (Arco Ribeirinho), no ACES 18 (Oeste Sul) e no ACES 22 (Leziria).",Ajuste Direto Regime Geral,Aquisição de serviços,"85141000-9, Serviços prestados pelo pessoal médico","Administração Regional de Saúde de Lisboa e Vale do Tejo, I.P. (503148776)","RANDSTAD CLINICAL - CUIDADOS DE SAÚDE, LDA. (505121247)","127.623,60 €",11-12-2012,13-11-2012,60 dias,"Portugal, Lisboa, Odivelas<BR/>Portugal, Lisboa, Cascais<BR/>Portugal, Lisboa, Torres Vedras<BR/>Portugal, Santarém, Santarém<BR/>Portugal, Setúbal, Barreiro","Artigo 24.º, n.º 1, alínea e) do Código dos Contratos Públicos",,,,,,Não aplicável.,Não aplicável.,
"Deslocações de vigilantes devido a disparos de alarme nos Centros de Saúde de Loures, S. João da Talha e Moscavide",Ajuste Direto Regime Geral,Aquisição de serviços,"79714000-2, Serviços de vigilância","Administração Regional de Saúde de Lisboa e Vale do Tejo, I.P. (503148776)","Prestibel, Empresa de Segurança, S.A. (501326456)","3.277,00 €",10-12-2012,24-09-2012,120 dias,"Portugal, Lisboa, Loures","Artigo 24.º, n.º 1, alínea e) do Código dos Contratos Públicos",,,,,,Não aplicável.,Não aplicável.,
Serviço de deslocação de segurança devido a disparo de alarme no C. de  Saúde de Loures e C. Saude de Moscavide,Ajuste Direto Regime Geral,Aquisição de serviços,"79714000-2, Serviços de vigilância","Administração Regional de Saúde de Lisboa e Vale do Tejo, I.P. (503148776)","Prestibel, Emp. de Segurança, S.A. (501326456)","226,00 €",10-12-2012,08-02-2012,20 dias,"Portugal, Lisboa, Loures","Artigo 24.º, n.º 1, alínea e) do Código dos Contratos Públicos",,,,,,Não aplicável.,Não aplicável.,
"Deslocaçã de um seurança às instalações do Cenro de Saúde de Loures - Mealhada, por disparo de alarme",Ajuste Direto Regime Geral,Aquisição de serviços,"79714000-2, Serviços de vigilância","Administração Regional de Saúde de Lisboa e Vale do Tejo, I.P. (503148776)","Prestibel - Emp. de Segurança, S.A. (501326456)","113,00 €",10-12-2012,06-02-2012,20 dias,"Portugal<BR/>Portugal, Lisboa, Loures","Artigo 24.º, n.º 1, alínea e) do Código dos Contratos Públicos",,,,,,Não aplicável.,Não aplicável.,
"Colocação de uma válvula reguladora de pressão no ar condicionado do Centro de Saude de Loures - Mealhada<br/>Valor do material 220,00 + IVA<br/>Mão-de-obra 168 + IVA",Ajuste Direto Regime Geral,Aquisição de serviços,"50500000-0, Serviços de reparação e manutenção de bombas, válvulas, torneiras, contentores de metal e equipamento","Administração Regional de Saúde de Lisboa e Vale do Tejo, I.P. (503148776)","Sorjeclima Montagens e Reparações, Lda (508565839)","388,00 €",10-12-2012,04-06-2012,60 dias,"Portugal, Lisboa, Loures","Artigo 20.º, n.º 1, alínea a) do Código dos Contratos Públicos",,,,,,Não aplicável.,Não aplicável.,
Aquisição de toners e drums reciclados para as várias Unidades do ACES Oeste Norte,Ajuste Direto Regime Geral,Aquisição de bens móveis,"30125100-2, Cartuchos de tinta (toner)","Administração Regional de Saúde de Lisboa e Vale do Tejo, I.P. (503148776)","Páginas a Preceito, Lda (509986803)","7.314,94 €",10-12-2012,19-04-2012,60 dias,"Portugal, Leiria, Caldas da Rainha","Artigo 20.º, n.º 1, alínea a) do Código dos Contratos Públicos",,,,,,Não aplicável.,Não aplicável.,
"Fornecimento de 11.400,00 Kg de Gás Propano para aquecimento do edificio da UCSP Bombarral do ACES Oeste Norte",Ajuste Direto Regime Geral,Aquisição de bens móveis,"09122100-1, Gás propano","Administração Regional de Saúde de Lisboa e Vale do Tejo, I.P. (503148776)","Petrogal - Petróleos de Portugal, S.A. (500697370)","12.546,61 €",10-12-2012,02-03-2012,365 dias,"Portugal, Leiria, Bombarral","Artigo 24.º, n.º 1, alínea e) do Código dos Contratos Públicos",,,,,,Não aplicável.,Não aplicável.,
Aquisição de seguro automovel para o periodo de 12 meses,Ajuste Direto Regime Geral,Aquisição de serviços,"66514110-0, Serviços de seguro automóvel","Administração Regional de Saúde de Lisboa e Vale do Tejo, I.P. (503148776)","Macif Portugal - Companhia de Seguros, SA (503640549)","450,00 €",10-12-2012,10-12-2012,365 dias,"Portugal, Lisboa, Lisboa",Artigo 258.º do Código dos Contratos Públicos,,,,,,Não aplicável.,Não aplicável.,
"Deslocações de vigilante de segurança por disparos de alarmes nos Centros de Saude, de Loures, S. João da Talha e Moscavide",Ajuste Direto Regime Geral,Aquisição de serviços,"79714000-2, Serviços de vigilância","Administração Regional de Saúde de Lisboa e Vale do Tejo, I.P. (503148776)","Prestibel - Emp. de Segurança, S.A. (501326456)","1.635,55 €",10-12-2012,20-09-2012,60 dias,"Portugal, Lisboa, Loures","Artigo 24.º, n.º 1, alínea e) do Código dos Contratos Públicos",,,,,,Não aplicável.,Não aplicável.,
"Montagem e fornecimento de lâmpadas florescentes, reparações de portas de WC, de cozinha e torneira misturadora, com fornecimento del materiais",Ajuste Direto Regime Geral,Aquisição de serviços,"50000000-5, Serviços de reparação e manutenção","Administração Regional de Saúde de Lisboa e Vale do Tejo, I.P. (503148776)","CSQL - Engenharia, Construção e Serviços, Lda (509649742)","381,12 €",10-12-2012,16-04-2012,3 dias,"Portugal, Lisboa, Loures","Artigo 20.º, n.º 1, alínea a) do Código dos Contratos Públicos",,,,,,Não aplicável.,Não aplicável.,
Consumíveis de impressão - Lote 3 do PECI - Lote NASHUATEC,Ajuste Direto Regime Geral,Aquisição de bens móveis,"30125110-5, Tóner para impressoras laser e aparelhos de fax","Administração Regional de Saúde de Lisboa e Vale do Tejo, I.P. (503148776)","Reproset, Comércio de Consumíveis Informáticos, Lda. (506448665)","139,70 €",10-12-2012,14-09-2012,20 dias,"Portugal, Lisboa",Artigo 258.º do Código dos Contratos Públicos,,,,,,Não aplicável.,Não aplicável.,
Kit penso III,Concurso público,Aquisição de bens móveis,"33140000-3, Material médico de consumo","Administração Regional de Saúde de Lisboa e Vale do Tejo, I.P. (503148776)","Paul Hartmann, Lda (502271728)","13.197,00 €",10-12-2012,28-11-2012,20 dias,"Portugal, Lisboa","Artigo 155.º, alínea b) do Código dos Contratos Públicos",,,,,,Não aplicável.,Não aplicável.,
"Assistência e manutenção de 3 autoclaves, existentes nos Centros de Saúde de S. João da Talha, Terraços da Ponte - Sacavém e Mealhada<br/>Valor dos materiais necessários para efetuar a manutenção até final de 2012 € 2.000,00<br/>Mão de obra para efetuar a manutenção até final de 2012 € 16.00,00",Ajuste Direto Regime Geral,Aquisição de serviços,"50421000-2, Serviços de reparação e manutenção de equipamento médico","Administração Regional de Saúde de Lisboa e Vale do Tejo, I.P. (503148776)",A. J. COSTA (IRMÃOS) LDA. (500002576),"3.600,00 €",08-12-2012,07-03-2012,300 dias,"Portugal, Lisboa, Loures","Artigo 20.º, n.º 1, alínea a) do Código dos Contratos Públicos",,,,,,Não aplicável.,Não aplicável.,
"Substituição de fechadura de 2 entradas, fornecimento de 4 chaves, fornecimento de vidro com 500x270<br/>Valor total dos materiais € 130,00 - Mão de Obra € 90,00",Ajuste Direto Regime Geral,Aquisição de serviços,"50800000-3, Serviços de reparação e manutenção diversos","Administração Regional de Saúde de Lisboa e Vale do Tejo, I.P. (503148776)","Estores 2001, Lda. (505281309)","220,00 €",08-12-2012,16-04-2012,15 dias,"Portugal, Lisboa, Loures","Artigo 20.º, n.º 1, alínea a) do Código dos Contratos Públicos",,,,,,Não aplicável.,Não aplicável.,
Manutenção dos dois elevadores do edifício Terraços da Ponte - Centro de Saúde de Sacavém e Centro de Saúde de Camarate,Ajuste Direto Regime Geral,Aquisição de serviços,"50750000-7, Serviços de manutenção de elevadores","Administração Regional de Saúde de Lisboa e Vale do Tejo, I.P. (503148776)","Orona Portugal, Lda. (501606319)","330,36 €",08-12-2012,19-01-2012,365 dias,"Portugal, Lisboa, Loures","Artigo 24.º, n.º 1, alínea e) do Código dos Contratos Públicos",,,,,,Não aplicável.,Não aplicável.,
"Verificação e reparação da rede de incêndio, do grupo de bombagem e carreteis de incêndio, do edifício dos Terraços da Ponte - Centro de Saúde de Sacavém e Centro de Saúde de Camarate",Ajuste Direto Regime Geral,Aquisição de serviços,"50511000-0, Serviços de reparação e manutenção de bombas","Administração Regional de Saúde de Lisboa e Vale do Tejo, I.P. (503148776)","Alcoaclima - Unipessoal, Lda. (507171152)","515,00 €",08-12-2012,07-03-2012,20 dias,"Portugal, Lisboa, Loures","Artigo 24.º, n.º 1, alínea e) do Código dos Contratos Públicos",,,,,,Não aplicável.,Não aplicável.,
Serviço de Assistência técnica e manutenção dos equipamentos de climatização instalados no Edifício Terraços da Ponte - C. Saude de Sacavém - C. Saude de Camarate,Ajuste Direto Regime Geral,Aquisição de serviços,"50720000-8, Serviços de reparação e manutenção de aquecimento central","Administração Regional de Saúde de Lisboa e Vale do Tejo, I.P. (503148776)","Gravimétrica - Engenharia e Gestão de Instalações, Lda. (503127485)","6.120,00 €",08-12-2012,24-04-2012,365 dias,"Portugal, Lisboa, Loures","Artigo 24.º, n.º 1, alínea e) do Código dos Contratos Públicos",,,,,,Não aplicável.,Não aplicável.,
Assistência Técina e Manutenção de Cadeira de Higiene Oral - Centro de Saude de Loures - Mealhada<br/>Assistência Técina e Manutenção de Estomatologia - Centro de Saude de Loures - Mealhada<br/>Assistência Técina e Manutenção de Estomatologia - Centro de Saude de Loures S. João da Talha,Ajuste Direto Regime Geral,Aquisição de serviços,"50421000-2, Serviços de reparação e manutenção de equipamento médico","Administração Regional de Saúde de Lisboa e Vale do Tejo, I.P. (503148776)","Montellano, Lda (500196494)","3.056,40 €",08-12-2012,09-02-2012,365 dias,"Portugal, Lisboa, Loures","Artigo 24.º, n.º 1, alínea e) do Código dos Contratos Públicos",,,,,,Não aplicável.,Não aplicável.,
Aquisição de contentores de recolha de agulhas contaminadas de 500cc e 1500cc,Ajuste Direto Regime Geral,Aquisição de bens móveis,"33140000-3, Material médico de consumo","Administração Regional de Saúde de Lisboa e Vale do Tejo, I.P. (503148776)","Overpharma, Lda. (505792362)","24.460,00 €",07-12-2012,04-12-2012,20 dias,"Portugal, Lisboa","Artigo 24.º, n.º 1, alínea a) do Código dos Contratos Públicos",,,,,,Não aplicável.,Não aplicável.,
Aquisição de Poliuretano com rebordo 9.5x9.5,Ajuste Direto Regime Geral,Aquisição de bens móveis,"33140000-3, Material médico de consumo","Administração Regional de Saúde de Lisboa e Vale do Tejo, I.P. (503148776)","Paul Hartmann, Lda. (502271728)","35.625,00 €",07-12-2012,06-12-2012,20 dias,"Portugal, Lisboa","Artigo 26.º, n.º 1, alínea e) do Código dos Contratos Públicos",,,,,,Não aplicável.,Não aplicável.,
Aquisição de Citrato de Sódio (microlax infantil),Ajuste Direto Regime Geral,Aquisição de bens móveis,"33690000-3, Medicamentos vários","Administração Regional de Saúde de Lisboa e Vale do Tejo, I.P. (503148776)","Overpharma, Lda. (505792362)","2.016,00 €",07-12-2012,05-12-2012,20 dias,"Portugal, Lisboa","Artigo 26.º, n.º 1, alínea e) do Código dos Contratos Públicos",,,,,,Não aplicável.,Não aplicável.,
Aqusição de Claritromicina,Ajuste Direto Regime Geral,Aquisição de bens móveis,"33690000-3, Medicamentos vários","Administração Regional de Saúde de Lisboa e Vale do Tejo, I.P. (503148776)",Farmoz SA (501505334),"720,00 €",07-12-2012,05-12-2012,20 dias,"Portugal, Lisboa","Artigo 26.º, n.º 1, alínea e) do Código dos Contratos Públicos",,,,,,Não aplicável.,Não aplicável.,
Aquisição de Desogestrel 0.075mg,Ajuste Direto Regime Geral,Aquisição de bens móveis,"33651600-4, Vacinas","Administração Regional de Saúde de Lisboa e Vale do Tejo, I.P. (503148776)","Merck Sharp & Dohme, Lda. (500191360)","71.454,60 €",07-12-2012,06-12-2012,20 dias,"Portugal, Lisboa","Artigo 26.º, n.º 1, alínea e) do Código dos Contratos Públicos",,,,,,Não aplicável.,Não aplicável.,
"Sistema de controlo de carga , fundo móvel desajuste/desalinhamento",Ajuste Direto Regime Geral,Aquisição de serviços,"50000000-5, Serviços de reparação e manutenção","Administração Regional de Saúde de Lisboa e Vale do Tejo, I.P. (503148776)",Schindler (502353740),"38,50 €",06-12-2012,01-10-2012,10 dias,"Portugal, Santarém, Vila Nova da Barquinha","Artigo 24.º, n.º 1, alínea e) do Código dos Contratos Públicos",,,,,,Não aplicável.,Não aplicável.,
"1 Compressor Daikin 2m,2 Kwbr/20 Kg R 422D",Ajuste Direto Regime Geral,Aquisição de serviços,"50000000-5, Serviços de reparação e manutenção","Administração Regional de Saúde de Lisboa e Vale do Tejo, I.P. (503148776)",SUCH - Serviço de Utilização Comum dos Hospitais (500900469),"2.904,25 €",06-12-2012,13-06-2012,10 dias,"Portugal, Santarém, Abrantes","Artigo 24.º, n.º 1, alínea e) do Código dos Contratos Públicos",,,,,,Não aplicável.,Não aplicável.,
Bomba Circuladora Grudfos 25-50-180,Ajuste Direto Regime Geral,Aquisição de serviços,"50000000-5, Serviços de reparação e manutenção","Administração Regional de Saúde de Lisboa e Vale do Tejo, I.P. (503148776)",SUCH - Serviço de Utilização Comum dos Hospitais (500900469),"569,57 €",06-12-2012,11-05-2012,10 dias,"Portugal, Santarém, Sardoal","Artigo 24.º, n.º 1, alínea e) do Código dos Contratos Públicos",,,,,,Não aplicável.,Não aplicável.,
"Reparação das tubagens so sistema do AVAC, Isolamento de chaminé da caldeira, em manta de fibra e selantes á base de poliuretano, reparação das linhas de saída de coletores,<br/>1 Bomba Grundfoss UPS 25-80<br/>reparação de chaminé de caldeira constando de isolamento da mesma com manta de fibra de vidro e selantes à base de poliuretano.-Constância",Ajuste Direto Regime Geral,Aquisição de serviços,"50000000-5, Serviços de reparação e manutenção","Administração Regional de Saúde de Lisboa e Vale do Tejo, I.P. (503148776)",SUCH-Serviço de Utilização Comum dos Hospitais (500900469),"1.422,74 €",06-12-2012,01-02-2012,10 dias,"Portugal, Santarém, Constancia<BR/>Portugal, Santarém, Sardoal","Artigo 24.º, n.º 1, alínea e) do Código dos Contratos Públicos",,,,,,Não aplicável.,Não aplicável.,
"Pequenas reparações no edifício do C.S. de Santo António dos Cavaleiros e C.S. Mealhada,  USF Magnólia, USF ARS Medica, USF Loures Saudável, USF Parque Cidade",Ajuste Direto Regime Geral,Aquisição de serviços,"98350000-1, Serviços relacionados com instalações públicas","Administração Regional de Saúde de Lisboa e Vale do Tejo, I.P. (503148776)","CSQL - Engenharia, Construção e Serviços Lda. (509649742)","1.185,00 €",05-12-2012,16-04-2012,20 dias,"Portugal, Lisboa, Loures","Artigo 20.º, n.º 1, alínea a) do Código dos Contratos Públicos",,,,,,Não aplicável.,Não aplicável.,
"Prestação de serviço de recolha, tratamento, transporte e distribuição de mercadorias dentro do âmbito do ACES VI - Loures, que inclui o fornecimento de bens, equipamentos, veiculos, combustiveis, recursos humanos, monitorização das operações, potagens, despesas de parqueamento e outros custos indissociáveis de uma operação de logística integrada de 01-03-2012 a 31-12-2012",Ajuste Direto Regime Geral,Aquisição de serviços,"60100000-9, Serviços de transporte rodoviário","Administração Regional de Saúde de Lisboa e Vale do Tejo, I.P. (503148776)",Transportes Júlio de Sousa Pereira Gil. Lda (500475180),"25.000,00 €",05-12-2012,07-03-2012,300 dias,"Portugal, Lisboa, Loures","Artigo 20.º, n.º 1, alínea a) do Código dos Contratos Públicos",,,,,,Não aplicável.,Não aplicável.,
"Reparação do sistema central de refrigeração do edifício do Centro de Saude de Santo António dos Cavaleiros.<br/>Substituição de componente electromecânico de controlador de fluxo no compressor 1<br/>Substituição de componente electrónico de controlo de temperatura do compressor 2<br/>Reparação de fuga na tubagem de freon, com soldadura oxiacetileno e reposição da carga freon R407",Ajuste Direto Regime Geral,Aquisição de serviços,"50730000-1, Serviços de reparação e manutenção de grupos de refrigeração","Administração Regional de Saúde de Lisboa e Vale do Tejo, I.P. (503148776)","Dalkia - Energia e Serviços, S.A. (502876581)","3.950,00 €",05-12-2012,21-11-2012,15 dias,"Portugal, Lisboa, Loures","Artigo 20.º, n.º 1, alínea a) do Código dos Contratos Públicos",,,,,,Não aplicável.,Não aplicável.,
2 Lâmpada DULUx L 18W 220-240V 50/60HZ<br/>1 Arrancador 18-36W 220-240V 50/60HZ,Ajuste Direto Regime Geral,Aquisição de serviços,"50000000-5, Serviços de reparação e manutenção","Administração Regional de Saúde de Lisboa e Vale do Tejo, I.P. (503148776)",Schindler (502353740),"25,87 €",05-12-2012,14-09-2012,10 dias,"Portugal, Santarém, Ferreira do Zezere","Artigo 24.º, n.º 1, alínea e) do Código dos Contratos Públicos",,,,,,Não aplicável.,Não aplicável.,
"Prestação de Serviços de gestão dos resíduos hospitalares, sólidos e líquidos perigosos com risco biológico e com risco químico da ARSLVT, IP; LSP ARSLVT - Oeiras e ACES 1; 2; 3; 4; 5; 6; 7;<br/>8; 9; 10; 11; 12; 18 e 21 (Azambuja) no período de 01/07/2012 a 31/12/2012.",Ajuste Direto Regime Geral,Aquisição de serviços,"98390000-3, Outros serviços","Administração Regional de Saúde de Lisboa e Vale do Tejo, I.P. (503148776)",Such - Serviços de Utilização Comum dos Hospitais (500900469),"113.547,73 €",05-12-2012,28-11-2012,184 dias,"Portugal, Lisboa","Artigo 24.º, n.º 1, alínea e) do Código dos Contratos Públicos",,,,,,Não aplicável.,Não aplicável.,
"Prestação de serviço de recolha, tratamento, transporte e distribuição de mercadorias dentro do âmbito do ACES VI",Ajuste Direto Regime Geral,Aquisição de serviços,"60100000-9, Serviços de transporte rodoviário","Administração Regional de Saúde de Lisboa e Vale do Tejo, I.P. (503148776)","Transportes Julio de Sousa Pereira Gil, Lda. (500475180)","4.740,00 €",04-12-2012,10-02-2012,60 dias,"Portugal, Lisboa, Loures","Artigo 24.º, n.º 1, alínea e) do Código dos Contratos Públicos",,,,,,Não aplicável.,Não aplicável.,
Aquisição de Piridoxina 40mg,Ajuste Direto Regime Geral,Aquisição de bens móveis,"33690000-3, Medicamentos vários","Administração Regional de Saúde de Lisboa e Vale do Tejo, I.P. (503148776)","Labesfal - Laboratórios Almiro, SA (501169580)","17.329,00 €",04-12-2012,04-12-2012,20 dias,"Portugal, Lisboa","Artigo 24.º, n.º 1, alínea e) do Código dos Contratos Públicos",,,,,,Não aplicável.,Não aplicável.,
Aquisição de tubos de ligação para O2- Fêmea/ Fêmea,Ajuste Direto Regime Geral,Aquisição de bens móveis,"33140000-3, Material médico de consumo","Administração Regional de Saúde de Lisboa e Vale do Tejo, I.P. (503148776)",Quilaban (500399670),"87,36 €",04-12-2012,04-12-2012,20 dias,"Portugal, Lisboa","Artigo 24.º, n.º 1, alínea a) do Código dos Contratos Públicos",,,,,,Não aplicável.,Não aplicável.,
