freguesia,acronym,validVotesPercentage,votes,dicofre
Bravães,PS,41.94,65,160603
Bravães,PPD/PSD,30.32,47,160603
Bravães,B.E.,10.97,17,160603
Bravães,PAN,5.16,8,160603
Bravães,CDS-PP,2.58,4,160603
Bravães,PCTP/MRPP,1.94,3,160603
Bravães,PDR,1.94,3,160603
Bravães,PCP-PEV,1.29,2,160603
Bravães,PURP,1.29,2,160603
Bravães,IL,0.65,1,160603
Bravães,L,0.65,1,160603
Bravães,NC,0.65,1,160603
Bravães,PTP,0.65,1,160603
Bravães,A,0,0,160603
Bravães,MAS,0,0,160603
Bravães,PNR,0,0,160603
Bravães,PPM.PPV/CDC,0,0,160603
