freguesia,acronym,validVotesPercentage,votes,dicofre
União das freguesias de Trigaches e São Brissos,PS,44.37,67,020524
União das freguesias de Trigaches e São Brissos,PCP-PEV,27.81,42,020524
União das freguesias de Trigaches e São Brissos,B.E.,11.92,18,020524
União das freguesias de Trigaches e São Brissos,CDS-PP,3.97,6,020524
União das freguesias de Trigaches e São Brissos,PPD/PSD,3.97,6,020524
União das freguesias de Trigaches e São Brissos,PPM.PPV/CDC,3.31,5,020524
União das freguesias de Trigaches e São Brissos,IL,1.32,2,020524
União das freguesias de Trigaches e São Brissos,PCTP/MRPP,1.32,2,020524
União das freguesias de Trigaches e São Brissos,MAS,0.66,1,020524
União das freguesias de Trigaches e São Brissos,PAN,0.66,1,020524
União das freguesias de Trigaches e São Brissos,PNR,0.66,1,020524
União das freguesias de Trigaches e São Brissos,A,0,0,020524
União das freguesias de Trigaches e São Brissos,L,0,0,020524
União das freguesias de Trigaches e São Brissos,NC,0,0,020524
União das freguesias de Trigaches e São Brissos,PDR,0,0,020524
União das freguesias de Trigaches e São Brissos,PTP,0,0,020524
União das freguesias de Trigaches e São Brissos,PURP,0,0,020524
