freguesia,acronym,validVotesPercentage,votes,dicofre
Maiorga,PS,50.26,288,100109
Maiorga,PPD/PSD,13.61,78,100109
Maiorga,B.E.,10.12,58,100109
Maiorga,PCP-PEV,9.08,52,100109
Maiorga,PAN,4.71,27,100109
Maiorga,CDS-PP,4.01,23,100109
Maiorga,A,1.92,11,100109
Maiorga,L,1.75,10,100109
Maiorga,PPM.PPV/CDC,1.4,8,100109
Maiorga,IL,0.7,4,100109
Maiorga,PCTP/MRPP,0.52,3,100109
Maiorga,PDR,0.52,3,100109
Maiorga,MAS,0.35,2,100109
Maiorga,NC,0.35,2,100109
Maiorga,PURP,0.35,2,100109
Maiorga,PNR,0.17,1,100109
Maiorga,PTP,0.17,1,100109
