Objeto do Contrato,Tipo de Procedimento,Tipo(s) de Contrato,CPVs,Entidade(s) Adjudicante(s),Entidade(s) Adjudicatária(s),Preço Contratual,Data de Publicação,Data de Celebração do Contrato,Prazo de Execução,Local de Execução,Fundamentação,Data de Fecho do Contrato,Preço Total Efetivo,Causas das Alterações ao Prazo,Causas das Alterações ao Preço,Estado,N.º registo do Acordo Quadro,Descrição do Acordo Quadro,Procedimento Centralizado
"Renovação do contrato de aquisição de serviços de consultadoria técnica na área da psicologia, com intervenção específica ao nível do Programa Nacional VIH/SIDA, em regime de avença, para o período de 1 de janeiro a 31 de dezembro de 2015",Ajuste Direto Regime Geral,Aquisição de serviços,"71621000-7, Serviços técnicos de análise ou consultoria",Direção-Geral da Saúde (600037100),Joana Mota Bettencourt Melo Fonseca (207526028),"24.298,68 €",14-07-2015,02-02-2015,364 dias,"Portugal, Lisboa, Lisboa","Artigo 20.º, n.º 1, alínea a) do Código dos Contratos Públicos","","",,,,Não aplicável.,Não aplicável.,FALSE
"Renovação do contrato de aquisição de serviços de consultadoria técnica na área da psicologia, com intervenção específica ao nível do Programa Nacional VIH/SIDA, em regime de avença, para o período de 1 de março a 31 de dezembro de 2014.",Ajuste Direto Regime Geral,Aquisição de serviços,"71621000-7, Serviços técnicos de análise ou consultoria",Direção-Geral da Saúde (600037100),Joana Mota Bettencourt Melo Fonseca (207526028),"20.248,90 €",14-07-2015,01-03-2014,300 dias,"Portugal, Lisboa, Lisboa","Artigo 20.º, n.º 1, alínea a) do Código dos Contratos Públicos",31-12-2014,"20.248,90 €",,,,Não aplicável.,Não aplicável.,FALSE
Produção de iniciativas culturais no contexto do ciclo de teatro e dança no âmbito do Dia Mundial da Saúde Mental,Ajuste Direto Regime Geral,Aquisição de serviços,"79952100-3, Serviços de organização de eventos culturais",Direção-Geral da Saúde (600037100),Cegada - Grupo de Teatro (504760874),"15.000,00 €",13-07-2015,11-11-2014,120 dias,"Portugal, Lisboa, Lisboa","Artigo 20.º, n.º 1, alínea a) do Código dos Contratos Públicos",13-07-2015,"15.000,00 €",,,,Não aplicável.,Não aplicável.,FALSE
