Objeto do Contrato,Tipo de Procedimento,Tipo(s) de Contrato,CPVs,Entidade(s) Adjudicante(s),Entidade(s) Adjudicatária(s),Preço Contratual,Data de Publicação,Data de Celebração do Contrato,Prazo de Execução,Local de Execução,Fundamentação,Data de Fecho do Contrato,Preço Total Efetivo,Causas das Alterações ao Prazo,Causas das Alterações ao Preço,Estado,N.º registo do Acordo Quadro,Descrição do Acordo Quadro,Procedimento Centralizado
Aquisição de Amoxicilina em comprimidos,Ajuste Direto Regime Geral,Aquisição de bens móveis,"33690000-3, Medicamentos vários","Administração Regional de Saúde de Lisboa e Vale do Tejo, I.P. (503148776)","Generis - Farmaceutica, SA (508107997)","792,00 €",10-11-2011,08-11-2011,20 dias,"Portugal, Lisboa, Lisboa","Artigo 26.º, n.º 1, alínea e) do Código dos Contratos Públicos","","",,,,Não aplicável.,Não aplicável.,
Aquisição de serviços de higiene e limpeza - ACES XIII Peninsula de Setúbal I - Almada (UCSP Costa da Caparica). Periodo de 01/10/2011 a 31/10/2011,Ajuste Direto Regime Geral,Aquisição de serviços,"90910000-9, Serviços de limpeza","Administração Regional de Saúde de Lisboa e Vale do Tejo, I.P. (503148776)","Eletrolimpa Sul - Empresa Tecnica de Limpeza, SA (507545427)","1.300,00 €",10-11-2011,07-11-2011,31 dias,"Portugal, Setúbal, Almada","Artigo 24.º, n.º 1, alínea e) do Código dos Contratos Públicos","","",,,,Não aplicável.,Não aplicável.,
LÂMINAS DE BISTURI DIVERSAS,Ajuste Direto Regime Geral,Aquisição de bens móveis,"33140000-3, Material médico de consumo","Administração Regional de Saúde de Lisboa e Vale do Tejo, I.P. (503148776)","OVERPHARMA, Lda. (505792362)","7.130,00 €",09-11-2011,02-11-2011,2 dias,"Portugal, Lisboa, Lisboa","Artigo 20.º, n.º 1, alínea a) do Código dos Contratos Públicos","","",,,,Não aplicável.,Não aplicável.,
"Upgrade de Software, Parametrização de Dados e Suporte à entrada em Produção dos Upgrades para várias USF´s",Ajuste Direto Regime Geral,Aquisição de bens móveis,"48983000-2, Pacote de software para desenvolvimento","Administração Regional de Saúde de Lisboa e Vale do Tejo, I.P. (503148776)","MDST - Soluções Tecnológicas para a Saúde,Lda (508695643)","8.640,00 €",09-11-2011,28-10-2011,2 dias,"Portugal, Lisboa, Lisboa","Artigo 20.º, n.º 1, alínea a) do Código dos Contratos Públicos","","",,,,Não aplicável.,Não aplicável.,
Aquisição de Reagentes para o LSP Oeiras e LSP Amadora,Concurso público,Aquisição de bens móveis,"33696500-0, Reagentes de laboratório","Administração Regional de Saúde de Lisboa e Vale do Tejo, I.P. (503148776)","Vidrolab 2- Equipamento Materiais de Laboratorio e Analise Diagnostico Saude, SA (501450629)","295,33 €",09-11-2011,08-11-2011,30 dias,"Portugal, Lisboa, Lisboa","Artigo 20.º, n.º 1, alínea b) do Código dos Contratos Públicos","","",,,,Não aplicável.,Não aplicável.,
"Conforme condições a seguir indicadas, a empresa XAVIERES, Lda. (Obras públicas e Construção Civil), como Segunda Outorgante, obriga-se à execução dos Trabalhos a Mais referente à Empreitada de Beneficiação de um edifício para a instalação de 4 Unidades de Saúde Familiar (USF) em Santarém, a que refere o presente aditamento, e a todos os actos que a ela digam respeito, o qual fica a fazer parte do Contrato n.º 365/2010, ao abrigo no previsto na alínea a), do n.º 1, do     art.º 19º do Decreto-Lei nº 18/2008, de 29 de Janeiro e de acordo com o Programa Funcional proposto pela ARSLVT, I.P.",Ajuste Direto Regime Geral,Empreitadas de obras públicas,"45113000-2, Obras no local","Administração Regional de Saúde de Lisboa e Vale do Tejo, I.P. (503148776)","XAVIERES, LDA. (501274812)","9.500,00 €",09-11-2011,08-11-2011,20 dias,"Portugal, Santarém, Santarém","Artigo 19.º, alínea a) do Código dos Contratos Públicos","","",,,,Não aplicável.,Não aplicável.,
"Conforme condições a seguir indicadas, a firma AGNCET – CONSTRUTORA, S.A., como Segundo Outorgante, obriga-se à Empreitada de Remodelação do Espaço Interior do Armazém para ACES 12 de Vila Franca de Xira, sito na Rua António Lúcio Batista, número seis, edifício CSX, 2600 Vila Franca de Xira, na Freguesia, Concelho e Distrito de Vila Franca de Xira, ao abrigo no previsto na alínea a), do n.º 1, do artigo 19º, do Decreto-Lei n.º 18/2008, de 29 de Janeiro.",Ajuste Direto Regime Geral,Empreitadas de obras públicas,"45453100-8, Obras de recuperação","Administração Regional de Saúde de Lisboa e Vale do Tejo, I.P. (503148776)","AGNCET - CONSTRUTORA, S.A. (509465668)","41.300,00 €",09-11-2011,31-10-2011,30 dias,"Portugal, Lisboa, Vila Franca de Xira","Artigo 19.º, alínea a) do Código dos Contratos Públicos","","",,,,Não aplicável.,Não aplicável.,
Produtos de limpeza para o ACES Loures,Ajuste Direto Regime Geral,Aquisição de bens móveis,"33000000-0, Equipamento médico, medicamentos e produtos para cuidados pessoais","Administração Regional de Saúde de Lisboa e Vale do Tejo, I.P. (503148776)",Fitisan Lda (506320073),"9.705,00 €",08-11-2011,01-08-2011,1 dias,"Portugal, Lisboa, Loures",Artigo 258.º do Código dos Contratos Públicos,"","",,,,Não aplicável.,Não aplicável.,
Aquisição de toners para o ACES Loures,Ajuste Direto Regime Geral,Aquisição de bens móveis,"30125100-2, Cartuchos de tinta (toner)","Administração Regional de Saúde de Lisboa e Vale do Tejo, I.P. (503148776)","reproset lda (506448665), Albano SA (505076780)","8.227,60 €",08-11-2011,02-08-2011,1 dias,"Portugal, Lisboa, Loures",Artigo 258.º do Código dos Contratos Públicos,"","",,,,Não aplicável.,Não aplicável.,
Aquisição de material administrativo - Toners,Ajuste Direto Regime Geral,Aquisição de bens móveis,"30125100-2, Cartuchos de tinta (toner)","Administração Regional de Saúde de Lisboa e Vale do Tejo, I.P. (503148776)",Albano SA (500746273),"4.398,00 €",08-11-2011,05-05-2011,1 dias,"Portugal, Lisboa, Loures",Artigo 258.º do Código dos Contratos Públicos,"","",,,,Não aplicável.,Não aplicável.,
Aluguer de 2 garrafas de oxigénio Conoxia B20,Ajuste Direto Regime Geral,Aquisição de bens móveis,"33690000-3, Medicamentos vários","Administração Regional de Saúde de Lisboa e Vale do Tejo, I.P. (503148776)",Linde Sogás (500266344),"140,00 €",08-11-2011,03-01-2011,365 dias,"Portugal, Santarém, Ferreira do Zezere","Artigo 24.º, n.º 1, alínea e) do Código dos Contratos Públicos","","",,,,Não aplicável.,Não aplicável.,
"Reparação da máquina de lavar ferros da UCSP de Torres Novas, mão de obra e colocação de peças",Ajuste Direto Regime Geral,Aquisição de serviços,"50000000-5, Serviços de reparação e manutenção","Administração Regional de Saúde de Lisboa e Vale do Tejo, I.P. (503148776)","Fernando Feleciano Unipessoal, Lda (507408896)","320,52 €",03-11-2011,26-10-2011,5 dias,"Portugal, Santarém, Torres Novas","Artigo 24.º, n.º 1, alínea e) do Código dos Contratos Públicos",26-10-2011,"320,52 €",,,,Não aplicável.,Não aplicável.,
Colocação de  material e mão de obra na reparação do telefone do elevador,Ajuste Direto Regime Geral,Aquisição de serviços,"50000000-5, Serviços de reparação e manutenção","Administração Regional de Saúde de Lisboa e Vale do Tejo, I.P. (503148776)",Leirimedição - Electricidade e Telecomunicações (504415310),"50,00 €",03-11-2011,26-10-2011,5 dias,"Portugal, Santarém, Alcanena","Artigo 24.º, n.º 1, alínea e) do Código dos Contratos Públicos",26-10-2011,"50,00 €",,,,Não aplicável.,Não aplicável.,
Mobiliário Médico para a USF andreas,Ajuste Direto Regime Geral,Aquisição de bens móveis,"33192000-2, Mobiliário para fins médicos","Administração Regional de Saúde de Lisboa e Vale do Tejo, I.P. (503148776)",Vitalino Lda (501277196),"10.800,00 €",03-11-2011,21-10-2011,30 dias,"Portugal, Lisboa, Lisboa","Artigo 20.º, n.º 1, alínea a) do Código dos Contratos Públicos","","",,,,Não aplicável.,Não aplicável.,
Colocação de Bombas circuladoras UPS 50/180 e UOS 20/30,Ajuste Direto Regime Geral,Aquisição de serviços,"50000000-5, Serviços de reparação e manutenção","Administração Regional de Saúde de Lisboa e Vale do Tejo, I.P. (503148776)",SUCH - Serviço de Utilização Comum dos Hospitais (500900469),"821,93 €",03-11-2011,25-10-2011,2 dias,"Portugal, Santarém, Almeirim","Artigo 24.º, n.º 1, alínea e) do Código dos Contratos Públicos",30-10-2011,"821,93 €",,,,Não aplicável.,Não aplicável.,
Reparação do Sistema AVAC - CHIDLLER<br />Por corte de energia eléctrica o sistema entrou em erro - Afinação dos termostátos e ligação do mesmo com substituição de arrancadores,Ajuste Direto Regime Geral,Aquisição de serviços,"50000000-5, Serviços de reparação e manutenção","Administração Regional de Saúde de Lisboa e Vale do Tejo, I.P. (503148776)",SUCH - Serviço de Utilização Comum dos Hospitais (500900469),"164,99 €",03-11-2011,15-09-2011,1 dias,"Portugal, Santarém, Almeirim","Artigo 24.º, n.º 1, alínea e) do Código dos Contratos Públicos",26-10-2011,"164,99 €",,,,Não aplicável.,Não aplicável.,
Aquisição de Mobiliário Médico para a UCSP de vila Franca de Xira,Ajuste Direto Regime Geral,Aquisição de bens móveis,"33192000-2, Mobiliário para fins médicos","Administração Regional de Saúde de Lisboa e Vale do Tejo, I.P. (503148776)",Intercromo SA (504058568),"3.930,00 €",03-11-2011,28-10-2011,30 dias,"Portugal, Lisboa, Vila Franca de Xira","Artigo 20.º, n.º 1, alínea a) do Código dos Contratos Públicos","","",,,,Não aplicável.,Não aplicável.,
Mobiliário médico para a UCSP de Vila franca de Xira,Ajuste Direto Regime Geral,Aquisição de bens móveis,"33192000-2, Mobiliário para fins médicos","Administração Regional de Saúde de Lisboa e Vale do Tejo, I.P. (503148776)",Promei Centro Lda (506470113),"8.068,00 €",03-11-2011,28-10-2011,1 dias,"Portugal, Lisboa, Vila Franca de Xira","Artigo 26.º, n.º 1, alínea a) do Código dos Contratos Públicos","","",,,,Não aplicável.,Não aplicável.,
Aquisição de Mobiliário Administrativo para a USF Ribeirinha - Extra Acordo Quadro,Ajuste Direto Regime Geral,Aquisição de bens móveis,"39151000-5, Mobiliário diverso","Administração Regional de Saúde de Lisboa e Vale do Tejo, I.P. (503148776)",Big Laguna Lda (505543869),"6.312,36 €",03-11-2011,28-10-2011,10 dias,"Portugal, Setúbal, Setúbal","Artigo 20.º, n.º 1, alínea a) do Código dos Contratos Públicos","","",,,,Não aplicável.,Não aplicável.,
Verificação da anomalia no Sistema AVAC no Gabinete Médico - Limpeza de filtros e desentupimento da tubagem de esgoto;<br />Reparação da Caldeira em virtude do rebentamento da tubagem,Ajuste Direto Regime Geral,Aquisição de serviços,"50000000-5, Serviços de reparação e manutenção","Administração Regional de Saúde de Lisboa e Vale do Tejo, I.P. (503148776)",SUCH Serviço de Utilização Comum dos Hospitais (500900469),"996,79 €",02-11-2011,13-09-2011,8 dias,"Portugal, Santarém, Almeirim","Artigo 24.º, n.º 1, alínea e) do Código dos Contratos Públicos",30-09-2011,"996,79 €",,,,Não aplicável.,Não aplicável.,
"Verificação da anomalia no sistema de aquecimento da caldeira - água quente - Aplicação de tubagem nova;<br />Verificação da anomalia do sistema AVAC, com aplicação de nova tubagem",Ajuste Direto Regime Geral,Aquisição de serviços,"50000000-5, Serviços de reparação e manutenção","Administração Regional de Saúde de Lisboa e Vale do Tejo, I.P. (503148776)",SUCH - Serviço de Utilização Comum dos hospitais (500900469),"1.539,58 €",02-11-2011,30-09-2011,8 dias,"Portugal, Santarém, Almeirim","Artigo 24.º, n.º 1, alínea e) do Código dos Contratos Públicos","","",,,,Não aplicável.,Não aplicável.,
"Aquisição de serviços de limpeza com fornecimento de consumiveis (Produtos de Higiene) para os Serviços da dependência da Administração Regional de Saúde de Lisboa e Vale do Tejo, IP.",Ajuste Direto Regime Geral,Aquisição de serviços,"90910000-9, Serviços de limpeza","Administração Regional de Saúde de Lisboa e Vale do Tejo, I.P. (503148776)","Conforlimpa (Tejo) - Multiserviços, SA (503172588)","883.461,06 €",02-11-2011,27-10-2011,365 dias,Portugal,Artigo 258.º do Código dos Contratos Públicos,"","",,,,Não aplicável.,Não aplicável.,
Aquisição de serviços de higiene e limpeza com fornecimento de consumiveis (Produtos de Higiene) para o ACES 15 Arco Ribeirinho para um periodo de 2 meses,Ajuste Direto Regime Geral,Aquisição de serviços,"90910000-9, Serviços de limpeza","Administração Regional de Saúde de Lisboa e Vale do Tejo, I.P. (503148776)","Electrolimpa Sul, SA (507545427)","260.083,10 €",02-11-2011,28-10-2011,365 dias,"Portugal, Setúbal",Artigo 258.º do Código dos Contratos Públicos,"","",,,,Não aplicável.,Não aplicável.,
