freguesia,acronym,validVotesPercentage,votes,dicofre
"União das freguesias de Mação, Penhascoso e Aboboreira",PS,39.39,583,141309
"União das freguesias de Mação, Penhascoso e Aboboreira",PPD/PSD.CDS-PP,30.81,456,141309
"União das freguesias de Mação, Penhascoso e Aboboreira",PCP-PEV,8.24,122,141309
"União das freguesias de Mação, Penhascoso e Aboboreira",MPT,7.3,108,141309
"União das freguesias de Mação, Penhascoso e Aboboreira",B.E.,4.73,70,141309
"União das freguesias de Mação, Penhascoso e Aboboreira",PAN,1.76,26,141309
"União das freguesias de Mação, Penhascoso e Aboboreira",PCTP/MRPP,1.69,25,141309
"União das freguesias de Mação, Penhascoso e Aboboreira",L,1.49,22,141309
"União das freguesias de Mação, Penhascoso e Aboboreira",PND,1.35,20,141309
"União das freguesias de Mação, Penhascoso e Aboboreira",PPM,0.74,11,141309
"União das freguesias de Mação, Penhascoso e Aboboreira",PTP,0.74,11,141309
"União das freguesias de Mação, Penhascoso e Aboboreira",PDA,0.54,8,141309
"União das freguesias de Mação, Penhascoso e Aboboreira",MAS,0.41,6,141309
"União das freguesias de Mação, Penhascoso e Aboboreira",POUS,0.41,6,141309
"União das freguesias de Mação, Penhascoso e Aboboreira",PNR,0.2,3,141309
"União das freguesias de Mação, Penhascoso e Aboboreira",PPV,0.2,3,141309
