Objeto do Contrato,Tipo de Procedimento,Tipo(s) de Contrato,CPVs,Entidade(s) Adjudicante(s),Entidade(s) Adjudicatária(s),Preço Contratual,Data de Publicação,Data de Celebração do Contrato,Prazo de Execução,Local de Execução,Fundamentação,Data de Fecho do Contrato,Preço Total Efetivo,Causas das Alterações ao Prazo,Causas das Alterações ao Preço,Estado,N.º registo do Acordo Quadro,Descrição do Acordo Quadro,Procedimento Centralizado
Aquisição do fármaco Tobramicina 28 Mg. Po Inalação Caps.,Ajuste Direto Regime Geral,Aquisição de bens móveis,"33651100-9, Antibacterianos de uso sistémico","Centro Hospitalar Lisboa Norte, EPE (508481287)","Novartis Farma, S.A. (500063524)","59.106,97 €",21-09-2012,11-09-2012,1 dias,"Portugal, Lisboa, Lisboa","Artigo 24.º, n.º 1, alínea e) do Código dos Contratos Públicos",,,,,,Não aplicável.,Não aplicável.,
Aquisição do fármaco Inibidor da Alfa 1 Proteinase Inj. 1000 Mg.,Ajuste Direto Regime Geral,Aquisição de bens móveis,"33690000-3, Medicamentos vários","Centro Hospitalar Lisboa Norte, EPE (508481287)","Grifols Portugal, Lda. (502041285)","71.680,00 €",21-09-2012,14-09-2012,1 dias,"Portugal, Lisboa, Lisboa","Artigo 24.º, n.º 1, alínea e) do Código dos Contratos Públicos",,,,,,Não aplicável.,Não aplicável.,
"Aquisição do fármaco Iloprost Sol. Inj. 50 Mcg/0,5 Ml",Ajuste Direto Regime Geral,Aquisição de bens móveis,"33621100-0, Antitrombóticos","Centro Hospitalar Lisboa Norte, EPE (508481287)","Bayer Portugal, S.A. (500043256)","12.569,40 €",21-09-2012,13-09-2012,1 dias,"Portugal, Lisboa, Lisboa","Artigo 24.º, n.º 1, alínea e) do Código dos Contratos Públicos",,,,,,Não aplicável.,Não aplicável.,
"Aquisição do fármaco Interferão beta 1 a 6 Mui/0,5 Ml Inj. Can.",Ajuste Direto Regime Geral,Aquisição de bens móveis,"33652000-5, Antineoplásicos e imunomoduladores","Centro Hospitalar Lisboa Norte, EPE (508481287)","Biogen Idec Portugal, Lda. (506415740)","23.247,90 €",20-09-2012,17-09-2012,1 dias,"Portugal, Lisboa, Lisboa","Artigo 24.º, n.º 1, alínea e) do Código dos Contratos Públicos",,,,,,Não aplicável.,Não aplicável.,
Aquisição do fármaco Imunoglobulina Sol. Inj. 50 Mg/Ml Fr. 200Ml,Ajuste Direto Regime Geral,Aquisição de bens móveis,"33651520-9, Imunoglobulinas","Centro Hospitalar Lisboa Norte, EPE (508481287)","Grifols Portugal, Lda. (502041285)","8.400,00 €",20-09-2012,20-09-2012,1 dias,"Portugal, Lisboa, Lisboa","Artigo 24.º, n.º 1, alínea e) do Código dos Contratos Públicos",,,,,,Não aplicável.,Não aplicável.,
Aquisição do fármaco Darbepoetina Alfa Inj. 30 Mcg.,Ajuste Direto Regime Geral,Aquisição de bens móveis,"33621300-2, Antianémicos","Centro Hospitalar Lisboa Norte, EPE (508481287)","Amgen Biofarmacêutica, Lda. (502942959)","12.484,80 €",20-09-2012,20-09-2012,1 dias,"Portugal, Lisboa, Lisboa","Artigo 24.º, n.º 1, alínea e) do Código dos Contratos Públicos",,,,,,Não aplicável.,Não aplicável.,
Aquisição do fámaco Darbopoetina Alfa 300 Mcg.,Ajuste Direto Regime Geral,Aquisição de bens móveis,"33621300-2, Antianémicos","Centro Hospitalar Lisboa Norte, EPE (508481287)","Amgen Biofarmacêutica, Lda. (502942959)","110.160,00 €",20-09-2012,14-09-2012,1 dias,"Portugal, Lisboa, Lisboa","Artigo 24.º, n.º 1, alínea e) do Código dos Contratos Públicos",,,,,,Não aplicável.,Não aplicável.,
Aquisição de Darbopoetina Alfa Inj. 60 Mcg.,Ajuste Direto Regime Geral,Aquisição de bens móveis,"33621300-2, Antianémicos","Centro Hospitalar Lisboa Norte, EPE (508481287)","Amgen Biofarmacêutica, Lda. (502942959)","26.438,40 €",20-09-2012,13-09-2012,1 dias,"Portugal, Lisboa, Lisboa","Artigo 24.º, n.º 1, alínea e) do Código dos Contratos Públicos",,,,,,Não aplicável.,Não aplicável.,
Aquisição do fármaco Omalizumb 150 Mg/1Ml Inj. Seringa,Ajuste Direto Regime Geral,Aquisição de bens móveis,"33670000-7, Medicamentos para o aparelho respiratório","Centro Hospitalar Lisboa Norte, EPE (508481287)","Novartis Farma, S.A. (500063524)","105.750,00 €",20-09-2012,11-09-2012,1 dias,"Portugal, Lisboa, Lisboa","Artigo 24.º, n.º 1, alínea e) do Código dos Contratos Públicos",,,,,,Não aplicável.,Não aplicável.,
Aquisição do fármaco de Factor VIII Recombinante S/ Albumina 1000,Ajuste Direto Regime Geral,Aquisição de bens móveis,"33621200-1, Anti-hemorrágicos","Centro Hospitalar Lisboa Norte, EPE (508481287)","Laboratórios Pfizer, Lda. (500162166)","41.400,00 €",20-09-2012,13-09-2012,1 dias,"Portugal, Lisboa, Lisboa","Artigo 24.º, n.º 1, alínea e) do Código dos Contratos Públicos",,,,,,Não aplicável.,Não aplicável.,
Aquisição do fármaco Concentrado C1 Inibidor Esterase Sol. Inj.,Ajuste Direto Regime Geral,Aquisição de bens móveis,"33141520-1, Derivados do plasma","Centro Hospitalar Lisboa Norte, EPE (508481287)","CSL Behring, Lda. (503047201)","21.119,60 €",20-09-2012,14-09-2012,1 dias,"Portugal, Lisboa, Lisboa","Artigo 24.º, n.º 1, alínea e) do Código dos Contratos Públicos",,,,,,Não aplicável.,Não aplicável.,
Aquisição de diversas próteses vasculares,Ajuste Direto Regime Geral,Aquisição de bens móveis,"33184200-5, Próteses vasculares","Centro Hospitalar Lisboa Norte, EPE (508481287)","Biosonda, Lda. (501463313)","26.000,00 €",20-09-2012,20-09-2012,5 dias,"Portugal, Lisboa, Lisboa","Artigo 20.º, n.º 1, alínea a) do Código dos Contratos Públicos",,,,,,Não aplicável.,Não aplicável.,
Aquisição do fármaco Darbopoetina Alfa Inj. 20 Mcg.,Ajuste Direto Regime Geral,Aquisição de bens móveis,"33621300-2, Antianémicos","Centro Hospitalar Lisboa Norte, EPE (508481287)","Amgen Biofarmacêutica, Lda. (502942959)","10.281,60 €",20-09-2012,18-09-2012,1 dias,"Portugal, Lisboa, Lisboa","Artigo 20.º, n.º 1, alínea a) do Código dos Contratos Públicos",,,,,,Não aplicável.,Não aplicável.,
Aquisição de CDI VR e de eléctrodo,Ajuste Direto Regime Geral,Aquisição de bens móveis,"33182100-0, Desfibrilhador","Centro Hospitalar Lisboa Norte, EPE (508481287)","St. Jude Medical, Lda. (504180746)","11.500,00 €",20-09-2012,20-09-2012,1 dias,"Portugal, Lisboa, Lisboa","Artigo 20.º, n.º 1, alínea a) do Código dos Contratos Públicos",,,,,,Não aplicável.,Não aplicável.,
Contrato de aquisição de diversos consumiveis para cardiologia.,Ajuste Direto Regime Geral,Aquisição de bens móveis,"33111710-1, Material para angiografia","Centro Hospitalar Lisboa Norte, EPE (508481287)","Terumo, SL (980472024)","28.124,00 €",20-09-2012,20-09-2012,1 dias,"Portugal, Lisboa, Lisboa","Artigo 20.º, n.º 1, alínea a) do Código dos Contratos Públicos",,,,,,Não aplicável.,Não aplicável.,
Contrato de aquisição de 3600 cps de tafamidis 20 MG,Ajuste Direto Regime Geral,Aquisição de bens móveis,"33661700-8, Outros medicamentos para o sistema nervoso","Centro Hospitalar Lisboa Norte, EPE (508481287)","Lab. Pfizer, S.A. (500162166)","1.332.000,00 €",17-09-2012,17-09-2012,2 dias,"Portugal, Lisboa, Lisboa","Artigo 24.º, n.º 1, alínea e) do Código dos Contratos Públicos",,,,,,Não aplicável.,Não aplicável.,
Contrato de aquisição de 60 fra de imunoglobulina sol inj 100 MG/ML FR 200,Ajuste Direto Regime Geral,Aquisição de bens móveis,"33651520-9, Imunoglobulinas","Centro Hospitalar Lisboa Norte, EPE (508481287)","CSL Berhring, Lda (503047201)","42.000,00 €",17-09-2012,14-09-2012,1 dias,"Portugal, Lisboa, Lisboa","Artigo 24.º, n.º 1, alínea e) do Código dos Contratos Públicos",,,,,,Não aplicável.,Não aplicável.,
Contrato de aquisição de 900 cps de Bexaroteno,Ajuste Direto Regime Geral,Aquisição de bens móveis,"33652000-5, Antineoplásicos e imunomoduladores","Centro Hospitalar Lisboa Norte, EPE (508481287)","Eisai Farmacêutica Unipessoal, lda (507847660)","10.054,71 €",17-09-2012,14-09-2012,1 dias,"Portugal, Lisboa, Lisboa","Artigo 24.º, n.º 1, alínea e) do Código dos Contratos Públicos",,,,,,Não aplicável.,Não aplicável.,
Contrato de aquisição de 60 fra agalsidase alfa inj  1 mg/ml,Ajuste Direto Regime Geral,Aquisição de bens móveis,"33616000-1, Vitaminas","Centro Hospitalar Lisboa Norte, EPE (508481287)",Shire (509264662),"96.946,20 €",14-09-2012,13-09-2012,1 dias,"Portugal, Lisboa, Lisboa","Artigo 24.º, n.º 1, alínea e) do Código dos Contratos Públicos",,,,,,Não aplicável.,Não aplicável.,
Contrato de aquisição de 36 fra Idursulfase sol perfusão 6 MG/3ML,Ajuste Direto Regime Geral,Aquisição de bens móveis,"33616000-1, Vitaminas","Centro Hospitalar Lisboa Norte, EPE (508481287)",Shire (509264662),"105.300,00 €",14-09-2012,14-09-2012,1 dias,"Portugal, Lisboa, Lisboa","Artigo 24.º, n.º 1, alínea e) do Código dos Contratos Públicos",,,,,,Não aplicável.,Não aplicável.,
"Contrato de aquisição de 10000 cps de Anagrelide 0,5 MG",Ajuste Direto Regime Geral,Aquisição de bens móveis,"33652000-5, Antineoplásicos e imunomoduladores","Centro Hospitalar Lisboa Norte, EPE (508481287)",Shire (509264662),"58.213,00 €",14-09-2012,14-09-2012,1 dias,"Portugal, Lisboa, Lisboa","Artigo 24.º, n.º 1, alínea e) do Código dos Contratos Públicos",,,,,,Não aplicável.,Não aplicável.,
Contrato de aquisição de 4800 SRG de lidocaina 2% c/ clorohexidina,Ajuste Direto Regime Geral,Aquisição de bens móveis,"33661100-2, Anestésicos","Centro Hospitalar Lisboa Norte, EPE (508481287)",Quilaban (500399670),"10.944,00 €",14-09-2012,12-09-2012,1 dias,"Portugal, Lisboa, Lisboa","Artigo 24.º, n.º 1, alínea e) do Código dos Contratos Públicos",,,,,,Não aplicável.,Não aplicável.,
contrato de aquisição de 420 cps de lenalidomida,Ajuste Direto Regime Geral,Aquisição de bens móveis,"33652000-5, Antineoplásicos e imunomoduladores","Centro Hospitalar Lisboa Norte, EPE (508481287)",Celgene (507791690),"108.342,78 €",14-09-2012,10-09-2012,1 dias,"Portugal, Lisboa, Lisboa","Artigo 24.º, n.º 1, alínea e) do Código dos Contratos Públicos",,,,,,Não aplicável.,Não aplicável.,
Contrato de aquisição de 250 CPS de Vinorelbina caps 30 MG,Ajuste Direto Regime Geral,Aquisição de bens móveis,"33652000-5, Antineoplásicos e imunomoduladores","Centro Hospitalar Lisboa Norte, EPE (508481287)","Pierre Fabre, Lda (500230366)","22.750,00 €",14-09-2012,14-09-2012,1 dias,"Portugal, Lisboa, Lisboa","Artigo 24.º, n.º 1, alínea e) do Código dos Contratos Públicos",,,,,,Não aplicável.,Não aplicável.,
Contrato de aquisição de 384 tts de CMV teste Amplificação ADN por PCR,Ajuste Direto Regime Geral,Aquisição de bens móveis,"33696500-0, Reagentes de laboratório","Centro Hospitalar Lisboa Norte, EPE (508481287)","Izasa Portugal, Lda (501086110)","11.256,00 €",14-09-2012,12-09-2012,1 dias,"Portugal, Lisboa, Lisboa","Artigo 24.º, n.º 1, alínea e) do Código dos Contratos Públicos",,,,,,Não aplicável.,Não aplicável.,
Contrato de aquisição de 150 fr de caspofungina sol inj,Ajuste Direto Regime Geral,Aquisição de bens móveis,"33631100-3, Antifúngicos usados em dermatologia","Centro Hospitalar Lisboa Norte, EPE (508481287)","Merck Sharp & Dohme, Lda (500191360)","762.885,00 €",14-09-2012,11-09-2012,1 dias,"Portugal, Lisboa, Lisboa","Artigo 24.º, n.º 1, alínea e) do Código dos Contratos Públicos",,,,,,Não aplicável.,Não aplicável.,
Contrato de aquisição de 30 amp de somatropina Inj 12 MG,Ajuste Direto Regime Geral,Aquisição de bens móveis,"33642100-3, Hormonas hipofisárias, hipotalâmicas e semelhantes","Centro Hospitalar Lisboa Norte, EPE (508481287)",Lilly Portugal (500165602),"11.757,30 €",14-09-2012,13-09-2012,2 dias,"Portugal, Lisboa, Lisboa","Artigo 24.º, n.º 1, alínea e) do Código dos Contratos Públicos",,,,,,Não aplicável.,Não aplicável.,
Contrato de aquisição de um sistema CDI VR ()CDI VR + electrodo desfibrilhador fixação activa,Ajuste Direto Regime Geral,Aquisição de bens móveis,"33182100-0, Desfibrilhador","Centro Hospitalar Lisboa Norte, EPE (508481287)",Medtronic (504223933),"11.500,00 €",14-09-2012,14-09-2012,1 dias,"Portugal, Lisboa, Lisboa","Artigo 20.º, n.º 1, alínea a) do Código dos Contratos Públicos",,,,,,Não aplicável.,Não aplicável.,
Contrato de aquisição 1 Sistema CDI BIV (electrodo seio coronario + electrodo desfibrilhador fixação activa),Ajuste Direto Regime Geral,Aquisição de bens móveis,"33182100-0, Desfibrilhador","Centro Hospitalar Lisboa Norte, EPE (508481287)",Medtronic (504223933),"18.039,00 €",14-09-2012,06-09-2012,1 dias,"Portugal, Lisboa, Lisboa","Artigo 20.º, n.º 1, alínea a) do Código dos Contratos Públicos",,,,,,Não aplicável.,Não aplicável.,
Contrato de aquisição de sitema CDI BIV (CDI + Electrodo desfibrilhador + Electrodo seio coronário + Electrodo auricular),Ajuste Direto Regime Geral,Aquisição de bens móveis,"33182100-0, Desfibrilhador","Centro Hospitalar Lisboa Norte, EPE (508481287)","farmimpex, SA (503061506)","17.597,00 €",14-09-2012,14-09-2012,1 dias,"Portugal, Lisboa, Lisboa","Artigo 20.º, n.º 1, alínea a) do Código dos Contratos Públicos",,,,,,Não aplicável.,Não aplicável.,
Contrato de aquisição de material ortopedia,Ajuste Direto Regime Geral,Aquisição de bens móveis,"33183100-7, Implantes ortopédicos","Centro Hospitalar Lisboa Norte, EPE (508481287)",Zimmer (980151716),"6.694,13 €",14-09-2012,14-09-2012,1 dias,"Portugal, Lisboa, Lisboa","Artigo 20.º, n.º 1, alínea a) do Código dos Contratos Públicos",,,,,,Não aplicável.,Não aplicável.,
Contrato de aquisição de Imunoglobolina 100 MG/ML inj FR 20 ML,Ajuste Direto Regime Geral,Aquisição de bens móveis,"33651520-9, Imunoglobulinas","Centro Hospitalar Lisboa Norte, EPE (508481287)",Octapharma (502820780),"9.600,00 €",14-09-2012,14-09-2012,2 dias,"Portugal, Lisboa, Lisboa","Artigo 24.º, n.º 1, alínea e) do Código dos Contratos Públicos",,,,,,Não aplicável.,Não aplicável.,
Contrato de aquisição de darbopoetina alfa 80 Mcg,Ajuste Direto Regime Geral,Aquisição de bens móveis,"33621000-9, Medicamentos para o sangue e para os órgãos hematopoiéticos","Centro Hospitalar Lisboa Norte, EPE (508481287)",Amgen (502942959),"27.417,60 €",14-09-2012,12-09-2012,1 dias,"Portugal, Lisboa, Lisboa","Artigo 24.º, n.º 1, alínea e) do Código dos Contratos Públicos",,,,,,Não aplicável.,Não aplicável.,
Contrato de aquisição de darbopoetina alfa 100 MCG,Ajuste Direto Regime Geral,Aquisição de bens móveis,"33621000-9, Medicamentos para o sangue e para os órgãos hematopoiéticos","Centro Hospitalar Lisboa Norte, EPE (508481287)",Amgen (502942959),"29.376,00 €",14-09-2012,12-09-2012,1 dias,"Portugal, Lisboa, Lisboa","Artigo 24.º, n.º 1, alínea e) do Código dos Contratos Públicos",,,,,,Não aplicável.,Não aplicável.,
Contrato de aquisição de inibidor alfa 1 proteinase Inj 1000 M,Ajuste Direto Regime Geral,Aquisição de bens móveis,"33690000-3, Medicamentos vários","Centro Hospitalar Lisboa Norte, EPE (508481287)",Grifols (502041285),"57.600,00 €",14-09-2012,13-09-2012,1 dias,"Portugal, Lisboa, Lisboa","Artigo 24.º, n.º 1, alínea e) do Código dos Contratos Públicos",,,,,,Não aplicável.,Não aplicável.,
Aquisição Cinacalcet Comp,Ajuste Direto Regime Geral,Aquisição de bens móveis,"33690000-3, Medicamentos vários","Centro Hospitalar Lisboa Norte, EPE (508481287)",Amgen (502942959),"13.092,30 €",13-09-2012,12-09-2012,1 dias,"Portugal, Lisboa, Lisboa","Artigo 24.º, n.º 1, alínea e) do Código dos Contratos Públicos",,,,,,Não aplicável.,Não aplicável.,
Aquisição de somatropina Inj 6 MG,Ajuste Direto Regime Geral,Aquisição de bens móveis,"33642100-3, Hormonas hipofisárias, hipotalâmicas e semelhantes","Centro Hospitalar Lisboa Norte, EPE (508481287)",Lilly Portugal (500165602),"11.757,00 €",13-09-2012,12-09-2012,2 dias,"Portugal, Lisboa, Lisboa","Artigo 20.º, n.º 1, alínea a) do Código dos Contratos Públicos",,,,,,Não aplicável.,Não aplicável.,
Aquisição recargas de agrafadores lin c/ corte endosc 45 mm,Ajuste Direto Regime Geral,Aquisição de bens móveis,"33141125-2, Material de sutura cirúrgica","Centro Hospitalar Lisboa Norte, EPE (508481287)",Johnson (500153370),"9.240,00 €",13-09-2012,13-09-2012,2 dias,"Portugal, Lisboa, Lisboa","Artigo 20.º, n.º 1, alínea a) do Código dos Contratos Públicos",,,,,,Não aplicável.,Não aplicável.,
Aquisição de agrafador hemorroidectomia,Ajuste Direto Regime Geral,Aquisição de bens móveis,"33141125-2, Material de sutura cirúrgica","Centro Hospitalar Lisboa Norte, EPE (508481287)",Johnson (500153370),"7.680,00 €",13-09-2012,13-09-2012,2 dias,"Portugal, Lisboa, Lisboa","Artigo 20.º, n.º 1, alínea a) do Código dos Contratos Públicos",,,,,,Não aplicável.,Não aplicável.,
Aquisição de inibidor alfa 1 proteinase INJ 1000M,Ajuste Direto Regime Geral,Aquisição de bens móveis,"33690000-3, Medicamentos vários","Centro Hospitalar Lisboa Norte, EPE (508481287)",Grigols (502041285),"57.600,00 €",13-09-2012,13-09-2012,1 dias,"Portugal, Lisboa, Lisboa","Artigo 24.º, n.º 1, alínea e) do Código dos Contratos Públicos",,,,,,Não aplicável.,Não aplicável.,
Aquisição de tempo protrombina Tiras Teste,Ajuste Direto Regime Geral,Aquisição de bens móveis,"33696200-7, Reagentes para análises ao sangue","Centro Hospitalar Lisboa Norte, EPE (508481287)","Roche Sistemas de Diagnóstico, Lda (504282921)","13.900,00 €",12-09-2012,10-09-2012,1 dias,"Portugal, Lisboa, Lisboa","Artigo 20.º, n.º 1, alínea a) do Código dos Contratos Públicos",,,,,,Não aplicável.,Não aplicável.,
"Aquisição de somatropina Sol Inj 10 MG/1,5 ML",Ajuste Direto Regime Geral,Aquisição de bens móveis,"33642100-3, Hormonas hipofisárias, hipotalâmicas e semelhantes","Centro Hospitalar Lisboa Norte, EPE (508481287)","Novo Nordisk, Lda (501485210)","22.337,25 €",12-09-2012,10-09-2012,1 dias,"Portugal, Lisboa, Lisboa","Artigo 24.º, n.º 1, alínea e) do Código dos Contratos Públicos",,,,,,Não aplicável.,Não aplicável.,
Aquisição de Imunoglobulina sol inj 165 MG/ML Amp 10 ML,Ajuste Direto Regime Geral,Aquisição de bens móveis,"33651520-9, Imunoglobulinas","Centro Hospitalar Lisboa Norte, EPE (508481287)",Octapharma (502820780),"37.620,00 €",12-09-2012,11-09-2012,1 dias,"Portugal, Lisboa, Lisboa","Artigo 24.º, n.º 1, alínea e) do Código dos Contratos Públicos",,,,,,Não aplicável.,Não aplicável.,
Aquisição de Factor VIII 1000 UI + Facor Willebrand 1000UI inj,Ajuste Direto Regime Geral,Aquisição de bens móveis,"33621200-1, Anti-hemorrágicos","Centro Hospitalar Lisboa Norte, EPE (508481287)",Octapharma (502820780),"38.160,00 €",12-09-2012,11-09-2012,1 dias,"Portugal, Lisboa, Lisboa","Artigo 24.º, n.º 1, alínea e) do Código dos Contratos Públicos",,,,,,Não aplicável.,Não aplicável.,
Aquisição de complexo de protombina humana 500UI/20M,Ajuste Direto Regime Geral,Aquisição de bens móveis,"33621200-1, Anti-hemorrágicos","Centro Hospitalar Lisboa Norte, EPE (508481287)",Octapharma (502820780),"19.080,00 €",12-09-2012,11-09-2012,1 dias,"Portugal, Lisboa, Lisboa","Artigo 24.º, n.º 1, alínea e) do Código dos Contratos Públicos",,,,,,Não aplicável.,Não aplicável.,
Contrato de aquisição de Imunoglobulina 100 MG/ML inj Fr 50 ML,Ajuste Direto Regime Geral,Aquisição de bens móveis,"33651520-9, Imunoglobulinas","Centro Hospitalar Lisboa Norte, EPE (508481287)",Octapharma (502820780),"30.528,00 €",12-09-2012,11-09-2012,1 dias,"Portugal, Lisboa, Lisboa","Artigo 24.º, n.º 1, alínea e) do Código dos Contratos Públicos",,,,,,Não aplicável.,Não aplicável.,
