Objeto do Contrato,Tipo de Procedimento,Tipo(s) de Contrato,CPVs,Entidade(s) Adjudicante(s),Entidade(s) Adjudicatária(s),Preço Contratual,Data de Publicação,Data de Celebração do Contrato,Prazo de Execução,Local de Execução,Fundamentação,Data de Fecho do Contrato,Preço Total Efetivo,Causas das Alterações ao Prazo,Causas das Alterações ao Preço,Estado,N.º registo do Acordo Quadro,Descrição do Acordo Quadro,Procedimento Centralizado
"Aquisição de Seguro de Acidentes de Trabalho para os Trabalhadores e Seguro de Acidentes Pessoais para os Voluntários da ULSLA, EPE",Concurso público,Aquisição de serviços,"66512000-2, Serviços de seguros de acidentes e de saúde",Unidade Local de Saúde do Litoral Alentejano EPE (510445152),Seguradoras Unidas SA (500940231),"1.857,60 €",07-09-2018,20-08-2018,1095 dias,"Portugal, Setúbal, Santiago do Cacém","Artigo 21.º, n.º 1, alínea a) do Código dos Contratos Públicos",,,,,,Não aplicável.,Não aplicável.,FALSE
"Aquisição de Seguro de Acidentes de Trabalho para os Trabalhadores e Seguro de Acidentes Pessoais para os Voluntários da ULSLA, EPE",Concurso público,Aquisição de serviços,"66512000-2, Serviços de seguros de acidentes e de saúde",Unidade Local de Saúde do Litoral Alentejano EPE (510445152),Lusitania Companhia de Seguros SA (501689168),"205.076,10 €",07-09-2018,20-08-2018,1095 dias,"Portugal, Setúbal, Santiago do Cacém","Artigo 21.º, n.º 1, alínea a) do Código dos Contratos Públicos",,,,,,Não aplicável.,Não aplicável.,FALSE
