Objeto do Contrato,Tipo de Procedimento,Tipo(s) de Contrato,CPVs,Entidade(s) Adjudicante(s),Entidade(s) Adjudicatária(s),Preço Contratual,Data de Publicação,Data de Celebração do Contrato,Prazo de Execução,Local de Execução,Fundamentação,Data de Fecho do Contrato,Preço Total Efetivo,Causas das Alterações ao Prazo,Causas das Alterações ao Preço,Estado,N.º registo do Acordo Quadro,Descrição do Acordo Quadro,Procedimento Centralizado
"Prestação de serviço efectuada por 38 (trinta e oito) trabalhadores, obrigando-se o segundo outorgante a colocar na prestação de serviço os elementos, em número e perfil, indicados no convite do procedimento.",Ajuste Direto Regime Geral,Aquisição de serviços,"79620000-6, Serviços de fornecimento de pessoal, inclusive temporário","Instituto Nacional de Emergência Médica, IP (501356126)","PSICOTEMPOS - Empresa de Trabalho Temporário, Lda. (504617010)","58.457,37 €",29-06-2012,29-06-2012,31 dias,"Portugal, Portugal Continental","Artigo 24.º, n.º 1, alínea c) do Código dos Contratos Públicos",,,,,,Não aplicável.,Não aplicável.,
Fornecimento de 50 mantas isotérmicas não descartáveis.,Ajuste Direto Regime Geral,Aquisição de bens móveis,"33140000-3, Material médico de consumo","Instituto Nacional de Emergência Médica, IP (501356126)","AMBEX, LDA. (507593111)","1.250,00 €",29-06-2012,27-06-2012,30 dias,"Portugal, Lisboa, Lisboa","Artigo 20.º, n.º 1, alínea a) do Código dos Contratos Públicos",,,,,,Não aplicável.,Não aplicável.,
Fornecimento de 2000 sistema de administração de soro c/arejador c/ligação luer lock.,Ajuste Direto Regime Geral,Aquisição de bens móveis,"33140000-3, Material médico de consumo","Instituto Nacional de Emergência Médica, IP (501356126)","ROCHA NEVES, LDA. (500233691)","360,00 €",29-06-2012,19-06-2012,30 dias,"Portugal, Lisboa, Lisboa","Artigo 20.º, n.º 1, alínea a) do Código dos Contratos Públicos",,,,,,Não aplicável.,Não aplicável.,
Fornecimento de 100 sacos p/cadaver vulc. c/fecho.,Ajuste Direto Regime Geral,Aquisição de bens móveis,"33922000-9, Sacos para transporte de cadáveres","Instituto Nacional de Emergência Médica, IP (501356126)","APG, LDA. (BNP FACTOR) (502063602)","1.200,00 €",29-06-2012,10-05-2012,30 dias,"Portugal, Lisboa, Lisboa","Artigo 20.º, n.º 1, alínea a) do Código dos Contratos Públicos",,,,,,Não aplicável.,Não aplicável.,
"Fornecimento de 400 sacos de Glucose 5%,sol.inj. saco 100ml.",Ao abrigo de acordo-quadro (art.º 258.º),Aquisição de bens móveis,"33690000-3, Medicamentos vários","Instituto Nacional de Emergência Médica, IP (501356126)","GRIFOLS PORTUGAL, LDA. (502041285)","356,00 €",28-06-2012,21-06-2012,30 dias,"Portugal, Lisboa, Lisboa","Artigo 26.º, n.º 1, alínea e) do Código dos Contratos Públicos",,,,,,Não definido.,Não definido.,
Fornecimento de 20.000 lancetas de uso unico estéril (p/amostra de sangue).,Ao abrigo de acordo-quadro (art.º 258.º),Aquisição de bens móveis,"33140000-3, Material médico de consumo","Instituto Nacional de Emergência Médica, IP (501356126)","PRESTIFARMA, LDA. (503474517)","1.130,00 €",28-06-2012,20-06-2012,30 dias,"Portugal, Lisboa, Lisboa","Artigo 26.º, n.º 1, alínea e) do Código dos Contratos Públicos",,,,,,Não definido.,Não definido.,
Aquisição de serviços de comunicações móveis para os meses de Junho e Julho do corrente ano.,Ajuste Direto Regime Geral,Aquisição de serviços,"64200000-8, Serviços de telecomunicações","Instituto Nacional de Emergência Médica, IP (501356126)","VODAFONE PORTUGAL, SA (502544180)","27.000,00 €",27-06-2012,08-06-2012,30 dias,"Portugal, Lisboa, Lisboa","Artigo 24.º, n.º 1, alínea c) do Código dos Contratos Públicos",,,,,,Não aplicável.,Não aplicável.,
Fornecimento de 50.000 copos plásticos disposable.,Ajuste Direto Regime Geral,Aquisição de bens móveis,"39221120-4, Chávenas e copos","Instituto Nacional de Emergência Médica, IP (501356126)","AQUARENT, LDA (504976923)","600,00 €",27-06-2012,21-06-2012,30 dias,"Portugal, Lisboa, Lisboa","Artigo 20.º, n.º 1, alínea a) do Código dos Contratos Públicos",,,,,,Não aplicável.,Não aplicável.,
"Deslocação a Maputo da Drª Ana Sofia Madeira, no periodo de 24-08-2011 a 03-09-2011, no ambito de um convite do Ministério da Saude de Moçambique/apoio organização dos jogos Africanos.",Ajuste Direto Regime Geral,Aquisição de serviços,"63515000-2, Serviços de viagens","Instituto Nacional de Emergência Médica, IP (501356126)","ESCALATUR, LDA. (501343237)","1.033,72 €",22-06-2012,28-05-2012,30 dias,"Portugal, Lisboa, Lisboa","Artigo 27.º, n.º 1, alínea h) do Código dos Contratos Públicos",,,,,,Não aplicável.,Não aplicável.,
Renovação das assinaturas online para o ano 2012 de diversas publicações periódicas.,Ajuste Direto Regime Geral,Aquisição de serviços,"79132100-9, Serviços de certificação de assinaturas electrónicas","Instituto Nacional de Emergência Médica, IP (501356126)","LUSODOC,Doc.Tecnico-Cient.,Lª (502609982)","8.127,00 €",22-06-2012,15-06-2012,30 dias,"Portugal, Lisboa, Lisboa","Artigo 24.º, n.º 1, alínea e) do Código dos Contratos Públicos",,,,,,Não aplicável.,Não aplicável.,
"Fornecimento de 50 ampolas de clemastina, sol. inj. 1mg/ml, amp. 2ml.",Ajuste Direto Regime Geral,Aquisição de bens móveis,"33690000-3, Medicamentos vários","Instituto Nacional de Emergência Médica, IP (501356126)",NOVARTIS (500268215),"46,35 €",22-06-2012,25-05-2012,30 dias,"Portugal, Lisboa, Lisboa","Artigo 20.º, n.º 1, alínea a) do Código dos Contratos Públicos",,,,,,Não aplicável.,Não aplicável.,
"Fornecimento de 50 frascos de Cetamina, sol.inj. 500mg/10ml, fr/amp.",Ao abrigo de acordo-quadro (art.º 258.º),Aquisição de bens móveis,"33690000-3, Medicamentos vários","Instituto Nacional de Emergência Médica, IP (501356126)","LABORATÓRIOS PFIZER, LDA. (500162166)","1.627,50 €",22-06-2012,06-06-2012,30 dias,"Portugal, Lisboa, Lisboa","Artigo 26.º, n.º 1, alínea e) do Código dos Contratos Públicos",,,,,,Não definido.,Não definido.,
"Fornecimento de 1200 ampolas de Adrenalina, sol. inj. 1mg/1ml, amp. 1ml.",Ao abrigo de acordo-quadro (art.º 258.º),Aquisição de bens móveis,"33690000-3, Medicamentos vários","Instituto Nacional de Emergência Médica, IP (501356126)","B. BRAUN MEDICAL, LDA. (501506543)","1.281,60 €",22-06-2012,15-06-2012,30 dias,"Portugal, Lisboa, Lisboa","Artigo 26.º, n.º 1, alínea e) do Código dos Contratos Públicos",,,,,,Não definido.,Não definido.,
"Fornecimento de 200 ampolas de Metoclopramida, sol. inj. 10mg/2ml, amp. 2ml; 100 Noradrenalina, inj. 10mg/10ml ampolas.",Ajuste Direto Regime Geral,Aquisição de bens móveis,"33690000-3, Medicamentos vários","Instituto Nacional de Emergência Médica, IP (501356126)","LABESFAL, SA (501169580)","3.879,00 €",22-06-2012,14-06-2012,30 dias,"Portugal, Lisboa, Lisboa","Artigo 26.º, n.º 1, alínea e) do Código dos Contratos Públicos",,,,,,Não aplicável.,Não aplicável.,
"Fornecimento de um serviço de locação de duas aeronaves iguais, tendo em vista a execução de operações secundárias e ocasionalmente primárias, de transporte de doentes, compreendendo,designadamente, o transporte de equipas de emergência, do equipamento clínico e de quaisquer outras pessoas ou objectos que sejam necessários ou convenientes para a realização daquelas operações. Fornecimento dos tripulantes, do combustível e dos serviços de manutenção necessários ao funcionamento das aeronaves e à execução das missões.",Ajuste Direto Regime Geral,Aquisição de serviços,"60424120-3, Aluguer de helicópteros, com tripulação","Instituto Nacional de Emergência Médica, IP (501356126)","INAER HELICOPTER PORTUGAL, LDA. (503546054)","1.375.104,00 €",21-06-2012,31-05-2012,122 dias,"Portugal, Portugal Continental","Artigo 24.º, n.º 1, alínea c) do Código dos Contratos Públicos",,,,,,Não aplicável.,Não aplicável.,
"Prestação de serviço de helitransporte de doentes e serviços conexos, composta pela locação de três aeronaves iguais, tendo em vista a execução de operações primárias e secundárias de transporte de doentes, compreendendo designadamente, o transporte de equipas de emergência médica, do equipamento clínico e de quaisquer outras pessoas e objeto, que sejam necessários ou convenientes para a realização daquelas operações. A prestação de serviço inclui ainda a disponibilização de tripulantes pilotos, de combustível e dos serviços de manutenção necessários ao funcionamento das aeronaves e à execução das missões.",Ajuste Direto Regime Geral,Aquisição de serviços,"60424120-3, Aluguer de helicópteros, com tripulação","Instituto Nacional de Emergência Médica, IP (501356126)","INAER HELICOPTER PORTUGAL, LDA. (503546054)","405.390,00 €",21-06-2012,31-05-2012,30 dias,"Portugal, Portugal Continental","Artigo 27.º, n.º 1, alínea a) do Código dos Contratos Públicos",,,,,,Não aplicável.,Não aplicável.,
