freguesia,acronym,validVotesPercentage,votes,dicofre
Faial da Terra,PS,69.66,62,420402
Faial da Terra,PPD/PSD.CDS-PP,22.47,20,420402
Faial da Terra,MPT,3.37,3,420402
Faial da Terra,B.E.,1.12,1,420402
Faial da Terra,PCP-PEV,1.12,1,420402
Faial da Terra,PND,1.12,1,420402
Faial da Terra,PTP,1.12,1,420402
Faial da Terra,L,0,0,420402
Faial da Terra,MAS,0,0,420402
Faial da Terra,PAN,0,0,420402
Faial da Terra,PCTP/MRPP,0,0,420402
Faial da Terra,PDA,0,0,420402
Faial da Terra,PNR,0,0,420402
Faial da Terra,POUS,0,0,420402
Faial da Terra,PPM,0,0,420402
Faial da Terra,PPV,0,0,420402
