Objeto do Contrato,Tipo de Procedimento,Tipo(s) de Contrato,CPVs,Entidade(s) Adjudicante(s),Entidade(s) Adjudicatária(s),Preço Contratual,Data de Publicação,Data de Celebração do Contrato,Prazo de Execução,Local de Execução,Fundamentação,Data de Fecho do Contrato,Preço Total Efetivo,Causas das Alterações ao Prazo,Causas das Alterações ao Preço,Estado,N.º registo do Acordo Quadro,Descrição do Acordo Quadro,Procedimento Centralizado
Período de vigência 01.01.2017 a 31.12.2017,Ajuste Direto Regime Geral,Aquisição de serviços,"50400000-9, Serviços de reparação e manutenção de equipamento médico e de precisão","Centro Hospitalar do Médio Tejo, E.P.E. (CHMT) (506361608)","Grifols Portugal, Produtos Farmacêuticos e Hospitalares, Lda (502041285)","11.088,98 €",10-08-2016,13-07-2016,365 dias,"Portugal, Santarém, Abrantes","Artigo 20.º, n.º 1, alínea a) do Código dos Contratos Públicos",,,,,,Não aplicável.,Não aplicável.,FALSE
Aquisição de Citoscópio,Ajuste Direto Regime Geral,Aquisição de bens móveis,"33100000-1, Equipamento médico","Centro Hospitalar do Médio Tejo, E. P. E. (506361608)","Grupo Taper, Lda (506886336)","3.125,00 €",08-08-2016,01-06-2016,30 dias,"Portugal, Santarém, Tomar","Artigo 20.º, n.º 1, alínea a) do Código dos Contratos Públicos",,,,,,Não aplicável.,Não aplicável.,FALSE
Rede de Gases Medicinais,Ajuste Direto Regime Geral,Empreitadas de obras públicas,"45300000-0, Instalações em edifícios","Centro Hospitalar do Médio Tejo, E. P. E. (506361608)","Air Liquide Medicinal, S.A. (501576436)","17.640,82 €",08-08-2016,10-02-2016,21 dias,"Portugal, Santarém, Abrantes","Artigo 19.º, alínea a) do Código dos Contratos Públicos",,,,,,Não aplicável.,Não aplicável.,FALSE
Instalação de rede de Gases Medicinais,Ajuste Direto Regime Geral,Empreitadas de obras públicas,"45300000-0, Instalações em edifícios","Centro Hospitalar do Médio Tejo, E.P.E. (CHMT) (506361608)","Air Liquide Medicinal, Lda (501576436)","9.699,10 €",08-08-2016,24-02-2016,8 dias,"Portugal, Santarém, Abrantes","Artigo 19.º, alínea a) do Código dos Contratos Públicos",,,,,,Não aplicável.,Não aplicável.,FALSE
Máquina de lavar e desinfectar endoscópios_38001416,Ajuste Direto Regime Geral,Aquisição de bens móveis,"39330000-4, Equipamento para desinfecção","Centro Hospitalar do Médio Tejo, E.P.E. (CHMT) (506361608)","Sistemas Integrales de la Medicina, S.A (980488842)","10.500,00 €",05-08-2016,08-06-2016,56 dias,"Portugal, Santarém, Torres Novas","Artigo 20.º, n.º 1, alínea a) do Código dos Contratos Públicos",,,,,,Não aplicável.,Não aplicável.,FALSE
Aquisição de Monitores cardíacos_38000516,Ajuste Direto Regime Geral,Aquisição de bens móveis,"33195100-4, Monitores","Centro Hospitalar do Médio Tejo, E.P.E. (CHMT) (506361608)",Medicinália Cormédica (500684324),"13.290,00 €",05-08-2016,29-02-2016,60 dias,"Portugal, Santarém, Torres Novas","Artigo 20.º, n.º 1, alínea a) do Código dos Contratos Públicos",,,,,,Não aplicável.,Não aplicável.,FALSE
Aquisição de campímetro,Ajuste Direto Regime Geral,Aquisição de bens móveis,"33122000-1, Equipamento oftalmológico","Centro Hospitalar do Médio Tejo, E.P.E. (CHMT) (506361608)","Carl Zeiss Meditec Iberia, S.A. (980503043)","25.700,00 €",05-08-2016,07-01-2016,1 dias,"Portugal, Santarém, Tomar","Artigo 20.º, n.º 1, alínea a) do Código dos Contratos Públicos",,,,,,Não aplicável.,Não aplicável.,FALSE
Serviço de Tratamento e recolha de Resíduos,Ajuste Direto Regime Geral,Aquisição de serviços,"90510000-5, Tratamento e eliminação de resíduos","Centro Hospitalar do Médio Tejo, E. P. E. (506361608)","Ambimed - Gestão Ambiental, Lda (503593427)","7.000,00 €",04-08-2016,25-07-2016,14 dias,"Portugal, Santarém, Tomar<BR/>Portugal, Santarém, Torres Novas<BR/>Portugal, Santarém, Abrantes","Artigo 20.º, n.º 1, alínea a) do Código dos Contratos Públicos",,,,,,Não aplicável.,Não aplicável.,FALSE
