Objeto do Contrato,Tipo de Procedimento,Tipo(s) de Contrato,CPVs,Entidade(s) Adjudicante(s),Entidade(s) Adjudicatária(s),Preço Contratual,Data de Publicação,Data de Celebração do Contrato,Prazo de Execução,Local de Execução,Fundamentação,Data de Fecho do Contrato,Preço Total Efetivo,Causas das Alterações ao Prazo,Causas das Alterações ao Preço,Estado,N.º registo do Acordo Quadro,Descrição do Acordo Quadro,Procedimento Centralizado
Aqisição de sacos e caricas (safecooker) no âmbito do Programa Troca de Seringas,Concurso público,Aquisição de bens móveis,"18000000-9, Vestuário, calçado, malas e artigos de viagem, acessórios","SPMS- Serviços Partilhados do M. da Saúde, E.P.E. (509540716)",Efervescente - Design e Comunicação Lda. (506738400),"20.500,00 €",11-05-2018,04-05-2018,304 dias,"Portugal, Lisboa","Artigo 20.º, n.º 1, alínea b) do Código dos Contratos Públicos",,,,,,Não aplicável.,Não aplicável.,FALSE
Aquisição de serviços para patrocínio judicial,Ajuste Direto Regime Geral,Aquisição de serviços,"79111000-5, Serviços de assessoria jurídica","SPMS - Serviços Partilhados do Ministério da Saúde, E. P. E. (509540716)",Miranda & Associados - Sociedade de Advogados SP RL (505701839),"67.500,00 €",10-05-2018,20-03-2018,285 dias,Portugal,"Artigo 20.º, n.º 1, alínea a) do Código dos Contratos Públicos",,,,,,Não aplicável.,Não aplicável.,FALSE
Aquisição de serviços de catering,Concurso público,Aquisição de serviços,"79952000-2, Serviços de eventos","SPMS- Serviços Partilhados do M. da Saúde, E.P.E. (509540716)",itau (500142858),"50.000,00 €",10-05-2018,03-04-2018,365 dias,Portugal,"Artigo 21.º, n.º 1, alínea a) do Código dos Contratos Públicos",,,,,,Não aplicável.,Não aplicável.,FALSE
Aquisição de serviços de análise e desenvolvimento necessários para o PNB (Portuguese National Broker) e NCP.pt (National Contact Point Portugal),Concurso público,Aquisição de serviços,"72500000-0, Serviços relacionados com a informática","SPMS- Serviços Partilhados do M. da Saúde, E.P.E. (509540716)","AltranPortugal, S.A. (504272179)","133.337,60 €",09-05-2018,05-04-2018,274 dias,Portugal,"Artigo 21.º, n.º 1, alínea a) do Código dos Contratos Públicos",,,,,,Não aplicável.,Não aplicável.,FALSE
Aquisição de serviços de consultoria na área jurídica para apoio na realização de uma parceria para a inovação,Ajuste Direto Regime Geral,Aquisição de serviços,"79111000-5, Serviços de assessoria jurídica","SPMS - Serviços Partilhados do Ministério da Saúde, E. P. E. (509540716)",LUIS FILIPE FONSECA VERDE DE SOUSA (213861402),"19.875,00 €",09-05-2018,11-04-2018,263 dias,Portugal,"Artigo 20.º, n.º 1, alínea a) do Código dos Contratos Públicos",,,,,,Não aplicável.,Não aplicável.,FALSE
Aquisição de Serviços de Manutenção e Suporte do Sistema de Informação para a Saúde Oral - SISO,Ao abrigo de acordo-quadro (art.º 259.º),Aquisição de serviços,"72500000-0, Serviços relacionados com a informática","SPMS - Serviços Partilhados do Ministério da Saúde, E. P. E. (509540716)","Everis Portugal, S.A. (506204650)","67.320,00 €",09-05-2018,27-03-2018,540 dias,Portugal,Artigo 259.º do Código dos Contratos Públicos,,,,,,1950010,Acordo quadro para Prestação de Serviços de Consultadoria na área da Saúde e Segurança   às Instituições e Serviços do Serviço Nacional de Saúde,FALSE
Aquisição de Combustíveis Rodoviários para as viaturas da SPMS,Ajuste Direto Regime Geral,Aquisição de bens móveis,"09134100-8, Gasóleo","SPMS- Serviços Partilhados do M. da Saúde, E.P.E. (509540716)","Petróleos de Portugal - Petrogal, SA. (500697370)","8.000,00 €",09-05-2018,06-04-2018,266 dias,Portugal,"Artigo 20.º, n.º 1, alínea a) do Código dos Contratos Públicos",,,,,,Não aplicável.,Não aplicável.,FALSE
Aquisição de serviços de administração de base de dados para os sistemas centrais,Ajuste Direto Regime Geral,Aquisição de serviços,"72500000-0, Serviços relacionados com a informática","SPMS - Serviços Partilhados do Ministério da Saúde, E. P. E. (509540716)","WHYMOB, Lda. (510856101)","9.950,00 €",09-05-2018,08-03-2018,90 dias,Portugal,"Artigo 20.º, n.º 1, alínea a) do Código dos Contratos Públicos",,,,,,Não aplicável.,Não aplicável.,FALSE
Aquisição de Serviços de manutenção de licenciamento de Liferay,Ajuste Direto Regime Geral,Aquisição de bens móveis,"48218000-9, Pacote de software para gestão de licenças","SPMS - Serviços Partilhados do Ministério da Saúde, E. P. E. (509540716)","Liferay, SL (B85341162)","261.562,50 €",08-05-2018,26-03-2018,365 dias,Portugal,"Artigo 24.º, n.º 1, alínea a) do Código dos Contratos Públicos",,,,,,Não aplicável.,Não aplicável.,FALSE
Aquisição de Equipamentos Wireless e Serviços Conexos,Ajuste Direto Regime Geral,Aquisição de bens móveis,"32420000-3, Equipamento de rede","SPMS - Serviços Partilhados do Ministério da Saúde, E. P. E. (509540716)","BPO - CONSULTING UNIPESSOAL, LDA. (508845815)","13.985,00 €",08-05-2018,12-03-2018,120 dias,Portugal,"Artigo 20.º, n.º 1, alínea a) do Código dos Contratos Públicos",,,,,,Não aplicável.,Não aplicável.,FALSE
Aquisição de serviços de manutenção de equipamentos ORACLE,Concurso público,Aquisição de serviços,"50300000-8, Serviços de reparação e manutenção e serviços conexos relacionados com computadores pessoais e com equipamento burótico, audiovisual e para telecomunicações","SPMS- Serviços Partilhados do M. da Saúde, E.P.E. (509540716)","NORMÁTICA, S.A. (501782230)","254.990,00 €",08-05-2018,27-03-2018,278 dias,Portugal,"Artigo 21.º, n.º 1, alínea b) do Código dos Contratos Públicos",,,,,,Não aplicável.,Não aplicável.,FALSE
Aquisição de circuito principal e outro de backup em tecnologia MPLS para interligação do SNS ao Ponto de Troca de Tráfego (PTT) da eSPap,Concurso público,Aquisição de serviços,"64210000-1, Serviços telefónicos e de transmissão de dados","SPMS - Serviços Partilhados do Ministério da Saúde, E. P. E. (509540716)","ONI - Telecom Infocomunicações, S.A. (504073206)","6.091,44 €",08-05-2018,17-04-2018,710 dias,Portugal,"Artigo 21.º, n.º 1, alínea b) do Código dos Contratos Públicos",,,,,,Não aplicável.,Não aplicável.,FALSE
Convite ao abrigo do acordo quadro - Aquisição de licenciamento para sistema de cybersegurança por via de DNS,Ao abrigo de acordo-quadro (art.º 259.º),Aquisição de bens móveis<br/>Aquisição de serviços,"48218000-9, Pacote de software para gestão de licenças","SPMS - Serviços Partilhados do Ministério da Saúde, E. P. E. (509540716)","AXIANSEU-DIGITAL SOLUTIONS,S.A. (500074372)","21.990,00 €",08-05-2018,22-12-2017,365 dias,Portugal,Artigo 259.º do Código dos Contratos Públicos,,,,,,610968,Acordo quadro de licenciamento de software e serviços conexos,FALSE
Convite ao abrigo do acordo quadro - Aquisição de serviços de apoio especializado para desenvolvimento de procedimentos de contratação pública - Lote 1 - Unidade Ministerial de Compras (UMC).,Ao abrigo de acordo-quadro (art.º 259.º),Aquisição de serviços,"79420000-4, Serviços relacionados com a gestão","SPMS- Serviços Partilhados do M. da Saúde, E.P.E. (509540716)",Deloitte Consultores SA (502310090),"189.050,40 €",08-05-2018,27-03-2018,630 dias,Portugal,Artigo 259.º do Código dos Contratos Públicos,,,,,,1950010,Acordo quadro para Prestação de Serviços de Consultadoria na área da Saúde e Segurança   às Instituições e Serviços do Serviço Nacional de Saúde,FALSE
Aquisição de serviços de apoio à elaboração de projetos no âmbito dos contratos públicos,Ajuste Direto Regime Geral,Aquisição de serviços,"79420000-4, Serviços relacionados com a gestão","SPMS- Serviços Partilhados do M. da Saúde, E.P.E. (509540716)","Randstad II - Prestação de Serviços, Lda. (503298999)","69.967,00 €",08-05-2018,05-03-2018,294 dias,Portugal,"Artigo 20.º, n.º 1, alínea a) do Código dos Contratos Públicos",,,,,,Não aplicável.,Não aplicável.,FALSE
"Aquisição de licenças de acesso à plataforma multicanal para elaboração e envio de newsletters, mass mailing para as entidades do Ministério da Saúde. ",Concurso público,Aquisição de bens móveis,"48218000-9, Pacote de software para gestão de licenças","SPMS- Serviços Partilhados do M. da Saúde, E.P.E. (509540716)","Miguel Gonçalves Unipessoal,  Lda (506305716)","65.400,00 €",08-05-2018,02-02-2018,365 dias,Portugal,Artigo 28.º do Código dos Contratos Públicos,,,,,,Não aplicável.,Não aplicável.,FALSE
Convite ao abrigo do acordo quadro - Aquisição de licenciamento OutSystem,Ao abrigo de acordo-quadro (art.º 259.º),Aquisição de bens móveis<br/>Aquisição de serviços,"48218000-9, Pacote de software para gestão de licenças","SPMS - Serviços Partilhados do Ministério da Saúde, E. P. E. (509540716)",NOESIS Portugal - Consultadoria em Sistemas Informáticos (505128985),"48.290,10 €",07-05-2018,02-04-2018,365 dias,Portugal,"Artigo 33.º, n.º 3 do Código dos Contratos Públicos",,,,,,610968,Acordo quadro de licenciamento de software e serviços conexos,FALSE
Aquisição de Serviço de migração para SClinico CSP de unidades da ARSCentro e ARSAlgave,Ajuste Direto Regime Geral,Aquisição de serviços,"72500000-0, Serviços relacionados com a informática","SPMS - Serviços Partilhados do Ministério da Saúde, E. P. E. (509540716)","Nimble Portal - Serviços e Consultoria  de Gestão, Lda. (510308759)","27.000,00 €",07-05-2018,20-02-2018,120 dias,Portugal,"Artigo 20.º, n.º 1, alínea a) do Código dos Contratos Públicos",,,,,,Não aplicável.,Não aplicável.,FALSE
Aquisição de Serviços de gestão e suporte - Lote 2 - sistemas da SPMS,Concurso público,Aquisição de serviços,"72500000-0, Serviços relacionados com a informática","SPMS - Serviços Partilhados do Ministério da Saúde, E. P. E. (509540716)","Winning Scientific Management, Ldª. (510098711)","108.979,20 €",07-05-2018,23-02-2018,540 dias,Portugal,"Artigo 21.º, n.º 1, alínea b) do Código dos Contratos Públicos",,,,,,Não aplicável.,Não aplicável.,FALSE
Aquisição de Serviços de manutenção corretiva e evolutiva do BAS e RNCCI,Concurso público,Aquisição de serviços,"72500000-0, Serviços relacionados com a informática","SPMS - Serviços Partilhados do Ministério da Saúde, E. P. E. (509540716)","Winning Scientific Management, Ldª. (510098711)","12.800,00 €",07-05-2018,23-02-2018,365 dias,Portugal,"Artigo 21.º, n.º 1, alínea b) do Código dos Contratos Públicos",,,,,,Não aplicável.,Não aplicável.,FALSE
Convite ao abrigo do acordo quadro  - Serviços de gestão e suporte - Lote 2 - sistemas da SPMS,Ao abrigo de acordo-quadro (art.º 259.º),Aquisição de serviços,"50312000-5, Manutenção e reparação de equipamento informático","SPMS - Serviços Partilhados do Ministério da Saúde, E. P. E. (509540716)","ITEN SOLUTIONS - SISTEMAS DE INFORMAÇÃO, S.A. (510728189)","72.403,50 €",07-05-2018,16-02-2018,365 dias,Portugal,Artigo 259.º do Código dos Contratos Públicos,,,,,,1950010,Acordo quadro para Prestação de Serviços de Consultadoria na área da Saúde e Segurança   às Instituições e Serviços do Serviço Nacional de Saúde,FALSE
Convite ao abrigo do acordo quadro  - Serviços de gestão e suporte - Lote 1 - interno ao utilizador,Ao abrigo de acordo-quadro (art.º 259.º),Aquisição de serviços,"50312000-5, Manutenção e reparação de equipamento informático","SPMS - Serviços Partilhados do Ministério da Saúde, E. P. E. (509540716)","Everis Portugal, S.A. (506204650)","84.944,64 €",07-05-2018,23-02-2018,365 dias,Portugal,Artigo 259.º do Código dos Contratos Públicos,,,,,,1950010,Acordo quadro para Prestação de Serviços de Consultadoria na área da Saúde e Segurança   às Instituições e Serviços do Serviço Nacional de Saúde,FALSE
Convite ao abrigo do acordo quadro - Aquisição de serviços de apoio à Direção de Planeamento e Desenvolvimento Organizacional,Ao abrigo de acordo-quadro (art.º 259.º),Aquisição de serviços,"79420000-4, Serviços relacionados com a gestão","SPMS - Serviços Partilhados do Ministério da Saúde, E. P. E. (509540716)",Deloitte Consultores SA (502310090),"65.049,60 €",07-05-2018,09-03-2018,710 dias,Portugal,Artigo 259.º do Código dos Contratos Públicos,,,,,,1950010,Acordo quadro para Prestação de Serviços de Consultadoria na área da Saúde e Segurança   às Instituições e Serviços do Serviço Nacional de Saúde,FALSE
Aquisição de Serviços de Vigilância nas Instalações da SPMS em Lisboa e no Porto,Ao abrigo de acordo-quadro (art.º 259.º),Aquisição de serviços,"79714000-2, Serviços de vigilância","SPMS - Serviços Partilhados do Ministério da Saúde, E. P. E. (SNCP) (509540716)",Ronsegur (507011724),"180.384,88 €",07-05-2018,04-04-2018,365 dias,Portugal,Artigo 259.º do Código dos Contratos Públicos,,,,,,613183,Acordo quadro para a prestação de serviços de vigilância e segurança,FALSE
Aquisição de equipamento informático - Lote 5 - Computadores Portáteis,Ao abrigo de acordo-quadro (art.º 259.º),Aquisição de bens móveis,"30213000-5, Computadores pessoais","SPMS- Serviços Partilhados do M. da Saúde, E.P.E. (509540716)",Basedois (501333401),"5.640,00 €",07-05-2018,06-02-2018,120 dias,Portugal,Artigo 259.º do Código dos Contratos Públicos,,,,,,1196657,Acordo Quadro para aquisição e aluguer operacional de equipamento informático,FALSE
Aquisição de equipamento informático - Lote 4 - Computadores Portáteis,Ao abrigo de acordo-quadro (art.º 259.º),Aquisição de bens móveis,"30213000-5, Computadores pessoais","SPMS- Serviços Partilhados do M. da Saúde, E.P.E. (509540716)",Basedois (501333401),"18.960,00 €",07-05-2018,06-02-2018,120 dias,Portugal,Artigo 259.º do Código dos Contratos Públicos,,,,,,1196657,Acordo Quadro para aquisição e aluguer operacional de equipamento informático,FALSE
Aquisição de equipamento informático - Lote 3 - Computadores Portáteis,Ao abrigo de acordo-quadro (art.º 259.º),Aquisição de bens móveis,"30213000-5, Computadores pessoais","SPMS- Serviços Partilhados do M. da Saúde, E.P.E. (509540716)",Basedois (501333401),"131.700,00 €",07-05-2018,22-02-2018,120 dias,Portugal,Artigo 259.º do Código dos Contratos Públicos,,,,,,1196657,Acordo Quadro para aquisição e aluguer operacional de equipamento informático,FALSE
Aquisição de equipamento informático - Lote 2 - Computadores Portáteis,Ao abrigo de acordo-quadro (art.º 259.º),Aquisição de bens móveis,"30213000-5, Computadores pessoais","SPMS- Serviços Partilhados do M. da Saúde, E.P.E. (509540716)",Basedois (501333401),"86.424,00 €",07-05-2018,06-02-2018,120 dias,Portugal,Artigo 259.º do Código dos Contratos Públicos,,,,,,1196657,Acordo Quadro para aquisição e aluguer operacional de equipamento informático,FALSE
Aquisição de equipamento informático - Lote 1 - Computadores de Secretária,Ao abrigo de acordo-quadro (art.º 259.º),Aquisição de bens móveis,"30213000-5, Computadores pessoais","SPMS- Serviços Partilhados do M. da Saúde, E.P.E. (509540716)",Basedois (501333401),"34.080,00 €",07-05-2018,22-02-2018,120 dias,Portugal,Artigo 259.º do Código dos Contratos Públicos,,,,,,1196657,Acordo Quadro para aquisição e aluguer operacional de equipamento informático,FALSE
Aquisição de serviços de housing para diversos sítios institucionais com Disaster Recovery,Ajuste Direto Regime Geral,Aquisição de serviços,"72514000-1, Serviços de gestão de instalações informáticas","SPMS - Serviços Partilhados do Ministério da Saúde, E. P. E. (509540716)","Curiosity Waves Unipessoal, Lda (513563440)","58.080,00 €",07-05-2018,01-02-2018,697 dias,Portugal,"Artigo 20.º, n.º 1, alínea a) do Código dos Contratos Públicos",,,,,,Não aplicável.,Não aplicável.,FALSE
Aquisição de Serviços de manutenção dos equipamento de videoconferência,Concurso público,Aquisição de serviços,"50312000-5, Manutenção e reparação de equipamento informático","SPMS - Serviços Partilhados do Ministério da Saúde, E. P. E. (509540716)","IP Wire - Tecnologias para comunicações, Lda (513603107)","11.000,00 €",07-05-2018,23-02-2018,365 dias,Portugal,"Artigo 21.º, n.º 1, alínea b) do Código dos Contratos Públicos",,,,,,Não aplicável.,Não aplicável.,FALSE
Aquisição de serviços de desenvolvimento de API de integração na framework do PNB,Concurso público,Aquisição de serviços,"72212100-0, Serviços de desenvolvimento de software para sectores específicos","SPMS - Serviços Partilhados do Ministério da Saúde, E. P. E. (509540716)","OPTIMIZER – SERVIÇOS E CONSULTADORIA INFORMÁTICA, LDA. (504775936)","71.174,40 €",07-05-2018,19-03-2018,540 dias,Portugal,"Artigo 21.º, n.º 1, alínea b) do Código dos Contratos Públicos",,,,,,Não aplicável.,Não aplicável.,FALSE
