freguesia,acronym,validVotesPercentage,votes,dicofre
Arcozelo,PPD/PSD.CDS-PP,34.29,1475,131701
Arcozelo,PS,30.4,1308,131701
Arcozelo,MPT,10.41,448,131701
Arcozelo,PCP-PEV,9.86,424,131701
Arcozelo,B.E.,5.07,218,131701
Arcozelo,L,2.67,115,131701
Arcozelo,PAN,2.19,94,131701
Arcozelo,PCTP/MRPP,1.91,82,131701
Arcozelo,PTP,0.7,30,131701
Arcozelo,PND,0.58,25,131701
Arcozelo,PPM,0.56,24,131701
Arcozelo,PPV,0.44,19,131701
Arcozelo,PNR,0.4,17,131701
Arcozelo,MAS,0.23,10,131701
Arcozelo,PDA,0.16,7,131701
Arcozelo,POUS,0.14,6,131701
