freguesia,acronym,validVotesPercentage,votes,dicofre
Borba (Matriz),PS,41.21,476,070301
Borba (Matriz),PCP-PEV,26.23,303,070301
Borba (Matriz),PPD/PSD.CDS-PP,16.62,192,070301
Borba (Matriz),MPT,4.42,51,070301
Borba (Matriz),B.E.,3.46,40,070301
Borba (Matriz),PCTP/MRPP,3.46,40,070301
Borba (Matriz),L,0.95,11,070301
Borba (Matriz),PTP,0.87,10,070301
Borba (Matriz),PAN,0.69,8,070301
Borba (Matriz),PNR,0.69,8,070301
Borba (Matriz),PND,0.43,5,070301
Borba (Matriz),MAS,0.26,3,070301
Borba (Matriz),PPM,0.26,3,070301
Borba (Matriz),POUS,0.17,2,070301
Borba (Matriz),PPV,0.17,2,070301
Borba (Matriz),PDA,0.09,1,070301
