Objeto do Contrato,Tipo de Procedimento,Tipo(s) de Contrato,CPVs,Entidade(s) Adjudicante(s),Entidade(s) Adjudicatária(s),Preço Contratual,Data de Publicação,Data de Celebração do Contrato,Prazo de Execução,Local de Execução,Fundamentação,Data de Fecho do Contrato,Preço Total Efetivo,Causas das Alterações ao Prazo,Causas das Alterações ao Preço,Estado,N.º registo do Acordo Quadro,Descrição do Acordo Quadro,Procedimento Centralizado
Aquisição de 2500 licenças de software   Symantec Protection,Ao abrigo de acordo-quadro (art.º 259.º),Aquisição de bens móveis,"48761000-0, Pacote de software antivírus","Administração Regional de Saúde do Norte, I.P. (503135593)",Fujitsu Technology Solutions. Lda. (500646791),"11.500,00 €",02-11-2012,18-04-2012,365 dias,"Portugal, Aveiro, Arouca<BR/>Portugal, Braga, Braga<BR/>Portugal, Porto, Póvoa de Varzim<BR/>Portugal, Vila Real, Vila Real<BR/>Portugal, Porto, Porto<BR/>Portugal, Porto, Vila Nova de Gaia",Artigo 259.º do Código dos Contratos Públicos,04-06-2012,"11.500,00 €",,,,Não definido.,Não definido.,
Aquisição de 57 Impressoras  Laserjet P2055DN,Ao abrigo de acordo-quadro (art.º 259.º),Aquisição de bens móveis,"30232110-8, Impressoras laser","Administração Regional de Saúde do Norte, I.P. (503135593)",Companhia Portuguesa de Computadores Informática e Sistemas (501267255),"11.782,47 €",02-11-2012,18-07-2011,15 dias,"Portugal, Porto, Baião",Artigo 259.º do Código dos Contratos Públicos,05-08-2011,"11.782,47 €",,,,Não definido.,Não definido.,
Aquisuição de 20 Impressoras pessoais laser,Ao abrigo de acordo-quadro (art.º 259.º),Aquisição de bens móveis,"30232110-8, Impressoras laser","Administração Regional de Saúde do Norte, I.P. (503135593)","Companhia Portuguesa de Computadores Informática e Sistemas, S.A. (501267255)","4.134,20 €",02-11-2012,15-09-2011,61 dias,"Portugal, Braga, Vila Nova de Famalicão",Artigo 259.º do Código dos Contratos Públicos,16-11-2011,"4.134,20 €",,,,Não definido.,Não definido.,
1500 Impressoras HP Laserjet P2055DN,Ao abrigo de acordo-quadro (art.º 259.º),Aquisição de bens móveis,"30232110-8, Impressoras laser","Administração Regional de Saúde do Norte, I.P. (503135593)",Companhia Portuguesa de Computadores Informática e Sistemas SA (501267255),"310.065,00 €",02-11-2012,27-07-2011,183 dias,"Portugal, Vila Real, Vila Real<BR/>Portugal, Porto, Gondomar<BR/>Portugal, Aveiro, Arouca<BR/>Portugal, Porto, Valongo<BR/>Portugal, Braga, Braga<BR/>Portugal, Porto, Maia<BR/>Portugal, Porto, Póvoa de Varzim<BR/>Portugal, Aveiro, Aveiro",Artigo 259.º do Código dos Contratos Públicos,31-01-2012,"310.065,00 €",,,,Não definido.,Não definido.,
Aquisição de 20 Impressoras Laser a Cores,Ao abrigo de acordo-quadro (art.º 259.º),Aquisição de bens móveis,"30232110-8, Impressoras laser","Administração Regional de Saúde do Norte, I.P. (503135593)",Beltão Coelho (505317087),"8.456,00 €",02-11-2012,12-06-2012,15 dias,"Portugal, Porto, Porto",Artigo 259.º do Código dos Contratos Públicos,12-06-2012,"8.456,00 €",,,,Não definido.,Não definido.,
Aquisição de 63  Impressoras Laser individuais,Ao abrigo de acordo-quadro (art.º 259.º),Aquisição de bens móveis,"30232110-8, Impressoras laser","Administração Regional de Saúde do Norte, I.P. (503135593)","Cpmpanhia Portuguesa de Computadores e Sistemas, S.A. (501267255)","13.022,73 €",02-11-2012,18-07-2011,30 dias,"Portugal, Porto, Porto",Artigo 259.º do Código dos Contratos Públicos,05-08-2011,"13.022,73 €",,,,Não definido.,Não definido.,
