Objeto do Contrato,Tipo de Procedimento,Tipo(s) de Contrato,CPVs,Entidade(s) Adjudicante(s),Entidade(s) Adjudicatária(s),Preço Contratual,Data de Publicação,Data de Celebração do Contrato,Prazo de Execução,Local de Execução,Fundamentação,Data de Fecho do Contrato,Preço Total Efetivo,Causas das Alterações ao Prazo,Causas das Alterações ao Preço,Estado,N.º registo do Acordo Quadro,Descrição do Acordo Quadro,Procedimento Centralizado
ad1294-2014-Aquisição  de medicamentos Asparaginase peguilada 750 ml,Ajuste Direto Regime Geral,Aquisição de bens móveis,"33690000-3, Medicamentos vários","Instituto Português de Oncologia de Lisboa Francisco Gentil, E. P. E. (506361616)","ALLOGA PORTUGAL ATMAZENAGEM E DISTRIBUIÇÃO FARMACEUTICA, LDA (504507230)","52.000,00 €",09-10-2014,07-08-2014,2 dias,"Portugal, Lisboa, Lisboa","Artigo 20.º, n.º 1, alínea a) do Código dos Contratos Públicos","","",,,,Não aplicável.,Não aplicável.,FALSE
AD2153-2014-Aquisição medicamentos levetiracetam 500 mg sol inj,Ajuste Direto Regime Geral,Aquisição de bens móveis,"33690000-3, Medicamentos vários","Instituto Português de Oncologia de Lisboa Francisco Gentil, E. P. E. (506361616)","GENERIS-FARMACEUTICA, SA (508107997)","10.950,00 €",08-10-2014,10-09-2014,1 dias,"Portugal, Lisboa, Lisboa","Artigo 24.º, n.º 1, alínea e) do Código dos Contratos Públicos","","",,,,Não aplicável.,Não aplicável.,FALSE
"AD1970-2014TIROTROFINA ALFA 0,9 MG INJ-",Ajuste Direto Regime Geral,Aquisição de bens móveis,"33690000-3, Medicamentos vários","Instituto Português de Oncologia de Lisboa Francisco Gentil, E. P. E. (506361616)","SANOFI-PRODUTOS FARMACÊUTICOS, LDA (500134960)","148.143,00 €",02-10-2014,07-08-2014,5 dias,"Portugal, Lisboa, Lisboa","Artigo 24.º, n.º 1, alínea e) do Código dos Contratos Públicos","","",,,,Não aplicável.,Não aplicável.,FALSE
AD2346-fFACT VIII COAGUL SANGUI 500 UI ( IV) ANTI-HEMOFILICO,Ajuste Direto Regime Geral,Aquisição de bens móveis,"33690000-3, Medicamentos vários","Instituto Português de Oncologia de Lisboa Francisco Gentil, E. P. E. (506361616)","OCTAPHARMA-PRODUTOS FARMACEUTICOS, LDA (502820780)","5.202,48 €",02-10-2014,23-09-2014,2 dias,"Portugal, Lisboa, Lisboa","Artigo 20.º, n.º 1, alínea a) do Código dos Contratos Públicos",23-09-2014,"5.202,48 €",,,,Não aplicável.,Não aplicável.,FALSE
