Objeto do Contrato,Tipo de Procedimento,Tipo(s) de Contrato,CPVs,Entidade(s) Adjudicante(s),Entidade(s) Adjudicatária(s),Preço Contratual,Data de Publicação,Data de Celebração do Contrato,Prazo de Execução,Local de Execução,Fundamentação,Data de Fecho do Contrato,Preço Total Efetivo,Causas das Alterações ao Prazo,Causas das Alterações ao Preço,Estado,N.º registo do Acordo Quadro,Descrição do Acordo Quadro,Procedimento Centralizado
"Lidocaína 25 mg/g (2,5%)+ Prilocaína 25 mg/g (2,5%) Pens impreg",Ao abrigo de acordo-quadro (art.º 258.º),Aquisição de bens móveis,"33600000-6, Produtos farmacêuticos",Instituto de Oftalmologia do Dr. Gama Pinto (600000052),"ASTRAZENECA PRODUTOS FARMACEUTICOS, LDA (502942240)","59,60 €",08-03-2018,08-03-2018,60 dias,"Portugal, Lisboa, Lisboa",Artigo 258.º do Código dos Contratos Públicos,29-03-2018,"59,60 €",,"",,2850371,"CP 2017/51 - Acordo Quadro para fornecimento de Medicamentos usados nas afeções cutâneas, às Instituições e Serviços do Serviço Nacional de Saúde",FALSE
Glicopirrolato 0.2 mg/ml Sol inj,Ajuste Direto Regime Geral,Aquisição de bens móveis,"33600000-6, Produtos farmacêuticos",Instituto de Oftalmologia do Dr. Gama Pinto (600000052),"IDIS  WORLD  MEDICINES, LDA (700513982)","23,00 €",08-03-2018,08-03-2018,300 dias,"Portugal, Lisboa, Lisboa","Artigo 24.º, n.º 1, alínea e) do Código dos Contratos Públicos",27-12-2018,"",,"Artigo não foi fornecido atempadamente. Primeiro esteve em rutura no fornecedor e posteriormente porque o fornecedor exigia um valor mínimo de € 50,00 o que significa que o preço unitário passava de € 4,60 para € 10,00 por ampola.",,Não aplicável.,Não aplicável.,FALSE
Aminofilina 240 mg/10 ml Sol inj  IV,Ajuste Direto Regime Geral,Aquisição de bens móveis,"33600000-6, Produtos farmacêuticos",Instituto de Oftalmologia do Dr. Gama Pinto (600000052),"B BRAUN MEDICAL, LDA (501506543)","7,20 €",08-03-2018,08-03-2018,30 dias,"Portugal, Lisboa, Lisboa","Artigo 21.º, n.º 1, alínea c) do Código dos Contratos Públicos",12-03-2018,"7,20 €",,"",,Não aplicável.,Não aplicável.,FALSE
HEXAFLUORETO DE ENXOFRE (SF6) MONODOSES,Ajuste Direto Regime Geral,Aquisição de bens móveis,"33600000-6, Produtos farmacêuticos",Instituto de Oftalmologia do Dr. Gama Pinto (600000052),Oftaldata (504887459),"130,00 €",08-03-2018,08-03-2018,60 dias,"Portugal, Lisboa, Lisboa","Artigo 21.º, n.º 1, alínea c) do Código dos Contratos Públicos",22-03-2018,"130,00 €",,"",,Não aplicável.,Não aplicável.,FALSE
"Droperidol 2,5 mg/ 1 ml Sol inj  IM, IV",Ao abrigo de acordo-quadro (art.º 258.º),Aquisição de bens móveis,"33600000-6, Produtos farmacêuticos",Instituto de Oftalmologia do Dr. Gama Pinto (600000052),"OVERPHARMA,LDA. (505792362)","40,00 €",08-03-2018,08-03-2018,60 dias,"Portugal, Lisboa, Lisboa",Artigo 258.º do Código dos Contratos Públicos,12-03-2018,"40,00 €",,"",,2356543,CP 2016/19 - Medicamentos Antipsicóticos,FALSE
"Hidroxipropimetilcelulose 2%, seringa 1 a 2 ml",Ajuste Direto Regime Geral,Aquisição de bens móveis,"33600000-6, Produtos farmacêuticos",Instituto de Oftalmologia do Dr. Gama Pinto (600000052),BAUSCH LOMB S A (980218764),"240,00 €",08-03-2018,08-03-2018,300 dias,"Portugal, Lisboa, Lisboa","Artigo 21.º, n.º 1, alínea c) do Código dos Contratos Públicos",20-12-2018,"240,00 €",,"",,Não aplicável.,Não aplicável.,FALSE
Óculos de Proteção c/ filtro,Ajuste Direto Regime Geral,Aquisição de bens móveis,"33140000-3, Material médico de consumo",Instituto de Oftalmologia Doutor Gama Pinto (IOGP) (600000052),NOVARTIS FARMACEUTICA (500063524),"522,40 €",07-03-2018,25-01-2018,340 dias,"Portugal, Lisboa, Lisboa","Artigo 24.º, n.º 1, alínea e) do Código dos Contratos Públicos",24-08-2018,"522,40 €",,"",,Não aplicável.,Não aplicável.,FALSE
Protecção de braços e Coberturas de Mayo,Ao abrigo de acordo-quadro (art.º 259.º),Aquisição de bens móveis,"33600000-6, Produtos farmacêuticos",Instituto de Oftalmologia do Dr. Gama Pinto (600000052),"MEDLINE INTERNATIONAL UNIPESSOAL, LDA (510533515)","824,80 €",01-03-2018,22-02-2018,311 dias,"Portugal, Lisboa, Lisboa",Artigo 259.º do Código dos Contratos Públicos,24-08-2018,"824,80 €",,"",,2497267,CP 2016/83 - Acordo Quadro para fornecimento de Proteções e coberturas de equipamentos às Instituições e Serviços do Serviço Nacional de Saúde,FALSE
Tubo Endotraqueal,Concurso público,Aquisição de bens móveis,"33140000-3, Material médico de consumo",Instituto de Oftalmologia do Dr. Gama Pinto (600000052),"TELEFLEX MEDICAL, SAU (EX-ARROW IBÉRICA,  SA) (980249783)","28,30 €",01-03-2018,22-02-2018,311 dias,"Portugal, Lisboa, Lisboa","Artigo 20.º, n.º 1, alínea b) do Código dos Contratos Públicos","","",,"",,Não aplicável.,Não aplicável.,FALSE
"Tubos, Bastonetes, Facas e Cânulas",Concurso público,Aquisição de bens móveis,"33140000-3, Material médico de consumo",Instituto de Oftalmologia do Dr. Gama Pinto (600000052),OVERPHARMA (505792362),"905,88 €",01-03-2018,22-02-2018,311 dias,"Portugal, Lisboa, Lisboa","Artigo 20.º, n.º 1, alínea b) do Código dos Contratos Públicos",08-01-2019,"905,88 €",,"",,Não aplicável.,Não aplicável.,FALSE
Cautérios de baixa temperatura,Concurso público,Aquisição de bens móveis,"33140000-3, Material médico de consumo",Instituto de Oftalmologia do Dr. Gama Pinto (600000052),Oftaldata (504887459),"434,00 €",01-03-2018,22-02-2018,311 dias,"Portugal, Lisboa, Lisboa","Artigo 20.º, n.º 1, alínea b) do Código dos Contratos Públicos",24-08-2018,"434,00 €",,"",,Não aplicável.,Não aplicável.,FALSE
Tubo Aspiração Liso,Concurso público,Aquisição de bens móveis,"33140000-3, Material médico de consumo",Instituto de Oftalmologia do Dr. Gama Pinto (600000052),"MEDTRONIC PORTUGAL, LDA. (504223933)","30,00 €",01-03-2018,22-02-2018,311 dias,"Portugal, Lisboa, Lisboa","Artigo 20.º, n.º 1, alínea b) do Código dos Contratos Públicos",24-08-2018,"30,00 €",,"",,Não aplicável.,Não aplicável.,FALSE
Caneta Demográfica,Concurso público,Aquisição de bens móveis,"33140000-3, Material médico de consumo",Instituto de Oftalmologia do Dr. Gama Pinto (600000052),"JMV PRODUTOS HOSPITALARES, LDA (501887148)","45,00 €",01-03-2018,22-02-2018,311 dias,"Portugal, Lisboa, Lisboa","Artigo 20.º, n.º 1, alínea b) do Código dos Contratos Públicos",24-08-2018,"45,00 €",,"",,Não aplicável.,Não aplicável.,FALSE
Sondas de Aspiração,Concurso público,Aquisição de bens móveis,"33140000-3, Material médico de consumo",Instituto de Oftalmologia do Dr. Gama Pinto (600000052),"ANASTACIO SALDANHA UNIPESSOAL, LDA. (505804441)","20,00 €",01-03-2018,22-02-2018,311 dias,"Portugal, Lisboa, Lisboa","Artigo 20.º, n.º 1, alínea b) do Código dos Contratos Públicos",14-11-2018,"20,00 €",,"",,Não aplicável.,Não aplicável.,FALSE
Suturas e Seringas Opacas,Concurso público,Aquisição de bens móveis,"33141100-1, Pensos; clipes, suturas, ligaduras",Instituto de Oftalmologia do Dr. Gama Pinto (600000052),"B. BRAUN MEDICAL, LDA (501506543)","4.024,73 €",01-03-2018,22-02-2018,311 dias,"Portugal, Lisboa, Lisboa","Artigo 20.º, n.º 1, alínea b) do Código dos Contratos Públicos",11-12-2018,"3.772,95 €",,Diferença na quantidade das caixas.,,Não aplicável.,Não aplicável.,FALSE
Penso Ocular e Cânula Nasal,Concurso público,Aquisição de bens móveis,"33140000-3, Material médico de consumo",Instituto de Oftalmologia do Dr. Gama Pinto (600000052),"Docworld, Lda (508592909)","65,14 €",01-03-2018,22-02-2018,311 dias,"Portugal, Lisboa, Lisboa","Artigo 20.º, n.º 1, alínea b) do Código dos Contratos Públicos",21-12-2018,"65,14 €",,"",,Não aplicável.,Não aplicável.,FALSE
Adesivo Hipoalérgico,Concurso público,Aquisição de bens móveis,"33140000-3, Material médico de consumo",Instituto de Oftalmologia do Dr. Gama Pinto (600000052),"3M ESPAÑA, S.L., SUCURSAL EM PORTUGAL (980560241)","60,00 €",01-03-2018,22-02-2018,311 dias,"Portugal, Lisboa, Lisboa","Artigo 20.º, n.º 1, alínea b) do Código dos Contratos Públicos",24-08-2018,"60,00 €",,"",,Não aplicável.,Não aplicável.,FALSE
