freguesia,acronym,validVotesPercentage,votes,dicofre
Santiago dos Velhos,PS,43.25,141,110204
Santiago dos Velhos,PPD/PSD.CDS-PP,21.17,69,110204
Santiago dos Velhos,PCP-PEV,12.58,41,110204
Santiago dos Velhos,MPT,7.67,25,110204
Santiago dos Velhos,B.E.,7.36,24,110204
Santiago dos Velhos,L,2.45,8,110204
Santiago dos Velhos,MAS,1.84,6,110204
Santiago dos Velhos,PAN,1.53,5,110204
Santiago dos Velhos,PCTP/MRPP,0.92,3,110204
Santiago dos Velhos,PPM,0.61,2,110204
Santiago dos Velhos,PND,0.31,1,110204
Santiago dos Velhos,PNR,0.31,1,110204
Santiago dos Velhos,PDA,0,0,110204
Santiago dos Velhos,POUS,0,0,110204
Santiago dos Velhos,PPV,0,0,110204
Santiago dos Velhos,PTP,0,0,110204
