Objeto do Contrato,Tipo de Procedimento,Tipo(s) de Contrato,CPVs,Entidade(s) Adjudicante(s),Entidade(s) Adjudicatária(s),Preço Contratual,Data de Publicação,Data de Celebração do Contrato,Prazo de Execução,Local de Execução,Fundamentação,Data de Fecho do Contrato,Preço Total Efetivo,Causas das Alterações ao Prazo,Causas das Alterações ao Preço,Estado,N.º registo do Acordo Quadro,Descrição do Acordo Quadro,Procedimento Centralizado
"Concepção da arquitectura de informação, web design, desenvolvimento e instalação do portal de Internet e Intranet da ERS com base numa solução de gestão de conteúdos.",Ajuste Direto Regime Geral,Aquisição de serviços,"72212220-7, Serviços de desenvolvimento de software para Internet e intranet<BR/>72212224-5, Serviços de desenvolvimento de software para edição de páginas Web",Entidade Reguladora da Saúde (507021266),"Wire Maze - Sistemas de Informação, S.A. (505331187)","26.524,25 €",20-12-2011,03-10-2011,87 dias,"Portugal, Porto, Porto","Artigo 20.º, n.º 1, alínea a) do Código dos Contratos Públicos",04-01-2012,"26.524,25 €",,"",,Não aplicável.,Não aplicável.,
"a) Estudo de caracterização e diagnóstico das actuais condições de realização de cirurgia bariátrica em Portugal, com vista à emissão de recomendações e orientações conducentes à promoção da prestação de cuidados de saúde em observância das normas de qualidade vigentes, passíveis de assegurar a adequação de meios às necessidades dos utentes, e<br />b) Estudo que visa o levantamento das condições de realização de cirurgia plástica, reconstrutiva e estética em Portugal, procedimentos inerentes, qualidade de instalações e qualificação dos profissionais envolvidos, tendo por objecto a emissão de recomendações e orientações formativas e informativas, destinadas a alertar sobre a necessidade de observância dos níveis de qualidade legalmente estabelecidos em respeito pelos direitos dos utentes.",Ajuste Direto Regime Geral,Aquisição de serviços,"98113000-8, Serviços prestados por organizações especializadas",Entidade Reguladora da Saúde (507021266),Faculdade de Medicina da Universidade do Porto (501413197),"10.000,00 €",20-12-2011,12-10-2011,140 dias,"Portugal, Porto, Porto","Artigo 20.º, n.º 1, alínea a) do Código dos Contratos Públicos","","",,Não foi pago qualquer valor.,,Não aplicável.,Não aplicável.,
"Aquisição de serviços para a elaboração de um estudo para avaliação da qualidade dos serviços de medicina física e de reabilitação dos prestadores públicos, privados e sociais, nomeadamente no concerne ao cumprimento das boas práticas instituídas, segurança das instalações e da qualificação dos profissionais de saúde.",Ajuste Direto Regime Geral,Aquisição de serviços,"98113000-8, Serviços prestados por organizações especializadas",Entidade Reguladora da Saúde (507021266),Instituto de Ciências Biomédicas de Abel Salazar da Universidade do Porto (501413197),"5.000,00 €",20-12-2011,31-08-2011,140 dias,"Portugal, Porto, Porto","Artigo 20.º, n.º 1, alínea a) do Código dos Contratos Públicos","","",,Não foi pago qualquer valor,,Não aplicável.,Não aplicável.,
"a) Aquisição de duas fotocopiadoras multifunções (cópia, impressão e digitalização) com velocidade de impressão até 25 ppm a cores / 25 ppm a preto e branco;<br />b) Aquisição de uma fotocopiadora multifunções (cópia, impressão, digitalização e fax) com velocidade de impressão até 23 ppm a cores / 23 ppm a preto e branco.",Ajuste Direto Regime Geral,Aquisição de bens móveis,"30232110-8, Impressoras laser",Entidade Reguladora da Saúde (507021266),"Pamafe Informática, Lda. (504099388)","5.440,00 €",20-12-2011,09-12-2011,5 dias,"Portugal, Porto, Porto","Artigo 20.º, n.º 1, alínea a) do Código dos Contratos Públicos",30-12-2011,"5.440,00 €",,"",,Não aplicável.,Não aplicável.,
