freguesia,acronym,validVotesPercentage,votes,dicofre
Capela,PS,44.16,136,131106
Capela,PPD/PSD,30.52,94,131106
Capela,B.E.,10.06,31,131106
Capela,PAN,4.87,15,131106
Capela,CDS-PP,3.9,12,131106
Capela,PCP-PEV,1.62,5,131106
Capela,PDR,1.62,5,131106
Capela,L,1.3,4,131106
Capela,PPM.PPV/CDC,0.65,2,131106
Capela,A,0.32,1,131106
Capela,MAS,0.32,1,131106
Capela,PNR,0.32,1,131106
Capela,PTP,0.32,1,131106
Capela,IL,0,0,131106
Capela,NC,0,0,131106
Capela,PCTP/MRPP,0,0,131106
Capela,PURP,0,0,131106
