freguesia,acronym,validVotesPercentage,votes,dicofre
"União das freguesias de Freixeda do Torrão, Quintã de Pêro Martins e Penha de Águia",PS,45.45,85,090421
"União das freguesias de Freixeda do Torrão, Quintã de Pêro Martins e Penha de Águia",PPD/PSD.CDS-PP,36.36,68,090421
"União das freguesias de Freixeda do Torrão, Quintã de Pêro Martins e Penha de Águia",MPT,7.49,14,090421
"União das freguesias de Freixeda do Torrão, Quintã de Pêro Martins e Penha de Águia",PCP-PEV,2.67,5,090421
"União das freguesias de Freixeda do Torrão, Quintã de Pêro Martins e Penha de Águia",PND,2.14,4,090421
"União das freguesias de Freixeda do Torrão, Quintã de Pêro Martins e Penha de Águia",B.E.,1.6,3,090421
"União das freguesias de Freixeda do Torrão, Quintã de Pêro Martins e Penha de Águia",PCTP/MRPP,1.07,2,090421
"União das freguesias de Freixeda do Torrão, Quintã de Pêro Martins e Penha de Águia",PPM,1.07,2,090421
"União das freguesias de Freixeda do Torrão, Quintã de Pêro Martins e Penha de Águia",PPV,1.07,2,090421
"União das freguesias de Freixeda do Torrão, Quintã de Pêro Martins e Penha de Águia",PNR,0.53,1,090421
"União das freguesias de Freixeda do Torrão, Quintã de Pêro Martins e Penha de Águia",PTP,0.53,1,090421
"União das freguesias de Freixeda do Torrão, Quintã de Pêro Martins e Penha de Águia",L,0,0,090421
"União das freguesias de Freixeda do Torrão, Quintã de Pêro Martins e Penha de Águia",MAS,0,0,090421
"União das freguesias de Freixeda do Torrão, Quintã de Pêro Martins e Penha de Águia",PAN,0,0,090421
"União das freguesias de Freixeda do Torrão, Quintã de Pêro Martins e Penha de Águia",PDA,0,0,090421
"União das freguesias de Freixeda do Torrão, Quintã de Pêro Martins e Penha de Águia",POUS,0,0,090421
