Objeto do Contrato,Tipo de Procedimento,Tipo(s) de Contrato,CPVs,Entidade(s) Adjudicante(s),Entidade(s) Adjudicatária(s),Preço Contratual,Data de Publicação,Data de Celebração do Contrato,Prazo de Execução,Local de Execução,Fundamentação,Data de Fecho do Contrato,Preço Total Efetivo,Causas das Alterações ao Prazo,Causas das Alterações ao Preço,Estado,N.º registo do Acordo Quadro,Descrição do Acordo Quadro,Procedimento Centralizado
"Concurso Público Nº 2 - Limpeza / ISEG / 2009 - Prestação de serviços de limpeza das instalações do ISEG nos Edifícios do Quelhas, nº 2, 4, 6, Cantina Velha w Biblioteca das Francesinhas e Áreas Envolventes",Concurso público,Aquisição de serviços,"90919300-5, Serviços de limpeza de escolas",Instituto Superior de Economia e Gestão (502488603),"Bom Ambiente - Serviços de Limpeza, Lda (505073005)","87.036,37 €",19-09-2014,20-04-2010,365 dias,"Portugal, Lisboa, Lisboa","Artigo 20.º, n.º 1, alínea b) do Código dos Contratos Públicos",19-04-2011,"87.036,37 €","","",,Não aplicável.,Não aplicável.,FALSE
"Aquisição de serviços auxiliares de copa, cozinha e refeitorio para a Base do Lumiar no mês de setembro de 2013",Ajuste Direto Regime Geral,Aquisição de serviços,"55000000-0, Serviços de hotelaria, restauração e comércio a retalho",Estado Maior da Força Aérea (600010686),"BOM AMBIENTE - SERVIÇO DE LIMPEZA, LDA (505073005)","8.765,41 €",10-03-2014,21-08-2013,30 dias,"Portugal, Lisboa, Lisboa","Artigo 20.º, n.º 1, alínea a) do Código dos Contratos Públicos",30-09-2013,"8.765,41 €","","",,Não aplicável.,Não aplicável.,FALSE
"Serviço auxiliares de copa, cozinha, refeitorio para a Base do Lumiar no mês de Agosto de 2013",Ajuste Direto Regime Geral,Aquisição de serviços,"90000000-7, Serviços relativos a águas residuais, resíduos, limpeza e ambiente",Estado Maior da Força Aérea (600010686),"BOM AMBIENTE - SERVIÇOS DE LIMPEZA, LDA (505073005)","8.765,41 €",14-02-2014,08-08-2013,30 dias,"Portugal, Lisboa, Lisboa","Artigo 20.º, n.º 1, alínea a) do Código dos Contratos Públicos",31-08-2013,"8.765,41 €","","",,Não aplicável.,Não aplicável.,FALSE
"Serviço de auxiliares de copa, cozinha, refeitorio e da Lavandaria para a Base do Lumiar no mês de Março de 2013",Ajuste Direto Regime Geral,Aquisição de serviços,"90000000-7, Serviços relativos a águas residuais, resíduos, limpeza e ambiente",Estado Maior da Força Aérea (600010686),"BOM AMBIENTE - SERVIÇO DE LIMPEZA, LDA (505073005)","10.089,71 €",14-02-2014,13-03-2013,30 dias,"Portugal<BR/>Portugal, Lisboa, Lisboa","Artigo 20.º, n.º 1, alínea a) do Código dos Contratos Públicos",31-03-2013,"10.089,71 €","","",,Não aplicável.,Não aplicável.,FALSE
"Fornecimento de serviço de auxiliares copa, cozinha e lavandaria para o mês de Julho de 2013 para a Base do Lumiar",Ajuste Direto Regime Geral,Aquisição de serviços,"90000000-7, Serviços relativos a águas residuais, resíduos, limpeza e ambiente",Estado Maior da Força Aérea (600010686),"BOM AMBIENTE-SERVIÇOS DE LIMPEZA, LDA (505073005)","10.089,71 €",12-02-2014,17-07-2013,31 dias,"Portugal, Lisboa, Lisboa","Artigo 20.º, n.º 1, alínea a) do Código dos Contratos Públicos",31-07-2013,"10.089,71 €","","",,Não aplicável.,Não aplicável.,FALSE
Serviço de auxiliares de copa e cozinha e Lavandaria para a Base do Lumiar para o mês de abril de 2013,Ajuste Direto Regime Geral,Aquisição de serviços,"90000000-7, Serviços relativos a águas residuais, resíduos, limpeza e ambiente",Estado Maior da Força Aérea (600010686),"BOM AMBINETE - SERVIÇOS DE LIMPEZA, LDA (505073005)","10.089,71 €",06-02-2014,08-04-2013,30 dias,"Portugal, Lisboa, Lisboa","Artigo 20.º, n.º 1, alínea a) do Código dos Contratos Públicos",30-04-2013,"10.089,71 €","","",,Não aplicável.,Não aplicável.,FALSE
Serviço de auxiliares de copa e cozinha e Lavandaria para a Base do Lumiar para o mês de Maio de 2013,Ajuste Direto Regime Geral,Aquisição de serviços,"90000000-7, Serviços relativos a águas residuais, resíduos, limpeza e ambiente",Estado Maior da Força Aérea (600010686),BOM AMBIENTE-SERVIÇO DE LIMPEZA LDA (505073005),"10.089,71 €",06-02-2014,17-05-2013,31 dias,"Portugal, Lisboa, Lisboa","Artigo 20.º, n.º 1, alínea a) do Código dos Contratos Públicos",31-05-2013,"10.089,71 €","","",,Não aplicável.,Não aplicável.,FALSE
HFAR AD 1151301280,Ajuste Direto Regime Geral,Aquisição de serviços,"55000000-0, Serviços de hotelaria, restauração e comércio a retalho",Hospital das Forças Armadas (600085058),"Bom Ambiente - Serviços de Limpeza, lda (505073005)","49.855,04 €",29-10-2013,16-10-2013,120 dias,"Portugal, Lisboa, Lisboa","Artigo 20.º, n.º 1, alínea a) do Código dos Contratos Públicos","","","","",,Não aplicável.,Não aplicável.,
Concurso Público para a Aquisição de Serviços de Limpeza para o Parque de Campismo da Fundação INATEL,Concurso público,Aquisição de serviços,"90910000-9, Serviços de limpeza",Fundação INATEL (500122237),"Bom Ambiente - Serviços de Limpeza, Lda (505073005)","10.388,25 €",24-07-2013,28-06-2013,184 dias,"Portugal, Lisboa, Lisboa","Artigo 20.º, n.º 1, alínea b) do Código dos Contratos Públicos","","","","",,Não aplicável.,Não aplicável.,
Concurso Público para a aquisição de serviços de outsourcing de limpeza de quartos para a Unidade Hoteleira da Fundação INATEL em Oeiras,Concurso público,Aquisição de serviços,"90911100-7, Serviços de limpeza de alojamentos",Fundação INATEL (500122237),"BOM AMBIENTE - Serviços de Limpeza, Lda (505073005)","64.147,60 €",21-06-2013,01-04-2013,365 dias,"Portugal, Lisboa, Oeiras","Artigo 20.º, n.º 1, alínea b) do Código dos Contratos Públicos","","","","",,Não aplicável.,Não aplicável.,
"Serviço de auxiliares de copa, cozinha, refeitorio e de lavandaria para o mes de março",Ajuste Direto Regime Geral,Aquisição de serviços,"90910000-9, Serviços de limpeza",Estado Maior da Força Aérea (600010686),BOM AMBIENTE - Serviço de Limpeza (505073005),"10.089,71 €",13-03-2013,13-03-2013,31 dias,"Portugal, Lisboa, Lisboa","Artigo 20.º, n.º 1, alínea a) do Código dos Contratos Públicos","","","","",,Não aplicável.,Não aplicável.,
"Serviço de auxiliares de copa, cozinha, refeitorio e de lavandaria para a Base do Lumiar",Ajuste Direto Regime Geral,Aquisição de serviços,"90910000-9, Serviços de limpeza",Estado Maior da Força Aérea (600010686),BOM AMBIENTE Serviço de Limpeza (505073005),"10.089,71 €",13-03-2013,19-02-2013,28 dias,"Portugal, Lisboa, Lisboa","Artigo 20.º, n.º 1, alínea a) do Código dos Contratos Públicos",28-02-2013,"10.089,71 €","","",,Não aplicável.,Não aplicável.,
Concurso Público para a Aquisição de Serviços de Limpeza,Concurso público,Aquisição de serviços,"90910000-9, Serviços de limpeza",Fundação INATEL (500122237),"Bom Ambiente - Serviços de Limpeza, Lda (505073005)","51.988,07 €",05-03-2013,03-01-2013,365 dias,Portugal,"Artigo 20.º, n.º 1, alínea b) do Código dos Contratos Públicos","","","","",,Não aplicável.,Não aplicável.,
Prestação de serviços indiferenciados nas Messes do CFMTFA para o mês de janeiro de 2013,Ajuste Direto Regime Geral,Aquisição de serviços,"98390000-3, Outros serviços",Estado Maior da Força Aérea (600010686),"Bom Ambiente - Serviços de Limpeza, Lda. (505073005)","7.317,36 €",26-02-2013,04-02-2013,31 dias,"Portugal, Lisboa, Alenquer","Artigo 24.º, n.º 1, alínea e) do Código dos Contratos Públicos","","","","",,Não aplicável.,Não aplicável.,
Serviços diversos na Lavandaria do CFMTFA para o ano 2013,Ajuste Direto Regime Geral,Aquisição de serviços,"98310000-9, Serviços de lavagem e de limpeza a seco",Estado Maior da Força Aérea (600010686),"Bom Ambiente - Serviços de Limpeza, Lda. (505073005)","23.954,50 €",18-02-2013,14-02-2013,365 dias,"Portugal, Lisboa, Alenquer","Artigo 20.º, n.º 1, alínea a) do Código dos Contratos Públicos","","","","",,Não aplicável.,Não aplicável.,
Serviços auxiliares de copa cozinha refeitorio e lavandaria da Base do Lumiar para o mês de janeiro de 2013,Ajuste Direto Regime Geral,Aquisição de serviços,"55130000-0, Outros serviços de hotelaria",Estado Maior da Força Aérea (600010686),BOM AMBIENTE (505073005),"1.089,71 €",01-02-2013,31-12-2012,31 dias,"Portugal, Lisboa, Lisboa","Artigo 20.º, n.º 1, alínea a) do Código dos Contratos Públicos",31-01-2013,"10.089,71 €","",Valor correcto do contrato,,Não aplicável.,Não aplicável.,
Serviços de higiene e limpeza - ACES XVIII Oeste II - Oeste Sul,Ajuste Direto Regime Geral,Aquisição de serviços,"90910000-9, Serviços de limpeza","Administração Regional de Saúde de Lisboa e Vale do Tejo, I.P. (503148776)","Bom Ambiente, Lda (505073005)","2.001,91 €",13-12-2011,29-11-2011,30 dias,"Portugal, Lisboa, Sobral de Monte Agraço","Artigo 24.º, n.º 1, alínea e) do Código dos Contratos Públicos","","","","",,Não aplicável.,Não aplicável.,
Aquisição de serviços de higiene e limpeza - ACES II,Ajuste Direto Regime Geral,Aquisição de serviços,"90910000-9, Serviços de limpeza","Administração Regional de Saúde de Lisboa e Vale do Tejo, I.P. (503148776)","Bom Ambiente, Lda (505073005)","4.639,88 €",21-10-2011,11-10-2011,31 dias,"Portugal, Lisboa, Lisboa","Artigo 24.º, n.º 1, alínea e) do Código dos Contratos Públicos","","","","",,Não aplicável.,Não aplicável.,
Aquisição de serviços de higiene e limpeza - ACES XII,Ajuste Direto Regime Geral,Aquisição de serviços,"90910000-9, Serviços de limpeza","Administração Regional de Saúde de Lisboa e Vale do Tejo, I.P. (503148776)","Bom Ambiente, Lda (505073005)","11.293,97 €",21-10-2011,11-10-2011,31 dias,"Portugal, Lisboa, Vila Franca de Xira","Artigo 24.º, n.º 1, alínea e) do Código dos Contratos Públicos","","","","",,Não aplicável.,Não aplicável.,
Aquisição de serviços de higiene e limpeza - ACES XVII,Ajuste Direto Regime Geral,Aquisição de serviços,"90910000-9, Serviços de limpeza","Administração Regional de Saúde de Lisboa e Vale do Tejo, I.P. (503148776)","Bom Ambiente, Lda (505073005)","1.184,66 €",21-10-2011,11-10-2011,31 dias,"Portugal, Leiria, Bombarral","Artigo 24.º, n.º 1, alínea e) do Código dos Contratos Públicos","","","","",,Não aplicável.,Não aplicável.,
Aquisição de serviços de higiene e limpeza - ACES XIV,Ajuste Direto Regime Geral,Aquisição de serviços,"90910000-9, Serviços de limpeza","Administração Regional de Saúde de Lisboa e Vale do Tejo, I.P. (503148776)","Bom Ambiente, Lda (505073005)","2.530,00 €",21-10-2011,11-10-2011,31 dias,"Portugal, Setúbal, Setúbal","Artigo 24.º, n.º 1, alínea e) do Código dos Contratos Públicos","","","","",,Não aplicável.,Não aplicável.,
Aquisição de serviços de higiene e limpeza - ACES IV,Ajuste Direto Regime Geral,Aquisição de serviços,"90910000-9, Serviços de limpeza","Administração Regional de Saúde de Lisboa e Vale do Tejo, I.P. (503148776)",Bom Ambiente (505073005),"10.530,68 €",19-10-2011,12-10-2011,31 dias,"Portugal, Lisboa, Oeiras","Artigo 24.º, n.º 1, alínea e) do Código dos Contratos Públicos","","","","",,Não aplicável.,Não aplicável.,
Aquisição de serviços de higiene e limpeza - ACES XXI,Ajuste Direto Regime Geral,Aquisição de serviços,"90910000-9, Serviços de limpeza","Administração Regional de Saúde de Lisboa e Vale do Tejo, I.P. (503148776)",Bom Ambiente (505073005),"6.613,13 €",19-10-2011,12-10-2011,31 dias,"Portugal, Santarém","Artigo 24.º, n.º 1, alínea e) do Código dos Contratos Públicos","","","","",,Não aplicável.,Não aplicável.,
Aquisição de serviços de higiene e limpeza - ACES XVIII,Ajuste Direto Regime Geral,Aquisição de serviços,"90910000-9, Serviços de limpeza","Administração Regional de Saúde de Lisboa e Vale do Tejo, I.P. (503148776)",Bom Ambiente (505073005),"2.001,91 €",19-10-2011,12-10-2011,31 dias,"Portugal, Lisboa, Sobral de Monte Agraço","Artigo 24.º, n.º 1, alínea e) do Código dos Contratos Públicos","","","","",,Não aplicável.,Não aplicável.,
Aquisição de serviços de higiene e limpeza - ACES XI,Ajuste Direto Regime Geral,Aquisição de serviços,"90910000-9, Serviços de limpeza","Administração Regional de Saúde de Lisboa e Vale do Tejo, I.P. (503148776)",Bom Ambiente (505073005),"22.079,25 €",19-10-2011,12-10-2011,31 dias,"Portugal, Lisboa, Cascais","Artigo 24.º, n.º 1, alínea e) do Código dos Contratos Públicos","","","","",,Não aplicável.,Não aplicável.,
"Aquisição de serviços de higiene e limpeza - ACES XI Grande Lisboa - Cascais (UCSP Cascais, UCSP Alcabideche e UCSP S.J. Estoril).Periodo de 01/07/2011 a 30/09/2011.",Ajuste Direto Regime Geral,Aquisição de serviços,"98390000-3, Outros serviços","Administração Regional de Saúde de Lisboa e Vale do Tejo, I.P. (503148776)","BOM AMBIENTE - SERVIÇOS DE LIMPEZA, LDA. (505073005)","66.237,75 €",08-09-2011,26-07-2011,90 dias,"Portugal, Lisboa, Cascais","Artigo 24.º, n.º 1, alínea e) do Código dos Contratos Públicos","","","","",,Não aplicável.,Não aplicável.,
"Aquisição de serviços de higiene e limpeza - ACES XVIII Oeste II - Oeste Sul (C. S. Sobral Monte Agraço, Ext. Atendimento Complementar e Ext. Sapataria). Periodo de 01/07/2011 a 30/09/2011.",Ajuste Direto Regime Geral,Aquisição de serviços,"98390000-3, Outros serviços","Administração Regional de Saúde de Lisboa e Vale do Tejo, I.P. (503148776)","BOM AMBIENTE - SERVIÇOS DE LIMPEZA, LDA. (505073005)","6.005,73 €",08-09-2011,19-07-2011,90 dias,"Portugal, Lisboa, Sobral de Monte Agraço","Artigo 24.º, n.º 1, alínea e) do Código dos Contratos Públicos","","","","",,Não aplicável.,Não aplicável.,
"Aquisição de serviços de higiene e limpeza - ACES IV Grande Lisboa - Oeiras (C. S. Oeiras, Ext. Barcarena e Ext. Paço DArcos). Periodo de 01/07/2011 a 30/09/2011.",Ajuste Direto Regime Geral,Aquisição de serviços,"98390000-3, Outros serviços","Administração Regional de Saúde de Lisboa e Vale do Tejo, I.P. (503148776)","BOM AMBIENTE - SERVIÇOS DE LIMPEZA, LDA. (505073005)","31.592,04 €",08-09-2011,26-07-2011,90 dias,"Portugal, Lisboa, Oeiras","Artigo 24.º, n.º 1, alínea e) do Código dos Contratos Públicos","","","","",,Não aplicável.,Não aplicável.,
Aquisição de serviços de higiene e limpeza - ACES Oeste I - Oeste Norte (C. S. Bombarral). Periodo de 01/07/2011 a 30/09/2011.,Ajuste Direto Regime Geral,Aquisição de serviços,"98390000-3, Outros serviços","Administração Regional de Saúde de Lisboa e Vale do Tejo, I.P. (503148776)","BOM AMBIENTE - SERVIÇOS DE LIMPEZA, LDA. (505073005)","3.553,98 €",08-09-2011,28-07-2011,90 dias,"Portugal, Leiria, Bombarral","Artigo 24.º, n.º 1, alínea e) do Código dos Contratos Públicos","","","","",,Não aplicável.,Não aplicável.,
serviços de higiene e limpeza - ACES XIV Peninsula de Setubal II - Seixal/Sesimbra,Ajuste Direto Regime Geral,Aquisição de serviços,"90910000-9, Serviços de limpeza","Administração Regional de Saúde de Lisboa e Vale do Tejo, I.P. (503148776)","Bom Ambiente, Lda (505073005)","7.590,00 €",08-08-2011,26-07-2011,92 dias,"Portugal, Setúbal","Artigo 24.º, n.º 1, alínea e) do Código dos Contratos Públicos","","","","",,Não aplicável.,Não aplicável.,
Serviços de higiene e limpeza - ACES XXI Leziria I - Ribatejo,Ajuste Direto Regime Geral,Aquisição de serviços,"90910000-9, Serviços de limpeza","Administração Regional de Saúde de Lisboa e Vale do Tejo, I.P. (503148776)","Bom Ambiente, Lda (505073005)","19.839,39 €",08-08-2011,28-07-2011,92 dias,"Portugal, Santarém","Artigo 24.º, n.º 1, alínea e) do Código dos Contratos Públicos","","","","",,Não aplicável.,Não aplicável.,
Serviços de higiene e limpeza - ACES XII Grande Lisboa - Vila Franca de Xira,Ajuste Direto Regime Geral,Aquisição de serviços,"90910000-9, Serviços de limpeza","Administração Regional de Saúde de Lisboa e Vale do Tejo, I.P. (503148776)","Bom Ambiente, Lda (505073005)","33.881,91 €",08-08-2011,28-07-2011,92 dias,"Portugal, Lisboa, Vila Franca de Xira","Artigo 24.º, n.º 1, alínea e) do Código dos Contratos Públicos","","","","",,Não aplicável.,Não aplicável.,
Serviços de higiene e limpeza - ACES II Grande Lisboa - Lisboa Oriental,Ajuste Direto Regime Geral,Aquisição de serviços,"90910000-9, Serviços de limpeza","Administração Regional de Saúde de Lisboa e Vale do Tejo, I.P. (503148776)","Bom Ambiente, Lda (505073005)","13.919,64 €",08-08-2011,26-07-2011,92 dias,"Portugal, Lisboa, Lisboa","Artigo 24.º, n.º 1, alínea e) do Código dos Contratos Públicos","","","","",,Não aplicável.,Não aplicável.,
DS - SERVIÇO DE LIMPEZA DA DIRECÇÃO DE SAÚDE E DOS ÓRGÃOS SOB SUA DEPENDÊNCIA,Ajuste Direto Regime Geral,Aquisição de serviços,"90910000-9, Serviços de limpeza",Estado Maior da Força Aérea (600010686),"BOM AMBIENTE SERVIÇOS DE LIMPEZA, LDA. (505073005)","38.220,02 €",26-07-2011,13-05-2011,60 dias,"Portugal, Lisboa, Lisboa","Artigo 24.º, n.º 1, alínea e) do Código dos Contratos Públicos",21-06-2011,"38.220,02 €",PRAZO PASSOU PARA 50 DIAS EM VEZ DE 60 DIAS,"",,Não aplicável.,Não aplicável.,
Prestação de serviços de higiene e limpeza - ACES XIV Peninsula de Setúbal II - Seixal/Sesimbra (Ext. Corroios e Ext. Moinho da Maré),Ajuste Direto Regime Geral,Aquisição de serviços,"90910000-9, Serviços de limpeza","Administração Regional de Saúde de Lisboa e Vale do Tejo, I.P. (503148776)",Bom Ambiente (505073005),"2.530,00 €",15-07-2011,27-06-2011,30 dias,"Portugal, Setúbal, Setúbal","Artigo 24.º, n.º 1, alínea e) do Código dos Contratos Públicos","","","","",,Não aplicável.,Não aplicável.,
"Aquisição de serviços de higiene e limpeza - ACES XVIII Oeste II - Oeste Sul (CS Sobral Monte Agraço, Ext. Atendimento Complementar e Ext. Sapataria). Periodo de 03/01/2011 a 30/06/2011",Ajuste Direto Regime Geral,Aquisição de serviços,"90910000-9, Serviços de limpeza","Administração Regional de Saúde de Lisboa e Vale do Tejo, I.P. (503148776)","Bom Ambiente, Lda (505073005)","12.011,46 €",06-06-2011,18-05-2011,178 dias,"Portugal, Lisboa, Sobral de Monte Agraço","Artigo 24.º, n.º 1, alínea e) do Código dos Contratos Públicos","","","","",,Não aplicável.,Não aplicável.,
"Aquisição de serviços de higiene e limpeza - ACES II Grande Lisboa - Lisboa Oriental (Ext. Mónicas, Ext. alecrim, Ext. São Nicolau e Ext. Pneumologia). Periodo de 03/01/2011 a 30/06/2011",Ajuste Direto Regime Geral,Aquisição de serviços,"90910000-9, Serviços de limpeza","Administração Regional de Saúde de Lisboa e Vale do Tejo, I.P. (503148776)","Bom Ambiente, Lda (505073005)","27.839,28 €",06-06-2011,18-05-2011,178 dias,"Portugal, Lisboa, Lisboa","Artigo 24.º, n.º 1, alínea e) do Código dos Contratos Públicos","","","","",,Não aplicável.,Não aplicável.,
"Aquisição de serviços de higiene e limpeza - ACES XXI Leziria I - Ribatejo (CS Azambuja, Ext. Manique do Intendente, Ext. Aveiras e Ext. Alcoentre). Periodo de 03/01/2011 a 30/06/2011",Ajuste Direto Regime Geral,Aquisição de serviços,"90910000-9, Serviços de limpeza","Administração Regional de Saúde de Lisboa e Vale do Tejo, I.P. (503148776)","Bom Ambiente, Lda (505073005)","39.678,78 €",26-05-2011,18-05-2011,178 dias,"Portugal, Lisboa, Azambuja","Artigo 24.º, n.º 1, alínea e) do Código dos Contratos Públicos","","","","",,Não aplicável.,Não aplicável.,
Aquisição de serviços de higiene e limpeza - aCES Oeste I - Oeste Norte (CS Bombarral). Periodo de 03/01/2011 a 30/06/2011,Ajuste Direto Regime Geral,Aquisição de serviços,"90910000-9, Serviços de limpeza","Administração Regional de Saúde de Lisboa e Vale do Tejo, I.P. (503148776)","Bom Ambiente, Lda (505073005)","7.107,96 €",26-05-2011,18-05-2011,178 dias,"Portugal, Leiria, Bombarral","Artigo 24.º, n.º 1, alínea e) do Código dos Contratos Públicos","","","","",,Não aplicável.,Não aplicável.,
HFA - SERVIÇO LIMPEZA NA DIRECÇÃO DE SAÚDE E DOS ÓRGÃOS SOB SUA DEPENDÊNCIA,Ajuste Direto Regime Geral,Aquisição de serviços,"90910000-9, Serviços de limpeza",Estado Maior da Força Aérea (600010686),"BOM AMBIENTE SERVIÇOS LIMPEZA, LDA (505073005)","45.000,00 €",20-05-2011,12-04-2011,60 dias,"Portugal, Lisboa, Lisboa","Artigo 24.º, n.º 1, alínea e) do Código dos Contratos Públicos",30-04-2011,"45.000,00 €","","",,Não aplicável.,Não aplicável.,
"Aquisição de serviços de higiene e limpeza - ACES XII Grande Lisboa - Vila Franca de Xira (US Alverca do Ribatejo, Ext. Arcena e CS Alhandra). Periodo de 01/01/2011 a 30/06/2011",Ajuste Direto Regime Geral,Aquisição de serviços,"90910000-9, Serviços de limpeza","Administração Regional de Saúde de Lisboa e Vale do Tejo, I.P. (503148776)",Bom Ambiente (505073005),"67.763,82 €",20-05-2011,11-05-2011,178 dias,"Portugal, Lisboa, Lisboa","Artigo 24.º, n.º 1, alínea e) do Código dos Contratos Públicos","","","","",,Não aplicável.,Não aplicável.,
"Aquisição de serviços de higiene e limpeza - ACES IV Grande Lisboa - Oeiras (CS Oeiras, Ext. Barcarena e Ext. Paço dArcos). Periodo de 03/01/2011 a 30/06/2011.",Ajuste Direto Regime Geral,Aquisição de serviços,"90910000-9, Serviços de limpeza","Administração Regional de Saúde de Lisboa e Vale do Tejo, I.P. (503148776)","Bom Ambiente, Lda (505073005)","63.184,08 €",12-05-2011,09-05-2011,178 dias,"Portugal, Lisboa, Oeiras","Artigo 24.º, n.º 1, alínea e) do Código dos Contratos Públicos","","","","",,Não aplicável.,Não aplicável.,
Aquisição de Serviços de Limpeza para o Parque de Jogos 1º de Maio,Ajuste Direto Regime Geral,Aquisição de serviços,"90910000-9, Serviços de limpeza",Fundação INATEL (500122237),"Bom Ambiente - Serviços de Limpeza, Lda (505073005)","37.990,00 €",04-04-2011,15-11-2010,60 dias,"Portugal, Lisboa, Lisboa","Artigo 20.º, n.º 1, alínea a) do Código dos Contratos Públicos","","","","",,Não aplicável.,Não aplicável.,
"BOM AMBIENTE - Serviços de Limpeza, Lda",Ajuste Direto Regime Geral,Aquisição de serviços,"90910000-9, Serviços de limpeza","Instituto do Emprego e Formação Profissional, I.P. (501442600)","BOM AMBIENTE - Serviços de Limpeza, Lda (505073005)","53.961,72 €",14-03-2011,17-02-2011,365 dias,"Portugal, Aveiro, Águeda","Artigo 27.º, n.º 1, alínea a) do Código dos Contratos Públicos","","","","",,Não aplicável.,Não aplicável.,
SERVIÇO DE LIMPEZA DA DIRECÇÃO DE SAÚDE E ORGÃOS SOB SUA DEPENDÊNCIA HFA,Ajuste Direto Regime Geral,Aquisição de serviços,"90911200-8, Serviços de limpeza de edifícios",Estado Maior da Força Aérea (600010686),"BOM AMBIENTE - SERVIÇOS DE LIMPEZA, LDA (505073005)","45.000,00 €",28-02-2011,14-02-2011,59 dias,"Portugal, Lisboa, Lisboa","Artigo 24.º, n.º 1, alínea e) do Código dos Contratos Públicos",31-12-2011,"45.000,00 €","","",,Não aplicável.,Não aplicável.,
"Aquisição de Serviços de limpeza do Centro de Formação Profissional de Beja, que abrange todos os espaços cobertos pertencentes a este Centro, para o ano de 2011.",Ajuste Direto Regime Geral,Aquisição de serviços,"90910000-9, Serviços de limpeza","Instituto do Emprego e Formação Profissional, I.P. (501442600)","Bom Ambiente - Serviços de Limpeza, Lda (505073005)","54.599,28 €",24-02-2011,13-01-2011,365 dias,"Portugal, Beja, Beja","Artigo 27.º, n.º 1, alínea a) do Código dos Contratos Públicos","","","","",,Não aplicável.,Não aplicável.,
"SERVIÇOS DE LIMPEZA NO PAVILHÃO, PISCINA, ESTÁDIO MUNICIPAL E ESPAÇO INTERNET",Ajuste Direto Regime Geral,Aquisição de serviços,"90911200-8, Serviços de limpeza de edifícios",Município do Bombarral (506800580),"BOM AMBIENTE - Serviço de Limpeza, Lda (505073005)","37.614,47 €",27-01-2011,22-01-2011,365 dias,"Portugal, Leiria, Bombarral","Artigo 20.º, n.º 1, alínea a) do Código dos Contratos Públicos","","","","",,Não aplicável.,Não aplicável.,
Aquisição de serviços de limpeza e higiene - ACES 2 Lisboa Oriental. Periodo de Janeiro a Dezembro de 2010.,Ajuste Direto Regime Geral,Aquisição de serviços,"90910000-9, Serviços de limpeza","Administração Regional de Saúde de Lisboa e Vale do Tejo, IP (503148776)","Bom Ambiente - Serviço de Limpeza, Lda (505073005)","56.065,80 €",14-10-2010,18-05-2010,365 dias,"Portugal, Lisboa, Lisboa","Artigo 24.º, n.º 1, alínea e) do Código dos Contratos Públicos","","","","",,Não aplicável.,Não aplicável.,
Aquisição de serviços de limpeza - C.S. Azambuja e Extensões.,Ajuste Direto Regime Geral,Aquisição de serviços,"90910000-9, Serviços de limpeza","Administração Regional de Saúde de Lisboa e Vale do Tejo, IP (503148776)","Bom Ambiente, Lda (505073005)","88.174,80 €",21-05-2010,11-05-2010,365 dias,"Portugal, Lisboa, Azambuja","Artigo 24.º, n.º 1, alínea e) do Código dos Contratos Públicos","","","","",,Não aplicável.,Não aplicável.,
Prestação de serviços de limpeza - C.S. Oeiras e Extensões.,Ajuste Direto Regime Geral,Aquisição de serviços,"90910000-9, Serviços de limpeza","Administração Regional de Saúde de Lisboa e Vale do Tejo, IP (503148776)","Bom Ambiente, Lda (505073005)","140.409,00 €",20-05-2010,13-04-2010,365 dias,"Portugal, Lisboa, Oeiras","Artigo 24.º, n.º 1, alínea e) do Código dos Contratos Públicos","","","","",,Não aplicável.,Não aplicável.,
Prestação de serviços de limpeza - C.S. Alhandra.,Ajuste Direto Regime Geral,Aquisição de serviços,"90910000-9, Serviços de limpeza","Administração Regional de Saúde de Lisboa e Vale do Tejo, IP (503148776)","Bom Ambiente, Lda (505073005)","87.319,92 €",20-05-2010,13-04-2010,365 dias,"Portugal, Lisboa, Vila Franca de Xira","Artigo 24.º, n.º 1, alínea e) do Código dos Contratos Públicos","","","","",,Não aplicável.,Não aplicável.,
Aquisição de Serviços de Limpeza para as Instalações do Parque de Jogos 1º de Maio,Ajuste Direto Regime Geral,Aquisição de serviços,"90910000-9, Serviços de limpeza",Fundação INATEL (500122237),"Bom Ambiente - Serviço de Limpeza, Ldª (505073005)","148.426,78 €",18-01-2010,01-12-2009,365 dias,"Portugal, Lisboa, Lisboa","Artigo 20.º, n.º 1, alínea a) do Código dos Contratos Públicos","","","","",,Não aplicável.,Não aplicável.,
Aquisição de serviços de limpeza para o SAG da Extensão Paço DArcos.,Ajuste Direto Regime Geral,Aquisição de serviços,"90910000-9, Serviços de limpeza","Administração Regional de Saúde de Lisboa e Vale do Tejo, IP (503148776)","Bom Ambiente, Lda (505073005)","11.956,56 €",12-01-2010,28-09-2009,120 dias,"Portugal, Lisboa, Oeiras","Artigo 24.º, n.º 1, alínea c) do Código dos Contratos Públicos","","","","",,Não aplicável.,Não aplicável.,
"Prestação de serviços de higiene e limpeza do Centro de Saúde de Sobral de Monte Agraço e Extensões, de Janeiro a Setembro de 2009.",Ajuste Direto Regime Geral,Aquisição de serviços,"90910000-9, Serviços de limpeza","Administração Regional de Saúde de Lisboa e Vale do Tejo, IP (503148776)","Bom Ambiente - Serviços de Limpeza, Lda (505073005)","18.667,89 €",31-07-2009,09-06-2009,270 dias,"Portugal, Lisboa, Sobral de Monte Agraço","Artigo 24.º, n.º 1, alínea e) do Código dos Contratos Públicos","","","","",,Não aplicável.,Não aplicável.,
"Prestação de serviços de higiene e limpeza do Centro de Saúde de Alhandra e Extensões, de Janeiro a Dezembro de 2009.",Ajuste Direto Regime Geral,Aquisição de serviços,"90910000-9, Serviços de limpeza","Administração Regional de Saúde de Lisboa e Vale do Tejo, IP (503148776)","Bom Ambiente - Serviços de Limpeza, Lda (505073005)","65.489,94 €",31-07-2009,09-06-2009,270 dias,"Portugal, Lisboa, Vila Franca de Xira","Artigo 24.º, n.º 1, alínea e) do Código dos Contratos Públicos","","","","",,Não aplicável.,Não aplicável.,
"Prestação de serviços de higiene e limpeza no Centro de Saúde de Oeiras e Extensões, de Janeiro a Setembro de 2009.",Ajuste Direto Regime Geral,Aquisição de serviços,"90910000-9, Serviços de limpeza","Administração Regional de Saúde de Lisboa e Vale do Tejo, IP (503148776)","Bom Ambiente - Serviços de Limpeza, Lda (505073005)","105.306,75 €",31-07-2009,09-06-2009,270 dias,"Portugal, Lisboa, Oeiras","Artigo 24.º, n.º 1, alínea e) do Código dos Contratos Públicos","","","","",,Não aplicável.,Não aplicável.,
"Prestação de serviços de higiene e limpeza no Centro de Saúde de Azambuja e Extensões, de Janeiro a Setembro de 2009.",Ajuste Direto Regime Geral,Aquisição de serviços,"90910000-9, Serviços de limpeza","Administração Regional de Saúde de Lisboa e Vale do Tejo, IP (503148776)","Bom Ambiente - Serviços de Limpeza, Lda (505073005)","66.131,19 €",31-07-2009,09-06-2009,270 dias,"Portugal, Lisboa, Azambuja","Artigo 24.º, n.º 1, alínea e) do Código dos Contratos Públicos","","","","",,Não aplicável.,Não aplicável.,
Serviços de Limpeza no Centro de Saúde do Bombarral.,Ajuste Direto Regime Geral,"","","Administração Regional de Saúde de Lisboa e Vale do Tejo, IP (503148776)","Bom Ambiente – Serviços de Limpeza, Ldª (505073005)","5.128,12 €",09-06-2009,"",136 dias,"Portugal, Leiria, Bombarral","Artigo 20.º, n.º 1, alínea a) do Código dos Contratos Públicos","","","","",,Não aplicável.,Não aplicável.,
"Serviço suplementar de limpeza, por motivo de surto de gripe",Ajuste Direto Regime Geral,"","","Administração Regional de Saúde de Lisboa e Vale do Tejo, IP (503148776)","Bom Ambiente – Serviços de Limpeza, Ldª (505073005)","63,60 €",02-06-2009,"",1 dias,"",Alínea e) do nº 1 do artº 24º do Decreto-Lei 18/2008.,"","","","",,Não aplicável.,Não aplicável.,
