freguesia,acronym,validVotesPercentage,votes,dicofre
Oliveira do Douro,PS,57.48,196,180410
Oliveira do Douro,PPD/PSD.CDS-PP,18.18,62,180410
Oliveira do Douro,PCP-PEV,8.8,30,180410
Oliveira do Douro,MPT,4.99,17,180410
Oliveira do Douro,B.E.,2.64,9,180410
Oliveira do Douro,L,1.76,6,180410
Oliveira do Douro,PCTP/MRPP,1.47,5,180410
Oliveira do Douro,PTP,1.17,4,180410
Oliveira do Douro,PPV,0.88,3,180410
Oliveira do Douro,MAS,0.59,2,180410
Oliveira do Douro,PAN,0.59,2,180410
Oliveira do Douro,PNR,0.59,2,180410
Oliveira do Douro,PPM,0.59,2,180410
Oliveira do Douro,PND,0.29,1,180410
Oliveira do Douro,PDA,0,0,180410
Oliveira do Douro,POUS,0,0,180410
