freguesia,acronym,validVotesPercentage,votes,dicofre
Bruçó,PS,72.22,65,040803
Bruçó,PPD/PSD.CDS-PP,17.78,16,040803
Bruçó,MPT,4.44,4,040803
Bruçó,B.E.,2.22,2,040803
Bruçó,PAN,2.22,2,040803
Bruçó,PCP-PEV,1.11,1,040803
Bruçó,L,0,0,040803
Bruçó,MAS,0,0,040803
Bruçó,PCTP/MRPP,0,0,040803
Bruçó,PDA,0,0,040803
Bruçó,PND,0,0,040803
Bruçó,PNR,0,0,040803
Bruçó,POUS,0,0,040803
Bruçó,PPM,0,0,040803
Bruçó,PPV,0,0,040803
Bruçó,PTP,0,0,040803
