Objeto do Contrato,Tipo de Procedimento,Tipo(s) de Contrato,CPVs,Entidade(s) Adjudicante(s),Entidade(s) Adjudicatária(s),Preço Contratual,Data de Publicação,Data de Celebração do Contrato,Prazo de Execução,Local de Execução,Fundamentação,Data de Fecho do Contrato,Preço Total Efetivo,Causas das Alterações ao Prazo,Causas das Alterações ao Preço,Estado,N.º registo do Acordo Quadro,Descrição do Acordo Quadro,Procedimento Centralizado
Aquisição de medicamentos em CPA,Ajuste Direto Regime Geral,Aquisição de bens móveis,"33690000-3, Medicamentos vários","Hospital do Espírito Santo de Évora, E.P.E. (508085888)","GRUNENTHAL SA (500101965), BAYER PORTUGAL S A (500043256), SANOFI- PRODUTOS FARMACEUTICOS LDA (500134960), BRISTOL-MYERS SQUIB FARMAC PORTUGUESA SA (500048193), MERCK SA (500650870), VIIVHIV HEALTHCARE UNIPESSOAL LDA (509117961), CONFAR - CONSORCIO FARMACEUTIC (500070229), FARMOZ - SOC TECNICO MEDICINAL SA (501505334), OVERPHARMA LDA (505792362), RATIOPHARM LDA (502414910), GENERIS - FARMACEUTICA SA (508107997), FRESENIUS KABI PHARMA PORTUGAL (504293753), NOVARTIS CONSUMER HEALTH LDA (500268215), ABBOTT MEDICAL OPTICS SPAIN SL SUC PORTUGAL (980262364), GLAXOSMITHKLINE-PROD FARMAC LD (500139962), CLINIFAR MEDICAL CARE SOLUTIONS (503281115), LABESFAL SA (501169580), SANDOZ FARMACEUTICA LDA (506985261), SMITH & NEPHEW LDA (503552461), LAB INIBSA LDA (500139571), PHARMIS BIOFARMACEUTICA (502595442), ACTAVIS AS (980334934), CICLUM FARMA UNIPESSOAL LDA (504362674), NOVARTIS FARMA-PROD FARMACEUT (500063524), B BRAUN MEDICAL LDA (501506543), JANSSEN CILAG FARMACEUTICA LDA (500189412), LAB PFIZER LDA (500162166), MEDAC (980369959), LAB MEDINFAR (500384045), AMGEN BIOFARMACEUTICA LDA (502942959), PAUL HARTMANN LDA (502271728), ROCHE FARMACEUTICA QUIMICA LDA (500233810), IPSEN PORTUGAL (502609800), ASTRAZENECA PROD FARM LDA (502942240), MERCK SHARP & DOME LDA (500191360), 3M PORTUGAL LDA (500193940), LILLY PORTUGAL - PRODUTOS FARMAEUTICOS LDA (500165602), TEVA PHARMA - PRODUTOS FARMACEUTICOS LDA (507045491), ABBVIE LDA (510229050), UCB-PROD FARMACEUTICOS LDA (500291322)","286.855,47 €",26-12-2012,08-11-2012,8 dias,"Portugal, Évora, Évora","Artigo 26.º, n.º 1, alínea e) do Código dos Contratos Públicos",,,,,,Não aplicável.,Não aplicável.,
Aquisição de medicamentos diversos,Ajuste Direto Regime Geral,Aquisição de bens móveis,"33690000-3, Medicamentos vários","Hospital do Espírito Santo de Évora, E.P.E. (508085888)","CS PORTUGAL PROD FARMACEUT (503395960), FERRING PORTUGUESA (502034831), LABORATORIOS NORMON SA (505654156), ETIOPHARMA SA (509393357), CELGENE - SOCIEDADE UNIPESSOAL LDA (507791690), GLAXOSMITHKLINE-PROD FARMAC LD (500139962), HIKMA FARMACEUTICA (502266791), MERCK SHARP & DOME LDA (500191360), FARMACIA DIANA (505409046), BAUSCH & LOMB S A (980218764), OCTAPHARMA - PROD FARMACEUTICO (502820780), AMGEN BIOFARMACEUTICA LDA (502942959), DISTRIFARMA S A (502948663), B BRAUN MEDICAL LDA (501506543), BALDACCI SA (500109842), VIIVHIV HEALTHCARE UNIPESSOAL LDA (509117961), PROSPA-LAB FARMACEUTICOS SA (500130248), ASTRAZENECA PROD FARM LDA (502942240), MEAD JOHNSON NUTRITION PORTUGAL (508791405), FRESENIUS KABI PHARMA PORTUGAL (504293753), UNILFARMA (500293023), BAXTER MEDICO FARMACEUTICA LDA (503347345), AGA-ALCOOL E GENEROS ALIMENTAR (500727457), LABESFAL SA (501169580), LUSOMEDICAMENTA - SOC TECN FARMACEUTICA SA (507150473), NOVARTIS CONSUMER HEALTH LDA (500268215), PHARMIS BIOFARMACEUTICA (502595442), ALCON PORTUGAL (501251685), NOVARTIS FARMA-PROD FARMACEUT (500063524), DAVI II FARMACEUTICA SA (508309450), LAB MEDINFAR (500384045), FRESENIUS MEDICAL CARE LDA (503070220), GILEAD SCIENCES LDA (503604704)","61.756,00 €",21-12-2012,08-11-2012,8 dias,"Portugal, Évora, Évora","Artigo 20.º, n.º 1, alínea a) do Código dos Contratos Públicos",,,,,,Não aplicável.,Não aplicável.,
Aquisição de DM em CPA,Ajuste Direto Regime Geral,Aquisição de bens móveis,"33190000-8, Dispositivos e produtos médicos variados","Hospital do Espírito Santo de Évora, E.P.E. (508085888)","BASTOS VIEGAS SA (500042772), PAUL HARTMANN LDA (502271728), EZEQUIEL PANAO JORGE LDA (501412727), OVERPHARMA LDA (505792362), B BRAUN MEDICAL LDA (501506543), DOCWORLD LDA (508592909), PMH-PROD MEDICOS HOSPITALARES (502376899), MEDICINALIA-CORMEDICA (500684324), PERGUT PORTUGAL (501799729), SMITH & NEPHEW LDA (503552461), ALBINO DIAS ANDRADE (500013810)","11.798,18 €",21-12-2012,08-11-2012,8 dias,"Portugal, Évora, Évora","Artigo 26.º, n.º 1, alínea f) do Código dos Contratos Públicos",,,,,,Não aplicável.,Não aplicável.,
