Objeto do Contrato,Tipo de Procedimento,Tipo(s) de Contrato,CPVs,Entidade(s) Adjudicante(s),Entidade(s) Adjudicatária(s),Preço Contratual,Data de Publicação,Data de Celebração do Contrato,Prazo de Execução,Local de Execução,Fundamentação,Data de Fecho do Contrato,Preço Total Efetivo,Causas das Alterações ao Prazo,Causas das Alterações ao Preço,Estado,N.º registo do Acordo Quadro,Descrição do Acordo Quadro,Procedimento Centralizado
Aquisição de Serviços de manutenção de  elevação ao abrigo do Acordo Quadro lote 10,Ao abrigo de acordo-quadro (art.º 259.º),Aquisição de serviços,"50750000-7, Serviços de manutenção de elevadores","Administração Central do Sistema de Saúde, I. P. (508188423)","Schmitt-Elevadores, Lda (500230757)","154,80 €",25-01-2018,22-01-2018,365 dias,"Portugal, Lisboa, Lisboa",Artigo 259.º do Código dos Contratos Públicos,31-12-2018,"154,80 €",,,,2660036,"O presente procedimento visa a Contratação ao abrigo do Acordo-quadro de SMIE - Lote 5 - Região do Algarve eSPap, para a Assistência Técnica e Manutenção de Elevadores do Edifício Sede do Agrupamento de Escolas Padre António Martins de Oliveira - Lagoa - Algarve.",FALSE
Aquisição de serviços de consultoria e gestão/normalização de sistemas de informação para o Núcleo de Cuidados de Saúde Primários.,Concurso público,Aquisição de serviços,"79400000-8, Serviços de consultoria em matéria comercial e de gestão e serviços conexos","Administração Central do Sistema de Saúde, I. P. (508188423)","Barómetro de Ideias - Unipessoal, Lda. (509174329)","211.200,00 €",25-01-2018,16-01-2018,1095 dias,"Portugal, Lisboa, Lisboa","Artigo 20.º, n.º 1, alínea b) do Código dos Contratos Públicos","","",,,,Não aplicável.,Não aplicável.,FALSE
Contrato para aquisição de serviços de comunicação de voz em local fixo para entidades do Ministério da Saúde,Concurso público,Aquisição de serviços,"64000000-6, Serviços postais e de telecomunicações","Administração Central do Sistema de Saúde, I. P. (508188423)","MEO - Serviços de Comunicações e Multimédia, SA (504615947)","3.725,17 €",25-01-2018,27-12-2017,730 dias,"Portugal, Lisboa, Lisboa","Artigo 20.º, n.º 1, alínea b) do Código dos Contratos Públicos","","",,,,Não aplicável.,Não aplicável.,TRUE
