Objeto do Contrato,Tipo de Procedimento,Tipo(s) de Contrato,CPVs,Entidade(s) Adjudicante(s),Entidade(s) Adjudicatária(s),Preço Contratual,Data de Publicação,Data de Celebração do Contrato,Prazo de Execução,Local de Execução,Fundamentação,Data de Fecho do Contrato,Preço Total Efetivo,Causas das Alterações ao Prazo,Causas das Alterações ao Preço,Estado,N.º registo do Acordo Quadro,Descrição do Acordo Quadro,Procedimento Centralizado
Aquisição de serviços de manutenção e assistência técnica aos PACS SECTRA.,Ajuste Direto Regime Geral,Aquisição de serviços,"72000000-5, Serviços de TI: consultoria, desenvolvimento de software, Internet e apoio","Centro Hospitalar Póvoa de Varzim - Vila do Conde, E. P. E. (508741823)",ART CES UNIPESSOAL (513270396),"27.120,00 €",29-09-2017,08-06-2017,207 dias,"Portugal, Porto, Póvoa de Varzim",Artigo 258.º do Código dos Contratos Públicos,,,,,,Não aplicável.,Não aplicável.,FALSE
"Aquisição e serviços de manutenção dos sistemas SGCIM, RADIO, SISLAB, ANAPAT e EPR-OR instalados nas entidades do ministério da saúde para o ano 2017. ",Ajuste Direto Regime Geral,Aquisição de serviços,"72200000-7, Serviços de consultoria e de programação de software","Centro Hospitalar Póvoa de Varzim - Vila do Conde, E. P. E. (508741823)","GLINTT - HEALTHCARE SOLUTIONS, S.A. (502479418)","61.680,07 €",29-09-2017,21-03-2017,286 dias,"Portugal, Porto, Póvoa de Varzim",Artigo 258.º do Código dos Contratos Públicos,,,,,,Não aplicável.,Não aplicável.,FALSE
"O objeto tem por base a aquisição de Equipamento Informático para o CHPVVC, EPE.",Ajuste Direto Regime Geral,Aquisição de bens móveis,"30200000-1, Equipamento e material informático","Centro Hospitalar Póvoa de Varzim/Vila do Conde, EPE (508741823)","BASE2 - Informática e Telecomunicações, Lda. (501333401)","39.550,00 €",28-09-2017,21-03-2017,286 dias,"Portugal, Porto, Póvoa de Varzim",Artigo 258.º do Código dos Contratos Públicos,,,,,,Não aplicável.,Não aplicável.,FALSE
Aquisição de Serviços de manutenção corretiva e evolutiva das aplicações First.,Ajuste Direto Regime Geral,Aquisição de serviços,"72000000-5, Serviços de TI: consultoria, desenvolvimento de software, Internet e apoio","Centro Hospitalar Póvoa de Varzim - Vila do Conde, E. P. E. (508741823)",First Solutions - sistemas Informação S.A (505345978),"38.646,42 €",28-09-2017,21-03-2017,286 dias,"Portugal, Porto, Póvoa de Varzim",Artigo 258.º do Código dos Contratos Públicos,,,,,,Não aplicável.,Não aplicável.,FALSE
Prestação serviços Manutenção corretiva e evolutiva dos sistemas Maxpro para o ano de 2017.,Ajuste Direto Regime Geral,Aquisição de serviços,"72000000-5, Serviços de TI: consultoria, desenvolvimento de software, Internet e apoio","Centro Hospitalar Póvoa de Varzim - Vila do Conde, E. P. E. (508741823)","SISQUAL - Empresa de Investigação e Desenvolvimento de Sistemas Informáticos, Lda. (502772298)","6.001,75 €",28-09-2017,13-07-2017,202 dias,"Portugal, Porto, Póvoa de Varzim",Artigo 258.º do Código dos Contratos Públicos,,,,,,Não aplicável.,Não aplicável.,FALSE
"Fornecimento de eletricidade para o CHPVVC, EPE.",Ajuste Direto Regime Geral,Aquisição de bens móveis,"09310000-5, Electricidade","Centro Hospitalar Póvoa de Varzim - Vila do Conde, E. P. E. (508741823)","Iberdrola Clientes Portugal, Unipessoal, Lda (502124083)","166.760,26 €",28-09-2017,20-12-2016,360 dias,"Portugal, Porto, Póvoa de Varzim",Artigo 258.º do Código dos Contratos Públicos,,,,,,Não aplicável.,Não aplicável.,FALSE
"fornecimento de gás natural para o CHPVVC, EPE",Ajuste Direto Regime Geral,Aquisição de bens móveis,"09123000-7, Gás natural","Centro Hospitalar Póvoa de Varzim - Vila do Conde, E. P. E. (508741823)","GALP POWER, S.A. (504723456)","18.799,72 €",27-09-2017,14-12-2016,383 dias,"Portugal, Porto, Póvoa de Varzim",Artigo 258.º do Código dos Contratos Públicos,,,,,,Não aplicável.,Não aplicável.,FALSE
"Prestação de serviços médicos internos de formação específica da especialidade de Pediatria, no âmbito de actividades no serviço de urgência e outras actividades no Centro Hospitalar Póvoa de Varzim/Vila do Conde, E.P.E. O tipo de procedimento adotado é o Ajuste Direto, nos termos da aplicação da alínea e) do nº 1 do artigo 24 do CCP e do cumprimento do nº 2 do Despacho nº 966-B/2016 de 27 de Julho de 2016 articulado com o Despacho nº 9666-B/2016 de 27 de Julho de 2016. ",Ajuste Direto Regime Geral,Aquisição de serviços,"85141000-9, Serviços prestados pelo pessoal médico","Centro Hospitalar Póvoa de Varzim - Vila do Conde, E. P. E. (508741823)",Maria Ayres Pereira (257616667),"5.544,00 €",27-09-2017,26-09-2017,97 dias,"Portugal, Porto, Póvoa de Varzim","Artigo 24.º, n.º 1, alínea e) do Código dos Contratos Públicos",,,,,,Não aplicável.,Não aplicável.,FALSE
"Aquisição de Sistema de Anestesia Epidural e sequencial para o CHPVVC, EPE.",Ajuste Direto Regime Geral,Aquisição de bens móveis,"33171300-2, Conjuntos ou pacotes epidurais","Centro Hospitalar Póvoa de Varzim/Vila do Conde, EPE (508741823)",B BRAUN MEDICAL LDA (501506543),"9.090,00 €",26-09-2017,07-07-2017,178 dias,"Portugal, Porto, Póvoa de Varzim","Artigo 26.º, n.º 1, alínea a) do Código dos Contratos Públicos",,,,,,Não aplicável.,Não aplicável.,FALSE
"Fornecimento de Gás Natural para o CHPVVC, EPE.",Ajuste Direto Regime Geral,Aquisição de bens móveis,"09123000-7, Gás natural","Centro Hospitalar Póvoa de Varzim - Vila do Conde, E. P. E. (508741823)","Galp Power, SA (504723456)","22.600,00 €",26-09-2017,16-08-2017,138 dias,"Portugal, Porto, Póvoa de Varzim","Artigo 20.º, n.º 1, alínea a) do Código dos Contratos Públicos",,,,,,Não aplicável.,Não aplicável.,FALSE
"Fornecimento de Fibra otica para o CHPVVC,EPE.",Ajuste Direto Regime Geral,Aquisição de serviços,"72720000-3, Serviços de rede de área global","Centro Hospitalar Póvoa de Varzim - Vila do Conde, E. P. E. (508741823)",ONI (504073206),"6.300,00 €",26-09-2017,14-02-2017,321 dias,"Portugal, Porto, Póvoa de Varzim","Artigo 20.º, n.º 1, alínea a) do Código dos Contratos Públicos",,,,,,Não aplicável.,Não aplicável.,FALSE
O presente procedimento tem por objeto o fornecimento de Medicamentos para Nutrição,Ao abrigo de acordo-quadro (art.º 259.º),Aquisição de bens móveis,"33600000-6, Produtos farmacêuticos","Centro Hospitalar Póvoa de Varzim - Vila do Conde, E. P. E. (508741823)","Fresenius Kabi Pharma Portugal, Lda. (504293753)","79,60 €",25-09-2017,10-05-2017,236 dias,"Portugal, Porto, Póvoa de Varzim",Artigo 259.º do Código dos Contratos Públicos,,,,,,1377429,Acordo Quadro para fornecimento de medicamentos para Nutrição Parentérica às Instituições e Serviços do Serviço Nacional de Saúde,FALSE
O presente procedimento tem por objeto o fornecimento de Medicamentos para Nutrição,Ao abrigo de acordo-quadro (art.º 259.º),Aquisição de bens móveis,"33600000-6, Produtos farmacêuticos","Centro Hospitalar Póvoa de Varzim - Vila do Conde, E. P. E. (508741823)","B. BRAUN MEDICAL, LDA. (501506543)","9.534,00 €",25-09-2017,10-05-2017,236 dias,"Portugal, Porto, Póvoa de Varzim",Artigo 259.º do Código dos Contratos Públicos,,,,,,1377429,Acordo Quadro para fornecimento de medicamentos para Nutrição Parentérica às Instituições e Serviços do Serviço Nacional de Saúde,FALSE
"O presente procedimento tem por objeto o fornecimento de Medicamentos para Nutrição Parentérica, para o CHPVVC,E.P.E.                                                                                            ",Ao abrigo de acordo-quadro (art.º 259.º),Aquisição de bens móveis,"33600000-6, Produtos farmacêuticos","Centro Hospitalar Póvoa de Varzim - Vila do Conde, E. P. E. (508741823)","Fresenius Kabi Pharma Portugal, Lda. (504293753)","117,60 €",25-09-2017,10-05-2017,236 dias,"Portugal, Porto, Póvoa de Varzim",Artigo 259.º do Código dos Contratos Públicos,,,,,,1377429,Acordo Quadro para fornecimento de medicamentos para Nutrição Parentérica às Instituições e Serviços do Serviço Nacional de Saúde,FALSE
"O presente procedimento tem por objeto o fornecimento de Medicamentos para Nutrição Parentérica para o CHPVVC, EPE.",Ao abrigo de acordo-quadro (art.º 259.º),Aquisição de bens móveis,"33600000-6, Produtos farmacêuticos","Centro Hospitalar Póvoa de Varzim - Vila do Conde, E. P. E. (508741823)",Labsfal - Laboratórios Almiro S.A (501169580),"4.298,05 €",25-09-2017,10-05-2017,236 dias,"Portugal, Porto, Póvoa de Varzim",Artigo 259.º do Código dos Contratos Públicos,,,,,,1377429,Acordo Quadro para fornecimento de medicamentos para Nutrição Parentérica às Instituições e Serviços do Serviço Nacional de Saúde,FALSE
