freguesia,acronym,validVotesPercentage,votes,dicofre
União das freguesias de Cantanhede e Pocariça,PS,33.6,797,060220
União das freguesias de Cantanhede e Pocariça,PPD/PSD,28.37,673,060220
União das freguesias de Cantanhede e Pocariça,B.E.,12.98,308,060220
União das freguesias de Cantanhede e Pocariça,PAN,5.44,129,060220
União das freguesias de Cantanhede e Pocariça,CDS-PP,5.06,120,060220
União das freguesias de Cantanhede e Pocariça,PCP-PEV,3.71,88,060220
União das freguesias de Cantanhede e Pocariça,A,2.23,53,060220
União das freguesias de Cantanhede e Pocariça,L,1.77,42,060220
União das freguesias de Cantanhede e Pocariça,PPM.PPV/CDC,1.64,39,060220
União das freguesias de Cantanhede e Pocariça,NC,1.6,38,060220
União das freguesias de Cantanhede e Pocariça,PDR,0.89,21,060220
União das freguesias de Cantanhede e Pocariça,IL,0.8,19,060220
União das freguesias de Cantanhede e Pocariça,PCTP/MRPP,0.72,17,060220
União das freguesias de Cantanhede e Pocariça,PNR,0.59,14,060220
União das freguesias de Cantanhede e Pocariça,MAS,0.3,7,060220
União das freguesias de Cantanhede e Pocariça,PURP,0.21,5,060220
União das freguesias de Cantanhede e Pocariça,PTP,0.08,2,060220
