freguesia,acronym,validVotesPercentage,votes,dicofre
Torreira,PPD/PSD.CDS-PP,46.32,264,011204
Torreira,PS,22.46,128,011204
Torreira,MPT,9.3,53,011204
Torreira,PCP-PEV,8.77,50,011204
Torreira,B.E.,2.81,16,011204
Torreira,PCTP/MRPP,2.63,15,011204
Torreira,PAN,1.75,10,011204
Torreira,PNR,1.23,7,011204
Torreira,L,1.05,6,011204
Torreira,PND,0.88,5,011204
Torreira,PTP,0.88,5,011204
Torreira,MAS,0.7,4,011204
Torreira,PPM,0.7,4,011204
Torreira,POUS,0.35,2,011204
Torreira,PPV,0.18,1,011204
Torreira,PDA,0,0,011204
