Entidade,Total Horas,Total Encargos
"ARS Norte, IP",106 551,2 358 432 €
"CH Porto, EPE",43 509,1 315 113 €
"CH Tâmega e Sousa, EPE",77 449,2 100 195 €
"CH Entre o Douro e Vouga, EPE",123 344,3 345 694 €
"CH Médio Ave, EPE",50 939,1 445 575 €
"CH Póvoa de Varzim / Vila do Conde, EPE",50 613,1 398 442 €
"CH São João, EPE",22 128,508 484 €
"CH Trás-os-Montes e Alto Douro, EPE",80 070,2 320 998 €
"CH Vila Nova de Gaia/Espinho, EPE",23 174,572 579 €
H Senhora da Oliveira- Guimarães EPE,46 181,1 182 751 €
H Magalhães Lemos EPE,964,55 671 €
H Santa Maria Maior EPE,34 427,787 325 €
Instituto Nacional de Emergência Médica IP (INEM),88660,2045651
Instituto Português do Sangue e da Transplantação IP,28553,574768
"IPO Porto, EPE",11 464,307 309 €
ULS Matosinhos EPE,63 058,1 692 733 €
ULS Alto Minho EPE,69 440,2 075 936 €
ULS Nordeste EPE,57 164,2 059 050 €
ARS Centro IP,36 642,689 052 €
CH Baixo Vouga EPE,75 617,1 987 159 €
CH Cova da Beira EPE,29 138,856 547 €
CH Leiria EPE,101 144,4 158 437 €
CH Universitário de Coimbra EPE,28 068,713 956 €
CH Tondela - Viseu EPE,49 428,1 243 407 €
Centro Medicina de Reabilitação da Região Centro - Rovisco Pais,3 384,71 032 €
H Arcebispo João Crisóstomo,19 716,442 987 €
H Distrital Figueira da Foz EPE,19 420,490 379 €
H Dr Francisco Zagalo - Ovar,15 862,618 587 €
IPO Coimbra EPE,3 603,108 075 €
ULS Guarda EPE,62 089,2 369 877 €
ULS Castelo Branco EPE,34 763,1 105 710 €
ARS Lisboa e Vale do Tejo IP,222 716,3 856 932 €
CH Barreiro Montijo EPE,81 896,2 103 307 €
CH Lisboa Central EPE,14 843,449 657 €
CH Médio Tejo EPE,189 673,6 211 225 €
CH Oeste,199371,"5,454,288€"
CH Lisboa Norte EPE,53 072,1 400 986 €
CH Lisboa Ocidental EPE,68 669,1 814 424 €
CH Psiquiátrico Lisboa,3476,"85,642€"
CH Setúbal EPE,120 058,3 858 147 €
H Distrital de Santarém EPE,71 629,1 981 373 €
H Garcia de Orta EPE,116 756,3 215 598 €
H ProfDoutor Fernando Fonseca EPE,153 640,5 084 308 €
Instituto Oftalmológico Dr Gama Pinto,2 176,83 007 €
IPO Lisboa EPE,4 949,134 532 €
ARS Alentejo IP,36 756,778 171 €
H Espírito Santo - Évora EPE,58 117,1 966 247 €
ULS Baixo Alentejo EPE,119 593,3 863 080 €
ULS Litoral Alentejano EPE,102 450,3 574 447 €
ULS Norte Alentejano EPE,134 427,4 462 016 €
ARS Algarve,26 091,526 413 €
CH Algarve EPE,185 394,5 902 496 €