freguesia,acronym,validVotesPercentage,votes,dicofre
Macieira da Maia,PS,36.55,235,131614
Macieira da Maia,PPD/PSD,31.42,202,131614
Macieira da Maia,B.E.,9.49,61,131614
Macieira da Maia,CDS-PP,4.82,31,131614
Macieira da Maia,PCP-PEV,4.82,31,131614
Macieira da Maia,PAN,4.51,29,131614
Macieira da Maia,IL,1.4,9,131614
Macieira da Maia,NC,1.24,8,131614
Macieira da Maia,L,0.93,6,131614
Macieira da Maia,PURP,0.93,6,131614
Macieira da Maia,A,0.78,5,131614
Macieira da Maia,PDR,0.78,5,131614
Macieira da Maia,PPM.PPV/CDC,0.78,5,131614
Macieira da Maia,MAS,0.47,3,131614
Macieira da Maia,PCTP/MRPP,0.47,3,131614
Macieira da Maia,PNR,0.31,2,131614
Macieira da Maia,PTP,0.31,2,131614
