freguesia,acronym,validVotesPercentage,votes,dicofre
União das freguesias de Figueiras e Covas,PPD/PSD.CDS-PP,45.6,259,130529
União das freguesias de Figueiras e Covas,PS,31.69,180,130529
União das freguesias de Figueiras e Covas,MPT,7.04,40,130529
União das freguesias de Figueiras e Covas,PCP-PEV,4.58,26,130529
União das freguesias de Figueiras e Covas,L,2.64,15,130529
União das freguesias de Figueiras e Covas,B.E.,2.11,12,130529
União das freguesias de Figueiras e Covas,PND,1.58,9,130529
União das freguesias de Figueiras e Covas,PCTP/MRPP,1.41,8,130529
União das freguesias de Figueiras e Covas,PPM,0.88,5,130529
União das freguesias de Figueiras e Covas,PNR,0.7,4,130529
União das freguesias de Figueiras e Covas,MAS,0.35,2,130529
União das freguesias de Figueiras e Covas,PAN,0.35,2,130529
União das freguesias de Figueiras e Covas,PDA,0.35,2,130529
União das freguesias de Figueiras e Covas,POUS,0.35,2,130529
União das freguesias de Figueiras e Covas,PTP,0.35,2,130529
União das freguesias de Figueiras e Covas,PPV,0,0,130529
