Objeto do Contrato,Tipo de Procedimento,Tipo(s) de Contrato,CPVs,Entidade(s) Adjudicante(s),Entidade(s) Adjudicatária(s),Preço Contratual,Data de Publicação,Data de Celebração do Contrato,Prazo de Execução,Local de Execução,Fundamentação,Data de Fecho do Contrato,Preço Total Efetivo,Causas das Alterações ao Prazo,Causas das Alterações ao Preço,Estado,N.º registo do Acordo Quadro,Descrição do Acordo Quadro,Procedimento Centralizado
"Aquisição de Combustível para a ARSLVT,IP, para o ano de 2013",Ajuste Direto Regime Geral,Aquisição de bens móveis,"09100000-0, Combustíveis","Administração Regional de Saúde de Lisboa e Vale do Tejo, I.P. (503148776)","Petróleos de Portugal, S.A. (500697370)","495.188,64 €",28-05-2013,18-01-2013,365 dias,"Portugal, Lisboa",Artigo 258.º do Código dos Contratos Públicos,,,,,,Não aplicável.,Não aplicável.,
Fornecimento de água para 2013 - ACES Médio Tejo.,Ajuste Direto Regime Geral,Aquisição de serviços,"65100000-4, Serviços de distribuição de água e serviços conexos","Administração Regional de Saúde de Lisboa e Vale do Tejo, I.P. (503148776)","AR - ÁGUAS DO RIBATEJO, EM, SA (508345464)","3.126,19 €",27-05-2013,23-05-2013,365 dias,"Portugal, Santarém, Salvaterra de Magos","Artigo 24.º, n.º 1, alínea e) do Código dos Contratos Públicos",,,,,,Não aplicável.,Não aplicável.,
Fornecimento de água para 2013 - ACES Oeste Sul.,Ajuste Direto Regime Geral,Aquisição de serviços,"65100000-4, Serviços de distribuição de água e serviços conexos","Administração Regional de Saúde de Lisboa e Vale do Tejo, I.P. (503148776)",MUNICÍPIO SOBRAL MONTE AGRAÇO (505410850),"1.351,88 €",27-05-2013,23-05-2013,365 dias,"Portugal, Lisboa, Sobral de Monte Agraço","Artigo 24.º, n.º 1, alínea e) do Código dos Contratos Públicos",,,,,,Não aplicável.,Não aplicável.,
Remodelação do Edifício da Direcção do ACEs Amadora para instalação da USF Alma Mater,Ajuste Direto Regime Geral,Empreitadas de obras públicas,"45113000-2, Obras no local","Administração Regional de Saúde de Lisboa e Vale do Tejo, I.P. (503148776)","Novopca - Construtores Associados, Lda (500204144)","13.875,00 €",27-05-2013,27-05-2013,12 dias,"Portugal, Lisboa, Amadora","Artigo 19.º, alínea a) do Código dos Contratos Públicos",,,,,,Não aplicável.,Não aplicável.,
Empreitada de Adaptação no Centro de Saúde dos Olivais,Ajuste Direto Regime Geral,Empreitadas de obras públicas,"45113000-2, Obras no local","Administração Regional de Saúde de Lisboa e Vale do Tejo, I.P. (503148776)","Metal Cúbico, Lda (503852880)","17.497,00 €",24-05-2013,20-05-2013,21 dias,"Portugal, Lisboa, Lisboa","Artigo 19.º, alínea a) do Código dos Contratos Públicos",,,,,,Não aplicável.,Não aplicável.,
"Fornecimento de energia Eletrica em Baixa Tensão especial (96 KVA), Lote 1 do AQ, á Unidade de S.Bento  sito na AV. António Bastos, 2 Santarém - 2005-193 Santarém  - ACES Leziria 1  - Ribatejo, para o ano de 2013.",Ajuste Direto Regime Geral,Aquisição de serviços,"65310000-9, Distribuição de electricidade","Administração Regional de Saúde de Lisboa e Vale do Tejo, I.P. (503148776)","EDP COMERCIAL - COMERCIALIZAÇÃO ENERGIA, S.A. (503504564)","35.860,35 €",24-05-2013,22-05-2013,365 dias,"Portugal, Santarém",Artigo 258.º do Código dos Contratos Públicos,,,,,,Não aplicável.,Não aplicável.,
Película de contacto para terapia de compressão - MEPITEL ONE,Ajuste Direto Regime Geral,Aquisição de bens móveis,"33000000-0, Equipamento médico, medicamentos e produtos para cuidados pessoais","Administração Regional de Saúde de Lisboa e Vale do Tejo, I.P. (503148776)","Molnlycke Health Care, Lda. (511101066)","49.432,00 €",22-05-2013,22-05-2013,20 dias,"Portugal, Lisboa","Artigo 26.º, n.º 1, alínea e) do Código dos Contratos Públicos",,,,,,Não aplicável.,Não aplicável.,
Tubo para amostrador SKALAR,Ajuste Direto Regime Geral,Aquisição de bens móveis,"33140000-3, Material médico de consumo","Administração Regional de Saúde de Lisboa e Vale do Tejo, I.P. (503148776)",Tecnilab - Portugal (500758158),"360,00 €",22-05-2013,22-05-2013,20 dias,"Portugal, Lisboa","Artigo 24.º, n.º 1, alínea e) do Código dos Contratos Públicos",,,,,,Não aplicável.,Não aplicável.,
Economato - Lote 3 do PECI - Conforme negociação da Secretaria Geral do Ministério da Saúde,Ajuste Direto Regime Geral,Aquisição de bens móveis,"30190000-7, Equipamento e material de escritório diverso","Administração Regional de Saúde de Lisboa e Vale do Tejo, I.P. (503148776)","Olmar - Artigos de Papelaria, Lda. (508831989)","112.852,14 €",22-05-2013,18-04-2013,257 dias,"Portugal, Lisboa",Artigo 258.º do Código dos Contratos Públicos,,,,,,Não aplicável.,Não aplicável.,
Reparação ao elevador nº 2 - CAT130082361,Ajuste Direto Regime Geral,Aquisição de serviços,"50000000-5, Serviços de reparação e manutenção","Administração Regional de Saúde de Lisboa e Vale do Tejo, I.P. (503148776)","Schindler, SA (502353740)","303,93 €",22-05-2013,22-05-2013,30 dias,"Portugal, Lisboa, Lisboa","Artigo 24.º, n.º 1, alínea e) do Código dos Contratos Públicos",,,,,,Não aplicável.,Não aplicável.,
"Aquisição de Mobiliário para a USF Póvoa 0, USF Póvoa 1 e USF Descobertas",Ajuste Direto Regime Geral,Aquisição de bens móveis,"39100000-3, Mobiliário","Administração Regional de Saúde de Lisboa e Vale do Tejo, I.P. (503148776)","Julcar Mobiliário Integrado, S.A. (501140263)","41.524,94 €",21-05-2013,10-05-2013,20 dias,"Portugal, Lisboa, Lisboa",Artigo 258.º do Código dos Contratos Públicos,,,,,,Não aplicável.,Não aplicável.,
