freguesia,acronym,validVotesPercentage,votes,dicofre
"União das freguesias de Geraz do Lima (Santa Maria, Santa Leocádia e Moreira) e Deão",PPD/PSD.CDS-PP,45.58,454,160943
"União das freguesias de Geraz do Lima (Santa Maria, Santa Leocádia e Moreira) e Deão",PS,32.63,325,160943
"União das freguesias de Geraz do Lima (Santa Maria, Santa Leocádia e Moreira) e Deão",MPT,6.93,69,160943
"União das freguesias de Geraz do Lima (Santa Maria, Santa Leocádia e Moreira) e Deão",PCP-PEV,3.61,36,160943
"União das freguesias de Geraz do Lima (Santa Maria, Santa Leocádia e Moreira) e Deão",PND,2.21,22,160943
"União das freguesias de Geraz do Lima (Santa Maria, Santa Leocádia e Moreira) e Deão",B.E.,2.11,21,160943
"União das freguesias de Geraz do Lima (Santa Maria, Santa Leocádia e Moreira) e Deão",L,1.1,11,160943
"União das freguesias de Geraz do Lima (Santa Maria, Santa Leocádia e Moreira) e Deão",PCTP/MRPP,1.1,11,160943
"União das freguesias de Geraz do Lima (Santa Maria, Santa Leocádia e Moreira) e Deão",PTP,1.1,11,160943
"União das freguesias de Geraz do Lima (Santa Maria, Santa Leocádia e Moreira) e Deão",PAN,0.9,9,160943
"União das freguesias de Geraz do Lima (Santa Maria, Santa Leocádia e Moreira) e Deão",MAS,0.7,7,160943
"União das freguesias de Geraz do Lima (Santa Maria, Santa Leocádia e Moreira) e Deão",PPM,0.7,7,160943
"União das freguesias de Geraz do Lima (Santa Maria, Santa Leocádia e Moreira) e Deão",PNR,0.5,5,160943
"União das freguesias de Geraz do Lima (Santa Maria, Santa Leocádia e Moreira) e Deão",PPV,0.4,4,160943
"União das freguesias de Geraz do Lima (Santa Maria, Santa Leocádia e Moreira) e Deão",PDA,0.2,2,160943
"União das freguesias de Geraz do Lima (Santa Maria, Santa Leocádia e Moreira) e Deão",POUS,0.2,2,160943
