freguesia,acronym,validVotesPercentage,votes,dicofre
Parque das Nações,PPD/PSD.CDS-PP,30.3,1925,110662
Parque das Nações,PS,30.28,1924,110662
Parque das Nações,PCP-PEV,11.54,733,110662
Parque das Nações,MPT,7.79,495,110662
Parque das Nações,L,7.51,477,110662
Parque das Nações,B.E.,5.68,361,110662
Parque das Nações,PAN,2.88,183,110662
Parque das Nações,PCTP/MRPP,1.05,67,110662
Parque das Nações,PPM,0.66,42,110662
Parque das Nações,MAS,0.58,37,110662
Parque das Nações,PPV,0.42,27,110662
Parque das Nações,PNR,0.41,26,110662
Parque das Nações,PND,0.39,25,110662
Parque das Nações,PTP,0.25,16,110662
Parque das Nações,PDA,0.17,11,110662
Parque das Nações,POUS,0.06,4,110662
