Objeto do Contrato,Tipo de Procedimento,Tipo(s) de Contrato,CPVs,Entidade(s) Adjudicante(s),Entidade(s) Adjudicatária(s),Preço Contratual,Data de Publicação,Data de Celebração do Contrato,Prazo de Execução,Local de Execução,Fundamentação,Data de Fecho do Contrato,Preço Total Efetivo,Causas das Alterações ao Prazo,Causas das Alterações ao Preço,Estado,N.º registo do Acordo Quadro,Descrição do Acordo Quadro,Procedimento Centralizado
Aquisição de Medicamentos urgentes - Bayer,Ajuste Direto Regime Geral,Aquisição de bens móveis,"33600000-6, Produtos farmacêuticos","Centro Hospitalar Vila Nova de Gaia - Espinho, E. P. E. (508142156)","BAYER PORTUGAL, S.A. (500043256)","17.244,74 €",21-04-2018,22-03-2018,20 dias,"Portugal, Porto, Vila Nova de Gaia","Artigo 24.º, n.º 1, alínea c) do Código dos Contratos Públicos",,,,,,Não aplicável.,Não aplicável.,FALSE
"Aquisição de Reagentes Para Microbactérias, Serologia e Microbiologia",Ajuste Direto Regime Geral,Aquisição de bens móveis,"33696200-7, Reagentes para análises ao sangue","Centro Hospitalar Vila Nova de Gaia - Espinho, E. P. E. (508142156)","Quilaban - Quimica Laboratorial Analítica, S.A. (500399670)","19.935,09 €",21-04-2018,26-03-2018,300 dias,"Portugal, Porto, Vila Nova de Gaia","Artigo 24.º, n.º 1, alínea e) do Código dos Contratos Públicos",,,,,,Não aplicável.,Não aplicável.,FALSE
Aquisição de Medicamentos Exclusivos Roche - Pirfenidona Urgente,Ajuste Direto Regime Geral,Aquisição de bens móveis,"33600000-6, Produtos farmacêuticos","Centro Hospitalar Vila Nova de Gaia - Espinho, E. P. E. (508142156)","ROCHE FARMACEUTICA QUIMICA, LDA (500233810)","15.442,56 €",21-04-2018,26-03-2018,5 dias,"Portugal, Porto, Vila Nova de Gaia","Artigo 24.º, n.º 1, alínea c) do Código dos Contratos Públicos",,,,,,Não aplicável.,Não aplicável.,FALSE
Aquisição de Medicamentos Centralizada Urgente - Sanofi,Ajuste Direto Regime Geral,Aquisição de bens móveis,"33600000-6, Produtos farmacêuticos","Centro Hospitalar Vila Nova de Gaia - Espinho, E. P. E. (508142156)","Sanofi Produtos Farmaceuticos, Lda (500134960)","56.859,00 €",21-04-2018,16-03-2018,90 dias,"Portugal, Porto, Vila Nova de Gaia","Artigo 24.º, n.º 1, alínea c) do Código dos Contratos Públicos",,,,,,Não aplicável.,Não aplicável.,FALSE
Aquisição de toalhetes interfolha zigzag,Ajuste Direto Regime Geral,Aquisição de bens móveis,"33763000-6, Toalhas de mão de papel","Centro Hospitalar Vila Nova de Gaia - Espinho, E. P. E. (508142156)","Jocalu- Higiene Industrial, Lda. (502999900)","71.540,00 €",21-04-2018,19-04-2018,20 dias,"Portugal, Porto, Vila Nova de Gaia","Artigo 24.º, n.º 1, alínea c) do Código dos Contratos Públicos",,,,,,Não aplicável.,Não aplicável.,FALSE
Aquisição de Medicamentos centralizada - Biogen,Ajuste Direto Regime Geral,Aquisição de bens móveis,"33600000-6, Produtos farmacêuticos","Centro Hospitalar Vila Nova de Gaia - Espinho, E. P. E. (508142156)","Biogen Portugal, lda (506415740)","46.200,00 €",21-04-2018,22-03-2018,90 dias,"Portugal, Porto, Vila Nova de Gaia","Artigo 24.º, n.º 1, alínea c) do Código dos Contratos Públicos",,,,,,Não aplicável.,Não aplicável.,FALSE
aquisição de Medicamentos Centralizada - Celgene,Ajuste Direto Regime Geral,Aquisição de bens móveis,"33600000-6, Produtos farmacêuticos","Centro Hospitalar Vila Nova de Gaia - Espinho, E. P. E. (508142156)","CELGENE SOCIEDADE UNIPESSOAL, LDA (507791690)","140.958,34 €",21-04-2018,22-03-2018,90 dias,"Portugal, Porto, Vila Nova de Gaia","Artigo 24.º, n.º 1, alínea c) do Código dos Contratos Públicos",,,,,,Não aplicável.,Não aplicável.,FALSE
Aquisição de Medicamentos Centralizada - Viiv- Dolutegravir,Ajuste Direto Regime Geral,Aquisição de bens móveis,"33600000-6, Produtos farmacêuticos","Centro Hospitalar Vila Nova de Gaia - Espinho, E. P. E. (508142156)","VIIVHIV HEALTHCARE, UNIPESSOAL LDA (509117961)","88.002,00 €",21-04-2018,22-03-2018,90 dias,"Portugal, Porto, Vila Nova de Gaia","Artigo 24.º, n.º 1, alínea c) do Código dos Contratos Públicos",,,,,,Não aplicável.,Não aplicável.,FALSE
Aquisição de Medicamentos Centralizada Urgentes -Teva,Ajuste Direto Regime Geral,Aquisição de bens móveis,"33600000-6, Produtos farmacêuticos","Centro Hospitalar Vila Nova de Gaia - Espinho, E. P. E. (508142156)",TEVA PHARMA PRODUTOS FARMACEUTICOS LDA (507045491),"46.287,65 €",21-04-2018,03-04-2018,90 dias,"Portugal, Porto, Vila Nova de Gaia","Artigo 24.º, n.º 1, alínea c) do Código dos Contratos Públicos",,,,,,Não aplicável.,Não aplicável.,FALSE
Fornecimento e colocação de porta de correr automática dupla motorização - Unidade II,Ajuste Direto Regime Geral,Empreitadas de obras públicas,"45421131-1, Instalação de portas","Centro Hospitalar Vila Nova de Gaia - Espinho, E. P. E. (508142156)",Manusa (509477526),"8.346,74 €",20-04-2018,19-04-2018,10 dias,"Portugal, Porto, Vila Nova de Gaia","Artigo 24.º, n.º 1, alínea e), subalínea ii) do Código dos Contratos Públicos",,,,,,Não aplicável.,Não aplicável.,FALSE
Serviços de Formação profissional Integrados – Candidatura POISE – programa Operacional de Inclusão e Emprego / Portugal 2020,Ajuste Direto Regime Geral,Aquisição de serviços,"80500000-9, Serviços de formação","Centro Hospitalar Vila Nova de Gaia - Espinho, E. P. E. (508142156)","Sinase - Recursos Humanos, Estudos e Desenvolvimento de Empresas, Lda. (502851791)","37.759,44 €",20-04-2018,12-01-2018,365 dias,"Portugal, Porto, Vila Nova de Gaia","Artigo 20.º, n.º 1, alínea a) do Código dos Contratos Públicos",,,,,,Não aplicável.,Não aplicável.,FALSE
Aquisição de Nutrição parenterica,Ajuste Direto Regime Geral,Aquisição de bens móveis,"33600000-6, Produtos farmacêuticos","Centro Hospitalar Vila Nova de Gaia - Espinho, E. P. E. (508142156)","BAXTER MEDICO FARMACEUTICA,LDA (503347345)","49.453,28 €",20-04-2018,21-03-2018,60 dias,"Portugal, Porto, Vila Nova de Gaia","Artigo 24.º, n.º 1, alínea c) do Código dos Contratos Públicos",,,,,,Não aplicável.,Não aplicável.,FALSE
Aquisição de Ceftazidima 2000 mg + Avibactam 500 mg Pó conc sol inj Fr IV,Ajuste Direto Regime Geral,Aquisição de bens móveis,"33600000-6, Produtos farmacêuticos","Centro Hospitalar Vila Nova de Gaia - Espinho, E. P. E. (508142156)",LABORATORIOS PFIZER  LDA (500162166),"17.250,00 €",20-04-2018,19-04-2018,20 dias,"Portugal, Porto, Vila Nova de Gaia","Artigo 24.º, n.º 1, alínea c) do Código dos Contratos Públicos",,,,,,Não aplicável.,Não aplicável.,FALSE
Aquisição de Tigeciclina 50mg pó sol inj. fr IV,Ajuste Direto Regime Geral,Aquisição de bens móveis,"33600000-6, Produtos farmacêuticos","Centro Hospitalar Vila Nova de Gaia - Espinho, E. P. E. (508142156)",LABORATORIOS PFIZER  LDA (500162166),"8.128,38 €",20-04-2018,20-03-2018,20 dias,"Portugal, Porto, Vila Nova de Gaia","Artigo 24.º, n.º 1, alínea c) do Código dos Contratos Públicos",,,,,,Não aplicável.,Não aplicável.,FALSE
"Aquisição de Reagentes Para o Equipamento """"Probetec""""",Ajuste Direto Regime Geral,Aquisição de bens móveis,"33696200-7, Reagentes para análises ao sangue","Centro Hospitalar Vila Nova de Gaia - Espinho, E. P. E. (508142156)","Quilaban - Quimica Laboratorial Analítica, SA (500399670)","51.671,40 €",19-04-2018,26-03-2018,300 dias,"Portugal, Porto, Vila Nova de Gaia","Artigo 24.º, n.º 1, alínea e) do Código dos Contratos Públicos",,,,,,Não aplicável.,Não aplicável.,FALSE
Empreitada para Execução de Sala Operatória na UCA - Unidade 3,Consulta Prévia,Empreitadas de obras públicas,"45215141-7, Construção de bloco operatório","Centro Hospitalar Vila Nova de Gaia - Espinho, E. P. E. (508142156)","TEISIL - EMPRESA DE CONSTRUÇÕES, LDA (501867180)","79.800,00 €",18-04-2018,12-04-2018,45 dias,"Portugal, Porto, Vila Nova de Gaia","Artigo 19.º, alínea c) do Código dos Contratos Públicos",,,,,,Não aplicável.,Não aplicável.,FALSE
MANUTENÇÃO E AT AOS PACS SECTRA  ref. 00087_2018,Ajuste Direto Regime Geral,Aquisição de serviços,"50000000-5, Serviços de reparação e manutenção","Centro Hospitalar Vila Nova de Gaia - Espinho, E. P. E. (508142156)","Art Ces - Unipessoal, Lda (513270396)","75.480,00 €",18-04-2018,26-03-2018,365 dias,"Portugal, Porto, Vila Nova de Gaia","Artigo 24.º, n.º 1, alínea e), subalínea ii) do Código dos Contratos Públicos",,,,,,Não aplicável.,Não aplicável.,FALSE
"Aquisição de Reagentes Para Microbiologia - Utilizados no Equipamento """"MGIT 960""""",Ajuste Direto Regime Geral,Aquisição de bens móveis,"33696200-7, Reagentes para análises ao sangue","Centro Hospitalar Vila Nova de Gaia - Espinho, E. P. E. (508142156)","Quilaban - Quimica Laboratorial Analitica, SA (500399670)","62.297,47 €",18-04-2018,26-03-2018,300 dias,"Portugal, Porto, Vila Nova de Gaia","Artigo 24.º, n.º 1, alínea e) do Código dos Contratos Públicos",,,,,,Não aplicável.,Não aplicável.,FALSE
Aquisição de CART - Equipamento móvel de Estomatologia,Ajuste Direto Regime Geral,Aquisição de bens móveis,"33126000-9, Aparelhos para estomatologia","Centro Hospitalar Vila Nova de Gaia - Espinho, E. P. E. (508142156)",Montellano (500196494),"10.900,00 €",17-04-2018,12-04-2018,30 dias,"Portugal, Porto, Vila Nova de Gaia","Artigo 24.º, n.º 1, alínea e) do Código dos Contratos Públicos",,,,,,Não aplicável.,Não aplicável.,FALSE
Reagentes para Imunologia Humoral,Ajuste Direto Regime Geral,Aquisição de bens móveis,"33696000-5, Reagentes e meios de contraste","Centro Hospitalar Vila Nova de Gaia - Espinho, E. P. E. (508142156)",THE BINDING SITE GROUP LTD (980525136),"25.540,00 €",17-04-2018,12-03-2018,275 dias,"Portugal, Porto, Vila Nova de Gaia","Artigo 24.º, n.º 1, alínea e) do Código dos Contratos Públicos",,,,,,Não aplicável.,Não aplicável.,FALSE
Prestação de Serviços de Medicina Nuclear - abril 2018,Ajuste Direto Regime Geral,Aquisição de serviços,"85150000-5, Serviços de imagiologia médica","Centro Hospitalar Vila Nova de Gaia - Espinho, E. P. E. (508142156)","HPP-Medicina Molecular, SA (506055787)","30.000,00 €",16-04-2018,16-04-2018,30 dias,"Portugal, Porto, Porto","Artigo 24.º, n.º 1, alínea e), subalínea ii) do Código dos Contratos Públicos",,,,,,Não aplicável.,Não aplicável.,FALSE
Fornecimento de 200 tokens para fortigate 600 C,Ajuste Direto Regime Geral,Aquisição de serviços,"50000000-5, Serviços de reparação e manutenção","Centro Hospitalar Vila Nova de Gaia - Espinho, E. P. E. (508142156)","CESCE - SOLUÇÕES INFORMÁTICAS, S.A. (505244713)","5.562,40 €",16-04-2018,15-11-2017,10 dias,"Portugal, Porto, Vila Nova de Gaia","Artigo 20.º, n.º 1, alínea a) do Código dos Contratos Públicos",,,,,,Não aplicável.,Não aplicável.,FALSE
Concurso Público nº 8020716,Concurso público,Aquisição de serviços,"72212311-2, Serviços de desenvolvimento de software para gestão de documentos","Centro Hospitalar Vila Nova de Gaia - Espinho, E. P. E. (508142156)","Indra Sistemas Portugal, S.A. (506176142)","34.146,00 €",16-04-2018,07-03-2018,365 dias,"Portugal, Porto, Vila Nova de Gaia","Artigo 20.º, n.º 1, alínea b) do Código dos Contratos Públicos",,,,,,Não aplicável.,Não aplicável.,FALSE
Serviços de Manutenção dos Aplicativos Glintt,Ajuste Direto Regime Geral,Aquisição de serviços,"50000000-5, Serviços de reparação e manutenção","Centro Hospitalar Vila Nova de Gaia - Espinho, E. P. E. (508142156)","Glintt - Healthcare Solutions, S.  A. (502479418)","25.100,00 €",16-04-2018,22-12-2017,10 dias,"Portugal, Porto, Vila Nova de Gaia","Artigo 24.º, n.º 1, alínea e) do Código dos Contratos Públicos",,,,,,Não aplicável.,Não aplicável.,FALSE
Reagentes para Serologia,Ajuste Direto Regime Geral,Aquisição de bens móveis,"33696000-5, Reagentes e meios de contraste","Centro Hospitalar Vila Nova de Gaia - Espinho, E. P. E. (508142156)","DIASORIN IBERIA,SA-SUCURSAL PORTUGAL (980379563)","8.360,00 €",14-04-2018,04-04-2018,275 dias,"Portugal, Porto, Vila Nova de Gaia","Artigo 24.º, n.º 1, alínea e) do Código dos Contratos Públicos",,,,,,Não aplicável.,Não aplicável.,FALSE
Reagentes para Equipamento Mago Plus,Ajuste Direto Regime Geral,Aquisição de bens móveis,"33696000-5, Reagentes e meios de contraste","Centro Hospitalar Vila Nova de Gaia - Espinho, E. P. E. (508142156)","Euroimmun Portugal, Lda. (504022180)","8.906,35 €",14-04-2018,09-04-2018,275 dias,"Portugal, Porto, Vila Nova de Gaia","Artigo 24.º, n.º 1, alínea e) do Código dos Contratos Públicos",,,,,,Não aplicável.,Não aplicável.,FALSE
Reagentes para Microbiologia,Ajuste Direto Regime Geral,Aquisição de bens móveis,"33696000-5, Reagentes e meios de contraste",Centro Hospitalar Vila Nova de Gaia (CHNVG) (508142156),IBERLAB (503406694),"5.209,27 €",14-04-2018,12-04-2018,305 dias,"Portugal, Porto, Vila Nova de Gaia","Artigo 24.º, n.º 1, alínea e), subalínea iii) do Código dos Contratos Públicos",,,,,,Não aplicável.,Não aplicável.,FALSE
Reagentes Equipamento G7,Ajuste Direto Regime Geral,Aquisição de bens móveis,"33696000-5, Reagentes e meios de contraste",Centro Hospitalar Vila Nova de Gaia (CHNVG) (508142156),HORIBA ABX - PORTUGAL (980158583),"19.800,00 €",14-04-2018,20-03-2018,275 dias,"Portugal, Porto, Vila Nova de Gaia","Artigo 24.º, n.º 1, alínea e) do Código dos Contratos Públicos",,,,,,Não aplicável.,Não aplicável.,FALSE
Reagentes para Equipamento Smartcycler,Ajuste Direto Regime Geral,Aquisição de bens móveis,"33696000-5, Reagentes e meios de contraste","Centro Hospitalar Vila Nova de Gaia - Espinho, E. P. E. (508142156)",WERFEN (501086110),"5.863,68 €",14-04-2018,11-04-2018,275 dias,"Portugal, Porto, Vila Nova de Gaia","Artigo 24.º, n.º 1, alínea e) do Código dos Contratos Públicos",,,,,,Não aplicável.,Não aplicável.,FALSE
Reagentes para Equipamento CFX96,Ajuste Direto Regime Geral,Aquisição de bens móveis,"33696000-5, Reagentes e meios de contraste","Centro Hospitalar Vila Nova de Gaia - Espinho, E. P. E. (508142156)",WERFEN (501086110),"5.000,00 €",14-04-2018,11-04-2018,275 dias,"Portugal, Porto, Vila Nova de Gaia","Artigo 24.º, n.º 1, alínea e) do Código dos Contratos Públicos",,,,,,Não aplicável.,Não aplicável.,FALSE
"Aquisiçãoi de Reagentes Para Quimica Clínica - Utilizados no Equipamento """"Corelabe""""",Ajuste Direto Regime Geral,Aquisição de bens móveis,"33696200-7, Reagentes para análises ao sangue",Centro Hospitalar Vila Nova de Gaia (CHNVG) (508142156),"Roche- Sist. Diagnósticos, Ldª (504282921)","99.684,37 €",12-04-2018,03-04-2018,120 dias,"Portugal, Porto, Vila Nova de Gaia","Artigo 24.º, n.º 1, alínea e) do Código dos Contratos Públicos",,,,,,Não aplicável.,Não aplicável.,FALSE
"Aquisição de Reagentes para Estudo do Sangue- Utilizados no Equipamento """"Architect""""",Ajuste Direto Regime Geral,Aquisição de bens móveis,"33696200-7, Reagentes para análises ao sangue","Centro Hospitalar Vila Nova de Gaia - Espinho, E. P. E. (508142156)","Abbott Laboratórios, Lda. (500006148)","168.672,00 €",12-04-2018,03-04-2018,300 dias,"Portugal, Porto, Vila Nova de Gaia","Artigo 24.º, n.º 1, alínea e) do Código dos Contratos Públicos",,,,,,Não aplicável.,Não aplicável.,FALSE
"Aquisição de Reagentes Para Imunohemoterapia- Equipamentos """"Micros ES-60 e Micros-60""""",Ajuste Direto Regime Geral,Aquisição de bens móveis,"33696200-7, Reagentes para análises ao sangue",Centro Hospitalar Vila Nova de Gaia (CHNVG) (508142156),HORIBA ABX - PORTUGAL (980158583),"8.703,93 €",12-04-2018,11-04-2018,300 dias,"Portugal, Porto, Vila Nova de Gaia","Artigo 24.º, n.º 1, alínea e) do Código dos Contratos Públicos",,,,,,Não aplicável.,Não aplicável.,FALSE
Aquisição de Sacos de Drenagem para Hemodiálise - FMC,Ajuste Direto Regime Geral,Aquisição de bens móveis,"33100000-1, Equipamento médico","Centro Hospitalar Vila Nova de Gaia - Espinho, E. P. E. (508142156)","FRESENIUS MEDICAL CARE PORTUGAL, SA (503070220)","9.895,20 €",12-04-2018,11-04-2018,270 dias,"Portugal, Porto, Vila Nova de Gaia","Artigo 24.º, n.º 1, alínea e), subalínea ii) do Código dos Contratos Públicos",,,,,,Não aplicável.,Não aplicável.,FALSE
Parafusos para craneoplastia,Ajuste Direto Regime Geral,Aquisição de bens móveis,"33100000-1, Equipamento médico","Centro Hospitalar Vila Nova de Gaia - Espinho, E. P. E. (508142156)","EUROCASMEDICA,S.A. (503322105)","14.300,00 €",11-04-2018,20-03-2018,280 dias,"Portugal, Porto, Vila Nova de Gaia","Artigo 24.º, n.º 1, alínea e) do Código dos Contratos Públicos",,,,,,Não aplicável.,Não aplicável.,FALSE
Ajuste Direto nº 1135418 - Aquisição de Medicamento E220 - Emtricitabina + Tenofovir 200 mg; cáp/ comp] - Proceso SPMS AD-2018-6,Ajuste Direto Regime Geral,Aquisição de bens móveis,"33600000-6, Produtos farmacêuticos","Centro Hospitalar Vila Nova de Gaia - Espinho, E. P. E. (508142156)","Gilead Sciences, Lda. (503604704)","40.448,04 €",11-04-2018,10-04-2018,365 dias,"Portugal, Porto, Vila Nova de Gaia","Artigo 24.º, n.º 1, alínea e), subalínea iii) do Código dos Contratos Públicos",,,,,,Não aplicável.,Não aplicável.,FALSE
Medicamentos Exclusivos Janssen Ano 2018,Ajuste Direto Regime Geral,Aquisição de bens móveis,"33600000-6, Produtos farmacêuticos","Centro Hospitalar Vila Nova de Gaia - Espinho, E. P. E. (508142156)","Janssen Cilag Farmacêutica, Lda. (500189412)","168.250,40 €",11-04-2018,10-04-2018,365 dias,"Portugal, Porto, Vila Nova de Gaia","Artigo 24.º, n.º 1, alínea e) do Código dos Contratos Públicos",,,,,,Não aplicável.,Não aplicável.,FALSE
