Objeto do Contrato,Tipo de Procedimento,Tipo(s) de Contrato,CPVs,Entidade(s) Adjudicante(s),Entidade(s) Adjudicatária(s),Preço Contratual,Data de Publicação,Data de Celebração do Contrato,Prazo de Execução,Local de Execução,Fundamentação,Data de Fecho do Contrato,Preço Total Efetivo,Causas das Alterações ao Prazo,Causas das Alterações ao Preço,Estado,N.º registo do Acordo Quadro,Descrição do Acordo Quadro,Procedimento Centralizado
"Realização de obras de beneficiação do arruamento de acesso à Urgência de Obstetrícia e Ginecologia do CHSJ, EPE",Ajuste Direto Regime Geral,Concessão de obras públicas,"50000000-5, Serviços de reparação e manutenção","Centro Hospitalar de São João, E. P. E. (509821197)",Teixeira Duarte SA (500097488),"57.887,91 €",16-12-2013,06-11-2013,15 dias,"Portugal, Porto, Porto","Artigo 19.º, alínea a) do Código dos Contratos Públicos",,,,,,Não aplicável.,Não aplicável.,
"Integração entre a Plataforma Única de Integração e o sistema Clinidata na Patologia Clínica, do CHSJ, EPE, no âmbito do Projeto ePatientCentric",Ajuste Direto Regime Geral,Aquisição de serviços,"72500000-0, Serviços relacionados com a informática","Centro Hospitalar de São João, E. P. E. (509821197)",Maxdata Software SA (502250259),"9.900,00 €",12-12-2013,05-12-2013,30 dias,"Portugal, Porto, Porto","Artigo 24.º, n.º 1, alínea e) do Código dos Contratos Públicos",,,,,,Não aplicável.,Não aplicável.,
"Monitorização das integrações implementadas entre o Sistema Clinidata e a Plataforma Única de Integração, para o CHSJ, EPE, no âmbito do Projeto ePatientCentric",Ajuste Direto Regime Geral,Aquisição de serviços,"72500000-0, Serviços relacionados com a informática","Centro Hospitalar de São João, E. P. E. (509821197)","Maxdata Software, SA (502250259)","9.750,00 €",12-12-2013,05-12-2013,30 dias,"Portugal, Porto, Porto","Artigo 24.º, n.º 1, alínea e) do Código dos Contratos Públicos",,,,,,Não aplicável.,Não aplicável.,
"Integração do Laboratório de Hematologia Clínica e o Sistema de Informação Clinidata, para o CHSJ, EPE, no âmbito do Projeto ePatientCentric",Ajuste Direto Regime Geral,Aquisição de serviços,"72500000-0, Serviços relacionados com a informática","Centro Hospitalar de São João, E. P. E. (509821197)","Maxdata Software, SA (502250259)","9.900,00 €",12-12-2013,11-12-2013,30 dias,"Portugal, Porto, Porto","Artigo 24.º, n.º 1, alínea e) do Código dos Contratos Públicos",,,,,,Não aplicável.,Não aplicável.,
"Integração do Sistema Informação Clinidata com o Microsoft Active Directory, para o CHSJ, EPE, no âmbito do Projeto ePatientCentric",Ajuste Direto Regime Geral,Aquisição de serviços,"72500000-0, Serviços relacionados com a informática","Centro Hospitalar de São João, E. P. E. (509821197)",Maxdata Software SA (502250259),"9.650,00 €",12-12-2013,11-12-2013,30 dias,"Portugal, Porto, Porto","Artigo 24.º, n.º 1, alínea e) do Código dos Contratos Públicos",,,,,,Não aplicável.,Não aplicável.,
"Integração do Sistema Informação SIIMA com o Microsfot Active Directory para o CHSJ, EPE, no âmbito do Projeto ePatientCentric",Ajuste Direto Regime Geral,Aquisição de serviços,"72500000-0, Serviços relacionados com a informática","Centro Hospitalar de São João, E. P. E. (509821197)","First Solutions Sistemas de Informação, SA (505345978)","9.734,65 €",12-12-2013,11-12-2013,30 dias,"Portugal, Porto, Porto","Artigo 24.º, n.º 1, alínea e) do Código dos Contratos Públicos",,,,,,Não aplicável.,Não aplicável.,
"Integração entre Plataforma Única de Integração Portais Balcão Único e o Sistema Informação SIIMA, do CHSJ, EPE no âmbito don Projeto ePatientCentric",Ajuste Direto Regime Geral,Aquisição de serviços,"72500000-0, Serviços relacionados com a informática","Centro Hospitalar de São João, E. P. E. (509821197)",First Solutions - Sistemas Informação SA (505345978),"9.933,23 €",12-12-2013,11-12-2013,30 dias,"Portugal, Porto, Porto","Artigo 24.º, n.º 1, alínea e) do Código dos Contratos Públicos",,,,,,Não aplicável.,Não aplicável.,
"Integração da aplicação SINGAP e o Sistema Gestão Documental do CHSJ, EPE, no âmbito do Projeto ePatientCentric",Ajuste Direto Regime Geral,Aquisição de serviços,"72500000-0, Serviços relacionados com a informática","Centro Hospitalar de São João, E. P. E. (509821197)",Wemake - Tecnologias de Informação Lda. (506097250),"5.500,00 €",12-12-2013,11-12-2013,30 dias,"Portugal, Porto, Porto","Artigo 24.º, n.º 1, alínea e) do Código dos Contratos Públicos",,,,,,Não aplicável.,Não aplicável.,
"Integração do Sistema Gestão Documental com o Sistema de Exposições de Ocorrências e Não Conformidades do CHSJ, EPE, no âmbito do Projeto ePatientCentric",Ajuste Direto Regime Geral,Aquisição de serviços,"72500000-0, Serviços relacionados com a informática","Centro Hospitalar de São João, E. P. E. (509821197)",Wemake - Tecnologias Informação Lda. (506097250),"9.750,00 €",12-12-2013,11-12-2013,30 dias,"Portugal, Porto, Porto","Artigo 24.º, n.º 1, alínea e) do Código dos Contratos Públicos",,,,,,Não aplicável.,Não aplicável.,
"Integração do Sistema Gestão Documental com o RHV do CHSJ, EPE, no âmbito do Projeto ePatientCentric",Ajuste Direto Regime Geral,Aquisição de serviços,"72500000-0, Serviços relacionados com a informática","Centro Hospitalar de São João, E. P. E. (509821197)","Wemake Tecnologias de Informação, Lda. (506097250)","4.000,00 €",12-12-2013,11-12-2013,30 dias,"Portugal, Porto, Porto","Artigo 24.º, n.º 1, alínea e) do Código dos Contratos Públicos",,,,,,Não aplicável.,Não aplicável.,
