Objeto do Contrato,Tipo de Procedimento,Tipo(s) de Contrato,CPVs,Entidade(s) Adjudicante(s),Entidade(s) Adjudicatária(s),Preço Contratual,Data de Publicação,Data de Celebração do Contrato,Prazo de Execução,Local de Execução,Fundamentação,Data de Fecho do Contrato,Preço Total Efetivo,Causas das Alterações ao Prazo,Causas das Alterações ao Preço,Estado,N.º registo do Acordo Quadro,Descrição do Acordo Quadro,Procedimento Centralizado
Narcóticos e Psicofármacos,Ajuste Direto Regime Geral,Aquisição de serviços,"33661200-3, Analgésicos","Administração Regional de Saúde do Algarve, I.P. (503148709)",D L A Farmacêutica S.A (503894427),"6.894,40 €",23-08-2011,18-08-2011,130 dias,"Portugal, Faro, Faro","Artigo 24.º, n.º 1, alínea e) do Código dos Contratos Públicos",,,,,,Não aplicável.,Não aplicável.,
Fornecimento e Montagem Estantes Metálicas Carga Média e Pesada para Farmácia,Ajuste Direto Regime Geral,Aquisição de bens móveis,"39141100-3, Estantes","Administração Regional de Saúde do Algarve, I.P. (503148709)","Imoart Arte e Decorações, Lda (501336877)","4.696,00 €",23-08-2011,18-08-2011,5 dias,"Portugal, Faro, Faro","Artigo 20.º, n.º 1, alínea a) do Código dos Contratos Públicos",,,,,,Não aplicável.,Não aplicável.,
Morfina Solução Oral,Ajuste Direto Regime Geral,Aquisição de serviços,"33661200-3, Analgésicos","Administração Regional de Saúde do Algarve, I.P. (503148709)","Grunenthal, S.A (500101965)","556,00 €",23-08-2011,19-08-2011,130 dias,"Portugal, Faro, Faro","Artigo 24.º, n.º 1, alínea e) do Código dos Contratos Públicos",,,,,,Não aplicável.,Não aplicável.,
