freguesia,acronym,validVotesPercentage,votes,dicofre
Maceira,PS,33.32,907,100913
Maceira,PPD/PSD.CDS-PP,32.95,897,100913
Maceira,MPT,8.23,224,100913
Maceira,PCP-PEV,8.16,222,100913
Maceira,B.E.,5.47,149,100913
Maceira,L,2.65,72,100913
Maceira,PCTP/MRPP,2.65,72,100913
Maceira,PAN,1.76,48,100913
Maceira,PND,0.96,26,100913
Maceira,MAS,0.88,24,100913
Maceira,PNR,0.77,21,100913
Maceira,PPM,0.77,21,100913
Maceira,PTP,0.59,16,100913
Maceira,PPV,0.4,11,100913
Maceira,PDA,0.22,6,100913
Maceira,POUS,0.22,6,100913
