Objeto do Contrato,Tipo de Procedimento,Tipo(s) de Contrato,CPVs,Entidade(s) Adjudicante(s),Entidade(s) Adjudicatária(s),Preço Contratual,Data de Publicação,Data de Celebração do Contrato,Prazo de Execução,Local de Execução,Fundamentação,Data de Fecho do Contrato,Preço Total Efetivo,Causas das Alterações ao Prazo,Causas das Alterações ao Preço,Estado,N.º registo do Acordo Quadro,Descrição do Acordo Quadro,Procedimento Centralizado
Mobiliário Hospitalar.,Ajuste Direto Regime Geral,Aquisição de bens móveis,"33100000-1, Equipamento médico","Administração Regional de Saúde do Norte, I.P. (503135593)",Sterimed II (509517676),"30.234,00 €",29-06-2011,07-04-2011,5 dias,"Portugal, Porto, Gondomar","Artigo 20.º, n.º 1, alínea a) do Código dos Contratos Públicos","","",,,,Não aplicável.,Não aplicável.,
"Aquisição de LCD, DVD e suporte de LCD e DVD",Ajuste Direto Regime Geral,Aquisição de bens móveis,"32000000-3, Equipamento de rádio, televisão, comunicação, telecomunicações e afins","Administração Regional de Saúde do Norte, I.P. (503135593)","R. S. & Santos - Distribuição de  Electródomesticos, Lda (506819973), Cor e Som - Electrodomésticos, Lda (500930554)","342,39 €",29-06-2011,06-05-2011,8 dias,"Portugal, Porto, Gondomar","Artigo 20.º, n.º 1, alínea a) do Código dos Contratos Públicos","","",,,,Não aplicável.,Não aplicável.,
"Aquisição de armário em inox, armário vitrine, banco rotativo, cadeira de rodas, divã pediátrico, fraldário, balde para fraldário, divã eletrico, divã eletrico ginecológico, balança com craveira, balança de chão, balança pediátrica, candeeiro halogénio, mesa pª  balança pediátrica, carro de pensos, suporte de soro, maca.",Ajuste Direto Regime Geral,Aquisição de bens móveis,"33100000-1, Equipamento médico","Administração Regional de Saúde do Norte, I.P. (503135593)","Sterimed II - Assistência Técnica de Equipamentos Médico-Hospitalares, Lda (509517676)","21.864,00 €",29-06-2011,01-04-2011,5 dias,"Portugal, Porto, Baião","Artigo 20.º, n.º 1, alínea a) do Código dos Contratos Públicos","","",,,,Não aplicável.,Não aplicável.,
"Aquisição de monofilamentos, electrocardiógrafos, desfibrilhador, nebulizador, esfignomanómetros, dopller fetal e vascular, oto-oftalmoscópio, ambu pediátrico e adulto, diapasão, aspirador de secreções, laringoscópio, carro de urgência, esfignomanometros, pelicómetro, carro transporte garrafa de oxigénio e otoscópio.",Ajuste Direto Regime Geral,Aquisição de bens móveis,"33100000-1, Equipamento médico","Administração Regional de Saúde do Norte, I.P. (503135593)","Sterimed II - Assistência Técnica de Equipamentos Médico-Hospitalares, Lda (509517676)","9.746,00 €",29-06-2011,12-04-2011,5 dias,"Portugal, Porto, Baião","Artigo 20.º, n.º 1, alínea a) do Código dos Contratos Públicos","","",,,,Não aplicável.,Não aplicável.,
Climatização e Ventilação Armazém Vila Real,Ajuste Direto Regime Geral,Empreitadas de obras públicas,"45331200-8, Instalação de ventilação e de ar condicionado","Administração Regional de Saúde do Norte, I.P. (503135593)","Climave, Equipamentos Electricomecânicos, Lda (503926140)","66.431,72 €",21-06-2011,15-06-2011,30 dias,"Portugal, Vila Real, Vila Real","Artigo 19.º, alínea a) do Código dos Contratos Públicos",14-09-2011,"66.431,72 €",,,,Não aplicável.,Não aplicável.,
Reparação Cobertura US Águas Santas,Ajuste Direto Regime Geral,Empreitadas de obras públicas,"45261900-3, Obras de reparação e manutenção de coberturas","Administração Regional de Saúde do Norte, I.P. (503135593)","Joaquina Moreira Dias, Construtores, Lda (501857966)","14.179,20 €",21-06-2011,11-05-2011,60 dias,"Portugal, Porto, Maia","Artigo 19.º, alínea a) do Código dos Contratos Públicos",05-09-2011,"14.179,20 €",,,,Não aplicável.,Não aplicável.,
Sinalética USF Modivas,Ajuste Direto Regime Geral,Empreitadas de obras públicas,"44423450-0, Placas sinaléticas","Administração Regional de Saúde do Norte, I.P. (503135593)",Degradê Publicidade (505637677),"5.379,00 €",21-06-2011,05-05-2011,30 dias,"Portugal, Porto, Vila do Conde","Artigo 19.º, alínea a) do Código dos Contratos Públicos",14-10-2011,"5.379,00 €",,,,Não aplicável.,Não aplicável.,
Tratamento Água USF Ao Encontro da Saúde,Ajuste Direto Regime Geral,Empreitadas de obras públicas,"45232430-5, Tratamento de águas","Administração Regional de Saúde do Norte, I.P. (503135593)","Watergen - A nálise e Tratamento de Águas, Lda (507487443)","8.923,25 €",21-06-2011,12-05-2011,30 dias,"Portugal, Porto, Trofa","Artigo 19.º, alínea a) do Código dos Contratos Públicos",27-10-2011,"8.923,25 €",,,,Não aplicável.,Não aplicável.,
