freguesia,acronym,validVotesPercentage,votes,dicofre
Casal Comba,PS,50.26,389,011103
Casal Comba,PPD/PSD.CDS-PP,22.35,173,011103
Casal Comba,MPT,8.01,62,011103
Casal Comba,PCP-PEV,7.62,59,011103
Casal Comba,B.E.,5.3,41,011103
Casal Comba,PCTP/MRPP,1.55,12,011103
Casal Comba,PAN,1.42,11,011103
Casal Comba,L,1.16,9,011103
Casal Comba,MAS,0.52,4,011103
Casal Comba,PNR,0.52,4,011103
Casal Comba,PPM,0.52,4,011103
Casal Comba,PND,0.39,3,011103
Casal Comba,PPV,0.26,2,011103
Casal Comba,PDA,0.13,1,011103
Casal Comba,POUS,0,0,011103
Casal Comba,PTP,0,0,011103
