freguesia,acronym,validVotesPercentage,votes,dicofre
Vinhais,PS,51.53,319,041235
Vinhais,PPD/PSD.CDS-PP,29.73,184,041235
Vinhais,MPT,4.2,26,041235
Vinhais,PCP-PEV,4.04,25,041235
Vinhais,B.E.,3.39,21,041235
Vinhais,PAN,1.62,10,041235
Vinhais,MAS,0.97,6,041235
Vinhais,PCTP/MRPP,0.97,6,041235
Vinhais,PND,0.97,6,041235
Vinhais,L,0.81,5,041235
Vinhais,PNR,0.65,4,041235
Vinhais,PPM,0.65,4,041235
Vinhais,PTP,0.32,2,041235
Vinhais,PPV,0.16,1,041235
Vinhais,PDA,0,0,041235
Vinhais,POUS,0,0,041235
