Objeto do Contrato,Tipo de Procedimento,Tipo(s) de Contrato,CPVs,Entidade(s) Adjudicante(s),Entidade(s) Adjudicatária(s),Preço Contratual,Data de Publicação,Data de Celebração do Contrato,Prazo de Execução,Local de Execução,Fundamentação,Data de Fecho do Contrato,Preço Total Efetivo,Causas das Alterações ao Prazo,Causas das Alterações ao Preço,Estado,N.º registo do Acordo Quadro,Descrição do Acordo Quadro,Procedimento Centralizado
"5-9133/15 - Aluguer de viatura com motorista p/ transporte de produtos sanguíneos, entre o CSTC e CSTP do IPST, IP.  ",Ajuste Direto Regime Geral,Aquisição de serviços,"60170000-0, Aluguer de veículos para transporte de passageiros com condutor","Instituto Português do Sangue e da Transplantação, I. P. (502423943)",Bioexpress (509855210),"17.632,00 €",18-06-2015,15-06-2015,90 dias,"Portugal, Coimbra, Coimbra","Artigo 20.º, n.º 1, alínea a) do Código dos Contratos Públicos",,,,,,Não aplicável.,Não aplicável.,FALSE
"5-9012/15 - Prestação de Serviços em Regime de Avença na Área da Manutenção do Edifício , IPST, IT, Durante o ano 2015 ",Ajuste Direto Regime Geral,Aquisição de serviços,"50710000-5, Serviços de reparação e manutenção de equipamento eléctrico e mecânico em edifícios","Instituto Português do Sangue e da Transplantação, I. P. (502423943)",Francisco Samarro Bonito (120861879),"14.256,00 €",12-06-2015,04-06-2015,365 dias,"Portugal, Lisboa, Lisboa","Artigo 20.º, n.º 1, alínea a) do Código dos Contratos Públicos",,,,,,Não aplicável.,Não aplicável.,FALSE
