Objeto do Contrato,Tipo de Procedimento,Tipo(s) de Contrato,CPVs,Entidade(s) Adjudicante(s),Entidade(s) Adjudicatária(s),Preço Contratual,Data de Publicação,Data de Celebração do Contrato,Prazo de Execução,Local de Execução,Fundamentação,Data de Fecho do Contrato,Preço Total Efetivo,Causas das Alterações ao Prazo,Causas das Alterações ao Preço,Estado,N.º registo do Acordo Quadro,Descrição do Acordo Quadro,Procedimento Centralizado
"Aquisição de Reagentes p/ os Lab. Doenças Transmissíveis do IPST, IP",Ajuste Direto Regime Geral,Aquisição de bens móveis,"33696200-7, Reagentes para análises ao sangue","Instituto Português do Sangue e da Transplantação, I. P. (502423943)","Abbott Laboratórios, Lda (500006148)","207.030,20 €",07-06-2018,14-05-2018,60 dias,"Portugal, Lisboa, Lisboa<BR/>Portugal, Porto, Porto","Artigo 26.º, n.º 1, alínea a) do Código dos Contratos Públicos",,,,,,Não aplicável.,Não aplicável.,FALSE
"36.000 Sacos Quádruplos CPD c/filtro RC TOP&BOTTOM, Sistema de Amostras",Ajuste Direto Regime Geral,Aquisição de bens móveis,"33141613-0, Sacos para sangue","Instituto Português do Sangue e da Transplantação, I. P. (502423943)","Fresenius Kabi Pharma Portugal, Ldª (504293753)","293.760,00 €",06-06-2018,08-05-2018,60 dias,"Portugal, Lisboa, Lisboa<BR/>Portugal, Coimbra, Coimbra<BR/>Portugal, Porto, Porto","Artigo 26.º, n.º 1, alínea a) do Código dos Contratos Públicos",,,,,,Não aplicável.,Não aplicável.,FALSE
