Objeto do Contrato,Tipo de Procedimento,Tipo(s) de Contrato,CPVs,Entidade(s) Adjudicante(s),Entidade(s) Adjudicatária(s),Preço Contratual,Data de Publicação,Data de Celebração do Contrato,Prazo de Execução,Local de Execução,Fundamentação,Data de Fecho do Contrato,Preço Total Efetivo,Causas das Alterações ao Prazo,Causas das Alterações ao Preço,Estado,N.º registo do Acordo Quadro,Descrição do Acordo Quadro,Procedimento Centralizado
AQUISIÇÃO DE MEDICAMENTOS NOS TERMOS E QUANTIDADES QUE CONSTAM DO ANEXO II AO PRESENTE CONVITE,Ao abrigo de acordo-quadro (art.º 259.º),Aquisição de bens móveis,"33600000-6, Produtos farmacêuticos","Centro Hospitalar Póvoa de Varzim - Vila do Conde, E. P. E. (508741823)",ABBVIE LDA (510229050),"68.148,90 €",27-07-2018,29-12-2017,365 dias,"Portugal, Porto, Póvoa de Varzim",Artigo 259.º do Código dos Contratos Públicos,,,,,,1771819,CP 2015/6 - Acordo quadro para o fornecimento de Medicamentos do Foro Oncológico,TRUE
AQUISIÇÃO DE MEDICAMENTOS NOS TERMOS E QUANTIDADES QUE CONSTAM DO ANEXO II AO PRESENTE CONVITE,Ao abrigo de acordo-quadro (art.º 259.º),Aquisição de bens móveis,"33600000-6, Produtos farmacêuticos","Centro Hospitalar Póvoa de Varzim/Vila do Conde, EPE (508741823)","MERCK, SHARP & DOHME, LDA (500191360)","33.433,65 €",27-07-2018,29-12-2017,365 dias,"Portugal, Porto, Póvoa de Varzim",Artigo 259.º do Código dos Contratos Públicos,,,,,,1338581,"Acordo quadro para fornecimento de Medicação antialérgica, medicamentos usados no tratamento de intoxicações, vitaminas e sais minerais e grupo 20.9 - outros produtos às instituições e serviços do serviço nacional de saúde",TRUE
