Objeto do Contrato,Tipo de Procedimento,Tipo(s) de Contrato,CPVs,Entidade(s) Adjudicante(s),Entidade(s) Adjudicatária(s),Preço Contratual,Data de Publicação,Data de Celebração do Contrato,Prazo de Execução,Local de Execução,Fundamentação,Data de Fecho do Contrato,Preço Total Efetivo,Causas das Alterações ao Prazo,Causas das Alterações ao Preço,Estado,N.º registo do Acordo Quadro,Descrição do Acordo Quadro,Procedimento Centralizado
FORNECIMENTO DE MATERIAL DE OSTEOSSINTES,Concurso público,Aquisição de bens móveis,"33183100-7, Implantes ortopédicos","Centro Hospitalar do Baixo Vouga, E. P. E (CHBV, E. P. E.) (510123210)","SMITH & NEPHEW, LDA (503552461)","255.025,00 €",25-10-2017,22-05-2017,365 dias,"Portugal, Aveiro, Aveiro","Artigo 20.º, n.º 1, alínea b) do Código dos Contratos Públicos","","","",,,Não aplicável.,Não aplicável.,FALSE
PRODUTOS FARMACÊUTICOS RUBRICA 31619,Ajuste Direto Regime Geral,Aquisição de bens móveis,"33690000-3, Medicamentos vários","Centro Hospitalar do Baixo Vouga, E.P.E. (510123210)",ALCON PORTUGAL (501251685),"792,00 €",23-10-2017,08-06-2017,365 dias,"Portugal, Aveiro","Artigo 20.º, n.º 1, alínea a) do Código dos Contratos Públicos","","","",,,Não aplicável.,Não aplicável.,FALSE
PRODUTOS FARMACÊUTICOS RUBRICA 31619,Ajuste Direto Regime Geral,Aquisição de bens móveis,"33690000-3, Medicamentos vários","Centro Hospitalar do Baixo Vouga, E.P.E. (510123210)",ABBOTT MEDICAL OPTICS SPAIN S.L. (980262364),"30.322,50 €",23-10-2017,21-06-2017,365 dias,"Portugal, Aveiro","Artigo 20.º, n.º 1, alínea a) do Código dos Contratos Públicos","","","",,,Não aplicável.,Não aplicável.,FALSE
"MEDICAMENTOS ANALGÉSICOS, ANTIPIRÉTICOS E ANTIDEPRESSIVOS (CP 2016/44-SPMS)",Ao abrigo de acordo-quadro (art.º 259.º),Aquisição de bens móveis,"33661000-1, Medicamentos para o sistema nervoso","Centro Hospitalar do Baixo Vouga, E. P. E. (510123210)","GRUNENTHAL SA                                      (500101965), ANGELINI FARMACÊUTICA, LDA.                        (500583650), B BRAUN MEDICAL, LDA (501506543), Janssen Cilag Farmacêutica, Lda (500189412), OVERPHARMA - PRODUTOS MEDICOS E FARM.              (505792362), TECNIMEDE, S.A. (500626413), LABESFAL-LABORATORIOS ALMIRO, SA (501169580), Siderfarma - Sociedade Industrial de Expansão Farmacêutica, SA (500717419), LAB. MEDINFAR, SA.                                 (500384045), FERRER PORTUGAL S.A. (500069190), GLAXOSMITHKLINE-PROD. FARMACÊUTICOS, LDA.          (500139962)","80.834,54 €",23-10-2017,29-05-2017,365 dias,"Portugal, Aveiro",Artigo 259.º do Código dos Contratos Públicos,"","","",,,1974985,"Medicamentos Analgésicos, Antipiréticos e Antidepressivos",FALSE
Empreitada Remodelação da Sala de Espera e WC's da Consulta Externa da Unidade de Aveiro do CHBV,Ajuste Direto Regime Geral,Empreitadas de obras públicas,"45454000-4, Obras de reestruturação","Centro Hospitalar do Baixo Vouga, E. P. E. (510123210)","Pavinatur-Pavimentos Unipessoal, Lda. (505728109)","31.683,80 €",23-10-2017,22-09-2017,15 dias,"Portugal, Aveiro, Aveiro","Artigo 19.º, alínea a) do Código dos Contratos Públicos","","31.683,80 €",Os trabalhos foram executados dentro do prazo.,,,Não aplicável.,Não aplicável.,FALSE
Aquisição equipamento Informático,Concurso público,Aquisição de bens móveis,"30000000-9, Máquinas, equipamento e material de escritório e de informática, excepto mobiliário e pacotes de programas (software)","Centro Hospitalar do Baixo Vouga, E.P.E. (510123210)","MEO - SERVIÇOS DE COMUNICAÇÕES E MULTIMÉDIA, S.A. (504615947)","44.653,76 €",23-10-2017,07-09-2017,30 dias,"Portugal, Aveiro, Aveiro","Artigo 20.º, n.º 1, alínea b) do Código dos Contratos Públicos",18-12-2017,"44.653,76 €","",,,Não aplicável.,Não aplicável.,TRUE
MEIOS DE DIAGNOSTICO IMAGIOLOGIA,Ao abrigo de acordo-quadro (art.º 259.º),Aquisição de bens móveis,"33694000-1, Meios de diagnóstico","Centro Hospitalar do Baixo Vouga, E. P. E (CHBV, E. P. E.) (510123210)","BAYER PORTUGAL, SA.                                (500043256)","40.912,00 €",23-10-2017,30-11-2016,365 dias,"Portugal, Aveiro, Aveiro",Artigo 259.º do Código dos Contratos Públicos,"","","",,,1473614,CP 2015/56 - Acordo quadro para fornecimento de medicamentos usados como meios de diagnóstico em Imagiologia às Instituições e Serviços do Serviço Nacional de Saúde,FALSE
EXCLUSIVO ViiV HEALTHCARE DOLUTEGRAVIR 50 MG+ABACAVIR 600 MG+LAMIVUDINA 300 MG,Ajuste Direto Regime Geral,Aquisição de bens móveis,"33651000-8, Anti-infecciosos gerais de uso sistémico","Centro Hospitalar do Baixo Vouga, E.P.E. (510123210)","VIIVHIV HEALTHCARE, UNIPESSOAL. LDA                (509117961)","181.025,88 €",23-10-2017,02-12-2016,365 dias,"Portugal, Aveiro","Artigo 24.º, n.º 1, alínea e) do Código dos Contratos Públicos","","","",,,Não aplicável.,Não aplicável.,FALSE
