Objeto do Contrato,Tipo de Procedimento,Tipo(s) de Contrato,CPVs,Entidade(s) Adjudicante(s),Entidade(s) Adjudicatária(s),Preço Contratual,Data de Publicação,Data de Celebração do Contrato,Prazo de Execução,Local de Execução,Fundamentação,Data de Fecho do Contrato,Preço Total Efetivo,Causas das Alterações ao Prazo,Causas das Alterações ao Preço,Estado,N.º registo do Acordo Quadro,Descrição do Acordo Quadro,Procedimento Centralizado
Aquisição Serviços Globais - 2018 ADSE.,Ajuste Direto Regime Geral,Aquisição de bens móveis,"48900000-7, Pacote de software e sistemas informáticos diversos","Instituto de Proteção e Assistência na Doença, I. P. (514247517)","Documática -  Sistemas de Processamento de Meios de Pagamento e Imagem, Lda. (503311111)","99.113,19 €",05-04-2018,12-02-2018,365 dias,"Portugal, Lisboa, Lisboa","Artigo 24.º, n.º 1, alínea e) do Código dos Contratos Públicos",,,,,,Não aplicável.,Não aplicável.,TRUE
Manutenção e Administração dos Sistemas SIGEB e SICOF 2018 - ADSE.,Ajuste Direto Regime Geral,Aquisição de bens móveis,"48900000-7, Pacote de software e sistemas informáticos diversos","Instituto de Proteção e Assistência na Doença, I. P. (514247517)","Glintt-Global Intelligent Technologies, S.A. (503541320)","75.151,12 €",05-04-2018,12-02-2018,365 dias,"Portugal, Lisboa, Lisboa","Artigo 24.º, n.º 1, alínea e) do Código dos Contratos Públicos",,,,,,Não aplicável.,Não aplicável.,TRUE
"Desenvolvimento dos Sistemas SIGEB E SICOF-2018 ADSE, I.P..",Ajuste Direto Regime Geral,Aquisição de bens móveis,"48900000-7, Pacote de software e sistemas informáticos diversos","Instituto de Proteção e Assistência na Doença, I. P. (514247517)","Glintt-Global Intelligent Technologies, S.A. (503541320)","98.010,00 €",04-04-2018,12-02-2018,365 dias,"Portugal, Lisboa, Lisboa","Artigo 24.º, n.º 1, alínea e) do Código dos Contratos Públicos",,,,,,Não aplicável.,Não aplicável.,TRUE
