Objeto do Contrato,Tipo de Procedimento,Tipo(s) de Contrato,CPVs,Entidade(s) Adjudicante(s),Entidade(s) Adjudicatária(s),Preço Contratual,Data de Publicação,Data de Celebração do Contrato,Prazo de Execução,Local de Execução,Fundamentação,Data de Fecho do Contrato,Preço Total Efetivo,Causas das Alterações ao Prazo,Causas das Alterações ao Preço,Estado,N.º registo do Acordo Quadro,Descrição do Acordo Quadro,Procedimento Centralizado
"Prestação de serviços de manutenção e Assistência Técnica de eletricidade ao QGBT, PT, postos de seccionamento e grupo eletrogéneo de emergência ",Ajuste Direto Regime Geral,Aquisição de serviços,"50711000-2, Serviços de reparação e manutenção de equipamento eléctrico em edifícios","Centro Hospitalar do Tâmega e Sousa, EPE (508318262)","Circuitos de Inovação - Soluções Energéticas, Unip., Lda (507910826)","7.925,00 €",29-08-2013,01-08-2013,153 dias,"Portugal, Porto, Amarante<BR/>Portugal, Porto, Penafiel","Artigo 20.º, n.º 1, alínea a) do Código dos Contratos Públicos",31-12-2013,"7.925,00 €",,"",,Não aplicável.,Não aplicável.,
Fornecimento de Candeeiros Cirurgicos para Bloco Operatório,Ajuste Direto Regime Geral,Aquisição de bens móveis,"33100000-1, Equipamento médico","Centro Hospitalar do Tâmega e Sousa, E.P.E. (508318262)","Medicinália Cormédica - Comercialização de Produtos Médico Hospitalares, Lda (500684324)","33.451,70 €",28-08-2013,19-07-2013,30 dias,"Portugal, Porto, Amarante","Artigo 20.º, n.º 1, alínea a) do Código dos Contratos Públicos",29-11-2013,"33.451,70 €",,"",,Não aplicável.,Não aplicável.,
Upgrade ou aquisição com retoma de Equipamento de Tomografia Axial Computorizada (TAC),Concurso público,Aquisição de bens móveis,"33115000-9, Aparelhos para tomografia","Centro Hospitalar do Tâmega e Sousa, EPE (508318262)","Philips Portuguesa, S.A. (500216843)","189.950,00 €",28-08-2013,27-07-2013,29 dias,"Portugal, Porto, Amarante","Artigo 20.º, n.º 1, alínea b) do Código dos Contratos Públicos",29-11-2013,"189.950,00 €",,"",,Não aplicável.,Não aplicável.,
Prestação de serviços de Segurança e Vigilância,Ajuste Direto Regime Geral,Aquisição de serviços,"79710000-4, Serviços de segurança","Centro Hospitalar do Tâmega e Sousa, EPE (508318262)","Ronsegur, Rondas e Segurança, Lda (507011724)","187.267,40 €",28-08-2013,27-06-2013,180 dias,"Portugal, Porto, Penafiel<BR/>Portugal, Porto, Amarante","Artigo 27.º, n.º 1, alínea a) do Código dos Contratos Públicos",01-11-2013,"130.431,80 €",,"Procedimento adjudicado para um período máximo de 6 meses, tendo sido apenas executados 4 meses de contrato.",,Não aplicável.,Não aplicável.,
