Objeto do Contrato,Tipo de Procedimento,Tipo(s) de Contrato,CPVs,Entidade(s) Adjudicante(s),Entidade(s) Adjudicatária(s),Preço Contratual,Data de Publicação,Data de Celebração do Contrato,Prazo de Execução,Local de Execução,Fundamentação,Data de Fecho do Contrato,Preço Total Efetivo,Causas das Alterações ao Prazo,Causas das Alterações ao Preço,Estado,N.º registo do Acordo Quadro,Descrição do Acordo Quadro,Procedimento Centralizado
"Fornecimento de Diverso Material de Tratamento, para a ULSNA, EPE, para 2015",Concurso público,Aquisição de bens móveis,"33000000-0, Equipamento médico, medicamentos e produtos para cuidados pessoais","Unidade Local de Saúde do Norte Alentejano, E. P. E. (508094461)","QUILABAN QUIMICA LAB ANALITICA (500399670), COLOPLAST PORTUGAL SOCIEDADE UNIPESSOAL, LDA (503989037), SPECULUM ARTIGOS MEDICOS SA (502996323), EPJMEDICA ARTIGOS MEDICOS E HOSPITALARES (506820513), HOSPITEX - MATERIAL HOSPITALAR (501909842), VYGON PORTUGAL (503232785), MUNDINTER - INTERCAMBIO MUNDIAL DE COMERCIO SA (500199906), HR - Hospitalar, Lda. (501895558), MEDTRONIC PORTUGAL COMERCIO E DIST. APARELHOS MED. (504223933), INTERSURGICAL PORTUGAL (503480045), B BRAUN MEDICAL, LDA. (501506543), COVIDIEN PORTUGAL (503413410), TELEFLEX MEDICAL, S.A (980249783), PMH PRODUTOS MEDICO HOSPITALARES SA (502376899), PAUL HARTMANN (502271728), Medicinália Cormédica, Lda. (500684324), OVERPHARMA - PRODUTOS MEDICOS E FARM. (505792362)","67.595,85 €",08-06-2015,29-04-2015,247 dias,"Portugal, Portalegre","Artigo 20.º, n.º 1, alínea b) do Código dos Contratos Públicos",08-06-2015,"67.595,85 €",,,,Não aplicável.,Não aplicável.,FALSE
"PRESTAÇÃO DE SERVIÇOS DE MANUTENÇÃO DO SISTEMA DE INFORMAÇÃO ALERT-EDIS, ANO 2015",Ajuste Direto Regime Geral,Aquisição de serviços,"72000000-5, Serviços de TI: consultoria, desenvolvimento de software, Internet e apoio","Unidade Local de Saúde do Norte Alentejano, E. P. E. (508094461)","ALERT - LIFE SCIENCES COMPUTING, S.A. (507567455)","51.894,00 €",05-06-2015,01-06-2015,365 dias,"Portugal, Portalegre, Portalegre","Artigo 24.º, n.º 1, alínea e) do Código dos Contratos Públicos",01-06-2015,"51.894,00 €",,,,Não aplicável.,Não aplicável.,FALSE
PRESTAÇÃO DE SERVIÇOS DE FORMAÇÃO ÀS CHEFIAS NO ÂMBITO DA IMPLEMENTAÇÃO DE SISTEMA BIOMÉTRICO,Ajuste Direto Regime Geral,Aquisição de serviços,"80000000-4, Serviços de ensino e formação","Unidade Local de Saúde do Norte Alentejano, E. P. E. (508094461)","Sisqual, Lda. (502772298)","7.500,00 €",05-06-2015,04-09-2014,365 dias,"Portugal, Portalegre, Portalegre","Artigo 20.º, n.º 1, alínea a) do Código dos Contratos Públicos",04-09-2014,"7.500,00 €",,,,Não aplicável.,Não aplicável.,FALSE
"Aquisição de Sistemas Automatizados de Dispensa de Produtos Farmacêuticos para o Serviço de Cirurgia do HDJMG e Serviço de Urgência Básica de Ponte de Sôr - ULSNA, EPE",Ajuste Direto Regime Geral,Aquisição de bens móveis,"39300000-5, Equipamento diverso","Unidade Local de Saúde do Norte Alentejano, E. P. E. (508094461)",BIQ (504105337),"29.831,29 €",05-06-2015,28-05-2015,45 dias,"Portugal, Portalegre, Ponte de Sor","Artigo 20.º, n.º 1, alínea a) do Código dos Contratos Públicos","","",,,,Não aplicável.,Não aplicável.,FALSE
"Trabalhos de Caixilharia no Serviço de Internamento de Cirurgia do HDJMG - ULSNA, EPE.",Ajuste Direto Regime Geral,Empreitadas de obras públicas,"50000000-5, Serviços de reparação e manutenção","Unidade Local de Saúde do Norte Alentejano, E. P. E. (508094461)",José Sebastião (508415233),"7.677,92 €",05-06-2015,28-05-2015,20 dias,"Portugal, Portalegre, Portalegre","Artigo 19.º, alínea a) do Código dos Contratos Públicos","","",,,,Não aplicável.,Não aplicável.,FALSE
"Aquisição de Cortinas Hospitalares para o Serviço de Internamento de Cirurgia do HDJMG - ULSNA, EPE.",Ajuste Direto Regime Geral,Empreitadas de obras públicas<br/>Aquisição de bens móveis,"19000000-6, Materiais têxteis, de couro, de plástico e de borracha","Unidade Local de Saúde do Norte Alentejano, E. P. E. (508094461)",Eugénio Pereira (503989525),"10.224,96 €",03-06-2015,21-05-2015,20 dias,"Portugal, Portalegre, Portalegre","Artigo 19.º, alínea a) do Código dos Contratos Públicos","","",,,,Não aplicável.,Não aplicável.,FALSE
"PRESTAÇÃO DE SERVIÇOS DE REVISÃO LEGAL DE CONTAS, ANO 2015",Ajuste Direto Regime Geral,Aquisição de serviços,"79200000-6, Serviços de contabilidade, de auditoria e fiscais","Unidade Local de Saúde do Norte Alentejano, E. P. E. (508094461)","Mariquito, Correia & Associados - SROC n.º 31 (501362509)","7.784,64 €",03-06-2015,21-01-2015,365 dias,"Portugal, Portalegre, Portalegre","Artigo 24.º, n.º 1, alínea e) do Código dos Contratos Públicos",21-01-2015,"7.784,64 €",,,,Não aplicável.,Não aplicável.,FALSE
61004615 - Reagentes,Ajuste Direto Regime Geral,Aquisição de bens móveis,"33000000-0, Equipamento médico, medicamentos e produtos para cuidados pessoais","Unidade Local de Saúde do Norte Alentejano, E. P. E. (508094461)",ROCHE SISTEMA DE DIAGNOSTICOS (504282921),"6.838,80 €",02-06-2015,02-02-2015,30 dias,"Portugal, Portalegre, Portalegre<BR/>Portugal, Portalegre, Elvas","Artigo 24.º, n.º 1, alínea e) do Código dos Contratos Públicos",02-02-2015,"6.838,80 €",,,,Não aplicável.,Não aplicável.,FALSE
61004215 - Medicamentos,Ajuste Direto Regime Geral,Aquisição de bens móveis,"33000000-0, Equipamento médico, medicamentos e produtos para cuidados pessoais","Unidade Local de Saúde do Norte Alentejano, E. P. E. (508094461)",ROCHE SISTEMA DE DIAGNOSTICOS (504282921),"8.621,60 €",02-06-2015,02-02-2015,30 dias,"Portugal, Portalegre, Portalegre<BR/>Portugal, Portalegre, Elvas","Artigo 24.º, n.º 1, alínea e) do Código dos Contratos Públicos",02-02-2015,"8.621,60 €",,,,Não aplicável.,Não aplicável.,FALSE
"PRESTAÇÃO DE SERVIÇOS DO INTERFACE PYXIS, PARA O ANO 2014",Ajuste Direto Regime Geral,Aquisição de serviços,"72000000-5, Serviços de TI: consultoria, desenvolvimento de software, Internet e apoio","Unidade Local de Saúde do Norte Alentejano, E. P. E. (508094461)","GLINTT - HEALTHCARE SOLUTIONS, S.A (502479418)","6.150,00 €",02-06-2015,16-10-2014,365 dias,"Portugal, Portalegre, Portalegre","Artigo 24.º, n.º 1, alínea e) do Código dos Contratos Públicos",16-10-2014,"6.150,00 €",,,,Não aplicável.,Não aplicável.,FALSE
61003815 - Reagentes,Ajuste Direto Regime Geral,Aquisição de bens móveis,"33000000-0, Equipamento médico, medicamentos e produtos para cuidados pessoais","Unidade Local de Saúde do Norte Alentejano, E. P. E. (508094461)",ROCHE SISTEMA DE DIAGNOSTICOS (504282921),"8.224,37 €",02-06-2015,02-02-2015,30 dias,"Portugal, Portalegre, Portalegre<BR/>Portugal, Portalegre, Elvas","Artigo 24.º, n.º 1, alínea e) do Código dos Contratos Públicos",02-02-2015,"8.224,37 €",,,,Não aplicável.,Não aplicável.,FALSE
PRESTAÇÃO DE SERVIÇOS DE COPIA E IMPRESSÃO PARA O PERIODO DE JANEIRO A AGOSTO DE 2015,Ajuste Direto Regime Geral,Aquisição de serviços,"72500000-0, Serviços relacionados com a informática","Unidade Local de Saúde do Norte Alentejano, E. P. E. (508094461)",CREDITEX-ALUGUER DE EQUIPAMENTOS SA (502825812),"9.413,68 €",02-06-2015,12-02-2015,242 dias,"Portugal, Portalegre, Portalegre","Artigo 20.º, n.º 1, alínea a) do Código dos Contratos Públicos",12-02-2015,"9.413,68 €",,,,Não aplicável.,Não aplicável.,FALSE
61003715 - Medicamentos,Ajuste Direto Regime Geral,Aquisição de bens móveis,"33000000-0, Equipamento médico, medicamentos e produtos para cuidados pessoais","Unidade Local de Saúde do Norte Alentejano, E. P. E. (508094461)","AMGEN BIOFARMACÊUTICA, LDA.     (502942959)","8.935,20 €",02-06-2015,02-02-2015,30 dias,"Portugal, Portalegre, Elvas<BR/>Portugal, Portalegre, Portalegre","Artigo 24.º, n.º 1, alínea e) do Código dos Contratos Públicos",02-02-2015,"8.935,20 €",,,,Não aplicável.,Não aplicável.,FALSE
PRESTAÇÃO DE SERVIÇOS DE COPIA E IMPRESSAO PARA O PERIODO DE SETEMBRO A DEZEMBRO DE 2014,Ajuste Direto Regime Geral,Aquisição de serviços,"72500000-0, Serviços relacionados com a informática","Unidade Local de Saúde do Norte Alentejano, E. P. E. (508094461)",CREDITEX-ALUGUER DE EQUIPAMENTOS SA (502825812),"5.157,56 €",02-06-2015,20-11-2014,120 dias,"Portugal, Portalegre, Portalegre","Artigo 24.º, n.º 1, alínea c) do Código dos Contratos Públicos",20-11-2014,"5.157,56 €",,,,Não aplicável.,Não aplicável.,FALSE
MEDICAMENTOS BOSENTANO,Ajuste Direto Regime Geral,Aquisição de bens móveis,"33000000-0, Equipamento médico, medicamentos e produtos para cuidados pessoais","Unidade Local de Saúde do Norte Alentejano, E. P. E. (508094461)","ACTELION PHARMACEUTICALS PORTUGAL, LDA             (507336488)","7.901,60 €",02-06-2015,26-09-2014,30 dias,"Portugal, Portalegre, Portalegre<BR/>Portugal, Portalegre, Elvas","Artigo 24.º, n.º 1, alínea e) do Código dos Contratos Públicos",26-09-2014,"7.901,60 €",,,,Não aplicável.,Não aplicável.,FALSE
PRESTAÇÃO DE SERVIÇOS DE COPIA E IMPRESSAO PARA O PERIODO DE MAIO A AGOSTO DE 2014,Ajuste Direto Regime Geral,Aquisição de serviços,"72500000-0, Serviços relacionados com a informática","Unidade Local de Saúde do Norte Alentejano, E. P. E. (508094461)",CREDITEX - ALUGUER DE EQUIPAMENTOS S.A (502825812),"5.117,56 €",02-06-2015,30-05-2015,120 dias,"Portugal, Portalegre, Portalegre","Artigo 20.º, n.º 1, alínea a) do Código dos Contratos Públicos",30-05-2015,"5.117,56 €",,,,Não aplicável.,Não aplicável.,FALSE
"PRESTAÇÃO DE SERVIÇOS DE MANUTENÇÃO A EQUIPAMENTOS INFORMÁTICOS COM PERDA DE GARANTIA EM PRODUÇÃO NA ULSNA, EPE ANO 2015",Ajuste Direto Regime Geral,Aquisição de serviços,"72200000-7, Serviços de consultoria e de programação de software","Unidade Local de Saúde do Norte Alentejano, E. P. E. (508094461)",HP-HEWLETT PACKARD (502407697),"24.662,66 €",02-06-2015,01-04-2015,365 dias,"Portugal, Portalegre, Portalegre","Artigo 24.º, n.º 1, alínea e) do Código dos Contratos Públicos","","",,,,Não aplicável.,Não aplicável.,FALSE
"PRESTAÇÃO DE SERVIÇOS DE MANUTENÇÃO DA INFRAESTRUTURA DE HARDWARE DO DATACENTER DA ULSNA, ANO 2014",Ajuste Direto Regime Geral,Aquisição de serviços,"72100000-6, Serviços de consultoria em matéria de hardware","Unidade Local de Saúde do Norte Alentejano, E. P. E. (508094461)",H P - HEWLETT PACKARD (502407697),"37.453,72 €",02-06-2015,01-10-2014,365 dias,"Portugal, Portalegre, Portalegre","Artigo 24.º, n.º 1, alínea e) do Código dos Contratos Públicos","","",,,,Não aplicável.,Não aplicável.,FALSE
"PRESTAÇÃO DE SERVIÇOS DE MANUTENÇÃO DE 5 SERVIDORES SUN V240, ANO 2015",Ajuste Direto Regime Geral,Aquisição de serviços,"72200000-7, Serviços de consultoria e de programação de software","Unidade Local de Saúde do Norte Alentejano, E. P. E. (508094461)","ITEN Solutions - Sistemas de Informação, S.A (510728189)","5.595,00 €",02-06-2015,03-12-2014,365 dias,"Portugal, Portalegre, Portalegre","Artigo 20.º, n.º 1, alínea a) do Código dos Contratos Públicos","","",,,,Não aplicável.,Não aplicável.,FALSE
"PRESTAÇÃO DE SERVIÇOS DE ASSISTENCIA TECNICA AO SOFTWARE APLICACIONAL EIS, ANO 2015",Ajuste Direto Regime Geral,Aquisição de serviços,"72200000-7, Serviços de consultoria e de programação de software","Unidade Local de Saúde do Norte Alentejano, E. P. E. (508094461)",ADVANGINGTO-PRESTAÇÂO DE SERVIÇOS DE INFOR.E GESTA (506002144),"9.058,00 €",02-06-2015,05-03-2015,365 dias,"Portugal, Portalegre, Portalegre","Artigo 24.º, n.º 1, alínea e) do Código dos Contratos Públicos","","",,,,Não aplicável.,Não aplicável.,FALSE
PRESTAÇÃO DE SERVIÇOS DE ASSISTENCIA TECNICA AO SOFTWARE APLICACIONAL EIS,Ajuste Direto Regime Geral,Aquisição de serviços,"72200000-7, Serviços de consultoria e de programação de software","Unidade Local de Saúde do Norte Alentejano, E. P. E. (508094461)",ADVANGINGTO-PRESTAÇÂO DE SERVIÇOS DE INFOR.E GESTA (506002144),"9.900,00 €",02-06-2015,27-08-2014,365 dias,"Portugal, Portalegre, Portalegre","Artigo 20.º, n.º 1, alínea a) do Código dos Contratos Públicos","","",,,,Não aplicável.,Não aplicável.,FALSE
REAGENTES,Ajuste Direto Regime Geral,Aquisição de bens móveis,"33000000-0, Equipamento médico, medicamentos e produtos para cuidados pessoais","Unidade Local de Saúde do Norte Alentejano, E. P. E. (508094461)",ROCHE SISTEMA DE DIAGNOSTICOS                      (504282921),"9.796,63 €",02-06-2015,01-10-2014,30 dias,"Portugal, Portalegre, Elvas<BR/>Portugal, Portalegre, Portalegre","Artigo 24.º, n.º 1, alínea e) do Código dos Contratos Públicos",01-10-2014,"9.796,63 €",,,,Não aplicável.,Não aplicável.,FALSE
REAGENTES,Ajuste Direto Regime Geral,Aquisição de bens móveis,"33000000-0, Equipamento médico, medicamentos e produtos para cuidados pessoais","Unidade Local de Saúde do Norte Alentejano, E. P. E. (508094461)",ROCHE SISTEMA DE DIAGNOSTICOS                      (504282921),"8.920,84 €",01-06-2015,09-10-2014,30 dias,"Portugal, Portalegre, Portalegre<BR/>Portugal, Portalegre, Elvas","Artigo 24.º, n.º 1, alínea e) do Código dos Contratos Públicos",09-10-2014,"8.920,84 €",,,,Não aplicável.,Não aplicável.,FALSE
REAGENTES,Ajuste Direto Regime Geral,Aquisição de bens móveis,"33000000-0, Equipamento médico, medicamentos e produtos para cuidados pessoais","Unidade Local de Saúde do Norte Alentejano, E. P. E. (508094461)",ROCHE SISTEMA DE DIAGNOSTICOS                      (504282921),"5.263,47 €",01-06-2015,10-10-2014,30 dias,"Portugal, Portalegre, Portalegre<BR/>Portugal, Portalegre, Elvas","Artigo 24.º, n.º 1, alínea e) do Código dos Contratos Públicos",10-10-2014,"5.263,47 €",,,,Não aplicável.,Não aplicável.,FALSE
Reagentes,Ajuste Direto Regime Geral,Aquisição de bens móveis,"33000000-0, Equipamento médico, medicamentos e produtos para cuidados pessoais","Unidade Local de Saúde do Norte Alentejano, E. P. E. (508094461)",ROCHE SISTEMA DE DIAGNOSTICOS (504282921),"9.711,68 €",01-06-2015,02-02-2015,30 dias,"Portugal, Portalegre, Elvas<BR/>Portugal, Portalegre, Portalegre","Artigo 24.º, n.º 1, alínea e) do Código dos Contratos Públicos",02-02-2015,"9.711,68 €",,,,Não aplicável.,Não aplicável.,FALSE
