Objeto do Contrato,Tipo de Procedimento,Tipo(s) de Contrato,CPVs,Entidade(s) Adjudicante(s),Entidade(s) Adjudicatária(s),Preço Contratual,Data de Publicação,Data de Celebração do Contrato,Prazo de Execução,Local de Execução,Fundamentação,Data de Fecho do Contrato,Preço Total Efetivo,Causas das Alterações ao Prazo,Causas das Alterações ao Preço,Estado,N.º registo do Acordo Quadro,Descrição do Acordo Quadro,Procedimento Centralizado
PRODUTOS IMPORTAÇÃO 2017,Ajuste Direto Regime Geral,Aquisição de bens móveis,"33600000-6, Produtos farmacêuticos","Centro Hospitalar Tondela-Viseu, E. P. E. (509822940)",WEPCLINICAL (944893866),"23.535,64 €",21-12-2016,09-12-2016,1 dias,"Portugal, Viseu, Viseu","Artigo 20.º, n.º 1, alínea a) do Código dos Contratos Públicos",,,,,,Não aplicável.,Não aplicável.,FALSE
PRODUTOS IMPORTAÇÃO 2017,Ajuste Direto Regime Geral,Aquisição de bens móveis,"33600000-6, Produtos farmacêuticos","Centro Hospitalar Tondela-Viseu, E. P. E. (509822940)",BIOJAM S.A. HEALTH CONSULTING (513642749),"19.934,00 €",21-12-2016,28-10-2016,1 dias,"Portugal, Viseu, Viseu","Artigo 20.º, n.º 1, alínea a) do Código dos Contratos Públicos",,,,,,Não aplicável.,Não aplicável.,FALSE
CENTRAL DE TRATAMENTO DE ÁGUA,Ajuste Direto Regime Geral,Empreitadas de obras públicas,"45232430-5, Tratamento de águas","Centro Hospitalar Tondela-Viseu, E. P. E. (509822940)",PROMEI CENTRO-COMP.VENDA MONT.ASSIST.TEC.EQUIP.HOSP (506470113),"45.021,06 €",15-12-2016,12-05-2016,1 dias,"Portugal, Viseu, Viseu","Artigo 19.º, alínea a) do Código dos Contratos Públicos",,,,,,Não aplicável.,Não aplicável.,FALSE
MOTOR ORTOPEDIA,Ajuste Direto Regime Geral,Aquisição de bens móveis,"33183300-9, Aparelhos para osteossíntese","Centro Hospitalar Tondela-Viseu, E. P. E. (509822940)","B. BRAUN MEDICAL, LDA (501506543)","17.019,70 €",15-12-2016,01-04-2016,1 dias,"Portugal, Viseu, Viseu","Artigo 20.º, n.º 1, alínea a) do Código dos Contratos Públicos",,,,,,Não aplicável.,Não aplicável.,FALSE
