Objeto do Contrato,Tipo de Procedimento,Tipo(s) de Contrato,CPVs,Entidade(s) Adjudicante(s),Entidade(s) Adjudicatária(s),Preço Contratual,Data de Publicação,Data de Celebração do Contrato,Prazo de Execução,Local de Execução,Fundamentação,Data de Fecho do Contrato,Preço Total Efetivo,Causas das Alterações ao Prazo,Causas das Alterações ao Preço,Estado,N.º registo do Acordo Quadro,Descrição do Acordo Quadro,Procedimento Centralizado
"Uma vez esgotadas as quantidades previstas de lençóis brancos com logotipo azul e vermelho, o Serviço de Tratamento de Roupa, pela urgência de reposição e satisfação permanente dos serviços de internamento.",Ajuste Direto Regime Geral,Aquisição de bens móveis,"39512100-5, Lençóis","Centro Hospitalar de Entre o Douro e Vouga, E.P.E. (508878462)","Coelima - Industrias Texteis, S.A. (500268886)","21.545,00 €",26-03-2013,28-02-2013,365 dias,"Portugal, Aveiro, Santa Maria da Feira","Artigo 20.º, n.º 1, alínea a) do Código dos Contratos Públicos",02-07-2013,"21.545,00 €",,,,Não aplicável.,Não aplicável.,
Aquisição de 1 Ampola de RX para equipamento PT1059 – Bucky Diagnost de HSJM,Ajuste Direto Regime Geral,Aquisição de serviços,"50421200-4, Serviços de reparação e manutenção de equipamentos de raios X","Centro Hospitalar de Entre o Douro e Vouga, E.P.E. (508878462)","Philips Portuguesa, S.A. (500216843)","8.730,40 €",26-03-2013,31-01-2013,365 dias,"Portugal, Aveiro, Santa Maria da Feira","Artigo 24.º, n.º 1, alínea e) do Código dos Contratos Públicos",05-04-2013,"8.730,40 €",,,,Não aplicável.,Não aplicável.,
Prestação de serviços de assistência técnica das máquinas de lavar endoscópios do serviço de Gastroenterologia e UCIP.,Ajuste Direto Regime Geral,Aquisição de serviços,"50530000-9, Serviços de reparação e manutenção de máquinas","Centro Hospitalar de Entre o Douro e Vouga, E.P.E. (508878462)","Olympus Iberia, S.A.U. (980474710)","9.386,00 €",26-03-2013,28-02-2013,365 dias,"Portugal, Aveiro, Santa Maria da Feira","Artigo 24.º, n.º 1, alínea e) do Código dos Contratos Públicos",23-07-2013,"9.386,00 €",,,,Não aplicável.,Não aplicável.,
