Objeto do Contrato,Tipo de Procedimento,Tipo(s) de Contrato,CPVs,Entidade(s) Adjudicante(s),Entidade(s) Adjudicatária(s),Preço Contratual,Data de Publicação,Data de Celebração do Contrato,Prazo de Execução,Local de Execução,Fundamentação,Data de Fecho do Contrato,Preço Total Efetivo,Causas das Alterações ao Prazo,Causas das Alterações ao Preço,Estado,N.º registo do Acordo Quadro,Descrição do Acordo Quadro,Procedimento Centralizado
AD1964-Aquisição de medicamento IPILIMUMAD  5MG,Ajuste Direto Regime Geral,Aquisição de bens móveis,"33690000-3, Medicamentos vários","Instituto Português de Oncologia de Lisboa Francisco Gentil, E. P. E. (506361616)",BRISTOL-MYERS SQUIBB FAR. PORTUGUESA LDA (500048193),"166.600,00 €",05-09-2014,06-08-2014,2 dias,"Portugal, Lisboa, Lisboa","Artigo 24.º, n.º 1, alínea e) do Código dos Contratos Públicos",,,,,,Não aplicável.,Não aplicável.,FALSE
Serviços de manutenção e software na área do HOSIX,Ajuste Direto Regime Geral,Aquisição de serviços,"72610000-9, Serviços de assistência informática","Instituto Português de Oncologia de Lisboa FG, E.P.E. (506361616)",SIVSA-SOL.INFORMATICAS S.A (36646685),"180.000,00 €",01-09-2014,23-05-2014,365 dias,"Portugal, Lisboa, Lisboa","Artigo 24.º, n.º 1, alínea e) do Código dos Contratos Públicos",,,,,,Não aplicável.,Não aplicável.,FALSE
Serviços de consultoria desenvolvimento de manutenção preventiva correctiva e de apoio técnico á plataforma do Ror e á Internet do IPO,Ajuste Direto Regime Geral,Aquisição de serviços,"72600000-6, Serviços de consultoria e assistência informáticas","Instituto Português de Oncologia de Lisboa FG, E.P.E. (506361616)","IT SECTOR-SISTEMAS DE INFORMAÇÃO, LDA (507291727)","99.950,00 €",01-09-2014,21-05-2014,365 dias,"Portugal, Lisboa, Lisboa","Artigo 24.º, n.º 1, alínea e) do Código dos Contratos Públicos",,,,,,Não aplicável.,Não aplicável.,FALSE
