Objeto do Contrato,Tipo de Procedimento,Tipo(s) de Contrato,CPVs,Entidade(s) Adjudicante(s),Entidade(s) Adjudicatária(s),Preço Contratual,Data de Publicação,Data de Celebração do Contrato,Prazo de Execução,Local de Execução,Fundamentação,Data de Fecho do Contrato,Preço Total Efetivo,Causas das Alterações ao Prazo,Causas das Alterações ao Preço,Estado,N.º registo do Acordo Quadro,Descrição do Acordo Quadro,Procedimento Centralizado
Manutenção da infraestrutura tecnológica da UESP para 2013,Ajuste Direto Regime Geral,Aquisição de serviços,"50330000-7, Serviços de manutenção de equipamento para telecomunicações",Direcção-Geral da Saúde (600037100),"PT Comunicações, S.A. (504615947)","14.431,06 €",31-10-2013,12-08-2013,365 dias,"Portugal, Lisboa, Lisboa","Artigo 27.º, n.º 1, alínea f) do Código dos Contratos Públicos",15-11-2013,"14.431,06 €",,,,Não aplicável.,Não aplicável.,
Aquisição de Toners KYOCERA,Ao abrigo de acordo-quadro (art.º 258.º),Aquisição de bens móveis,"22610000-9, Tinta para impressão",Direcção-Geral da Saúde (600037100),"Centeque-Centro Técnico de Equipamento de Escritório, Lda. (501726772)","687,50 €",29-10-2013,27-05-2013,6 dias,"Portugal, Lisboa, Lisboa",Artigo 258.º do Código dos Contratos Públicos,08-07-2013,"687,50 €",,,,162548,"Concurso limitado por prévia qualificação para a celebração de Acordo Quadro para fornecimento de papel, economato e consumíveis de impressão.",
Aquisição de Toners HP,Ao abrigo de acordo-quadro (art.º 258.º),Aquisição de bens móveis,"22610000-9, Tinta para impressão",Direcção-Geral da Saúde (600037100),"Paulo S. Conde, Lda. (506324729)","14.607,15 €",29-10-2013,27-05-2013,30 dias,"Portugal, Lisboa, Lisboa",Artigo 258.º do Código dos Contratos Públicos,01-07-2013,"14.607,15 €",,,,162548,"Concurso limitado por prévia qualificação para a celebração de Acordo Quadro para fornecimento de papel, economato e consumíveis de impressão.",
Aquisição de Toners CANON,Ao abrigo de acordo-quadro (art.º 258.º),Aquisição de bens móveis,"22610000-9, Tinta para impressão",Direcção-Geral da Saúde (600037100),"Centeque-Centro Técnico de Equipamento de Escritório, Lda. (501726772)","4.222,90 €",28-10-2013,27-05-2013,60 dias,"Portugal, Lisboa, Lisboa",Artigo 258.º do Código dos Contratos Públicos,01-08-2013,"4.222,90 €",,,,162548,"Concurso limitado por prévia qualificação para a celebração de Acordo Quadro para fornecimento de papel, economato e consumíveis de impressão.",
Outros Consumíveis de Impressão HP,Ao abrigo de acordo-quadro (art.º 258.º),Aquisição de bens móveis,"22610000-9, Tinta para impressão",Direcção-Geral da Saúde (600037100),"Companhia Portuguesa de Computadores Informática e Sistemas, SA (501267255)","3.061,20 €",28-10-2013,27-05-2013,30 dias,"Portugal, Lisboa, Lisboa",Artigo 258.º do Código dos Contratos Públicos,01-08-2013,"3.061,20 €",,,,162548,"Concurso limitado por prévia qualificação para a celebração de Acordo Quadro para fornecimento de papel, economato e consumíveis de impressão.",
Aquisição de 50 caixas de toalhetes de mãos zig-zag2,Ao abrigo de acordo-quadro (art.º 258.º),Aquisição de bens móveis,"33763000-6, Toalhas de mão de papel",Direcção-Geral da Saúde (600037100),"Interlimpe-Facility Services, SA (502611057)","749,00 €",25-10-2013,10-10-2013,12 dias,"Portugal, Lisboa, Lisboa",Artigo 258.º do Código dos Contratos Públicos,24-10-2013,"749,00 €",,,,600259,Concurso público para selecção de fornecedores de produtos de higiene e de prestadores de serviços de limpeza,
Realização de um inquérito anual sobre atitudes a comportamentos dos portugueses face à infeção VIH/Sida,Ajuste Direto Regime Geral,Aquisição de serviços,"79311200-9, Serviços de realização de inquéritos",Direcção-Geral da Saúde (600037100),"MARKTEST - Markting, Organização, Formação, Ldª (501070982)","13.482,00 €",22-10-2013,24-06-2013,42 dias,"Portugal, Lisboa, Lisboa","Artigo 20.º, n.º 1, alínea a) do Código dos Contratos Públicos",07-11-2013,"13.482,00 €",,,,Não aplicável.,Não aplicável.,
Elaboração e publicação do estudo Necessidades de Cuidados a Pessoas com Demências no âmbito do PNSM.,Ajuste Direto Regime Geral,Aquisição de serviços,"71319000-7, Serviços de consultoria de peritos",Direcção-Geral da Saúde (DGS) (600037100),UNIFAI - ICBAS - Universidade do Porto (501413197),"48.385,00 €",22-10-2013,08-10-2013,365 dias,"Portugal, Lisboa, Lisboa","Artigo 20.º, n.º 1, alínea a) do Código dos Contratos Públicos","","",,,,Não aplicável.,Não aplicável.,
"Aquisição de 2000 exemplares do Estudo Nacional de Prevalência das Perturbações Mentais, no âmbito do Programa Nacional para a Saúde Mental.",Ajuste Direto Regime Geral,Aquisição de bens móveis,"22100000-1, Livros, brochuras e folhetos impressos",Direcção-Geral da Saúde (600037100),Faculdade de Ciências Médicas da Universidade Nova de Lisboa (600018571),"12.000,00 €",21-10-2013,04-10-2013,7 dias,"Portugal, Lisboa, Lisboa","Artigo 20.º, n.º 1, alínea a) do Código dos Contratos Públicos",18-10-2013,"12.000,00 €",,,,Não aplicável.,Não aplicável.,
