Objeto do Contrato,Tipo de Procedimento,Tipo(s) de Contrato,CPVs,Entidade(s) Adjudicante(s),Entidade(s) Adjudicatária(s),Preço Contratual,Data de Publicação,Data de Celebração do Contrato,Prazo de Execução,Local de Execução,Fundamentação,Data de Fecho do Contrato,Preço Total Efetivo,Causas das Alterações ao Prazo,Causas das Alterações ao Preço,Estado,N.º registo do Acordo Quadro,Descrição do Acordo Quadro,Procedimento Centralizado
Aquisição de Aparelho de Retinografia para Rastreio de Retinopatia Diabética para o ACES Baixo Vouga,Consulta Prévia,Aquisição de bens móveis,"33100000-1, Equipamento médico","Administração Regional de Saúde do Centro, I. P. (503122165)",Optometron (503793060),"17.880,00 €",31-10-2018,15-10-2018,76 dias,Portugal,"Artigo 20.º, n.º 1, alínea c) do Código dos Contratos Públicos",19-11-2018,"17.880,00 €",,"",,Não aplicável.,Não aplicável.,FALSE
Aquisição de Aparelho de Retinografia para Rastreio de Retinopatia Diabética para o ACES Cova Beira,Consulta Prévia,Aquisição de bens móveis,"33100000-1, Equipamento médico","Administração Regional de Saúde do Centro,IP(ARSC) (503122165)",Optometron (503793060),"17.880,00 €",31-10-2018,10-09-2018,112 dias,"Portugal<BR/>Portugal, Castelo Branco, Covilhã","Artigo 20.º, n.º 1, alínea c) do Código dos Contratos Públicos",26-11-2018,"17.880,00 €",,"",,Não aplicável.,Não aplicável.,FALSE
"Aquisição de peliculas de RX, fixador e revelador, posições desertas no CP n.º 18210469 - Art. 24.º CCP",Ajuste Direto Regime Geral,Aquisição de bens móveis,"33698000-9, Produtos para fins clínicos","Administração Regional de Saúde do Centro,IP(ARSC) (503122165)","Carestream Health Portugal, Lda. (508054320)","9.583,37 €",31-10-2018,30-08-2018,122 dias,"Portugal, Coimbra<BR/>Portugal","Artigo 24.º, n.º 1, alínea a) do Código dos Contratos Públicos",05-12-2018,"9.582,49 €",,O fornecedor fez um desconto no preço unitário de um produto,,Não aplicável.,Não aplicável.,FALSE
Aquisição de reagentes para os Laboratórios de Saúde Pública para o ano de 2018,Concurso público,Aquisição de bens móveis,"33000000-0, Equipamento médico, medicamentos e produtos para cuidados pessoais","Administração Regional de Saúde do Centro,IP(ARSC) (503122165)","JOSÉ MANUEL GOMES DOS SANTOS,LDA (501399224)","5.185,74 €",31-10-2018,28-08-2018,213 dias,"Portugal, Leiria, Leiria<BR/>Portugal, Coimbra, Coimbra<BR/>Portugal, Aveiro, Aveiro","Artigo 20.º, n.º 1, alínea b) do Código dos Contratos Públicos","","",,"",,Não aplicável.,Não aplicável.,FALSE
Aquisição de reagentes para os Laboratórios de Saúde Pública para o ano de 2018,Concurso público,Aquisição de bens móveis,"33000000-0, Equipamento médico, medicamentos e produtos para cuidados pessoais","Administração Regional de Saúde do Centro,IP(ARSC) (503122165)",CSPSaude (508440246),"377,04 €",31-10-2018,28-09-2018,213 dias,"Portugal, Aveiro, Aveiro<BR/>Portugal, Coimbra, Coimbra<BR/>Portugal, Leiria, Leiria","Artigo 20.º, n.º 1, alínea b) do Código dos Contratos Públicos","","",,"",,Não aplicável.,Não aplicável.,FALSE
Aquisição de reagentes para os Laboratórios de Saúde Pública para o ano de 2018,Concurso público,Aquisição de bens móveis,"33000000-0, Equipamento médico, medicamentos e produtos para cuidados pessoais","Administração Regional de Saúde do Centro,IP(ARSC) (503122165)","Know-How, Lda (509884296)","741,50 €",31-10-2018,28-08-2018,213 dias,"Portugal, Aveiro, Aveiro<BR/>Portugal, Leiria, Leiria<BR/>Portugal, Coimbra, Coimbra","Artigo 20.º, n.º 1, alínea b) do Código dos Contratos Públicos","","",,"",,Não aplicável.,Não aplicável.,FALSE
Aquisição de reagentes para os Laboratórios de Saúde Pública para o ano de 2018,Concurso público,Aquisição de bens móveis,"33000000-0, Equipamento médico, medicamentos e produtos para cuidados pessoais","Administração Regional de Saúde do Centro,IP(ARSC) (503122165)",VWR International - Mat. Lab. Lda (503842770),"3.001,94 €",31-10-2018,28-08-2018,213 dias,"Portugal, Aveiro, Aveiro<BR/>Portugal, Leiria, Leiria<BR/>Portugal, Coimbra, Coimbra","Artigo 20.º, n.º 1, alínea b) do Código dos Contratos Públicos","","",,"",,Não aplicável.,Não aplicável.,FALSE
Aquisição de reagentes para os Laboratórios de Saúde Pública para o ano de 2018,Concurso público,Aquisição de bens móveis,"33000000-0, Equipamento médico, medicamentos e produtos para cuidados pessoais","Administração Regional de Saúde do Centro,IP(ARSC) (503122165)","Quilaban - Quimica Loboratorial Analítica, S.A. (500399670)","1.559,58 €",30-10-2018,28-08-2018,213 dias,"Portugal, Aveiro, Aveiro<BR/>Portugal, Leiria, Leiria<BR/>Portugal, Coimbra, Coimbra","Artigo 20.º, n.º 1, alínea b) do Código dos Contratos Públicos","","",,"",,Não aplicável.,Não aplicável.,FALSE
Aquisição de reagentes para os Laboratórios de Saúde Pública para o ano de 2018,Concurso público,Aquisição de bens móveis,"33000000-0, Equipamento médico, medicamentos e produtos para cuidados pessoais","Administração Regional de Saúde do Centro,IP(ARSC) (503122165)",IBERLAB- EQUIPAMENTOS DE LABORATORI (503406694),"11.691,33 €",30-10-2018,28-08-2018,213 dias,"Portugal, Coimbra, Coimbra<BR/>Portugal, Aveiro, Aveiro<BR/>Portugal, Leiria, Leiria","Artigo 20.º, n.º 1, alínea b) do Código dos Contratos Públicos","","",,"",,Não aplicável.,Não aplicável.,FALSE
Aquisição de reagentes para os Laboratórios de Saúde Pública para o ano de 2018,Concurso público,Aquisição de bens móveis,"33000000-0, Equipamento médico, medicamentos e produtos para cuidados pessoais","Administração Regional de Saúde do Centro,IP(ARSC) (503122165)",BIOMERIEUX PORTUGAL (501524177),"9.939,30 €",30-10-2018,28-08-2018,213 dias,"Portugal, Coimbra, Coimbra<BR/>Portugal, Coimbra, Coimbra<BR/>Portugal, Aveiro, Aveiro","Artigo 20.º, n.º 1, alínea b) do Código dos Contratos Públicos","","",,"",,Não aplicável.,Não aplicável.,FALSE
Aquisição de reagentes para os Laboratórios de Saúde Pública para o ano de 2018,Concurso público,Aquisição de bens móveis,"33000000-0, Equipamento médico, medicamentos e produtos para cuidados pessoais","Administração Regional de Saúde do Centro,IP(ARSC) (503122165)","Biogerm, S.A. (503265390)","6.496,54 €",30-10-2018,28-08-2018,213 dias,"Portugal, Coimbra, Coimbra<BR/>Portugal, Leiria, Leiria<BR/>Portugal, Aveiro, Aveiro","Artigo 20.º, n.º 1, alínea b) do Código dos Contratos Públicos","","",,"",,Não aplicável.,Não aplicável.,FALSE
Aquisição de reagentes para os Laboratórios de Saúde Pública para o ano de 2018,Concurso público,Aquisição de bens móveis,"33000000-0, Equipamento médico, medicamentos e produtos para cuidados pessoais","Administração Regional de Saúde do Centro,IP(ARSC) (503122165)","PVL-PRODUTOS PARA LABORATORIO, LDA. (501411852)","1.257,00 €",30-10-2018,28-08-2018,213 dias,"Portugal, Aveiro, Aveiro<BR/>Portugal, Leiria, Leiria<BR/>Portugal, Coimbra, Coimbra","Artigo 20.º, n.º 1, alínea b) do Código dos Contratos Públicos","","",,"",,Não aplicável.,Não aplicável.,FALSE
Aquisição de reagentes para os Laboratórios de Saúde Pública para o ano de 2018,Concurso público,Aquisição de bens móveis,"33000000-0, Equipamento médico, medicamentos e produtos para cuidados pessoais","Administração Regional de Saúde do Centro,IP(ARSC) (503122165)","Frilabo II, Lda. (507958861)","3.159,53 €",30-10-2018,28-08-2018,213 dias,"Portugal, Leiria, Leiria<BR/>Portugal, Coimbra, Coimbra<BR/>Portugal, Aveiro, Aveiro","Artigo 20.º, n.º 1, alínea b) do Código dos Contratos Públicos","","",,"",,Não aplicável.,Não aplicável.,FALSE
Aquisição de reagentes para os Laboratórios de Saúde Pública para o ano de 2018,Concurso público,Aquisição de bens móveis,"33000000-0, Equipamento médico, medicamentos e produtos para cuidados pessoais","Administração Regional de Saúde do Centro,IP(ARSC) (503122165)"," BIO-RAD LABORATORIES, LDA (501301321)","33.535,20 €",30-10-2018,16-08-2018,213 dias,"Portugal, Coimbra, Coimbra<BR/>Portugal, Aveiro, Aveiro<BR/>Portugal, Leiria, Leiria","Artigo 20.º, n.º 1, alínea b) do Código dos Contratos Públicos","","",,"",,Não aplicável.,Não aplicável.,FALSE
"Proc. 18710584 - Aquisição de equipamento médico para diversas unidades de saúde da ARSC, IP",Concurso público,Aquisição de bens móveis,"33000000-0, Equipamento médico, medicamentos e produtos para cuidados pessoais","Administração Regional de Saúde do Centro,IP(ARSC) (503122165)","SANO TECNICA, LDA (500239819)","10,50 €",24-10-2018,11-10-2018,30 dias,"Portugal, Distrito não determinado, Concelho não determinado","Artigo 20.º, n.º 1, alínea b) do Código dos Contratos Públicos","","",,"",,Não aplicável.,Não aplicável.,FALSE
"Proc. 18710584 - Aquisição de equipamento médico para diversas unidades de saúde da ARSC, IP",Concurso público,Aquisição de bens móveis,"33000000-0, Equipamento médico, medicamentos e produtos para cuidados pessoais","Administração Regional de Saúde do Centro,IP(ARSC) (503122165)","ALFRAPHAR - Eq. e Produtos Farmacêuticos, Lda. (504223895)","198,50 €",24-10-2018,04-10-2018,30 dias,"Portugal, Distrito não determinado, Concelho não determinado","Artigo 20.º, n.º 1, alínea b) do Código dos Contratos Públicos","","",,"",,Não aplicável.,Não aplicável.,FALSE
"Proc. 18710584 - Aquisição de equipamento médico para diversas unidades de saúde da ARSC, IP",Concurso público,Aquisição de bens móveis,"33000000-0, Equipamento médico, medicamentos e produtos para cuidados pessoais","Administração Regional de Saúde do Centro,IP(ARSC) (503122165)",Clinifar (503281115),"5.250,00 €",24-10-2018,11-10-2018,30 dias,"Portugal, Distrito não determinado, Concelho não determinado","Artigo 20.º, n.º 1, alínea b) do Código dos Contratos Públicos","","",,"",,Não aplicável.,Não aplicável.,FALSE
"Proc. 18710584 - Aquisição de equipamento médico para diversas unidades de saúde da ARSC, IP",Concurso público,Aquisição de bens móveis,"33000000-0, Equipamento médico, medicamentos e produtos para cuidados pessoais","Administração Regional de Saúde do Centro,IP(ARSC) (503122165)","PARAMEDICA-EQUIPAMENTOS MED, LDA (501393005)","356,00 €",24-10-2018,11-10-2018,30 dias,"Portugal, Distrito não determinado, Concelho não determinado","Artigo 20.º, n.º 1, alínea b) do Código dos Contratos Públicos","","",,"",,Não aplicável.,Não aplicável.,FALSE
"Proc. 18710584 - Aquisição de equipamento médico para diversas unidades de saúde da ARSC, IP",Concurso público,Aquisição de bens móveis,"33000000-0, Equipamento médico, medicamentos e produtos para cuidados pessoais","Administração Regional de Saúde do Centro,IP(ARSC) (503122165)","SPACE MEDICAL - EQUIPAMENTOS MEDICOS, LDA (507662407)","1.800,00 €",24-10-2018,11-10-2018,30 dias,"Portugal, Distrito não determinado, Concelho não determinado","Artigo 20.º, n.º 1, alínea b) do Código dos Contratos Públicos","","",,"",,Não aplicável.,Não aplicável.,FALSE
"Proc. 18710584 - Aquisição de equipamento médico para diversas unidades de saúde da ARSC, IP",Concurso público,Aquisição de bens móveis,"33000000-0, Equipamento médico, medicamentos e produtos para cuidados pessoais","Administração Regional de Saúde do Centro,IP(ARSC) (503122165)","Bramédica Fisio - Produtos Saúde, Lda (508560152)","70,20 €",24-10-2018,11-10-2018,30 dias,"Portugal, Distrito não determinado, Concelho não determinado","Artigo 20.º, n.º 1, alínea b) do Código dos Contratos Públicos","","",,"",,Não aplicável.,Não aplicável.,FALSE
"Proc. 18710584 - Aquisição de equipamento médico para diversas unidades de saúde da ARSC, IP",Concurso público,Aquisição de bens móveis,"33000000-0, Equipamento médico, medicamentos e produtos para cuidados pessoais","Administração Regional de Saúde do Centro,IP(ARSC) (503122165)",Speculum (502996323),"44,07 €",24-10-2018,11-10-2018,30 dias,"Portugal, Distrito não determinado, Concelho não determinado","Artigo 20.º, n.º 1, alínea b) do Código dos Contratos Públicos","","",,"",,Não aplicável.,Não aplicável.,FALSE
"Proc. 18710584 - Aquisição de equipamento médico para diversas unidades de saúde da ARSC, IP",Concurso público,Aquisição de bens móveis,"33000000-0, Equipamento médico, medicamentos e produtos para cuidados pessoais","Administração Regional de Saúde do Centro,IP(ARSC) (503122165)","BASTOS VIEGAS, S.A. (500042772)","501,00 €",24-10-2018,11-10-2018,30 dias,"Portugal, Distrito não determinado, Concelho não determinado","Artigo 20.º, n.º 1, alínea b) do Código dos Contratos Públicos","","",,"",,Não aplicável.,Não aplicável.,FALSE
"Proc. 18710584 - Aquisição de equipamento médico para diversas unidades de saúde da ARSC, IP",Concurso público,Aquisição de bens móveis,"33000000-0, Equipamento médico, medicamentos e produtos para cuidados pessoais","Administração Regional de Saúde do Centro,IP(ARSC) (503122165)","Bramédica Fisio - Produtos Saúde, Lda (508560152)","900,00 €",24-10-2018,11-10-2018,30 dias,"Portugal, Distrito não determinado, Concelho não determinado","Artigo 20.º, n.º 1, alínea b) do Código dos Contratos Públicos","","",,"",,Não aplicável.,Não aplicável.,FALSE
"Proc. 18710584 - Aquisição de equipamento médico para diversas unidades de saúde da ARSC, IP",Concurso público,Aquisição de bens móveis,"33000000-0, Equipamento médico, medicamentos e produtos para cuidados pessoais","Administração Regional de Saúde do Centro,IP(ARSC) (503122165)","Bramédica Fisio - Produtos Saúde, Lda (508560152)","750,00 €",23-10-2018,11-10-2018,30 dias,"Portugal, Distrito não determinado, Concelho não determinado","Artigo 20.º, n.º 1, alínea b) do Código dos Contratos Públicos","","",,"",,Não aplicável.,Não aplicável.,FALSE
"Proc. 18710584 - Aquisição de equipamento médico para diversas unidades de saúde da ARSC, IP",Concurso público,Aquisição de bens móveis,"33000000-0, Equipamento médico, medicamentos e produtos para cuidados pessoais","Administração Regional de Saúde do Centro,IP(ARSC) (503122165)","BASTOS VIEGAS, S.A. (500042772)","998,80 €",23-10-2018,04-10-2018,30 dias,"Portugal, Distrito não determinado, Concelho não determinado","Artigo 20.º, n.º 1, alínea b) do Código dos Contratos Públicos","","",,"",,Não aplicável.,Não aplicável.,FALSE
