Objeto do Contrato,Tipo de Procedimento,Tipo(s) de Contrato,CPVs,Entidade(s) Adjudicante(s),Entidade(s) Adjudicatária(s),Preço Contratual,Data de Publicação,Data de Celebração do Contrato,Prazo de Execução,Local de Execução,Fundamentação,Data de Fecho do Contrato,Preço Total Efetivo,Causas das Alterações ao Prazo,Causas das Alterações ao Preço,Estado,N.º registo do Acordo Quadro,Descrição do Acordo Quadro,Procedimento Centralizado
Aquisição de serviços de Desenvolvimento e Manutenção Aplicacional Evacinas - Ao abrigo do AQ 20120117,Ajuste Direto Regime Geral,Aquisição de serviços,"72500000-0, Serviços relacionados com a informática","Serviço Partilhados do Ministério da Saúde, E. P. E. (509540716)","Alert Life Sciences Computing, S.A. (507567455)","48.294,40 €",16-11-2012,15-10-2012,365 dias,Portugal,Artigo 258.º do Código dos Contratos Públicos,,,,,,Não aplicável.,Não aplicável.,
Aqusição de equipamentos informáticos - Computadores de secretária e Portáteis,Ajuste Direto Regime Geral,Aquisição de bens móveis,"30213000-5, Computadores pessoais<BR/>30213100-6, Computadores portáteis","Serviço Partilhados do Ministério da Saúde, E. P. E. (509540716)","EXITUS - Soluções Tecnológicas, Lda (509117660)","20.990,00 €",13-11-2012,02-11-2012,10 dias,Portugal,"Artigo 20.º, n.º 1, alínea a) do Código dos Contratos Públicos",,,,,,Não aplicável.,Não aplicável.,
