Objeto do Contrato,Tipo de Procedimento,Tipo(s) de Contrato,CPVs,Entidade(s) Adjudicante(s),Entidade(s) Adjudicatária(s),Preço Contratual,Data de Publicação,Data de Celebração do Contrato,Prazo de Execução,Local de Execução,Fundamentação,Data de Fecho do Contrato,Preço Total Efetivo,Causas das Alterações ao Prazo,Causas das Alterações ao Preço,Estado,N.º registo do Acordo Quadro,Descrição do Acordo Quadro,Procedimento Centralizado
Aquisição de energia eléctrica ao abrigo do AQ-PARA -2015,Ao abrigo de acordo-quadro (art.º 259.º),Aquisição de bens móveis,"09310000-5, Electricidade","Centro Hospitalar do Médio Tejo, E. P. E. (506361608), Unidade Local de Saúde Nordeste, EPE (509932584), Hospital Garcia de Orta, E. P. E. (506361470), Instituto Nacional de Emergência Médica, I. P. (501356126), Unidade Local de Saude do Baixo Alentejo, EPE (508754275), Centro Hospitalar do Algarve, E. P. E. (510745997), Centro Hospitalar do Baixo Vouga, E. P. E (CHBV, E. P. E.) (510123210), Centro Hospitalar de Setúbal, E. P. E. (507606787), Hospital Arcebispo João Crisóstomo (501626123), SPMS - Serviços Partilhados do Ministério da Saúde, E. P. E. (509540716), Hospital Prof. Doutor Fernando Fonseca E.P.E. (503035416), Centro Hospitalar e Universitário de Coimbra, E. P. E. (510103448), Administração Regional de Saúde do Alentejo, I. P. (503148768), Unidade Local de Saúde de Castelo Branco, E. P. E. (509309844), Centro Hospitalar Lisboa Norte, E. P. E. (508481287), Centro Hospitalar Cova da Beira, EPE (506361659), Unidade Local de Saúde de Matosinhos, EPE (ULSM) (506361390), Administração Regional de Saúde Algarve, I.P. (503148709), Centro Hospitalar Póvoa de Varzim - Vila do Conde, E.P.E. (508741823), Unidade Local de Saúde do Norte Alentejano, E. P. E. (508094461), Centro de medicina e Reabilitação da Região Centro Rovisco Pais (503767336), Secretaria-Geral do Ministério da Saúde - SNCP (600080684), Centro Hospitalar de Lisboa Ocidental, E. P. E. (507618319), Instituto Português de Oncologia de Lisboa Francisco Gentil, E. P. E. (506361616), Centro Hospitalar Vila Nova de Gaia - Espinho, E. P. E. (508142156), Direção-Geral da Saúde (600037100), Centro Hospitalar Médio Ave, E.P.E.. (508093937), Centro Hospitalar Psiquiátrico de Lisboa (CHPL) (508338476), Centro Hospitalar Tondela-Viseu, E. P. E. (509822940), Centro Hospitalar de Trás-os-Montes e Alto Douro, E. P. E. (508100496), Centro Hospitalar Barreiro Montijo, E. P. E. (509186998), Hospital Dr. Francisco Zagalo (501510150), Instituto Português de Oncologia de Coimbra - Francisco Gentil E.P.E. (506361438), Administração Central do Sistema de Saúde, I. P. (508188423), Hospital Distrital da Figueira da Foz, EPE (506361527), Administração Regional de Saúde Norte, I.P. (503135593), Centro Hospitalar de Lisboa Central, E. P. E. (508080142), Centro Hospitalar Porto, E. P. E. (508331471), Hospital do Espírito Santo de Évora, E. P. E. (508085888), Centro Hospitalar do Tâmega e Sousa, E. P. E. (508318262), Unidade Local de Saúde da Guarda, E. P. E. (508752000), Inspeção-Geral das Atividades em Saúde (600018857), Instituto Nacional de Saúde Dr. Ricardo Jorge, I. P. (501427511), Hospital de Santarém, EPE (506361462), Instituto de Oftalmologia Dr. Gama Pinto (600000052), Hospital Santa Maria Maior, E. P. E. (506361381), Instituto Português de Oncologia do Porto Francisco Gentil, E. P. E. (506362299), Centro Hospitalar do Alto Ave, EPE (508080827), Unidade Local de Saúde do Alto Minho, E. P. E. (508786193), CHO - Centro Hospitalar do Oeste (510412009), Centro Hospitalar de Entre o Douro e Vouga, E.P.E. (508878462), CENTRO HOSPITALAR DE LEIRIA, E.P.E. (509822932), SUCH - Serviço Utilização Comum Hospitais (500900469), Instituto Português do Sangue e da Transplantação, I. P. (502423943), Administração Regional de Saúde Lisboa e Vale do Tejo, I.P. (503148776), Hospital de Magalhães Lemos, E. P. E. (502828790), Administração Regional de Saúde do Centro, I. P. (503122165), Centro Hospitalar de São João, E. P. E. (509821197), INFARMED - Autoridade Nacional do Medicamento e Produtos de Saúde I.P. (600037002), Unidade Local de Saúde do Litoral Alentejano, E. P. E. (510445152), Hospital de José Luciano de Castro (501613021)","GALP POWER, S.A. (504723456)","807.437,59 €",26-08-2015,13-02-2015,305 dias,"Portugal, Lisboa, Lisboa",Artigo 259.º do Código dos Contratos Públicos,31-12-2015,"807.437,59 €",NÃO APLICÁVEL,NÃO APLICÁVEL,,314294,Acordo quadro para o fornecimento de electricidade em regime de mercado livre para Portugal Continental,TRUE
Aquisição de Expansão da Solução SGICM-Farmácia e Logística (Software) para a ULSCB,Ajuste Direto Regime Geral,Aquisição de bens móveis,"48440000-4, Pacote de software para análise financeira e contabilidade","Unidade Local de Saúde de Castelo Branco, E.P.E. (509309844)","GLINTT - HEALTHCARE SOLUTIONS, SA (502479418)","74.868,95 €",25-08-2015,06-08-2015,90 dias,"Portugal, Castelo Branco, Castelo Branco","Artigo 24.º, n.º 1, alínea e) do Código dos Contratos Públicos",27-10-2015,"74.868,95 €","","",,Não aplicável.,Não aplicável.,FALSE
