freguesia,acronym,validVotesPercentage,votes,dicofre
Carapinheira,PS,41,205,061003
Carapinheira,PPD/PSD,24.2,121,061003
Carapinheira,B.E.,13,65,061003
Carapinheira,PCP-PEV,6.2,31,061003
Carapinheira,CDS-PP,4.2,21,061003
Carapinheira,A,3,15,061003
Carapinheira,PAN,2.8,14,061003
Carapinheira,NC,1.4,7,061003
Carapinheira,L,0.8,4,061003
Carapinheira,PCTP/MRPP,0.8,4,061003
Carapinheira,PDR,0.6,3,061003
Carapinheira,PNR,0.6,3,061003
Carapinheira,PPM.PPV/CDC,0.6,3,061003
Carapinheira,PTP,0.4,2,061003
Carapinheira,MAS,0.2,1,061003
Carapinheira,PURP,0.2,1,061003
Carapinheira,IL,0,0,061003
