freguesia,acronym,validVotesPercentage,votes,dicofre
União das freguesias de Felgueiras e Feirão,PS,56.8,117,181317
União das freguesias de Felgueiras e Feirão,PPD/PSD.CDS-PP,31.07,64,181317
União das freguesias de Felgueiras e Feirão,MPT,5.34,11,181317
União das freguesias de Felgueiras e Feirão,B.E.,1.94,4,181317
União das freguesias de Felgueiras e Feirão,PCP-PEV,1.94,4,181317
União das freguesias de Felgueiras e Feirão,PPM,1.46,3,181317
União das freguesias de Felgueiras e Feirão,L,0.49,1,181317
União das freguesias de Felgueiras e Feirão,PCTP/MRPP,0.49,1,181317
União das freguesias de Felgueiras e Feirão,PTP,0.49,1,181317
União das freguesias de Felgueiras e Feirão,MAS,0,0,181317
União das freguesias de Felgueiras e Feirão,PAN,0,0,181317
União das freguesias de Felgueiras e Feirão,PDA,0,0,181317
União das freguesias de Felgueiras e Feirão,PND,0,0,181317
União das freguesias de Felgueiras e Feirão,PNR,0,0,181317
União das freguesias de Felgueiras e Feirão,POUS,0,0,181317
União das freguesias de Felgueiras e Feirão,PPV,0,0,181317
