Objeto do Contrato,Tipo de Procedimento,Tipo(s) de Contrato,CPVs,Entidade(s) Adjudicante(s),Entidade(s) Adjudicatária(s),Preço Contratual,Data de Publicação,Data de Celebração do Contrato,Prazo de Execução,Local de Execução,Fundamentação,Data de Fecho do Contrato,Preço Total Efetivo,Causas das Alterações ao Prazo,Causas das Alterações ao Preço,Estado,N.º registo do Acordo Quadro,Descrição do Acordo Quadro,Procedimento Centralizado
Aquisição de detergente enzimático,Ajuste Direto Regime Geral,Aquisição de bens móveis,"33140000-3, Material médico de consumo","Administração Regional de Saúde de Lisboa e Vale do Tejo, I.P. (503148776)","Laboratorios Inibsa, Lda. (500139571)","12.250,00 €",11-05-2012,10-05-2012,20 dias,"Portugal, Lisboa, Lisboa","Artigo 26.º, n.º 1, alínea e) do Código dos Contratos Públicos","","",,,,Não aplicável.,Não aplicável.,
"A empresa Costa & Carvalho, S.A., como segunda Outorgante, obriga-se à execução daEmpreitada de Construção da Unidade de Saúde Familiar de Santo António da Charneca, no Centro de Saúde do Barreiro",Concurso público,Empreitadas de obras públicas,"45215100-8, Obras de construção de edifícios relacionados com serviços de saúde","Administração Regional de Saúde de Lisboa e Vale do Tejo, I.P. (503148776)","Costa & Carvalho, S.A. (501298100)","1.355.000,00 €",11-05-2012,16-03-2012,240 dias,"Portugal, Setúbal, Barreiro","Artigo 19.º, alínea b) do Código dos Contratos Públicos","","",,,,Não aplicável.,Não aplicável.,
Aquisição de Poliuretano c/Rebordo,Ajuste Direto Regime Geral,Aquisição de bens móveis,"33141110-4, Pensos","Administração Regional de Saúde de Lisboa e Vale do Tejo, I.P. (503148776)","Paul Hartmann, Lda (502271728)","42.750,00 €",09-05-2012,02-05-2012,20 dias,"Portugal, Lisboa, Lisboa","Artigo 26.º, n.º 1, alínea e) do Código dos Contratos Públicos","","",,,,Não aplicável.,Não aplicável.,
Aquisição de Vacina contra Febre Amarela e Vacina contra Febre Tífoíde,Ajuste Direto Regime Geral,Aquisição de bens móveis,"33651600-4, Vacinas","Administração Regional de Saúde de Lisboa e Vale do Tejo, I.P. (503148776)","Sanofi Pasteur MSD, S.A. (507632796)","85.500,00 €",09-05-2012,02-05-2012,20 dias,"Portugal, Lisboa, Lisboa","Artigo 26.º, n.º 1, alínea e) do Código dos Contratos Públicos","","",,,,Não aplicável.,Não aplicável.,
Aquisição de Tiotropio (Brometo),Ajuste Direto Regime Geral,Aquisição de bens móveis,"33690000-3, Medicamentos vários","Administração Regional de Saúde de Lisboa e Vale do Tejo, I.P. (503148776)","Unifarma - União Internacional de Laboratórios Farmacêuticos, Lda (500293023)","16.638,00 €",09-05-2012,27-04-2012,20 dias,"Portugal, Lisboa, Lisboa","Artigo 26.º, n.º 1, alínea e) do Código dos Contratos Públicos","","",,,,Não aplicável.,Não aplicável.,
"Aquisição de Pensos Impregnados com Iodoforos 9,5x9,5",Ajuste Direto Regime Geral,Aquisição de bens móveis,"33690000-3, Medicamentos vários","Administração Regional de Saúde de Lisboa e Vale do Tejo, I.P. (503148776)",Systagenix Wound Management (Spain) - Sucursal em Portugal (980402298),"66.750,00 €",09-05-2012,30-04-2012,20 dias,"Portugal, Lisboa, Lisboa","Artigo 26.º, n.º 1, alínea e) do Código dos Contratos Públicos","","",,,,Não aplicável.,Não aplicável.,
Aquisição de Pensos Impregnados com Vaselina,Ajuste Direto Regime Geral,Aquisição de bens móveis,"33690000-3, Medicamentos vários","Administração Regional de Saúde de Lisboa e Vale do Tejo, I.P. (503148776)","Paul Hartmann, Lda (502271728)","16.000,00 €",09-05-2012,30-04-2012,20 dias,"Portugal, Lisboa, Lisboa","Artigo 26.º, n.º 1, alínea e) do Código dos Contratos Públicos","","",,,,Não aplicável.,Não aplicável.,
Aquisição de Vacina Triplice DTP,Ajuste Direto Regime Geral,Aquisição de bens móveis,"33651600-4, Vacinas","Administração Regional de Saúde de Lisboa e Vale do Tejo, I.P. (503148776)","GLAXOSMITHKLINE - Produtos Farmacêuticos, Lda (500139962)","4.305,00 €",09-05-2012,27-04-2012,20 dias,"Portugal, Lisboa, Lisboa","Artigo 26.º, n.º 1, alínea e) do Código dos Contratos Públicos","","",,,,Não aplicável.,Não aplicável.,
Aquisição de Amicacina Inj 250mg/ml - 2ml,Ajuste Direto Regime Geral,Aquisição de bens móveis,"33690000-3, Medicamentos vários","Administração Regional de Saúde de Lisboa e Vale do Tejo, I.P. (503148776)","Hikma Farmacêutica (Portugal), S.A. (502266791)","4.800,00 €",09-05-2012,27-04-2012,20 dias,"Portugal, Lisboa, Lisboa","Artigo 26.º, n.º 1, alínea e) do Código dos Contratos Públicos","","",,,,Não aplicável.,Não aplicável.,
Aquisição de Sistemas Epicraneanos,Ajuste Direto Regime Geral,Aquisição de bens móveis,"33140000-3, Material médico de consumo","Administração Regional de Saúde de Lisboa e Vale do Tejo, I.P. (503148776)","Pergut Portugal - Comércio Produtos Hospitalares e Médicos, Lda (501799729)","881,75 €",09-05-2012,27-04-2012,20 dias,"Portugal, Lisboa, Lisboa","Artigo 26.º, n.º 1, alínea e) do Código dos Contratos Públicos","","",,,,Não aplicável.,Não aplicável.,
Aquisição de Seringas sem Agulha de 20ml e 50ml,Ajuste Direto Regime Geral,Aquisição de bens móveis,"33141310-6, Seringas","Administração Regional de Saúde de Lisboa e Vale do Tejo, I.P. (503148776)","Pergut Portugal - Comércio Produtos Hospitalares e Médicos, Lda (501799729)","6.968,92 €",09-05-2012,27-04-2012,20 dias,"Portugal, Lisboa, Lisboa","Artigo 26.º, n.º 1, alínea e) do Código dos Contratos Públicos","","",,,,Não aplicável.,Não aplicável.,
"Aquisição de Seringas Irrecuperáveis de 2ml, 5ml e 10ml",Ajuste Direto Regime Geral,Aquisição de bens móveis,"33141310-6, Seringas","Administração Regional de Saúde de Lisboa e Vale do Tejo, I.P. (503148776)","B. Braun Medical, Lda (501506543)","51.700,00 €",09-05-2012,27-04-2012,20 dias,"Portugal, Lisboa, Lisboa","Artigo 26.º, n.º 1, alínea e) do Código dos Contratos Públicos","","",,,,Não aplicável.,Não aplicável.,
Aquisição de Seringas para Insulina e Tubercolina,Ajuste Direto Regime Geral,Aquisição de bens móveis,"33141310-6, Seringas","Administração Regional de Saúde de Lisboa e Vale do Tejo, I.P. (503148776)","Pergut Portugal - Comércio Produtos Hospitalares e Médicos, Lda (501799729)","8.690,00 €",09-05-2012,27-04-2012,20 dias,"Portugal, Lisboa, Lisboa","Artigo 26.º, n.º 1, alínea e) do Código dos Contratos Públicos","","",,,,Não aplicável.,Não aplicável.,
Aquisição de Agulhas Irrecuperáveis com Bisel Curto,Ajuste Direto Regime Geral,Aquisição de bens móveis,"33141320-9, Agulhas para fins médicos","Administração Regional de Saúde de Lisboa e Vale do Tejo, I.P. (503148776)","Pergut Portugal - Comércio Produtos Hospitalares e Médicos, Lda (501799729)","900,00 €",09-05-2012,27-04-2012,20 dias,"Portugal, Lisboa, Lisboa","Artigo 26.º, n.º 1, alínea e) do Código dos Contratos Públicos","","",,,,Não aplicável.,Não aplicável.,
Aquisição de Cateteres Periféricos,Ajuste Direto Regime Geral,Aquisição de bens móveis,"33140000-3, Material médico de consumo","Administração Regional de Saúde de Lisboa e Vale do Tejo, I.P. (503148776)","Smiths Medical Portugal Unipessoal, Lda (507445937)","41.650,00 €",09-05-2012,27-04-2012,20 dias,"Portugal, Lisboa, Lisboa","Artigo 26.º, n.º 1, alínea e) do Código dos Contratos Públicos","","",,,,Não aplicável.,Não aplicável.,
Aquisição de Agulhas Irrecuperáveis - Bisel Normal,Ajuste Direto Regime Geral,Aquisição de bens móveis,"33140000-3, Material médico de consumo","Administração Regional de Saúde de Lisboa e Vale do Tejo, I.P. (503148776)","B. Braun Medical, Lda (501506543)","19.437,00 €",09-05-2012,27-04-2012,20 dias,"Portugal, Lisboa, Lisboa","Artigo 26.º, n.º 1, alínea e) do Código dos Contratos Públicos","","",,,,Não aplicável.,Não aplicável.,
Aquisição de Mangas mistas para Esterilização,Ajuste Direto Regime Geral,Aquisição de bens móveis,"33140000-3, Material médico de consumo","Administração Regional de Saúde de Lisboa e Vale do Tejo, I.P. (503148776)","Bastos Viegas, S.A. (500042772)","87.518,24 €",09-05-2012,27-04-2012,20 dias,"Portugal, Lisboa","Artigo 26.º, n.º 1, alínea e) do Código dos Contratos Públicos","","",,,,Não aplicável.,Não aplicável.,
Aquisição de Sacos de Papel para Esterelização,Ajuste Direto Regime Geral,Aquisição de bens móveis,"33140000-3, Material médico de consumo","Administração Regional de Saúde de Lisboa e Vale do Tejo, I.P. (503148776)","Pergut Portugal - Comércio de Produtos Hospitalares e Médicos, Lda (501799729)","2.839,26 €",09-05-2012,27-04-2012,20 dias,"Portugal, Lisboa, Lisboa","Artigo 26.º, n.º 2, alínea b) do Código dos Contratos Públicos","","",,,,Não aplicável.,Não aplicável.,
Aquisição de Testes e Integradores para Esterelização,Ajuste Direto Regime Geral,Aquisição de bens móveis,"33140000-3, Material médico de consumo","Administração Regional de Saúde de Lisboa e Vale do Tejo, I.P. (503148776)","Dimor Lusitana - Comércio de Produtos de Saúde e Higiene, Lda (500730741)","41.340,00 €",09-05-2012,27-04-2012,20 dias,"Portugal, Lisboa, Lisboa","Artigo 26.º, n.º 1, alínea e) do Código dos Contratos Públicos","","",,,,Não aplicável.,Não aplicável.,
Aquisição de Membrana Lauryl - Laboratório de Saúde Pública de Santarém,Ajuste Direto Regime Geral,Aquisição de bens móveis,"33140000-3, Material médico de consumo","Administração Regional de Saúde de Lisboa e Vale do Tejo, I.P. (503148776)","Biogerm, S.A. (503265390)","2.070,00 €",09-05-2012,24-04-2012,20 dias,"Portugal, Santarém, Santarém","Artigo 24.º, n.º 1, alínea e) do Código dos Contratos Públicos","","",,,,Não aplicável.,Não aplicável.,
Aquisição de Reagentes para o Laboratório de Saúde Pública de Setúbal - Parte II,Ajuste Direto Regime Geral,Aquisição de bens móveis,"33696500-0, Reagentes de laboratório","Administração Regional de Saúde de Lisboa e Vale do Tejo, I.P. (503148776)","Biogerm, S.A. (503265390)","5.542,50 €",09-05-2012,02-05-2012,20 dias,"Portugal, Setúbal, Setúbal","Artigo 20.º, n.º 1, alínea a) do Código dos Contratos Públicos","","",,,,Não aplicável.,Não aplicável.,
Aquisição de Protamina Inj 10mg/ml - 5ml,Ajuste Direto Regime Geral,Aquisição de bens móveis,"33690000-3, Medicamentos vários","Administração Regional de Saúde de Lisboa e Vale do Tejo, I.P. (503148776)","Distrifarma - Companhia de Distribuição Farmaceutica, S.A. (502948663)","630,00 €",08-05-2012,30-04-2012,20 dias,"Portugal, Lisboa, Lisboa","Artigo 24.º, n.º 2, alínea b) do Código dos Contratos Públicos","","",,,,Não aplicável.,Não aplicável.,
Aquisição de Vacina contra o Pneumococo (Pn 13) Inj - Monodose,Ajuste Direto Regime Geral,Aquisição de bens móveis,"33690000-3, Medicamentos vários","Administração Regional de Saúde de Lisboa e Vale do Tejo, I.P. (503148776)","Laboratorios Pfizer, Lda (500162166)","4.168,00 €",08-05-2012,24-04-2012,20 dias,"Portugal, Lisboa, Lisboa","Artigo 24.º, n.º 1, alínea e) do Código dos Contratos Públicos","","",,,,Não aplicável.,Não aplicável.,
Aquisição de Amicacina Inj 250mg/ml - 2ml,Ajuste Direto Regime Geral,Aquisição de bens móveis,"33690000-3, Medicamentos vários","Administração Regional de Saúde de Lisboa e Vale do Tejo, I.P. (503148776)","Labesfal - Laboratórios Almiro, S.A. (501169580)","1.000,00 €",08-05-2012,27-04-2012,20 dias,"Portugal, Lisboa, Lisboa","Artigo 26.º, n.º 1, alínea e) do Código dos Contratos Públicos","","",,,,Não aplicável.,Não aplicável.,
Aquisição de Etionamida 250mg comprimidos,Ajuste Direto Regime Geral,Aquisição de bens móveis,"33690000-3, Medicamentos vários","Administração Regional de Saúde de Lisboa e Vale do Tejo, I.P. (503148776)","Etiopharma, S.A. (509393357)","25.000,00 €",08-05-2012,08-03-2012,20 dias,"Portugal, Lisboa, Lisboa","Artigo 24.º, n.º 1, alínea e) do Código dos Contratos Públicos","","",,,,Não aplicável.,Não aplicável.,
"Revisão efectuada aos 568139 KM a viatura 35-23-RN, da UCSP de Ourém. Afim da mesma poder ser presente à Inspecção anual de veiculos.",Ajuste Direto Regime Geral,Aquisição de serviços,"50112100-4, Serviços de reparação de automóveis","Administração Regional de Saúde de Lisboa e Vale do Tejo, I.P. (503148776)","LIZAUTO- soc.portuguesa comércio e reparação de automóveis,lda (501417052)","267,68 €",08-05-2012,16-04-2012,5 dias,"Portugal, Santarém, Ourém","Artigo 24.º, n.º 1, alínea e) do Código dos Contratos Públicos",16-04-2012,"267,68 €",,,,Não aplicável.,Não aplicável.,
"Aquisição de prestação de serviços de manutenção e reparação periódicado de ar condicionado e ventilação na ARSLVT,IP e no Laboratório de Micobacteriologia em Alcântara, para o ano de 2012.",Ajuste Direto Regime Geral,Aquisição de serviços,"98390000-3, Outros serviços","Administração Regional de Saúde de Lisboa e Vale do Tejo, I.P. (503148776)","Ventifor - Representações Equipamentos e Assistencia Técnica, Lda. (501140751)","8.780,40 €",08-05-2012,30-04-2012,366 dias,"Portugal, Lisboa, Lisboa","Artigo 24.º, n.º 1, alínea e) do Código dos Contratos Públicos","","",,,,Não aplicável.,Não aplicável.,
Fornecimento de dosimetros termoluminescentes de corpo inteiro para o pessoal profissionalmente exposto,Ajuste Direto Regime Geral,Aquisição de serviços,"98390000-3, Outros serviços","Administração Regional de Saúde de Lisboa e Vale do Tejo, I.P. (503148776)","MedicalConsult, SA (504092138)","38,72 €",08-05-2012,27-04-2012,30 dias,"Portugal, Santarém, Santarém","Artigo 24.º, n.º 1, alínea e) do Código dos Contratos Públicos","","",,,,Não aplicável.,Não aplicável.,
"Fornecimento de Peças e MAnutenção aos Servidores de Bases de Dados ORACLE, SINUS, SQL, MedicineOne, VitaHisCare e Sistema de Informação da Administração Regional de Saúde de Lisboa e Vale do Tejo, IP.",Ajuste Direto Regime Geral,Aquisição de serviços,"72222300-0, Serviços relacionados com as tecnologias da informação","Administração Regional de Saúde de Lisboa e Vale do Tejo, I.P. (503148776)","Integrator - Tecnologias da Informação, Lda. (506619290)","74.214,29 €",08-05-2012,24-04-2012,365 dias,"Portugal, Lisboa, Lisboa","Artigo 24.º, n.º 1, alínea e) do Código dos Contratos Públicos","","",,,,Não aplicável.,Não aplicável.,
Manutenção Evolutiva/Adaptativa do Software de Gestão de Atendimento a 25 Unidades de Saúde Familiar,Ajuste Direto Regime Geral,Aquisição de serviços,"72222300-0, Serviços relacionados com as tecnologias da informação","Administração Regional de Saúde de Lisboa e Vale do Tejo, I.P. (503148776)","MDST - Soluções Tecnológicas para a Saúde, Lda. (508695643)","20.708,33 €",08-05-2012,23-04-2012,305 dias,"Portugal, Lisboa, Lisboa","Artigo 27.º, n.º 1, alínea f) do Código dos Contratos Públicos","","",,,,Não aplicável.,Não aplicável.,
"Assistência técnica com fornecimento de peças ao Espectrofotómetro de absorção molécular Uv/Vis 300, sito no Laboratório de Saúde Pública de Santarém, para o periodo de 01/05/2012 a 31/12/2012.",Ajuste Direto Regime Geral,Aquisição de serviços,"98390000-3, Outros serviços","Administração Regional de Saúde de Lisboa e Vale do Tejo, I.P. (503148776)","Inicam - Sistemas Analíticos, Lda. (502614625)","2.523,87 €",07-05-2012,11-04-2012,366 dias,"Portugal, Santarém, Santarém","Artigo 24.º, n.º 1, alínea e) do Código dos Contratos Públicos","","",,,,Não aplicável.,Não aplicável.,
Aquisição de Impressoras Monocromáticas,Ajuste Direto Regime Geral,Aquisição de bens móveis,"30200000-1, Equipamento e material informático","Administração Regional de Saúde de Lisboa e Vale do Tejo, I.P. (503148776)","BaseDois - Informática e Telecomunicações, Lda. (501333401)","20.400,00 €",07-05-2012,27-04-2012,45 dias,"Portugal, Leiria, Nazaré<BR/>Portugal, Lisboa, Lisboa<BR/>Portugal, Setúbal, Setúbal",Artigo 258.º do Código dos Contratos Públicos,"","",,,,Não aplicável.,Não aplicável.,
"Trabalhos urgentes a realizar no Posto de Transformação da Unidade de Saúde de Algueirão, com necessidade de substituição do oleo, de juntas e trabalhos de limpeza do transformador, por razões de segurança. ACES IX.",Ajuste Direto Regime Geral,Aquisição de serviços,"98390000-3, Outros serviços","Administração Regional de Saúde de Lisboa e Vale do Tejo, I.P. (503148776)",Such- Serviço de Utilização Comum Hospitais (500900469),"2.278,00 €",07-05-2012,11-04-2012,30 dias,"Portugal, Lisboa, Sintra","Artigo 24.º, n.º 1, alínea e) do Código dos Contratos Públicos","","",,,,Não aplicável.,Não aplicável.,
"Assistência técnica com fornecimento de peças ao cromatógrafo da marca Dionex, modelo DX100 sito no Laboratório de Saúde Pública de Santarém, para o periodo de 01/05/2012 a 31/12/2012.",Ajuste Direto Regime Geral,Aquisição de serviços,"98390000-3, Outros serviços","Administração Regional de Saúde de Lisboa e Vale do Tejo, I.P. (503148776)","Dias de Sousa- Instrumentação Analítica e Científica, S.A. (504080857)","771,60 €",07-05-2012,11-04-2012,366 dias,"Portugal, Santarém, Santarém","Artigo 24.º, n.º 1, alínea e) do Código dos Contratos Públicos","","",,,,Não aplicável.,Não aplicável.,
Reparação do equipamento SKALAR SAN PLUS - Laboratório de Saúde Pública de Setúbal,Ajuste Direto Regime Geral,Aquisição de serviços,"98390000-3, Outros serviços","Administração Regional de Saúde de Lisboa e Vale do Tejo, I.P. (503148776)","Tecnilab- Portugal- Sociedade de Planeamento Técnico e científico, S.A. (500758158)","227,00 €",07-05-2012,11-04-2012,30 dias,"Portugal, Setúbal, Setúbal","Artigo 24.º, n.º 1, alínea f) do Código dos Contratos Públicos","","",,,,Não aplicável.,Não aplicável.,
"Substituição de motores dos ventiladores, estrutura de apoio e aplicação de isolamentos nos equipamentos de ar condicionado instalados no edifício da ARSLVT,IP n.º 77 pisos 7º, 8º, 9º e 10º.",Ajuste Direto Regime Geral,Aquisição de serviços,"98390000-3, Outros serviços","Administração Regional de Saúde de Lisboa e Vale do Tejo, I.P. (503148776)","Odiclima - Sociedade Técnica de Ar Condicionado, Lda (502835230)","724,00 €",07-05-2012,11-04-2012,30 dias,"Portugal, Lisboa, Lisboa","Artigo 24.º, n.º 1, alínea e) do Código dos Contratos Públicos","","",,,,Não aplicável.,Não aplicável.,
"Cópias adicionais da ARSLVT,I.P.  referentes ao equipamento BIZHUB C203 com o n.º de série A02E022021112.",Ajuste Direto Regime Geral,Aquisição de serviços,"98390000-3, Outros serviços","Administração Regional de Saúde de Lisboa e Vale do Tejo, I.P. (503148776)","konica Minolta - Business Solutions Portugal, Unipessoal, Lda. (502120070)","425,88 €",07-05-2012,20-04-2012,183 dias,"Portugal, Lisboa, Lisboa","Artigo 24.º, n.º 1, alínea e) do Código dos Contratos Públicos","","",,,,Não aplicável.,Não aplicável.,
Ligação à rede em baixa tensão para a USF Sobral Monte Agraço-Estabelecimento de Ramal BT,Ajuste Direto Regime Geral,Aquisição de serviços,"98390000-3, Outros serviços","Administração Regional de Saúde de Lisboa e Vale do Tejo, I.P. (503148776)","EDP-Distribuição de Energia, SA (504394029)","6.069,57 €",07-05-2012,12-04-2012,45 dias,"Portugal, Lisboa, Sobral de Monte Agraço","Artigo 24.º, n.º 1, alínea e) do Código dos Contratos Públicos","","",,,,Não aplicável.,Não aplicável.,
"Necessiddae de adquirir 3 botijas de oxixénio de 12,6M3 para a UCSP do Entroncamento",Ajuste Direto Regime Geral,Aquisição de bens móveis,"24111000-5, Hidrogénio, árgon, gases raros, azoto e oxigénio","Administração Regional de Saúde de Lisboa e Vale do Tejo, I.P. (503148776)","Linde Sogás, lda (500266344)","210,00 €",04-05-2012,30-03-2012,10 dias,"Portugal, Santarém, Entroncamento","Artigo 24.º, n.º 1, alínea e) do Código dos Contratos Públicos",04-04-2012,"210,00 €",,,,Não aplicável.,Não aplicável.,
reparação de convectores da UCSP de Alcanena,Ajuste Direto Regime Geral,Aquisição de serviços,"50720000-8, Serviços de reparação e manutenção de aquecimento central","Administração Regional de Saúde de Lisboa e Vale do Tejo, I.P. (503148776)",SUCH (500900469),"773,27 €",04-05-2012,24-02-2012,5 dias,"Portugal, Santarém, Alcanena","Artigo 24.º, n.º 1, alínea e) do Código dos Contratos Públicos",24-02-2012,"773,27 €",,,,Não aplicável.,Não aplicável.,
"Deslocação, mão de obra e material aplicado na reparação do autoclave da UCSP de Ourém",Ajuste Direto Regime Geral,Aquisição de serviços,"50000000-5, Serviços de reparação e manutenção","Administração Regional de Saúde de Lisboa e Vale do Tejo, I.P. (503148776)",STERYL-SER (508051711),"468,49 €",04-05-2012,22-03-2012,10 dias,"Portugal, Santarém, Ourém","Artigo 24.º, n.º 1, alínea e) do Código dos Contratos Públicos",22-03-2012,"468,49 €",,,,Não aplicável.,Não aplicável.,
"Deslocação, mão de obra e material aplicado na reparação do autoclave da UCSP de ALCANENA. O mesmo encontrava-se sem funcionar devido às seguintes mensagens, constantes no visor, falha de pressão na câmara, falha de presão na camisa e falha de vácuo.",Ajuste Direto Regime Geral,Aquisição de serviços,"50000000-5, Serviços de reparação e manutenção","Administração Regional de Saúde de Lisboa e Vale do Tejo, I.P. (503148776)",STERYL-Ser (508051711),"242,19 €",04-05-2012,22-03-2012,10 dias,"Portugal, Santarém, Alcanena","Artigo 24.º, n.º 1, alínea e) do Código dos Contratos Públicos",22-03-2012,"242,19 €",,,,Não aplicável.,Não aplicável.,
"Aquisição de serviços recolha, tratamento, transporte e distribuição de mercadorias, numa lógica de logística integrada para o Centro de Saúde de Vila Franca de Xira.",Ajuste Direto Regime Geral,Aquisição de serviços,"98390000-3, Outros serviços","Administração Regional de Saúde de Lisboa e Vale do Tejo, I.P. (503148776)","Transportes Barata & Carvalho, Lda. (500425299)","23.200,00 €",03-05-2012,18-04-2012,20 dias,"Portugal, Lisboa, Vila Franca de Xira","Artigo 20.º, n.º 1, alínea a) do Código dos Contratos Públicos","","",,,,Não aplicável.,Não aplicável.,
Recolha e transporte de resíduos.,Ajuste Direto Regime Geral,Aquisição de serviços,"98390000-3, Outros serviços","Administração Regional de Saúde de Lisboa e Vale do Tejo, I.P. (503148776)","Transportes Evaristo Luis, Lda. (504878808)","17.010,00 €",03-05-2012,18-04-2012,20 dias,"Portugal, Lisboa, Lisboa","Artigo 20.º, n.º 1, alínea a) do Código dos Contratos Públicos","","",,,,Não aplicável.,Não aplicável.,
Aquisição de Software IBM SPSS Statistics,Ajuste Direto Regime Geral,Aquisição de bens móveis,"30200000-1, Equipamento e material informático","Administração Regional de Saúde de Lisboa e Vale do Tejo, I.P. (503148776)","PSE - Produtos e Serviços de Estatística, Lda. (503323390)","7.454,25 €",02-05-2012,19-04-2012,8 dias,"Portugal, Lisboa, Lisboa","Artigo 20.º, n.º 1, alínea a) do Código dos Contratos Públicos","","",,,,Não aplicável.,Não aplicável.,
"A firma Socodefil - Sociedade de Construções Manuel Delgado & Filhos, Lda, como Segundo Outorgantge, obriga-se à Empreitada para a Beneficiação do Edifício da Unidade de Saúde Familiar Afonsoeiro, Centro de Saúde do Montijo (ACES 15)",Ajuste Direto Regime Geral,Empreitadas de obras públicas,"45113000-2, Obras no local","Administração Regional de Saúde de Lisboa e Vale do Tejo, I.P. (503148776)","Socodefil - Soc. Construções Manuel Delgado & Filhos, Lda (500742219)","78.488,73 €",02-05-2012,17-04-2012,90 dias,"Portugal, Setúbal, Montijo","Artigo 19.º, alínea a) do Código dos Contratos Públicos","","",,,,Não aplicável.,Não aplicável.,
"Substituição do comando para o ventilo convector da marca Carrier e de um condensador no equipamento do sistema AVAC, sito no Centro de Saúde de S. Domingos de Rana - ACES XI.",Ajuste Direto Regime Geral,Aquisição de serviços,"98390000-3, Outros serviços","Administração Regional de Saúde de Lisboa e Vale do Tejo, I.P. (503148776)",Such - Serviços de Utilização Comum Hospitais (500900469),"75,12 €",02-05-2012,20-04-2012,20 dias,"Portugal, Lisboa, Cascais","Artigo 24.º, n.º 1, alínea e) do Código dos Contratos Públicos","","",,,,Não aplicável.,Não aplicável.,
"A firma Construtora Albarrã Lda, como Segunda Outorgante, obriga-se à Empreitada para a Instalação da Unidade de Saúde Familiar Almonda, no Centro de Saúde de Torres Novas (ACES 19)",Ajuste Direto Regime Geral,Empreitadas de obras públicas,"45113000-2, Obras no local","Administração Regional de Saúde de Lisboa e Vale do Tejo, I.P. (503148776)","Construtora Albarrã, Lda (501635890)","64.494,35 €",02-05-2012,20-04-2012,60 dias,"Portugal, Santarém, Torres Novas","Artigo 19.º, alínea a) do Código dos Contratos Públicos","","",,,,Não aplicável.,Não aplicável.,
"Substituição de uma bomba circuladora da marca Grundfos modelo UPS 25-80-180 no equipamento do sistema de AVAC, sito na  Centro de Saúde do Sardoal - ACES XX.",Ajuste Direto Regime Geral,Aquisição de serviços,"98390000-3, Outros serviços","Administração Regional de Saúde de Lisboa e Vale do Tejo, I.P. (503148776)",Such - Serviços de utilização Comum Hospitais (500900469),"316,80 €",02-05-2012,20-04-2012,20 dias,"Portugal, Santarém, Sardoal","Artigo 24.º, n.º 1, alínea e) do Código dos Contratos Públicos","","",,,,Não aplicável.,Não aplicável.,
"A firma Imotelha - Empreiteiros de Construção, Lda, como Segunda Outorgante, obriga-se à Empreitada de Remoção de Infraestruturas e Limpeza de Terreno da Unidade de Saúde Familiar Locomotiva, no Centro de Saúde do Entroncamento (ACES 19)",Ajuste Direto Regime Geral,Empreitadas de obras públicas,"45111000-8, Demolição, preparação e limpeza dos locais para construção","Administração Regional de Saúde de Lisboa e Vale do Tejo, I.P. (503148776)","Imotelha - Empreiteiros de Construção Cívil, Lda (507546946)","22.512,68 €",02-05-2012,19-04-2012,15 dias,"Portugal, Santarém, Entroncamento","Artigo 19.º, alínea a) do Código dos Contratos Públicos","","",,,,Não aplicável.,Não aplicável.,
