Objeto do Contrato,Tipo de Procedimento,Tipo(s) de Contrato,CPVs,Entidade(s) Adjudicante(s),Entidade(s) Adjudicatária(s),Preço Contratual,Data de Publicação,Data de Celebração do Contrato,Prazo de Execução,Local de Execução,Fundamentação,Data de Fecho do Contrato,Preço Total Efetivo,Causas das Alterações ao Prazo,Causas das Alterações ao Preço,Estado,N.º registo do Acordo Quadro,Descrição do Acordo Quadro,Procedimento Centralizado
Renovação do Contrato de Manutenção dos Elevadores da SCHMITT Localizados no HSM para 2015,Ajuste Direto Regime Geral,Aquisição de serviços,"50000000-5, Serviços de reparação e manutenção","Unidade Local de Saúde da Guarda, E. P. E. (508752000)","SCHMITT - ELEVADORES, LDA (500230757)","14.280,00 €",07-03-2016,06-10-2015,86 dias,"Portugal, Guarda, Guarda","Artigo 20.º, n.º 1, alínea a) do Código dos Contratos Públicos",31-12-2015,"12.852,00 €",,A alteração no valor do contrato para um valor mais baixo é devido a uma manutenção de nove elevadores e não de dez elevadores.,,Não aplicável.,Não aplicável.,FALSE
Aquisição de Gas Natural para o CHPL Ano 2015-(UMC-SG),Concurso público,Aquisição de bens móveis,"09123000-7, Gás natural","Centro Hospitalar Lisboa Norte, E. P. E. (508481287), Administração Regional de Saúde do Centro, I. P. (503122165), Centro Hospitalar de Lisboa Ocidental, E. P. E. (507618319), SUCH - Serviço de Utilização Comum dos Hospitais (500900469), Centro Hospitalar Vila Nova de Gaia - Espinho, E. P. E. (508142156), Centro Hospitalar Barreiro Montijo, E. P. E. (509186998), Centro Hospitalar de Trás-os-Montes e Alto Douro, E. P. E. (508100496), Serviço de Intervenção nos Comportamentos Aditivos e nas Dependências (600084884), Centro Hospitalar de Lisboa Central, E. P. E. (508080142), Instituto Português de Oncologia do Porto Francisco Gentil, E. P. E. (506362299), Unidade Local de Saúde de Castelo Branco, E. P. E. (509309844), Hospital Dr. Francisco Zagalo (501510150), Centro Hospitalar Tondela-Viseu, E. P. E. (509822940), Instituto de Oftalmologia Dr. Gama Pinto (600000052), Secretaria-Geral do Ministério da Saúde (600080684), Centro Hospitalar do Médio Ave, E. P. E. (508093937), Hospital Distrital de Santarém, E. P. E. (506361462), Hospital Santa Maria Maior, E. P. E. (506361381), Direcção-Geral da Saúde (600037100), Centro Hospitalar Psiquiátrico de Lisboa (508338476), Hospital do Espírito Santo de Évora, E. P. E. (508085888), Hospital Garcia de Orta, E. P. E. (506361470), Centro Hospitalar do Oeste (510412009), Unidade Local de Saúde do Nordeste, E. P. E (509932584), Hospital de José Luciano de Castro (501613021), Administração Regional de Saúde do Norte, I. P. (503135593), Centro Hospitalar do Médio Tejo, E. P. E. (506361608), Hospital Arcebispo João Crisóstomo (501626123), Instituto Português de Oncologia de Lisboa Francisco Gentil, E. P. E. (506361616), Unidade Local de Saúde do Alto Minho, E. P. E. (508786193), Instituto Nacional de Emergência Médica, I. P. (501356126), Instituto Português do Sangue e da Transplantação, I. P. (502423943), Centro Hospitalar Póvoa de Varzim - Vila do Conde, E. P. E. (508741823), Centro Hospitalar de São João, E. P. E. (509821197), Centro Hospitalar de Entre o Douro e Vouga, E.P.E. (508878462), Hospital de Magalhães Lemos, E. P. E. (502828790), Unidade Local de Saúde da Guarda, E. P. E. (508752000), Centro Hospitalar de Setúbal, E. P. E. (507606787), Centro Hospitalar Porto, E. P. E. (508331471), Instituto Português de Oncologia de Coimbra Francisco Gentil, E. P. E. (506361438), Administração Regional de Saúde de Lisboa e Vale do Tejo, I. P. (503148776), Centro Hospitalar do Algarve, E. P. E. (510745997), Centro Hospitalar do Alto Ave, E. P. E. (508080827), Centro Hospitalar do Baixo Vouga, E. P. E (CHBV, E. P. E.) (510123210), Centro Hospitalar e Universitário de Coimbra, E. P. E. (510103448), Centro Hospitalar Cova da Beira, E. P. E. (506361659), Centro Hospitalar de Leiria, E. P. E. (509822932), Centro Hospitalar do Tâmega e Sousa, E. P. E. (508318262), Instituto Nacional de Saúde Dr. Ricardo Jorge, I. P. (501427511)","EDP Comercial, S.A (503504564)","579.733,88 €",07-03-2016,30-01-2015,365 dias,"Portugal, Lisboa, Lisboa",Artigo 259.º do Código dos Contratos Públicos,31-12-2015,"525.715,02 €",,Valor corresponde ao Faturado (inferior ao estimado),,Não aplicável.,Não aplicável.,TRUE
Aquisição de Equipamento para Avaliação e Diagnóstico da Patologia do Endométrio,Ajuste Direto Regime Geral,Aquisição de bens móveis,"33000000-0, Equipamento médico, medicamentos e produtos para cuidados pessoais","Unidade Local de Saúde da Guarda, E. P. E. (508752000)","TEPREL - Equipamentos Médicos, S.A. (502262184)","74.500,00 €",04-03-2016,29-05-2015,30 dias,"Portugal, Guarda, Guarda","Artigo 20.º, n.º 1, alínea a) do Código dos Contratos Públicos","","",,"",,Não aplicável.,Não aplicável.,FALSE
Contrato de Manutenção do Software ALERT para 2016,Ajuste Direto Regime Geral,Aquisição de serviços,"72267000-4, Serviços de manutenção e reparação de software","Unidade Local de Saúde da Guarda, E. P. E. (508752000)","ALERT LIFE SCIENCES COMPUTING, S.A. (507567455)","177.617,00 €",03-03-2016,18-02-2016,317 dias,"Portugal, Guarda, Guarda","Artigo 24.º, n.º 1, alínea e) do Código dos Contratos Públicos","","",,"",,Não aplicável.,Não aplicável.,FALSE
Contrato de Manutenção PACS para o ano de 2015,Ajuste Direto Regime Geral,Aquisição de serviços,"72267000-4, Serviços de manutenção e reparação de software","Unidade Local de Saúde da Guarda, E. P. E. (508752000)","SIEMENS, S.A. (500247480)","91.914,00 €",03-03-2016,06-07-2015,365 dias,"Portugal, Guarda, Guarda","Artigo 24.º, n.º 1, alínea e) do Código dos Contratos Públicos","","",,"",,Não aplicável.,Não aplicável.,FALSE
Renovação do Contrato de Manutenção do Software ALERT para 2015,Ajuste Direto Regime Geral,Aquisição de serviços,"72267000-4, Serviços de manutenção e reparação de software",Unidade Local de Saude da Guarda (508752000),"ALERT LIFE SCIENCES COMPUTING, S.A. (507567455)","177.617,00 €",03-03-2016,03-11-2015,58 dias,"Portugal, Guarda, Guarda","Artigo 24.º, n.º 1, alínea e) do Código dos Contratos Públicos","","",,"",,Não aplicável.,Não aplicável.,FALSE
Contrato de Manutenção de Licenciamento e Suporte do SGTD 2016,Ajuste Direto Regime Geral,Aquisição de serviços,"72000000-5, Serviços de TI: consultoria, desenvolvimento de software, Internet e apoio","Unidade Local de Saúde da Guarda, E.P.E (508752000)","LINK CONSULTING, TECNOLOGIAS DE INFORMAÇÃO, S.A. (504551221)","11.000,00 €",03-03-2016,12-02-2016,323 dias,"Portugal, Guarda, Guarda","Artigo 20.º, n.º 1, alínea a) do Código dos Contratos Públicos","","",,"",,Não aplicável.,Não aplicável.,FALSE
Contrato de Manutenção Preventiva e Corretiva dos Sistemas de Segurança do Novo Edifício do HSM,Ajuste Direto Regime Geral,Aquisição de serviços,"50000000-5, Serviços de reparação e manutenção","Unidade Local de Saúde da Guarda, E. P. E. (508752000)","SIEMENS, S.A. (500247480)","15.323,40 €",03-03-2016,25-08-2015,365 dias,"Portugal, Guarda, Guarda","Artigo 20.º, n.º 1, alínea a) do Código dos Contratos Públicos","","",,"",,Não aplicável.,Não aplicável.,FALSE
Contrato de Manutenção e Assistência Técnica do Sistema de Gestão Técnica Centralizada,Ajuste Direto Regime Geral,Aquisição de serviços,"50000000-5, Serviços de reparação e manutenção","Unidade Local de Saúde da Guarda, E. P. E. (508752000)","SIEMENS, S.A. (500247480)","9.856,85 €",03-03-2016,14-08-2015,365 dias,"Portugal, Guarda, Guarda","Artigo 20.º, n.º 1, alínea a) do Código dos Contratos Públicos","","",,"",,Não aplicável.,Não aplicável.,FALSE
Prestação de Serviços de Sistema AVAC - Substituição de Filtros e Correias,Ajuste Direto Regime Geral,Aquisição de serviços,"50000000-5, Serviços de reparação e manutenção","Unidade Local de Saúde da Guarda, E. P. E. (508752000)",SERVIÇO DE UTILIZAÇÃO COMUM DOS HOSPITAIS (SUCH) (500900469),"17.344,06 €",03-03-2016,20-08-2015,30 dias,"Portugal, Guarda, Guarda","Artigo 20.º, n.º 1, alínea a) do Código dos Contratos Públicos","","",,"",,Não aplicável.,Não aplicável.,FALSE
Contrato de Manutenção dos Servidores dos CSP 2015,Ajuste Direto Regime Geral,Aquisição de serviços,"72000000-5, Serviços de TI: consultoria, desenvolvimento de software, Internet e apoio","Unidade Local de Saúde da Guarda, E. P. E. (508752000)","GONKSYS, S.A. (510874169)","26.089,50 €",03-03-2016,27-04-2015,248 dias,"Portugal, Guarda, Guarda","Artigo 27.º, n.º 1, alínea f) do Código dos Contratos Públicos","","",,"",,Não aplicável.,Não aplicável.,FALSE
"Renovação do Contrato de Equipamentos de Eletromecânica, Laboratório e Raios X para 2015",Ajuste Direto Regime Geral,Aquisição de serviços,"50000000-5, Serviços de reparação e manutenção","Unidade Local de Saúde da Guarda, E. P. E. (508752000)",SERVIÇO DE UTILIZAÇÃO COMUM DOS HOSPITAIS (SUCH) (500900469),"29.601,72 €",02-03-2016,27-07-2015,157 dias,"Portugal, Guarda, Guarda","Artigo 27.º, n.º 1, alínea f) do Código dos Contratos Públicos","","",,"",,Não aplicável.,Não aplicável.,FALSE
Renovação do Contrato da Exploração das Instalações Elétricas para 2015,Ajuste Direto Regime Geral,Aquisição de serviços,"50000000-5, Serviços de reparação e manutenção","Unidade Local de Saúde da Guarda, E. P. E. (508752000)",SERVIÇO DE UTILIZAÇÃO COMUM DOS HOSPITAIS (SUCH) (500900469),"21.544,32 €",02-03-2016,27-07-2015,157 dias,"Portugal, Guarda, Guarda","Artigo 27.º, n.º 1, alínea f) do Código dos Contratos Públicos","","",,"",,Não aplicável.,Não aplicável.,FALSE
Renovação do Contrato de Quantificação Gases Anestésicos e Controlo Microbiológico para 2015,Ajuste Direto Regime Geral,Aquisição de serviços,"50000000-5, Serviços de reparação e manutenção","Unidade Local de Saúde da Guarda, E. P. E. (508752000)",SERVIÇO DE UTILIZAÇÃO COMUM DOS HOSPITAIS (SUCH) (500900469),"13.239,84 €",02-03-2016,27-07-2015,157 dias,"Portugal, Guarda, Guarda","Artigo 27.º, n.º 1, alínea f) do Código dos Contratos Públicos","","",,"",,Não aplicável.,Não aplicável.,FALSE
