freguesia,acronym,validVotesPercentage,votes,dicofre
Azias,PPD/PSD.CDS-PP,57.94,62,160601
Azias,PS,31.78,34,160601
Azias,L,3.74,4,160601
Azias,PND,1.87,2,160601
Azias,PTP,1.87,2,160601
Azias,PAN,0.93,1,160601
Azias,PCP-PEV,0.93,1,160601
Azias,PPM,0.93,1,160601
Azias,B.E.,0,0,160601
Azias,MAS,0,0,160601
Azias,MPT,0,0,160601
Azias,PCTP/MRPP,0,0,160601
Azias,PDA,0,0,160601
Azias,PNR,0,0,160601
Azias,POUS,0,0,160601
Azias,PPV,0,0,160601
