Objeto do Contrato,Tipo de Procedimento,Tipo(s) de Contrato,CPVs,Entidade(s) Adjudicante(s),Entidade(s) Adjudicatária(s),Preço Contratual,Data de Publicação,Data de Celebração do Contrato,Prazo de Execução,Local de Execução,Fundamentação,Data de Fecho do Contrato,Preço Total Efetivo,Causas das Alterações ao Prazo,Causas das Alterações ao Preço,Estado,N.º registo do Acordo Quadro,Descrição do Acordo Quadro,Procedimento Centralizado
Aquisição serviços médicos - ACES Gerês/Cabreira - Processo 18000138,Ajuste Direto Regime Geral,Aquisição de serviços,"85121000-3, Serviços de prática médica","Administração Regional de Saúde do Norte, I. P. (503135593)",José Fernando Fernandes da Silva (157267954),"70.304,00 €",20-07-2018,29-01-2018,365 dias,"Portugal, Braga, Vieira do Minho","Artigo 20.º, n.º 1, alínea a) do Código dos Contratos Públicos","","",,"",,Não aplicável.,Não aplicável.,FALSE
Aquisição de serviços na área da Medicina - ACES Cávado II - Gerês/Cabreira,Ajuste Direto Regime Geral,Aquisição de serviços,"85121000-3, Serviços de prática médica","Administração Regional de Saúde do Norte, I. P. (503135593)",José Fernando Fernandes da Silva (157267954),"58.968,00 €",22-03-2017,23-01-2017,365 dias,"Portugal, Braga, Vieira do Minho","Artigo 20.º, n.º 1, alínea a) do Código dos Contratos Públicos",31-12-2017,"70.659,00 €",,Não foram executadas a totalidade das horas contratualizadas,,Não aplicável.,Não aplicável.,FALSE
