freguesia,acronym,validVotesPercentage,votes,dicofre
Arrifana,PPD/PSD,34.43,63,090706
Arrifana,PS,31.15,57,090706
Arrifana,B.E.,9.29,17,090706
Arrifana,CDS-PP,8.74,16,090706
Arrifana,A,3.83,7,090706
Arrifana,PAN,3.28,6,090706
Arrifana,PCP-PEV,2.19,4,090706
Arrifana,PPM.PPV/CDC,1.64,3,090706
Arrifana,IL,1.09,2,090706
Arrifana,MAS,1.09,2,090706
Arrifana,PCTP/MRPP,1.09,2,090706
Arrifana,PNR,1.09,2,090706
Arrifana,L,0.55,1,090706
Arrifana,NC,0.55,1,090706
Arrifana,PDR,0,0,090706
Arrifana,PTP,0,0,090706
Arrifana,PURP,0,0,090706
