Objeto do Contrato,Tipo de Procedimento,Tipo(s) de Contrato,CPVs,Entidade(s) Adjudicante(s),Entidade(s) Adjudicatária(s),Preço Contratual,Data de Publicação,Data de Celebração do Contrato,Prazo de Execução,Local de Execução,Fundamentação,Data de Fecho do Contrato,Preço Total Efetivo,Causas das Alterações ao Prazo,Causas das Alterações ao Preço,Estado,N.º registo do Acordo Quadro,Descrição do Acordo Quadro,Procedimento Centralizado
Aquisição de 301.875 unidades de preservativos masculinos extra-fortes,Ao abrigo de acordo-quadro (art.º 259.º),Aquisição de bens móveis,"33712000-4, Preservativos",Direção-Geral da Saúde (600037100),"Ezequiel Panão Jorge, Lda. (501412727)","103.883,31 €",10-11-2017,06-11-2017,55 dias,"Portugal, Lisboa",Artigo 259.º do Código dos Contratos Públicos,,,,,,1459323,CP 2015/20,TRUE
"Aquisição de material informático, ao abrigo do A. Q. - Refª P259_2017UMC026",Ajuste Direto Regime Geral,Aquisição de bens móveis,"30000000-9, Máquinas, equipamento e material de escritório e de informática, excepto mobiliário e pacotes de programas (software)",Direção-Geral da Saúde (600037100),Informantem (503670693),"5.270,30 €",03-11-2017,24-10-2017,365 dias,"Portugal, Lisboa",Artigo 258.º do Código dos Contratos Públicos,,,,,,Não aplicável.,Não aplicável.,FALSE
Aquisição de material informático ao abrigo A.Q. - Refª P259_2017UMC044,Ajuste Direto Regime Geral,Aquisição de bens móveis,"30000000-9, Máquinas, equipamento e material de escritório e de informática, excepto mobiliário e pacotes de programas (software)",Direção-Geral da Saúde (600037100),"Inforlandia, S.A. (502425296)","9.220,10 €",03-11-2017,24-10-2017,365 dias,"Portugal, Lisboa",Artigo 258.º do Código dos Contratos Públicos,,,,,,Não aplicável.,Não aplicável.,FALSE
