freguesia,acronym,validVotesPercentage,votes,dicofre
União das freguesias de Lamas e Cercal,PS,47.74,497,110412
União das freguesias de Lamas e Cercal,PPD/PSD,23.05,240,110412
União das freguesias de Lamas e Cercal,B.E.,6.92,72,110412
União das freguesias de Lamas e Cercal,PAN,5.28,55,110412
União das freguesias de Lamas e Cercal,CDS-PP,4.13,43,110412
União das freguesias de Lamas e Cercal,PCP-PEV,3.84,40,110412
União das freguesias de Lamas e Cercal,PPM.PPV/CDC,2.69,28,110412
União das freguesias de Lamas e Cercal,A,1.44,15,110412
União das freguesias de Lamas e Cercal,PCTP/MRPP,1.06,11,110412
União das freguesias de Lamas e Cercal,L,0.77,8,110412
União das freguesias de Lamas e Cercal,NC,0.77,8,110412
União das freguesias de Lamas e Cercal,PNR,0.77,8,110412
União das freguesias de Lamas e Cercal,PURP,0.48,5,110412
União das freguesias de Lamas e Cercal,PDR,0.38,4,110412
União das freguesias de Lamas e Cercal,IL,0.29,3,110412
União das freguesias de Lamas e Cercal,MAS,0.19,2,110412
União das freguesias de Lamas e Cercal,PTP,0.19,2,110412
