freguesia,acronym,validVotesPercentage,votes,dicofre
Mogege,PS,39.79,269,031225
Mogege,PPD/PSD.CDS-PP,36.24,245,031225
Mogege,MPT,6.36,43,031225
Mogege,PCP-PEV,5.92,40,031225
Mogege,B.E.,3.25,22,031225
Mogege,L,1.92,13,031225
Mogege,PAN,1.78,12,031225
Mogege,MAS,1.04,7,031225
Mogege,PTP,1.04,7,031225
Mogege,PPV,0.74,5,031225
Mogege,PCTP/MRPP,0.59,4,031225
Mogege,PND,0.59,4,031225
Mogege,PPM,0.44,3,031225
Mogege,PDA,0.15,1,031225
Mogege,POUS,0.15,1,031225
Mogege,PNR,0,0,031225
