Objeto do Contrato,Tipo de Procedimento,Tipo(s) de Contrato,CPVs,Entidade(s) Adjudicante(s),Entidade(s) Adjudicatária(s),Preço Contratual,Data de Publicação,Data de Celebração do Contrato,Prazo de Execução,Local de Execução,Fundamentação,Data de Fecho do Contrato,Preço Total Efetivo,Causas das Alterações ao Prazo,Causas das Alterações ao Preço,Estado,N.º registo do Acordo Quadro,Descrição do Acordo Quadro,Procedimento Centralizado
Hidroxizina Ampola e Xarope,Ajuste Direto Regime Geral,Aquisição de serviços,"33000000-0, Equipamento médico, medicamentos e produtos para cuidados pessoais","Administração Regional de Saúde do Algarve, I.P. (503148709)","U.C.B.Pharma Prod. Farm, Ldª. (500291322)","155,20 €",05-09-2011,26-08-2011,90 dias,"Portugal, Faro, Faro","Artigo 24.º, n.º 1, alínea e) do Código dos Contratos Públicos","","",,"",,Não aplicável.,Não aplicável.,
MATERIAL DESINFETANTE,Ajuste Direto Regime Geral,Aquisição de serviços,"33631600-8, Anti-sépticos e desinfectantes","Administração Regional de Saúde do Algarve, I.P. (503148709)",PROCLINICA EQUIP. PROD. CLINICOS LDª (500222665),"5.617,92 €",02-09-2011,24-08-2011,360 dias,"Portugal, Faro, Faro","Artigo 20.º, n.º 1, alínea a) do Código dos Contratos Públicos","","",,"",,Não aplicável.,Não aplicável.,
MATERIAL DESINFETANTE,Ajuste Direto Regime Geral,Aquisição de serviços,"33631600-8, Anti-sépticos e desinfectantes","Administração Regional de Saúde do Algarve, I.P. (503148709)",B.BRAUN MEDICAL LDª (501506543),"5.896,70 €",02-09-2011,24-08-2011,360 dias,"Portugal, Faro, Faro","Artigo 20.º, n.º 1, alínea a) do Código dos Contratos Públicos","","",,"",,Não aplicável.,Não aplicável.,
MATERIAL DESINFETANTE,Ajuste Direto Regime Geral,Aquisição de serviços,"33631600-8, Anti-sépticos e desinfectantes","Administração Regional de Saúde do Algarve, I.P. (503148709)",LABORATÓRIO INIBSA (500139571),"167,65 €",02-09-2011,24-08-2011,360 dias,"Portugal, Faro, Faro","Artigo 20.º, n.º 1, alínea a) do Código dos Contratos Públicos","","",,"",,Não aplicável.,Não aplicável.,
Contrato de manutenção e assistência técnica aos equipamentos de digitalização de imagem radiológica instalados nos centros de saúde da ARS Algarve.,Ajuste Direto Regime Geral,Aquisição de serviços,"50000000-5, Serviços de reparação e manutenção","Administração Regional de Saúde do Algarve, I.P. (503148709)","FUJIFILM Portugal, Lda (500134936)","10.473,30 €",02-09-2011,02-09-2011,365 dias,"Portugal, Faro, Tavira<BR/>Portugal, Faro, Vila Real Sto Antonio<BR/>Portugal, Faro, Olhão<BR/>Portugal, Faro, Silves<BR/>Portugal, Faro, Faro<BR/>Portugal, Faro, Loulé<BR/>Portugal, Faro, Albufeira","Artigo 24.º, n.º 1, alínea e) do Código dos Contratos Públicos",01-09-2012,"10.473,24 €",,"Relativo a arredondamento na facturação, no valor de 0,06€",,Não aplicável.,Não aplicável.,
Aquisição de Serviços de Transporte e Distribuição de Materiais para as Unidades de Saúde dos ACES e Serviços da Sede da ARS Algarve,Ajuste Direto Regime Geral,Aquisição de serviços,"60161000-4, Serviços de transporte de encomendas","Administração Regional de Saúde do Algarve, I.P. (503148709)","Transnelcar-Transporte de Mercadorias, Lda (502173475)","36.216,00 €",02-09-2011,01-09-2011,365 dias,"Portugal, Faro, Vila do Bispo<BR/>Portugal, Faro, Aljezur<BR/>Portugal, Faro, Faro<BR/>Portugal, Faro, São Brás de Alportel<BR/>Portugal, Faro, Loulé<BR/>Portugal, Faro, Albufeira<BR/>Portugal, Faro, Olhão<BR/>Portugal, Faro, Lagos<BR/>Portugal, Faro, Vila Real Sto Antonio<BR/>Portugal, Faro, Alcoutim<BR/>Portugal, Faro, Silves<BR/>Portugal, Faro, Lagoa<BR/>Portugal, Faro, Tavira<BR/>Portugal, Faro, Monchique<BR/>Portugal, Faro, Portimão","Artigo 20.º, n.º 1, alínea a) do Código dos Contratos Públicos",31-08-2012,"36.216,00 €",,"",,Não aplicável.,Não aplicável.,
