freguesia,acronym,validVotesPercentage,votes,dicofre
Vilela,PPD/PSD.CDS-PP,56.92,736,131024
Vilela,PS,20.88,270,131024
Vilela,MPT,6.73,87,131024
Vilela,PCP-PEV,4.33,56,131024
Vilela,B.E.,3.09,40,131024
Vilela,PND,1.78,23,131024
Vilela,PCTP/MRPP,1.62,21,131024
Vilela,PTP,1.16,15,131024
Vilela,PAN,0.7,9,131024
Vilela,PPM,0.7,9,131024
Vilela,L,0.54,7,131024
Vilela,PDA,0.46,6,131024
Vilela,PNR,0.46,6,131024
Vilela,MAS,0.31,4,131024
Vilela,PPV,0.23,3,131024
Vilela,POUS,0.08,1,131024
