Objeto do Contrato,Tipo de Procedimento,Tipo(s) de Contrato,CPVs,Entidade(s) Adjudicante(s),Entidade(s) Adjudicatária(s),Preço Contratual,Data de Publicação,Data de Celebração do Contrato,Prazo de Execução,Local de Execução,Fundamentação,Data de Fecho do Contrato,Preço Total Efetivo,Causas das Alterações ao Prazo,Causas das Alterações ao Preço,Estado,N.º registo do Acordo Quadro,Descrição do Acordo Quadro,Procedimento Centralizado
Dosimetria 78/1579/19,Ajuste Direto Regime Geral,Aquisição de serviços,"50410000-2, Serviços de reparação e manutenção de aparelhos de medição, ensaio e controlo","Centro Hospitalar Universitário do Algarve, E. P. E. (510745997)",Medical Consult Lda (504092138),"8.122,80 €",28-03-2019,26-03-2019,365 dias,"Portugal, Faro, Portimão<BR/>Portugal, Faro, Faro<BR/>Portugal, Faro, Lagos","Artigo 20.º, n.º 1, alínea d) do Código dos Contratos Públicos","","","","",,Não aplicável.,Não aplicável.,FALSE
SERVIÇOS DE DOSIMETRIA E PROTEÇÃO RADIOLÓGICA,Ajuste Direto Regime Geral,Aquisição de serviços,"71700000-5, Serviços de controlo e monitorização","Centro Hospitalar Tondela-Viseu, E. P. E. (509822940)",MEDICAL CONSULT (504092138),"5.850,00 €",08-02-2019,28-12-2018,165 dias,"Portugal, Viseu, Viseu","Artigo 20.º, n.º 1, alínea d) do Código dos Contratos Públicos","","","","",,Não aplicável.,Não aplicável.,FALSE
AD 36/2018 Aquisição de serviços de dosimetria individual,Ajuste Direto Regime Geral,Aquisição de bens móveis,"38547000-1, Sistema de dosimetria","Centro Hospitalar Cova da Beira, EPE (506361659)",MEDICAL CONSULT (504092138),"4.764,00 €",18-01-2019,03-01-2019,730 dias,Portugal,"Artigo 20.º, n.º 1, alínea d) do Código dos Contratos Públicos","","","","",,Não aplicável.,Não aplicável.,FALSE
Contrato de Manutenção para os Equipamentos de Medição Radiológica da Medical Consult. Para o ano 2018,Ajuste Direto Regime Geral,Aquisição de serviços,"50000000-5, Serviços de reparação e manutenção","Hospital Professor Doutor Fernando Fonseca, E. P. E. (503035416)","MedicalConsult, Sociedade Unipessoal, Lda. (504092138)","9.948,00 €",03-12-2018,03-12-2018,365 dias,"Portugal, Lisboa, Amadora","Artigo 24.º, n.º 1, alínea e), subalínea ii) do Código dos Contratos Públicos","","","","",,Não aplicável.,Não aplicável.,FALSE
AD 0635-2016-Prestação de serviços para leitura de dosimetria individual externa,Ajuste Direto Regime Geral,Aquisição de serviços,"90721600-3, Serviços de radioprotecção","Centro Hospitalar de Trás-os-Montes e Alto Douro, E. P. E. (508100496)",MEDICAL CONSULT SOC UNIPESSOAL LDA (504092138),"8.427,00 €",28-06-2018,15-02-2016,365 dias,"Portugal, Vila Real","Artigo 20.º, n.º 1, alínea a) do Código dos Contratos Públicos",26-12-2016,"6.354,00 €",não aplicável,não aplicável,,Não aplicável.,Não aplicável.,FALSE
Prestação de serviços de assistência técnica,Ajuste Direto Regime Geral,Aquisição de serviços,"71356200-0, Serviços de assistência técnica","Hospital do Espírito Santo de Évora, E. P. E. (508085888)",MEDICAL CONSULT SOC UNIPESSOAL LDA (504092138),"5.544,00 €",11-06-2018,18-04-2018,365 dias,"Portugal, Évora, Évora","Artigo 20.º, n.º 1, alínea d) do Código dos Contratos Públicos","","","","",,Não aplicável.,Não aplicável.,FALSE
4S0013/2018 Serviços de Dosimetria Individual,Ajuste Direto Regime Geral,Aquisição de serviços,"90721600-3, Serviços de radioprotecção","Centro Hospitalar Barreiro Montijo, E. P. E. (509186998)",MEDICAL CONSULT SOC UNIPESSOAL LDA (504092138),"4.602,00 €",04-06-2018,19-12-2017,365 dias,"Portugal, Setúbal, Barreiro","Artigo 20.º, n.º 1, alínea a) do Código dos Contratos Públicos",31-12-2018,"3.491,80 €","",Consumo efetivo inferior ao estimado,,Não aplicável.,Não aplicável.,FALSE
Aquisição de serviços de controlo de qualidade aos equipamentos de imagiologia para o ano de 2018,Ajuste Direto Regime Geral,Aquisição de serviços,"71700000-5, Serviços de controlo e monitorização","Centro Hospitalar Lisboa Norte, E. P. E. (508481287)",MEDICAL CONSULT SOC UNIPESSOAL LDA (504092138),"21.949,92 €",18-05-2018,02-05-2018,236 dias,"Portugal, Lisboa, Lisboa","Artigo 24.º, n.º 1, alínea e) do Código dos Contratos Públicos","","","","",,Não aplicável.,Não aplicável.,FALSE
78/0282/2018 - Prestação Serviços de Dosimetria Individual do CHUAlgarve para 2018,Ajuste Direto Regime Geral,Aquisição de serviços,"50410000-2, Serviços de reparação e manutenção de aparelhos de medição, ensaio e controlo","Centro Hospitalar Universitário do Algarve, E. P. E. (510745997)",MEDICAL CONSULT (504092138),"7.164,00 €",19-03-2018,08-01-2018,365 dias,"Portugal, Faro, Portimão<BR/>Portugal, Faro, Faro","Artigo 20.º, n.º 1, alínea a) do Código dos Contratos Públicos","","","","",,Não aplicável.,Não aplicável.,FALSE
78/0534/2018 - Serviços Controlo Qualidade Equipamentos RX - Ano 2018,Ajuste Direto Regime Geral,Aquisição de serviços,"71630000-3, Serviços técnicos de inspecção e ensaio","Centro Hospitalar Universitário do Algarve, E. P. E. (510745997)",MEDICAL CONSULT (504092138),"9.645,00 €",19-03-2018,02-01-2018,365 dias,"Portugal, Faro, Portimão<BR/>Portugal, Faro, Lagos<BR/>Portugal, Faro, Faro","Artigo 20.º, n.º 1, alínea a) do Código dos Contratos Públicos","","","","",,Não aplicável.,Não aplicável.,FALSE
Aquisição de serviços de dosimetria individual - ano de 2018,Ajuste Direto Regime Geral,Aquisição de bens móveis,"38527200-7, Dosímetros","Centro Hospitalar Lisboa Norte, E. P. E. (508481287)","MEDICALCONSULT, SOCIEDADE UNIPESSOAL, LDA (504092138)","11.114,40 €",07-02-2018,11-01-2018,354 dias,"Portugal, Lisboa, Lisboa","Artigo 20.º, n.º 1, alínea a) do Código dos Contratos Públicos","","","","",,Não aplicável.,Não aplicável.,FALSE
Controlo de Qualidade e Calibração,Ajuste Direto Regime Geral,Aquisição de serviços,"98300000-6, Serviços diversos","Centro Hospitalar do Tâmega e Sousa, E.P.E. (508318262)","MEDICALCONSULT, SOCIEDADE UNIPESSOAL, LDA (504092138)","8.334,00 €",06-02-2018,01-01-2018,365 dias,"Portugal, Porto, Penafiel","Artigo 20.º, n.º 1, alínea a) do Código dos Contratos Públicos","","","","",,Não aplicável.,Não aplicável.,FALSE
leitura de dosimetros,Ajuste Direto Regime Geral,Aquisição de serviços,"50000000-5, Serviços de reparação e manutenção","Hospital da Horta, E. P. E. R. (512103070)","MEDICALCONSULT, SOCIEDADE UNIPESSOAL, LDA (504092138)","300,00 €",18-01-2018,12-01-2018,365 dias,"Portugal, Região Autónoma dos Açores, Horta","Artigo 24.º, n.º 8 do Decreto Legislativo Regional n.º 27/2015/A, de 29.12","","","","",,Não aplicável.,Não aplicável.,FALSE
Aquisição de Serviços de Dosimetria Individual,Ajuste Direto Regime Geral,Aquisição de bens móveis,"38547000-1, Sistema de dosimetria","Centro Hospitalar Cova da Beira, E. P. E. (506361659)","MEDICALCONSULT, SOCIEDADE UNIPESSOAL, LDA (504092138)","2.394,60 €",12-01-2018,03-01-2018,365 dias,"Portugal, Castelo Branco, Covilhã","Artigo 20.º, n.º 1, alínea a) do Código dos Contratos Públicos","","","","",,Não aplicável.,Não aplicável.,FALSE
20170093 - Aquisição de Programa de Controlo de Dosimetria,Ajuste Direto Regime Geral,Aquisição de serviços,"98300000-6, Serviços diversos","Instituto Nacional de Saúde Doutor Ricardo Jorge, I. P. (501427511)","MEDICALCONSULT, SOCIEDADE UNIPESSOAL, LDA (504092138)","240,00 €",27-09-2017,24-02-2017,95 dias,"Portugal, Lisboa, Lisboa","Artigo 20.º, n.º 1, alínea a) do Código dos Contratos Públicos",13-03-2018,"240,00 €","","",,Não aplicável.,Não aplicável.,FALSE
Contratação de Serviços de Dosimetria individual para o Instituto Politécnico de Leiria,Ajuste Direto Regime Geral,Aquisição de serviços<br/>Aquisição de bens móveis,"38580000-4, Equipamento radiológico não médico",Instituto Politécnico de Leiria (506971244),"MEDICALCONSULT, SOCIEDADE UNIPESSOAL, LDA (504092138)","235,93 €",25-09-2017,25-09-2017,1095 dias,"Portugal, Leiria, Leiria","Artigo 20.º, n.º 1, alínea a) do Código dos Contratos Públicos","","","","",,Não aplicável.,Não aplicável.,FALSE
"Aquisição de Serviços de Dosimetria Individual para o CHSJ, EPE. para o ano de 2017",Ajuste Direto Regime Geral,Aquisição de serviços,"85100000-0, Serviços de saúde","Centro Hospitalar de São João, E. P. E. (509821197)",MEDICAL CONSULT SOC UNIPESSOAL LDA (504092138),"8.986,40 €",03-07-2017,10-04-2017,365 dias,"Portugal, Porto, Porto","Artigo 20.º, n.º 1, alínea a) do Código dos Contratos Públicos","","","","",,Não aplicável.,Não aplicável.,FALSE
49000516-Serviços especializados - Dosimetros,Ajuste Direto Regime Geral,Aquisição de serviços,"85100000-0, Serviços de saúde",Hospital Dr. Francisco Zagalo (501510150),MEDICAL CONSULT SOC UNIPESSOAL LDA (504092138),"735,75 €",30-06-2017,17-03-2017,365 dias,"Portugal, Aveiro, Ovar","Artigo 20.º, n.º 1, alínea a) do Código dos Contratos Públicos",31-12-2017,"742,50 €","",SERVIÇOS ACIMA DO PREVISTO,,Não aplicável.,Não aplicável.,FALSE
"Controlo de qualidade e controlo da calibração de aparelhagem radiológica, auditoria em proteção radiológica e consultoria em física médica e proteção contra radiações",Ajuste Direto Regime Geral,Aquisição de serviços,"90721600-3, Serviços de radioprotecção","Centro Hospitalar do Tâmega e Sousa, E.P.E. (508318262)","Medicalconsult, Sociedade Unipessoal, Lda. (504092138)","8.334,00 €",23-06-2017,28-04-2017,248 dias,"Portugal, Porto, Penafiel","Artigo 20.º, n.º 1, alínea a) do Código dos Contratos Públicos","","","","",,Não aplicável.,Não aplicável.,FALSE
Aquisição de serviços de consultoria da Medical Consult,Ajuste Direto Regime Geral,Aquisição de serviços,"71317000-3, Serviços de consultoria em matéria de controlo e protecção contra os riscos potenciais",Hospital Prof. Doutor Fernando Fonseca E.P.E. (503035416),"Medicalconsult, Sociedade Unipessoal, Lda. (504092138)","9.995,40 €",07-06-2017,06-06-2017,365 dias,"Portugal, Lisboa, Amadora","Artigo 24.º, n.º 1, alínea e) do Código dos Contratos Públicos","","","","",,Não aplicável.,Não aplicável.,FALSE
4S0010/2017 DOSIMETRIA INDIVIDUAL PARA ANO 2017,Ajuste Direto Regime Geral,Aquisição de serviços,"85000000-9, Serviços de saúde e acção social","Centro Hospitalar Barreiro Montijo, E. P. E. (509186998)","Medicalconsult, Sociedade Unipessoal, Lda. (504092138)","5.004,00 €",31-05-2017,23-12-2016,365 dias,"Portugal, Setúbal, Barreiro","Artigo 20.º, n.º 1, alínea a) do Código dos Contratos Públicos",31-12-2017,"4.041,58 €","",CONSUMO FETIVO INFERIOR AO ESTIMADO,,Não aplicável.,Não aplicável.,FALSE
SERVIÇOS PROTECÇÃO RADIOLÓGICA E DOSIMETRIA,Ajuste Direto Regime Geral,Aquisição de serviços,"98000000-3, Outros serviços comunitários, sociais e pessoais","Hospital Distrital de Santarém, E. P. E. (506361462)","Medicalconsult, Sociedade Unipessoal, Lda. (504092138)","8.349,50 €",03-05-2017,27-04-2017,365 dias,"Portugal, Santarém, Santarém","Artigo 26.º, n.º 1, alínea a) do Código dos Contratos Públicos","","","","",,Não aplicável.,Não aplicável.,FALSE
Serviços de dosimetria,Ajuste Direto Regime Geral,Aquisição de serviços,"71700000-5, Serviços de controlo e monitorização",Faculdade Ciências Universidade Lisboa (502618418),"Medicalconsult, Sociedade Unipessoal, Lda. (504092138)","1.512,00 €",06-04-2017,24-03-2017,1095 dias,"Portugal, Lisboa, Lisboa","Artigo 20.º, n.º 1, alínea a) do Código dos Contratos Públicos","","","","",,Não aplicável.,Não aplicável.,FALSE
"Apoio ao processo de licenciamento, e controlo de qualidade, de 19 equipamentos emissores de radiação X da ARS Norte",Ajuste Direto Regime Geral,Aquisição de serviços,"79000000-4, Serviços a empresas: direito, comercialização, consultoria, recrutamento, impressão e segurança",Serviço de Utilização Comum dos Hospitais (500900469),"MedicalConsult, S.A (504092138)","6.000,00 €",05-04-2017,23-03-2017,281 dias,Portugal,"Artigo 20.º, n.º 1, alínea a) do Código dos Contratos Públicos","","","","",,Não aplicável.,Não aplicável.,FALSE
Leitura de Dosimetros,Ajuste Direto Regime Geral,Aquisição de serviços,"98000000-3, Outros serviços comunitários, sociais e pessoais","Administração Regional de Saúde de Lisboa e Vale do Tejo, I. P. (503148776)","MEDICAL CONSULT, LDA. (504092138)","180,00 €",22-03-2017,06-02-2017,365 dias,"Portugal, Santarém","Artigo 24.º, n.º 1, alínea e) do Código dos Contratos Públicos","","","","",,Não aplicável.,Não aplicável.,FALSE
0160E17-CONTROLO DE QUALIDADE EM CONSULTADORIA FÍSICA MÉDICA PARA 2017,Ajuste Direto Regime Geral,Aquisição de serviços,"50000000-5, Serviços de reparação e manutenção","Centro Hospitalar de Leiria, E. P. E. (509822932)","MEDICAL CONSULT, LDA. (504092138)","6.544,99 €",16-03-2017,02-03-2017,365 dias,"Portugal, Leiria, Leiria","Artigo 20.º, n.º 1, alínea a) do Código dos Contratos Públicos","","","","",,Não aplicável.,Não aplicável.,FALSE
controlo qualidade ( 78/0365/17),Ajuste Direto Regime Geral,Aquisição de serviços,"71630000-3, Serviços técnicos de inspecção e ensaio","Centro Hospitalar do Algarve, E. P. E. (510745997)","Medical Consult, Sociedade Unipessoal, Lda. (504092138)","10.857,48 €",06-03-2017,13-01-2017,365 dias,"Portugal, Faro, Faro<BR/>Portugal, Faro, Portimão","Artigo 20.º, n.º 1, alínea a) do Código dos Contratos Públicos",15-12-2017,"10.857,48 €","","",,Não aplicável.,Não aplicável.,FALSE
eletricidade subs 2017 ( 78/0360/17),Ajuste Direto Regime Geral,Aquisição de serviços,"50410000-2, Serviços de reparação e manutenção de aparelhos de medição, ensaio e controlo","Centro Hospitalar do Algarve, E. P. E. (510745997)","Medical Consult, Sociedade Unipessoal, Lda. (504092138)","7.164,00 €",03-03-2017,09-01-2017,365 dias,"Portugal, Faro, Portimão<BR/>Portugal, Faro, Faro","Artigo 20.º, n.º 1, alínea a) do Código dos Contratos Públicos",29-12-2017,"7.164,00 €","","",,Não aplicável.,Não aplicável.,FALSE
"17I00023 - Serviços de dosimetria individual a pessoas profissionalmente expostas a radiações ionizantes, no âmbito do normal funcionamento do Instituto de Ciências Nucleares Aplicadas à Saúde (ICNAS)",Ajuste Direto Regime Geral,Aquisição de serviços,"51210000-7, Serviços de instalação de equipamento para medição",Universidade de Coimbra (501617582),"Medical Consult, Sociedade Unipessoal, Lda. (504092138)","4.735,92 €",21-02-2017,21-02-2017,1095 dias,"Portugal, Coimbra, Coimbra","Artigo 20.º, n.º 1, alínea a) do Código dos Contratos Públicos","","","","",,Não aplicável.,Não aplicável.,FALSE
"Aquisição de Prestação de Serviços na Área de Protecção Radiológica, Controlo de Qualidade e Dosimetria",Ajuste Direto Regime Geral,Aquisição de bens móveis,"38000000-5, Equipamento laboratorial, óptico e de precisão (exc. óculos)","Centro Hospitalar de Entre o Douro e Vouga, E.P.E. (508878462)","Medical Consult Sociedade Unipessoal, Lda (504092138)","30.795,60 €",31-01-2017,01-04-2016,365 dias,"Portugal, Aveiro, Santa Maria da Feira","Artigo 20.º, n.º 1, alínea a) do Código dos Contratos Públicos","","","","",,Não aplicável.,Não aplicável.,FALSE
Aquisição de serviços de dosimetria individual 2017,Ajuste Direto Regime Geral,Aquisição de bens móveis,"38527200-7, Dosímetros","Centro Hospitalar Lisboa Norte, E. P. E. (508481287)","MEDICAL CONSULT-CONS.FORM.TECN.SAUDE,LDA (504092138)","11.131,20 €",02-01-2017,02-01-2017,364 dias,"Portugal, Lisboa, Lisboa","Artigo 20.º, n.º 1, alínea a) do Código dos Contratos Públicos","","","","",,Não aplicável.,Não aplicável.,FALSE
Aquisição de serviços de controlo de qualidade de equipamentos de Imagiologia p/ 2017,Ajuste Direto Regime Geral,Aquisição de serviços,"71700000-5, Serviços de controlo e monitorização","Centro Hospitalar Lisboa Norte, E. P. E. (508481287)","MEDICAL CONSULT-CONS.FORM.TECN.SAUDE,LDA (504092138)","20.544,96 €",02-01-2017,28-12-2016,365 dias,"Portugal, Lisboa, Lisboa","Artigo 20.º, n.º 1, alínea a) do Código dos Contratos Públicos","","","","",,Não aplicável.,Não aplicável.,FALSE
16I00191 - Aquisição de serviços de dosimetria individual para o Departamento de Física da Universidade de Coimbra.,Ajuste Direto Regime Geral,Aquisição de serviços<br/>Aquisição de bens móveis,"51210000-7, Serviços de instalação de equipamento para medição",Universidade de Coimbra (501617582),"MedicalConsult, Sociedade Unipessoal, Lda (504092138)","1.416,00 €",30-09-2016,30-09-2016,1095 dias,"Portugal, Coimbra, Coimbra","Artigo 20.º, n.º 1, alínea a) do Código dos Contratos Públicos","","","","",,Não aplicável.,Não aplicável.,FALSE
SERVIÇOS DE DOSIMETRIA E CONTROLO QUALIDADE EQUIPAMENTOS,Ajuste Direto Regime Geral,Aquisição de serviços,"71700000-5, Serviços de controlo e monitorização","Centro Hospitalar Tondela-Viseu, E. P. E. (509822940)","MEDICAL CONSULT-CONS.F.T.S.,LD (504092138)","28.413,00 €",28-09-2016,22-09-2015,1095 dias,"Portugal, Viseu, Viseu","Artigo 20.º, n.º 1, alínea a) do Código dos Contratos Públicos","","","","",,Não aplicável.,Não aplicável.,FALSE
Aquisição de serviços de consultoria da Medical Consult,Ajuste Direto Regime Geral,Aquisição de serviços,"71356000-8, Serviços técnicos","Hospital Professor Doutor Fernando Fonseca, E. P. E. (503035416)","Medicalconsult, Sociedade Unipessoal, Lda. (504092138)","9.585,00 €",05-07-2016,28-01-2016,365 dias,"Portugal, Lisboa, Amadora","Artigo 24.º, n.º 1, alínea e) do Código dos Contratos Públicos","","","","",,Não aplicável.,Não aplicável.,FALSE
0057E16-CONTROLO DE QUALIDADE E CONSULTORIA  EM PROTECÇÃO RADIOLÓGICA,Ajuste Direto Regime Geral,Aquisição de serviços,"71317000-3, Serviços de consultoria em matéria de controlo e protecção contra os riscos potenciais","Centro Hospitalar de Leiria, E. P. E. (509822932)","MEDICAL CONSULT, LDA. (504092138)","8.183,00 €",05-07-2016,04-07-2016,365 dias,"Portugal, Leiria, Leiria","Artigo 20.º, n.º 1, alínea a) do Código dos Contratos Públicos",04-07-2016,"8.183,00 €","","",,Não aplicável.,Não aplicável.,FALSE
0063E15-CONTROLO DE QUALIDADE E CONSULTORIA FÍSICA MÉDICA,Ajuste Direto Regime Geral,Aquisição de serviços,"71317210-8, Serviços de consultoria em matéria de saúde e segurança","Centro Hospitalar de Leiria, E. P. E. (509822932)",MEDICAL CONSULT (504092138),"5.696,25 €",07-06-2016,27-02-2015,365 dias,"Portugal, Leiria, Leiria","Artigo 20.º, n.º 1, alínea a) do Código dos Contratos Públicos","","","","",,Não aplicável.,Não aplicável.,FALSE
490000516-Dosimetros,Ajuste Direto Regime Geral,Aquisição de serviços,"85000000-9, Serviços de saúde e acção social",Hospital Dr. Francisco Zagalo (501510150),"MEDICALCONSULT, S.A. (504092138)","729,00 €",30-05-2016,15-01-2016,365 dias,"Portugal, Aveiro, Ovar","Artigo 20.º, n.º 1, alínea a) do Código dos Contratos Públicos",31-12-2016,"962,48 €","",serviços efetuados acima do previsto,,Não aplicável.,Não aplicável.,FALSE
SERVICOS DE DOSIMETRIA,Ajuste Direto Regime Geral,Aquisição de serviços,"85110000-3, Serviços hospitalares e afins","Instituto Português de Oncologia de Coimbra Francisco Gentil, E. P. E. (506361438)",MEDICALCONSULT SOC.UNIPESSOAL LDA (504092138),"13.855,92 €",10-05-2016,01-01-2015,1095 dias,"Portugal, Coimbra, Coimbra","Artigo 20.º, n.º 1, alínea a) do Código dos Contratos Públicos","","","","",,Não aplicável.,Não aplicável.,FALSE
PRESTAÇÃO SERVIÇOS PROTECÇÃO RADIOLOGIA E DO SIMETRIA INDIVIDUAL,Ajuste Direto Regime Geral,Aquisição de serviços,"98113000-8, Serviços prestados por organizações especializadas","Hospital Distrital de Santarém, EPE (506361462)","Medicalconsult, S.A. (504092138)","8.349,50 €",04-05-2016,01-01-2016,365 dias,"Portugal, Santarém, Santarém","Artigo 20.º, n.º 1, alínea a) do Código dos Contratos Públicos","","","","",,Não aplicável.,Não aplicável.,FALSE
DOSIMETRIA INDIVIDUAL,Ajuste Direto Regime Geral,Aquisição de serviços,"85100000-0, Serviços de saúde","Centro Hospitalar de Leiria, E. P. E. (509822932)","MEDICAL CONSULT-CONS.FORM.TECN.SAUDE,LDA  (504092138)","3.300,00 €",01-04-2016,21-03-2016,365 dias,"Portugal, Leiria, Leiria","Artigo 20.º, n.º 1, alínea a) do Código dos Contratos Públicos",31-12-2016,"3.300,00 €","","",,Não aplicável.,Não aplicável.,FALSE
serviços de controlo de qualidade e controlo de calibração de equipamento radiologico,Ajuste Direto Regime Geral,Aquisição de serviços,"72000000-5, Serviços de TI: consultoria, desenvolvimento de software, Internet e apoio","Hospital da Senhora da Oliveira Guimarães, E. P. E. (508080827)",MEDICAL CONSULT - Cons. Form. Tecn. da Saúde Lda (504092138),"8.215,00 €",19-02-2016,01-01-2016,365 dias,"Portugal, Braga, Guimarães","Artigo 20.º, n.º 1, alínea a) do Código dos Contratos Públicos","","","","",,Não aplicável.,Não aplicável.,FALSE
controlo qualidade ( 78/580/16),Ajuste Direto Regime Geral,Aquisição de serviços,"71600000-4, Serviços técnicos de ensaio, análise e consultoria","Centro Hospitalar do Algarve, E. P. E. (510745997)",Medical Consult (504092138),"10.858,50 €",11-02-2016,22-01-2016,365 dias,"Portugal, Faro, Faro<BR/>Portugal, Faro, Portimão","Artigo 20.º, n.º 1, alínea a) do Código dos Contratos Públicos",25-11-2016,"10.858,50 €","","",,Não aplicável.,Não aplicável.,FALSE
leitura dosimetros ( 78/0579/16),Ajuste Direto Regime Geral,Aquisição de serviços,"71630000-3, Serviços técnicos de inspecção e ensaio","Centro Hospitalar do Algarve, E. P. E. (510745997)",Medical Consult  (504092138),"7.794,00 €",20-01-2016,07-01-2016,365 dias,"Portugal, Faro, Faro<BR/>Portugal, Faro, Portimão","Artigo 20.º, n.º 1, alínea a) do Código dos Contratos Públicos",30-12-2016,"6.943,27 €","",serviços de dosimetria necessários em 2016 inferior ao previsto.,,Não aplicável.,Não aplicável.,FALSE
Aquisição de serviço de dosimetria individual dos trabalhadores profissionalmente expostos a radiações ionizantes,Ajuste Direto Regime Geral,Aquisição de serviços,"51430000-5, Serviços de instalação de equipamento de laboratório",Instituto Politécnico de Tomar (503767549),"Medical Consult, Sociedade Unipessoal, Lda (504092138)","243,00 €",11-11-2015,28-10-2015,1095 dias,"Portugal, Santarém, Tomar","Artigo 20.º, n.º 1, alínea a) do Código dos Contratos Públicos",31-12-2018,"243,00 €","","",,Não aplicável.,Não aplicável.,FALSE
AQUISIÇÃO DE DOSIMETROS PARA FUNCIONARIOS,Ajuste Direto Regime Geral,Aquisição de serviços,"79000000-4, Serviços a empresas: direito, comercialização, consultoria, recrutamento, impressão e segurança",Hospital Dr. Francisco Zagalo (501510150),"MEDICALCONSULT, S.A. (504092138)","195,75 €",29-09-2015,12-11-2014,90 dias,"Portugal, Aveiro, Ovar","Artigo 20.º, n.º 1, alínea a) do Código dos Contratos Públicos",12-11-2014,"195,75 €","","",,Não aplicável.,Não aplicável.,FALSE
Aquisição de serviços de manutenção ao controlo de qualidade,Ajuste Direto Regime Geral,Aquisição de serviços,"71700000-5, Serviços de controlo e monitorização","Centro Hospitalar Lisboa Norte, E. P. E. (508481287)","Medical Consult, SA (504092138)","21.750,00 €",23-07-2015,08-04-2015,375 dias,"Portugal, Lisboa, Lisboa","Artigo 20.º, n.º 1, alínea a) do Código dos Contratos Públicos","","","","",,Não aplicável.,Não aplicável.,FALSE
Aquisição da Prestação de serviços de Dosimetria,Ajuste Direto Regime Geral,Aquisição de serviços,"85000000-9, Serviços de saúde e acção social",CHO - Centro Hospitalar do Oeste (510412009),"Medical Consult, S.A (504092138)","975,61 €",22-05-2015,31-12-2013,300 dias,"Portugal, Leiria, Caldas da Rainha","Artigo 20.º, n.º 1, alínea a) do Código dos Contratos Públicos",31-12-2013,"975,61 €","","",,Não aplicável.,Não aplicável.,FALSE
Aquisição de dosimetros individuais,Ajuste Direto Regime Geral,Aquisição de serviços,"65000000-3, Serviços públicos",Hospital Dr. Francisco Zagalo (501510150),"Medical Consult, S.A. (504092138)","783,00 €",22-05-2015,23-04-2015,365 dias,"Portugal, Aveiro, Ovar","Artigo 20.º, n.º 1, alínea a) do Código dos Contratos Públicos",26-11-2015,"742,50 €","",SERVIÇOS ABAIXO DO PREVISTO,,Não aplicável.,Não aplicável.,FALSE
14I00464 - Serviços em dosimetria individual para o ICNAS,Ajuste Direto Regime Geral,Aquisição de bens móveis<br/>Aquisição de serviços,"38527200-7, Dosímetros",Universidade de Coimbra (501617582),MedicalConsult S.A. (504092138),"4.609,80 €",04-05-2015,23-02-2015,730 dias,"Portugal, Coimbra, Coimbra","Artigo 20.º, n.º 1, alínea a) do Código dos Contratos Públicos","","","","",,Não aplicável.,Não aplicável.,FALSE
Aquisição de Serviços de Controlo de Qualidade do Equipamento de Radiodiagnóstico do Hospital Veterinário.,Ajuste Direto Regime Geral,Aquisição de serviços,"71621000-7, Serviços técnicos de análise ou consultoria",Universidade de Trás-os-Montes e Alto Douro (501345361),"Medical Consult, SA. (504092138)","855,00 €",28-04-2015,07-04-2015,365 dias,"Portugal, Vila Real, Vila Real","Artigo 20.º, n.º 1, alínea a) do Código dos Contratos Públicos","","","","",,Não aplicável.,Não aplicável.,FALSE
controlo Qualidade Equip RX ( 78/1335/15),Ajuste Direto Regime Geral,Aquisição de serviços,"71630000-3, Serviços técnicos de inspecção e ensaio","Centro Hospitalar do Algarve, E. P. E. (510745997)",Medical Consult (504092138),"10.858,50 €",15-04-2015,17-03-2015,365 dias,"Portugal, Faro, Faro<BR/>Portugal, Faro, Portimão","Artigo 20.º, n.º 1, alínea a) do Código dos Contratos Públicos","","","","",,Não aplicável.,Não aplicável.,FALSE
Leitura Dosimetros ( 78/1256/15),Ajuste Direto Regime Geral,Aquisição de serviços,"50410000-2, Serviços de reparação e manutenção de aparelhos de medição, ensaio e controlo","Centro Hospitalar do Algarve, E. P. E. (510745997)",Medical Consult (504092138),"8.386,20 €",11-03-2015,09-03-2015,365 dias,"Portugal, Faro, Faro<BR/>Portugal, Faro, Portimão","Artigo 20.º, n.º 1, alínea a) do Código dos Contratos Públicos","","","","",,Não aplicável.,Não aplicável.,FALSE
Prestação de Serviços de Dosimetria Individual,Ajuste Direto Regime Geral,Aquisição de serviços,"50000000-5, Serviços de reparação e manutenção",CHO - Centro Hospitalar do Oeste (510412009),Medical Consult (504092138),"732,00 €",31-12-2014,15-12-2014,365 dias,"Portugal, Leiria, Caldas da Rainha","Artigo 20.º, n.º 1, alínea a) do Código dos Contratos Públicos",15-12-2014,"732,00 €","","",,Não aplicável.,Não aplicável.,FALSE
"Prest.Ser.para o Controle de Qualidade, Auditoria e Consultoria em Protecção Radiológica, ano 2013",Ajuste Direto Regime Geral,Aquisição de serviços,"90714500-0, Serviços de controlo da qualidade ambiental","Unidade Local de Saúde de Castelo Branco, E. P. E. (509309844)","MEDICALCONSULT, SA (504092138)","13.066,24 €",01-09-2014,01-04-2013,365 dias,"Portugal, Castelo Branco, Castelo Branco","Artigo 20.º, n.º 1, alínea a) do Código dos Contratos Públicos",31-12-2013,"13.066,24 €","","",,Não aplicável.,Não aplicável.,FALSE
"Contrato Manutenção Controlo Qualidade de Equipamentos, Auditoria as Condições de Protecção Radiológica, Consultoria em Física Médica e Protecção Radiológica ",Ajuste Direto Regime Geral,Aquisição de serviços,"71630000-3, Serviços técnicos de inspecção e ensaio","Centro Hospitalar do Algarve, E. P. E. (510745997)",Medical Consult (504092138),"10.858,50 €",01-08-2014,23-06-2014,365 dias,"Portugal, Faro, Faro<BR/>Portugal, Faro, Portimão","Artigo 20.º, n.º 1, alínea a) do Código dos Contratos Públicos","","","","",,Não aplicável.,Não aplicável.,FALSE
Prestação de serviços de controlo da qualidade de calibragem de equipamento radiologicos,Ajuste Direto Regime Geral,Aquisição de serviços,"50000000-5, Serviços de reparação e manutenção","Centro Hospitalar do Alto Ave, E. P. E. (508080827)","Medical Consult, S.A.  (504092138)","11.050,00 €",17-07-2014,01-07-2014,365 dias,"Portugal, Braga, Guimarães","Artigo 20.º, n.º 1, alínea a) do Código dos Contratos Públicos","","","","",,Não aplicável.,Não aplicável.,FALSE
SERVIÇOS DE LEITURA DOSIMÉTRICA DO CHP,Ajuste Direto Regime Geral,Concessão de serviços públicos,"85000000-9, Serviços de saúde e acção social","Centro Hospitalar Porto, E.P.E. (508331471)","MEDICAL CONSULT, SA (504092138)","7.536,00 €",03-07-2014,01-04-2013,365 dias,"Portugal, Porto, Porto","Artigo 20.º, n.º 1, alínea a) do Código dos Contratos Públicos",01-04-2014,"7.536,00 €",Não aplicavel,Não aplicavel,,Não aplicável.,Não aplicável.,FALSE
Serviços de Dosimetria Individual,Ajuste Direto Regime Geral,Aquisição de bens móveis<br/>Aquisição de serviços,"38580000-4, Equipamento radiológico não médico",Instituto Politécnico de Leiria (506971244),"Medicalconsult, S.A (504092138)","235,92 €",02-07-2014,02-07-2014,1095 dias,"Portugal, Leiria, Leiria","Artigo 20.º, n.º 1, alínea a) do Código dos Contratos Públicos","","","","",,Não aplicável.,Não aplicável.,FALSE
Prestação de serviços de controlo de qualidade e proteção radiologica,Ajuste Direto Regime Geral,Aquisição de serviços,"71356300-1, Serviços de apoio técnico","Serviço de Saúde da Região Autónoma da Madeira, E. P. E. (511228848)","MEDICAL CONSULT, S.A. (504092138)","21.340,00 €",02-07-2014,01-07-2014,365 dias,"Portugal, Região Autónoma da Madeira, Funchal","Artigo 20.º, n.º 1, alínea a) do Código dos Contratos Públicos","","","","",,Não aplicável.,Não aplicável.,FALSE
Leitura de Dosimetros-2014,Ajuste Direto Regime Geral,Aquisição de serviços,"98300000-6, Serviços diversos","Centro Hospitalar do Algarve, E. P. E. (510745997)",Medical Consult (504092138),"8.319,00 €",25-06-2014,19-06-2014,365 dias,"Portugal, Faro, Lagos<BR/>Portugal, Faro, Portimão<BR/>Portugal, Faro, Faro","Artigo 20.º, n.º 1, alínea a) do Código dos Contratos Públicos","","","","",,Não aplicável.,Não aplicável.,FALSE
Serviços Medicos Radiologia,Ajuste Direto Regime Geral,Aquisição de serviços,"85121200-5, Serviços de medicina especializada","Centro Hospitalar do Algarve, E. P. E. (510745997)",Medical Consult (504092138),"8.640,00 €",04-04-2014,26-03-2014,10 dias,"Portugal, Faro, Portimão","Artigo 20.º, n.º 1, alínea a) do Código dos Contratos Públicos","","","","",,Não aplicável.,Não aplicável.,FALSE
Prestação de serviços de controlo de qualidade de equipamento radiologico,Ajuste Direto Regime Geral,Aquisição de serviços,"50000000-5, Serviços de reparação e manutenção",CENTRO HOSPITALAR DO ALTO AVE (508080827),Medical Consult S A (504092138),"13.757,00 €",01-04-2014,27-06-2013,365 dias,"Portugal, Braga, Guimarães","Artigo 20.º, n.º 1, alínea a) do Código dos Contratos Públicos",30-06-2014,"13.757,00 €","","",,Não aplicável.,Não aplicável.,FALSE
"Aluguer de Dosímetros, para dosimetria individual, para as unidades de Saúde de:  - Rio Maior; - Cartaxo; - Almeirim; - Coruche ",Ajuste Direto Regime Geral,Aquisição de serviços,"51000000-9, Serviços de instalação (excepto software)","Administração Regional de Saúde de Lisboa e Vale do Tejo, I. P. (503148776)","Medical Consult, SA (504092138)","180,00 €",19-02-2014,17-02-2014,180 dias,"Portugal, Santarém","Artigo 24.º, n.º 1, alínea e) do Código dos Contratos Públicos","","","","",,Não aplicável.,Não aplicável.,FALSE
"Prestação de Serviços de controlo de qualidade e controlo da calibração de aparelhagem radiológica, auditoria em proteção radiológica e consultoria em física médica e proteção contra radiações e Prestação de serviços de dosimetria Individual ",Ajuste Direto Regime Geral,Aquisição de serviços,"50800000-3, Serviços de reparação e manutenção diversos","Centro Hospitalar do Tâmega e Sousa, E. P. E. (508318262)","MEDICAL CONSULT, S.A. (504092138)","24.660,00 €",03-02-2014,01-01-2014,1096 dias,"Portugal, Porto, Penafiel<BR/>Portugal, Porto, Amarante","Artigo 20.º, n.º 1, alínea a) do Código dos Contratos Públicos","","","","",,Não aplicável.,Não aplicável.,FALSE
"Aquisição de Serviços de Dosimetria Individual com leitura trimestral para o CHLC,EPE",Ajuste Direto Regime Geral,Aquisição de serviços,"85150000-5, Serviços de imagiologia médica","Centro Hospitalar de Lisboa Central, E. P. E. (508080142)","Medical Consult, S.A. (504092138)","9.976,00 €",28-01-2014,22-01-2014,365 dias,"Portugal, Lisboa, Lisboa","Artigo 20.º, n.º 1, alínea a) do Código dos Contratos Públicos","","","","",,Não aplicável.,Não aplicável.,FALSE
"AQUISIÇÃO DE SERVIÇOS, LICENCIAMENTO DE INSTALAÇÕES RADIOLÓGICAS",Ajuste Direto Regime Geral,Aquisição de serviços,"79132000-8, Serviços de certificação","Hospital do Espírito Santo de Évora, E. P. E. (508085888)",MEDICAL CONSULT (504092138),"5.800,00 €",11-12-2013,04-10-2013,90 dias,"Portugal, Évora, Évora",Artigo 258.º do Código dos Contratos Públicos,"","","","",,Não aplicável.,Não aplicável.,
Contrato de Prestação de Serviços em Dosimetria Individual para a FCUL,Ajuste Direto Regime Geral,Aquisição de serviços,"85150000-5, Serviços de imagiologia médica",Faculdade Ciências Universidade Lisboa (502618418),Medical Consult SA (504092138),"531,00 €",31-10-2013,28-10-2013,365 dias,"Portugal, Lisboa, Lisboa","Artigo 20.º, n.º 1, alínea a) do Código dos Contratos Públicos","","","","",,Não aplicável.,Não aplicável.,
Leitura Dosimetros ( proc 58098213 ),Ajuste Direto Regime Geral,Aquisição de serviços,"98300000-6, Serviços diversos","Centro Hospitalar do Barlavento Algarvio, E.P.E. (507062540)",Medical Consult  (504092138),"6.564,00 €",04-06-2013,02-01-2013,365 dias,"Portugal, Faro, Portimão","Artigo 20.º, n.º 1, alínea a) do Código dos Contratos Públicos",15-04-2013,"6.564,00 €","","",,Não aplicável.,Não aplicável.,
AQUISIÇÃO DE SERVIÇOS PARA FORNECIMENTO DE DOSIMETROS E CONTROLO DE DOSIMETRIA,Ajuste Direto Regime Geral,Aquisição de bens móveis,"38341200-9, Dosímetros de radiações","EP Estradas de Portugal, S.A. (504598686)",MEDICALCONSULT CONSULTORIA E FORMAÇÃO EM TECNOLOGIAS DA SAUDE LDA (504092138),"2.463,60 €",22-04-2013,05-04-2013,1095 dias,"Portugal, Setúbal, Almada","Artigo 20.º, n.º 1, alínea a) do Código dos Contratos Públicos","","","","",,Não aplicável.,Não aplicável.,
controlo qualidade,Ajuste Direto Regime Geral,Aquisição de serviços,"71600000-4, Serviços técnicos de ensaio, análise e consultoria","Centro Hospitalar do Barlavento Algarvio, E.P.E. (507062540)",Medical Consult - Consultadoria e Formação (504092138),"9.600,00 €",20-03-2013,02-01-2013,365 dias,"Portugal, Faro, Portimão","Artigo 20.º, n.º 1, alínea a) do Código dos Contratos Públicos",28-03-2013,"9.600,00 €","","",,Não aplicável.,Não aplicável.,
ASSISTENCIA TECNICA AO DOSIMETROS,Ajuste Direto Regime Geral,Aquisição de serviços,"50000000-5, Serviços de reparação e manutenção",Centro Hospitalar Psiquiatrico de Lisboa (508338476),MEDICAL CONSULT (504092138),"280,00 €",27-02-2013,30-08-2012,120 dias,"Portugal, Lisboa, Lisboa","Artigo 27.º, n.º 1, alínea f) do Código dos Contratos Públicos",31-12-2012,"280,00 €","","",,Não aplicável.,Não aplicável.,
Aquisição de dosímetros termoluminescentes TLD de corpo inteiro para a ESTeSL,Ajuste Direto Regime Geral,Aquisição de bens móveis,"38527200-7, Dosímetros",Instituto Politécnico de Lisboa (508519713),"Medicalconsult, S.A. (504092138)","4.590,00 €",24-01-2013,25-03-2012,66 dias,"Portugal, Lisboa, Lisboa","Artigo 20.º, n.º 1, alínea a) do Código dos Contratos Públicos",02-05-2012,"4.590,00 €","","",,Não aplicável.,Não aplicável.,
"O presente contrato tem por objecto a prestação de serviços de Dosimetria Individual, para os funcionários expostos a radiações ionizantes, que operam os scanners instalados nos diversos serviços da DGAIEC, conforme o indicado no n.º 1 do convite, e, no artigo 14.º, do Caderno de Encargos do Ajuste Directo n.º 13/2011.",Ajuste Direto Regime Geral,Aquisição de serviços,"85147000-1, Serviços de medicina do trabalho",Direcção-Geral das Alfândegas e dos Impostos Especiais sobre o Consumo (600012875),"Medicalconsult, S.A. (504092138)","2.457,60 €",31-10-2012,14-10-2011,365 dias,Portugal,"Artigo 20.º, n.º 1, alínea a) do Código dos Contratos Públicos",13-10-2012,"2.457,60 €","","",,Não aplicável.,Não aplicável.,
Serviços de Dosimetria Individual,Ajuste Direto Regime Geral,Aquisição de serviços,"50410000-2, Serviços de reparação e manutenção de aparelhos de medição, ensaio e controlo","Instituto Nacional de Saúde Dr. Ricardo Jorge, I.P. (501427511)",Medical Consult (504092138),"1.491,60 €",01-10-2012,31-01-2012,334 dias,"Portugal, Porto, Porto<BR/>Portugal, Lisboa, Lisboa","Artigo 20.º, n.º 1, alínea a) do Código dos Contratos Públicos","","","","",,Não aplicável.,Não aplicável.,
"Dosimetros com leitura trimestral, efectuada aos tecnicos de RX da UCSP de Ourém",Ajuste Direto Regime Geral,Locação de bens móveis,"38341200-9, Dosímetros de radiações","Administração Regional de Saúde de Lisboa e Vale do Tejo, I.P. (503148776)","Medical Consult, S.A (504092138)","84,60 €",30-05-2012,14-05-2012,5 dias,"Portugal, Santarém, Ourém","Artigo 24.º, n.º 1, alínea e) do Código dos Contratos Públicos",14-05-2012,"84,60 €","","",,Não aplicável.,Não aplicável.,
Fornecimento de dosimetros termoluminescentes de corpo inteiro para o pessoal profissionalmente exposto,Ajuste Direto Regime Geral,Aquisição de serviços,"98390000-3, Outros serviços","Administração Regional de Saúde de Lisboa e Vale do Tejo, I.P. (503148776)","MedicalConsult, SA (504092138)","38,72 €",08-05-2012,27-04-2012,30 dias,"Portugal, Santarém, Santarém","Artigo 24.º, n.º 1, alínea e) do Código dos Contratos Públicos","","","","",,Não aplicável.,Não aplicável.,
11I00424 - Aquisição de serviços para a realização de contrato pelo periodo de 3 anos para a prestação de serviços em Dosimetria Individual para o ICNAS,Ajuste Direto Regime Geral,Aquisição de serviços,"85100000-0, Serviços de saúde",Universidade de Coimbra (501617582),"Medical Consult, SA (504092138)","11.098,41 €",13-04-2012,01-01-2012,1095 dias,"Portugal, Coimbra, Coimbra","Artigo 20.º, n.º 1, alínea a) do Código dos Contratos Públicos","","","","",,Não aplicável.,Não aplicável.,
Análises em detectores de dosímetros de sítio para controlo da exposição interna devida à energia alpha potencial dos descendentes de vida curta do radão e dos emissores de vida longa presentes em poeiras - 2012-2013,Concurso público,Aquisição de serviços,"71620000-0, Serviços de análise","EDM - Empresa de Desenvolvimento Mineiro, S.A. (501692983)","Medicalconsult, S.A. (504092138)","49.500,00 €",14-03-2012,01-03-2012,540 dias,"Portugal, Lisboa, Lisboa","Artigo 20.º, n.º 1, alínea b) do Código dos Contratos Públicos",23-08-2013,"33.639,22 €","",Foram realizadas menos amostragens relativamente ao que havia sido previsto em fase de planeamento,,Não aplicável.,Não aplicável.,
Contrato de assistência técnica de dosímetros.,Ajuste Direto Regime Geral,Aquisição de serviços,"50530000-9, Serviços de reparação e manutenção de máquinas","Instituto Nacional de Saúde Dr. Ricardo Jorge, I.P. (501427511)","Medicallconsult, SA (504092138)","1.491,60 €",25-11-2011,09-09-2011,365 dias,"Portugal, Lisboa, Lisboa<BR/>Portugal, Porto, Porto","Artigo 20.º, n.º 1, alínea a) do Código dos Contratos Públicos","","","","",,Não aplicável.,Não aplicável.,
Contratação de serviços de controlo de qualidade de equipamento e de auditorias às condições de protecção radiológica nas Unidades de Radiologia da ARSA,Ajuste Direto Regime Geral,Aquisição de serviços,"71700000-5, Serviços de controlo e monitorização","Administração Regional de Saúde do Alentejo, IP (503148768)","Medical Consult, S.A. (504092138)","3.200,00 €",23-11-2011,18-11-2011,365 dias,"Portugal, Évora, Estremoz","Artigo 20.º, n.º 1, alínea a) do Código dos Contratos Públicos",31-12-2012,"3.200,00 €","","",,Não aplicável.,Não aplicável.,
Aquisição de serviço de dosimetria individual.,Ajuste Direto Regime Geral,Aquisição de serviços,"50411000-9, Serviços de reparação e manutenção de aparelhos de medição","Instituto Nacional de Saúde Dr. Ricardo Jorge, I.P. (501427511)","Medicalconsult, SA (504092138)","1.589,16 €",16-11-2010,04-11-2010,365 dias,"Portugal, Lisboa, Lisboa<BR/>Portugal, Porto, Porto","Artigo 20.º, n.º 1, alínea a) do Código dos Contratos Públicos","","","","",,Não aplicável.,Não aplicável.,
FORNECIMENTO DE DOSÍMETROS E CONTROLO DA DOSIMETRIA POR TERMOLUMINESCÊNCIA DOS TRABALHADORES EXPOSTOS ÀS RADIAÇÕES IONIZANTES,Ajuste Direto Regime Geral,Aquisição de serviços,"38341200-9, Dosímetros de radiações","EP Estradas de Portugal, S.A. (504598686)","MEDICAL CONSULT – Consultoria e Formação em Tecnologia da Saúde, Lda (504092138)","3.297,60 €",23-09-2010,29-09-2009,365 dias,"Portugal, Setúbal, Almada","Artigo 20.º, n.º 1, alínea a) do Código dos Contratos Públicos","","","","",,Não aplicável.,Não aplicável.,
2 Dosimetros TLD-CI leitura trimestral,Ajuste Direto Regime Geral,Aquisição de serviços,"38527300-8, Sistemas de dosimetria-padrão secundários","Administração Regional de Saúde de Lisboa e Vale do Tejo, IP (503148776)",MEDICAL CONSULT (504092138),"63,80 €",04-08-2010,12-07-2010,1 dias,"Portugal, Santarém, Abrantes","Artigo 24.º, n.º 1, alínea e) do Código dos Contratos Públicos",12-07-2010,"63,80 €","","",,Não aplicável.,Não aplicável.,
Aqusição do Serviço de Dosimetria Individual CS Ourém,Ajuste Direto Regime Geral,Aquisição de serviços,"33000000-0, Equipamento médico, medicamentos e produtos para cuidados pessoais","Administração Regional de Saúde de Lisboa e Vale do Tejo, IP (503148776)",Medical Consult (504092138),"222,24 €",29-07-2010,15-06-2010,5 dias,"Portugal, Santarém, Ourém","Artigo 24.º, n.º 1, alínea e) do Código dos Contratos Públicos",15-06-2010,"222,24 €","","",,Não aplicável.,Não aplicável.,
FORNECIMENTO DE DOSÍMETROS E CONTROLO DA DOSIMETRIA POR TERMOLUMINESCÊNCIA DOS TRABALHADORES EXPOSTOS ÀS RADIAÇÕES IONIZANTES,Ajuste Direto Regime Geral,Aquisição de serviços,"38547000-1, Sistema de dosimetria","EP Estradas de Portugal, S.A. (504598686)","MEDICAL CONSULT – Consultoria e Formação em Tecnologia da Saúde, Lda. (504092138)","3.297,60 €",02-02-2010,08-10-2009,330 dias,"Portugal, Setúbal, Almada","Artigo 20.º, n.º 1, alínea a) do Código dos Contratos Públicos","","","","",,Não aplicável.,Não aplicável.,
Dosimetria individual para profissionais expostos a radiações ionizantes.,Ajuste Direto Regime Geral,"","",Hospital de São Marcos – Braga (501620605),"Medical Consult, S.A. (504092138)","6.302,04 €",02-03-2009,"",365 dias,"",Não Preenchido,"","","","",,Não aplicável.,Não aplicável.,
Controlo de radiações ionizantes,Ajuste Direto Regime Geral,"","",Hospital de São Marcos – Braga (501620605),"Medical Consult, S.A. (504092138)","16.500,00 €",21-02-2009,"",365 dias,"",Não Preenchido,"","","","",,Não aplicável.,Não aplicável.,
