freguesia,acronym,validVotesPercentage,votes,dicofre
Algeriz,PPD/PSD.CDS-PP,52.85,102,171203
Algeriz,PS,34.72,67,171203
Algeriz,MPT,5.18,10,171203
Algeriz,PCP-PEV,1.55,3,171203
Algeriz,B.E.,1.04,2,171203
Algeriz,MAS,1.04,2,171203
Algeriz,PNR,1.04,2,171203
Algeriz,PAN,0.52,1,171203
Algeriz,PDA,0.52,1,171203
Algeriz,PND,0.52,1,171203
Algeriz,PPM,0.52,1,171203
Algeriz,PTP,0.52,1,171203
Algeriz,L,0,0,171203
Algeriz,PCTP/MRPP,0,0,171203
Algeriz,POUS,0,0,171203
Algeriz,PPV,0,0,171203
