freguesia,acronym,validVotesPercentage,votes,dicofre
Selho (São Jorge),PS,33.97,713,030854
Selho (São Jorge),PPD/PSD.CDS-PP,25.96,545,030854
Selho (São Jorge),PCP-PEV,17.82,374,030854
Selho (São Jorge),MPT,9.05,190,030854
Selho (São Jorge),B.E.,5.29,111,030854
Selho (São Jorge),PCTP/MRPP,2.1,44,030854
Selho (São Jorge),L,1.38,29,030854
Selho (São Jorge),PTP,0.91,19,030854
Selho (São Jorge),PAN,0.81,17,030854
Selho (São Jorge),PND,0.62,13,030854
Selho (São Jorge),PNR,0.62,13,030854
Selho (São Jorge),PPM,0.48,10,030854
Selho (São Jorge),PPV,0.43,9,030854
Selho (São Jorge),MAS,0.38,8,030854
Selho (São Jorge),PDA,0.1,2,030854
Selho (São Jorge),POUS,0.1,2,030854
