Objeto do Contrato,Tipo de Procedimento,Tipo(s) de Contrato,CPVs,Entidade(s) Adjudicante(s),Entidade(s) Adjudicatária(s),Preço Contratual,Data de Publicação,Data de Celebração do Contrato,Prazo de Execução,Local de Execução,Fundamentação,Data de Fecho do Contrato,Preço Total Efetivo,Causas das Alterações ao Prazo,Causas das Alterações ao Preço,Estado,N.º registo do Acordo Quadro,Descrição do Acordo Quadro,Procedimento Centralizado
Contrato nº 20180215 - Aquisição de equipamento informático ao abrigo do Lote 2 do Acordo Quadro da ESPAP (Refª 0055_2017),Ao abrigo de acordo-quadro (art.º 259.º),Aquisição de bens móveis,"30213300-8, Computadores de secretária (desktop computers)","Instituto Nacional de Saúde Doutor Ricardo Jorge, I. P. (501427511)","Informantem - Informática e manutenção, Lda (503670693)","29.656,20 €",18-05-2018,28-03-2018,30 dias,"Portugal, Lisboa, Lisboa",Artigo 259.º do Código dos Contratos Públicos,"","",,,,1196657,Acordo Quadro para aquisição e aluguer operacional de equipamento informático,FALSE
Contrato 20180044 -Aquisição de economato ao abrigo do lote 1 do Acordo Quadro da ESPAP (Refª 00103_2017),Ao abrigo de acordo-quadro (art.º 259.º),Aquisição de bens móveis,"30192000-1, Material de escritório","Instituto Nacional de Saúde Doutor Ricardo Jorge, I. P. (501427511)","OHM TECNICA - REPRESENTAÇÕES DE MARCAS, LDA (504059521)","2.226,61 €",15-05-2018,01-02-2018,334 dias,"Portugal, Lisboa, Lisboa",Artigo 259.º do Código dos Contratos Públicos,"","",,,,1351201,Acordo quadro de fornecimento de papel e economato,FALSE
Aquisição de Serviço Móvel Terrestre Refª 0094_2017 (Contrato nº 20180038),Concurso público,Aquisição de serviços,"64000000-6, Serviços postais e de telecomunicações","Instituto Nacional de Saúde Doutor Ricardo Jorge, I. P. (501427511)","MEO - Serviços de Comunicações e Multimédia, S.A. (504615947)","30.175,20 €",15-05-2018,01-02-2018,730 dias,"Portugal, Setúbal, Setúbal<BR/>Portugal, Porto, Porto<BR/>Portugal, Lisboa, Lisboa","Artigo 20.º, n.º 1, alínea b) do Código dos Contratos Públicos","","",,,,Não aplicável.,Não aplicável.,TRUE
Aquisição de licenciamento de software e serviços conexos ao abrigo do lote 20 da ESPAP,Ao abrigo de acordo-quadro (art.º 259.º),Aquisição de bens móveis,"48000000-8, Pacotes de software e sistemas de informação","Instituto Nacional de Saúde Doutor Ricardo Jorge, I. P. (501427511)","AR Telecom - Acessos e Redes de Telecomunic., S.A. (506303810)","2.650,00 €",15-05-2018,15-05-2018,365 dias,"Portugal, Lisboa, Lisboa",Artigo 259.º do Código dos Contratos Públicos,09-07-2018,"2.650,00 €",,,,610968,Acordo quadro de licenciamento de software e serviços conexos,FALSE
Aquisição e reagentes,Ajuste Direto Regime Geral,Aquisição de bens móveis,"33696500-0, Reagentes de laboratório","Instituto Nacional de Saúde Doutor Ricardo Jorge, I. P. (501427511)","Labor Spirit, Lda (507485149)","835,00 €",15-05-2018,14-05-2018,30 dias,"Portugal, Lisboa, Lisboa","Artigo 20.º, n.º 1, alínea d) do Código dos Contratos Públicos",30-08-2018,"835,00 €",,,,Não aplicável.,Não aplicável.,FALSE
CP 28-2017 - Reagentes para Bioquímica Genética,Concurso público,Aquisição de bens móveis,"33696500-0, Reagentes de laboratório","Instituto Nacional de Saúde Doutor Ricardo Jorge, I. P. (501427511)",GOMENSORO POTENCIAL ZERO - INSTRUM (506704017),"69.750,00 €",14-05-2018,16-05-2017,229 dias,"Portugal, Lisboa, Lisboa","Artigo 20.º, n.º 1, alínea b) do Código dos Contratos Públicos",12-12-2017,"69.750,00 €",,,,Não aplicável.,Não aplicável.,FALSE
Aquisição de reagentes de sequenciação,Ajuste Direto Regime Geral,Aquisição de bens móveis,"33696500-0, Reagentes de laboratório","Instituto Nacional de Saúde Doutor Ricardo Jorge, I. P. (501427511)","ILC - Instrumentos de Laboratório e Científicos, Lda (500948208)","1.069,00 €",14-05-2018,14-05-2018,30 dias,"Portugal, Lisboa, Lisboa","Artigo 24.º, n.º 1, alínea e), subalínea ii) do Código dos Contratos Públicos",16-10-2018,"1.069,00 €",,,,Não aplicável.,Não aplicável.,FALSE
Reagentes para biologia molecular,Ajuste Direto Regime Geral,Aquisição de bens móveis,"33696500-0, Reagentes de laboratório","Instituto Nacional de Saúde Doutor Ricardo Jorge, I. P. (501427511)",Roche Sistemas Diagnosticos (504282921),"953,00 €",14-05-2018,14-05-2018,30 dias,"Portugal, Lisboa, Lisboa","Artigo 24.º, n.º 1, alínea e), subalínea i) do Código dos Contratos Públicos",16-08-2018,"953,00 €",,,,Não aplicável.,Não aplicável.,FALSE
Aquisição de reagentes para análise automatizada,Ajuste Direto Regime Geral,Aquisição de bens móveis,"33696500-0, Reagentes de laboratório","Instituto Nacional de Saúde Doutor Ricardo Jorge, I. P. (501427511)",Bioportugal (502380543),"2.500,00 €",11-05-2018,11-05-2018,30 dias,"Portugal, Lisboa, Lisboa","Artigo 24.º, n.º 1, alínea e), subalínea iii) do Código dos Contratos Públicos",08-11-2018,"2.500,00 €",,,,Não aplicável.,Não aplicável.,FALSE
