Objeto do Contrato,Tipo de Procedimento,Tipo(s) de Contrato,CPVs,Entidade(s) Adjudicante(s),Entidade(s) Adjudicatária(s),Preço Contratual,Data de Publicação,Data de Celebração do Contrato,Prazo de Execução,Local de Execução,Fundamentação,Data de Fecho do Contrato,Preço Total Efetivo,Causas das Alterações ao Prazo,Causas das Alterações ao Preço,Estado,N.º registo do Acordo Quadro,Descrição do Acordo Quadro,Procedimento Centralizado
"Prestação de serviços de recolha, tratamento e transporte de resíduos",Concurso público,Aquisição de serviços,"90524400-0, Recolha, transporte e eliminação de resíduos hospitalares","Unidade Local de Saúde do Baixo Alentejo, E. P. E. (508754275)","Ambimed-Gestão Ambiental, Lda (503593427)","134.417,39 €",23-10-2015,04-12-2014,1095 dias,"Portugal, Beja, Beja",Artigo 28.º do Código dos Contratos Públicos,,,,,,Não aplicável.,Não aplicável.,FALSE
Aquisição de sterrad para Serviço de Esterilização,Concurso público,Aquisição de bens móveis,"33191100-6, Esterilizador","Unidade Local de Saude do Baixo Alentejo, EPE (508754275)",Johnson& Johnson (500153370),"28.000,00 €",23-10-2015,12-11-2014,30 dias,"Portugal, Beja, Beja",Artigo 28.º do Código dos Contratos Públicos,,,,,,Não aplicável.,Não aplicável.,FALSE
Aquisição de diversos reagentes,Concurso público,Aquisição de bens móveis,"33696500-0, Reagentes de laboratório","Unidade Local de Saude do Baixo Alentejo, EPE (508754275)",Bio rad Laboratories (501301321),"24.189,24 €",21-10-2015,26-02-2015,730 dias,"Portugal, Beja, Beja","Artigo 20.º, n.º 1, alínea b) do Código dos Contratos Públicos",,,,,,Não aplicável.,Não aplicável.,FALSE
