Objeto do Contrato,Tipo de Procedimento,Tipo(s) de Contrato,CPVs,Entidade(s) Adjudicante(s),Entidade(s) Adjudicatária(s),Preço Contratual,Data de Publicação,Data de Celebração do Contrato,Prazo de Execução,Local de Execução,Fundamentação,Data de Fecho do Contrato,Preço Total Efetivo,Causas das Alterações ao Prazo,Causas das Alterações ao Preço,Estado,N.º registo do Acordo Quadro,Descrição do Acordo Quadro,Procedimento Centralizado
"Reparação de autoclave, instalado na UCSP Santarém - UF Oeste<br />- Reparação do esterilizador horizontal Modelo 145 litros 2PD GV~, constando de substituição da câmara de esterilização, incluindo toda a tubagem de aço inoxidável e grande parte da mecânica.",Ajuste Direto Regime Geral,Aquisição de serviços,"71356200-0, Serviços de assistência técnica","Administração Regional de Saúde de Lisboa e Vale do Tejo, I.P. (503148776)","PROHS - Equipamento Hospitalar e Serviços Associados, S.A. (505005468)","5.500,00 €",11-03-2011,13-01-2011,45 dias,"Portugal, Santarém, Santarém","Artigo 20.º, n.º 1, alínea a) do Código dos Contratos Públicos","","",,,,Não aplicável.,Não aplicável.,
VAC. CONTRA ENCEFALITE JAPONESA PO SOL. INJ - MONODOSE,Ajuste Direto Regime Geral,Outros Tipos (artº 5 al. a) nº 4 dl 18/2010 e artº 4  nº 1 DL 19/2010),"33651600-4, Vacinas","Administração Regional de Saúde de Lisboa e Vale do Tejo, I.P. (503148776)","SOMOS COMPRAS / SPMS, EPE (508096197)","10.700,80 €",11-03-2011,10-03-2011,1 dias,"Portugal, Lisboa, Lisboa","Artigo 26.º, n.º 1, alínea e) do Código dos Contratos Públicos","","",,,,Não aplicável.,Não aplicável.,
"Software para Gestão do Orçamento do Investimento PIDDAC - ARSLVT, I.P",Ajuste Direto Regime Geral,Aquisição de bens móveis,"48983000-2, Pacote de software para desenvolvimento","Administração Regional de Saúde de Lisboa e Vale do Tejo, I.P. (503148776)","Informar - Soluções Informáticas, Lda (502793236)","20.000,00 €",10-03-2011,09-03-2011,2 dias,"Portugal, Lisboa, Lisboa","Artigo 27.º, n.º 1, alínea f) do Código dos Contratos Públicos","","",,,,Não aplicável.,Não aplicável.,
Aquisição de central telefonica,Ajuste Direto Regime Geral,Aquisição de bens móveis,"32551200-2, Centrais telefónicas","Administração Regional de Saúde de Lisboa e Vale do Tejo, I.P. (503148776)",Fonotel - Comunicações SA (501397469),"11.680,00 €",10-03-2011,28-02-2011,20 dias,"Portugal, Lisboa, Vila Franca de Xira","Artigo 20.º, n.º 1, alínea a) do Código dos Contratos Públicos","","",,,,Não aplicável.,Não aplicável.,
SOL. POLIMERICA REF EXTRACTO CORNEO - SPRAY,Ajuste Direto Regime Geral,Outros Tipos (artº 26 al. e) nº 1),"33662100-9, Medicamentos usados em oftalmologia","Administração Regional de Saúde de Lisboa e Vale do Tejo, I.P. (503148776)","3M PORTUGAL, Lda. (500193940)","63.251,16 €",10-03-2011,15-02-2011,2 dias,"Portugal, Lisboa, Lisboa","Artigo 26.º, n.º 1, alínea e) do Código dos Contratos Públicos","","",,,,Não aplicável.,Não aplicável.,
GLUCAGOM PO SOL. INJ 1MG,Ajuste Direto Regime Geral,Outros Tipos (artº 26 al. e) nº 1),"33692500-2, Soluções injectáveis","Administração Regional de Saúde de Lisboa e Vale do Tejo, I.P. (503148776)","NOVO NORDISK, Lda. (501485210)","8.599,50 €",10-03-2011,23-02-2011,2 dias,"Portugal, Lisboa, Lisboa","Artigo 26.º, n.º 1, alínea e) do Código dos Contratos Públicos","","",,,,Não aplicável.,Não aplicável.,
"GAZE IMPREGNADA IODOFOROS 9,5X9,5CM.",Ajuste Direto Regime Geral,Outros Tipos (artº 26 al. e) nº 1),"33141119-7, Compressas","Administração Regional de Saúde de Lisboa e Vale do Tejo, I.P. (503148776)",SYSTAGENIX WOUND MANAGEMENT (SPAIN) SUCURSAL EM PORTUGAL (980402298),"244.750,00 €",10-03-2011,15-02-2011,1 dias,"Portugal, Lisboa, Lisboa","Artigo 26.º, n.º 1, alínea e) do Código dos Contratos Públicos","","",,,,Não aplicável.,Não aplicável.,
Aquisição de Trolamina composta,Ajuste Direto Regime Geral,Aquisição de bens móveis,"33690000-3, Medicamentos vários","Administração Regional de Saúde de Lisboa e Vale do Tejo, I.P. (503148776)","Johnson & Johnson, Lda (500153370)","71.250,00 €",10-03-2011,18-02-2011,30 dias,"Portugal, Lisboa, Lisboa","Artigo 24.º, n.º 1, alínea e) do Código dos Contratos Públicos","","",,,,Não aplicável.,Não aplicável.,
Aquisição de equipamento médico para a USF Eça,Ajuste Direto Regime Geral,Aquisição de bens móveis,"33100000-1, Equipamento médico","Administração Regional de Saúde de Lisboa e Vale do Tejo, I.P. (503148776)",produlabe lda (500700605),"1.183,00 €",09-03-2011,07-03-2011,30 dias,"Portugal, Setúbal, Barreiro","Artigo 1.º do Decreto-Lei n.º 48/2008, de 13.03","","",,,,Não aplicável.,Não aplicável.,
Aquisição de Mobiliário médico para a USF Arco Iris,Ajuste Direto Regime Geral,Aquisição de bens móveis,"33192000-2, Mobiliário para fins médicos","Administração Regional de Saúde de Lisboa e Vale do Tejo, I.P. (503148776)",Sorisa SA (500990441),"228,13 €",09-03-2011,01-03-2011,30 dias,"Portugal, Lisboa, Amadora","Artigo 1.º do Decreto-Lei n.º 48/2008, de 13.03","","",,,,Não aplicável.,Não aplicável.,
Aquisição de equipamento para a USF Pinhal de Frades,Ajuste Direto Regime Geral,Aquisição de bens móveis,"33100000-1, Equipamento médico","Administração Regional de Saúde de Lisboa e Vale do Tejo, I.P. (503148776)",Elnor SA (500094403),"1.386,80 €",09-03-2011,03-03-2011,30 dias,"Portugal, Setúbal, Seixal","Artigo 1.º do Decreto-Lei n.º 48/2008, de 13.03","","",,,,Não aplicável.,Não aplicável.,
Aquisição de equipamento médico para a USF Lapias,Ajuste Direto Regime Geral,Aquisição de bens móveis,"33100000-1, Equipamento médico","Administração Regional de Saúde de Lisboa e Vale do Tejo, I.P. (503148776)",Dignum Lda (509569188),"5.059,00 €",09-03-2011,04-03-2011,15 dias,"Portugal, Lisboa, Sintra","Artigo 1.º do Decreto-Lei n.º 48/2008, de 13.03","","",,,,Não aplicável.,Não aplicável.,
Aquisição de gás propano a granel,Ajuste Direto Regime Geral,Aquisição de bens móveis,"09122100-1, Gás propano","Administração Regional de Saúde de Lisboa e Vale do Tejo, I.P. (503148776)","PETROGAL-Petróleos de Portugal, S.A. (500697370)","1.284,15 €",09-03-2011,21-02-2011,5 dias,"Portugal, Santarém, Alcanena","Artigo 24.º, n.º 1, alínea e) do Código dos Contratos Públicos",21-02-2011,"1.284,15 €",,,,Não aplicável.,Não aplicável.,
Manutenção do elevador da UCSP de Alcanena,Ajuste Direto Regime Geral,Aquisição de serviços,"50750000-7, Serviços de manutenção de elevadores","Administração Regional de Saúde de Lisboa e Vale do Tejo, I.P. (503148776)",SCHINDLER (502353740),"738,19 €",09-03-2011,01-01-2011,365 dias,"Portugal, Santarém, Alcanena","Artigo 24.º, n.º 1, alínea e) do Código dos Contratos Públicos","","",,,,Não aplicável.,Não aplicável.,
Aquisição de mobiliário médico para a USF Loures Saudavel,Ajuste Direto Regime Geral,Aquisição de bens móveis,"33192000-2, Mobiliário para fins médicos","Administração Regional de Saúde de Lisboa e Vale do Tejo, I.P. (503148776)",Ergotec Lda (503455105),"1.572,54 €",09-03-2011,24-02-2011,15 dias,"Portugal, Lisboa, Loures","Artigo 1.º do Decreto-Lei n.º 48/2008, de 13.03","","",,,,Não aplicável.,Não aplicável.,
Reparação do autoclave da UCSP de Fátima,Ajuste Direto Regime Geral,Aquisição de serviços,"50000000-5, Serviços de reparação e manutenção","Administração Regional de Saúde de Lisboa e Vale do Tejo, I.P. (503148776)",STERYL-SER (508051711),"780,20 €",09-03-2011,24-01-2011,10 dias,"Portugal, Santarém, Ourém","Artigo 24.º, n.º 1, alínea e) do Código dos Contratos Públicos",12-02-2011,"780,20 €",,,,Não aplicável.,Não aplicável.,
Aquisição de equipamento médico para a USF Tejo,Ajuste Direto Regime Geral,Aquisição de bens móveis,"33100000-1, Equipamento médico","Administração Regional de Saúde de Lisboa e Vale do Tejo, I.P. (503148776)","Duekipa , Lda (508690102)","10.355,40 €",09-03-2011,21-02-2011,30 dias,"Portugal, Lisboa, Loures","Artigo 1.º do Decreto-Lei n.º 48/2008, de 13.03","","",,,,Não aplicável.,Não aplicável.,
Aquisição de Penicilina G Benzatina - Injectável,Ajuste Direto Regime Geral,Aquisição de bens móveis,"33690000-3, Medicamentos vários","Administração Regional de Saúde de Lisboa e Vale do Tejo, I.P. (503148776)","Laboratório Atral, SA (500162085)","51.680,00 €",09-03-2011,03-03-2011,30 dias,"Portugal, Lisboa, Lisboa","Artigo 26.º, n.º 1, alínea e) do Código dos Contratos Públicos","","",,,,Não aplicável.,Não aplicável.,
Aquisição de mobiliário médico para a uSF Pinhal de Frades,Ajuste Direto Regime Geral,Aquisição de bens móveis,"33100000-1, Equipamento médico","Administração Regional de Saúde de Lisboa e Vale do Tejo, I.P. (503148776)",promei centro lda (506470113),"5.319,76 €",09-03-2011,07-03-2011,10 dias,"Portugal, Setúbal, Seixal","Artigo 1.º do Decreto-Lei n.º 48/2008, de 13.03","","",,,,Não aplicável.,Não aplicável.,
Aquisição de equipamento para a USF Eça,Ajuste Direto Regime Geral,Aquisição de bens móveis,"33100000-1, Equipamento médico","Administração Regional de Saúde de Lisboa e Vale do Tejo, I.P. (503148776)",Joao Morgado de Brito (101078846),"866,10 €",09-03-2011,03-03-2011,15 dias,"Portugal, Setúbal, Barreiro","Artigo 1.º do Decreto-Lei n.º 48/2008, de 13.03","","",,,,Não aplicável.,Não aplicável.,
Em virtude das peças que compõem o aparelho de RX serem da marca Pilips,Ajuste Direto Regime Geral,Aquisição de bens móveis,"31120000-3, Geradores","Administração Regional de Saúde de Lisboa e Vale do Tejo, I.P. (503148776)",Philips Portuguesa S.A. (500216843),"23.470,00 €",09-03-2011,02-03-2011,10 dias,"Portugal, Santarém, Ourém","Artigo 24.º, n.º 1, alínea e) do Código dos Contratos Públicos","","",,,,Não aplicável.,Não aplicável.,
Aquisição de mobiliário médico para a uSF Eça,Ajuste Direto Regime Geral,Aquisição de bens móveis,"33192000-2, Mobiliário para fins médicos","Administração Regional de Saúde de Lisboa e Vale do Tejo, I.P. (503148776)",Promei centro lda (506470113),"8.192,44 €",09-03-2011,22-02-2011,20 dias,"Portugal, Setúbal, Barreiro","Artigo 1.º do Decreto-Lei n.º 48/2008, de 13.03","","",,,,Não aplicável.,Não aplicável.,
Aquisição de mobiliário médico para a USF Eça,Ajuste Direto Regime Geral,Aquisição de bens móveis,"33192000-2, Mobiliário para fins médicos","Administração Regional de Saúde de Lisboa e Vale do Tejo, I.P. (503148776)",Duekipa Lda (508690102),"4.100,00 €",09-03-2011,23-02-2011,30 dias,"Portugal, Setúbal, Barreiro","Artigo 1.º do Decreto-Lei n.º 48/2008, de 13.03","","",,,,Não aplicável.,Não aplicável.,
Renovação do Licenciamento VITAhisCARE - USF Rosinha,Ajuste Direto Regime Geral,Aquisição de bens móveis,"22456000-1, Licenças","Administração Regional de Saúde de Lisboa e Vale do Tejo, I.P. (503148776)","PT PRIME - Soluções Empresariais de Telecomunicações e Sistemas, S.A. (502840757)","1.715,78 €",09-03-2011,02-03-2011,2 dias,"Portugal, Setúbal, Seixal",Artigo 258.º do Código dos Contratos Públicos,"","",,,,Não aplicável.,Não aplicável.,
SANGUE OCULTO (HEMOGLOBINA HUMANA),Ajuste Direto Regime Geral,Outros Tipos (artº  24 al. e) nº 1),"33696500-0, Reagentes de laboratório","Administração Regional de Saúde de Lisboa e Vale do Tejo, I.P. (503148776)","PRESTIFARMA, Lda. (503474517)","425,00 €",04-03-2011,28-02-2011,5 dias,"Portugal, Lisboa, Lisboa","Artigo 24.º, n.º 1, alínea e) do Código dos Contratos Públicos","","",,,,Não aplicável.,Não aplicável.,
Ligação 24 horas á central,Ajuste Direto Regime Geral,Aquisição de serviços,"79710000-4, Serviços de segurança","Administração Regional de Saúde de Lisboa e Vale do Tejo, I.P. (503148776)","Segurança 24,Lda (503481939)","162,84 €",04-03-2011,03-01-2011,365 dias,"Portugal, Santarém, Tomar","Artigo 20.º, n.º 1, alínea a) do Código dos Contratos Públicos","","",,,,Não aplicável.,Não aplicável.,
Ligação 24 horas á central,Ajuste Direto Regime Geral,Aquisição de serviços,"79710000-4, Serviços de segurança","Administração Regional de Saúde de Lisboa e Vale do Tejo, I.P. (503148776)","Segurança 24, Lda. (503481939)","180,00 €",04-03-2011,03-01-2011,365 dias,"Portugal, Santarém, Abrantes","Artigo 20.º, n.º 1, alínea a) do Código dos Contratos Públicos","","",,,,Não aplicável.,Não aplicável.,
Ligação 24 horas á central,Ajuste Direto Regime Geral,Aquisição de serviços,"79710000-4, Serviços de segurança","Administração Regional de Saúde de Lisboa e Vale do Tejo, I.P. (503148776)","Segurança 24, Lda (503481939)","240,00 €",04-03-2011,03-01-2011,365 dias,"Portugal, Santarém, Constancia","Artigo 20.º, n.º 1, alínea a) do Código dos Contratos Públicos","","",,,,Não aplicável.,Não aplicável.,
Aquisição de Luvas Cirurgicas em Latex,Ajuste Direto Regime Geral,Aquisição de bens móveis,"33141420-0, Luvas para cirurgia","Administração Regional de Saúde de Lisboa e Vale do Tejo, I.P. (503148776)",Medicinalia Cormédica (500684324),"3.272,50 €",04-03-2011,23-02-2011,30 dias,"Portugal, Lisboa, Lisboa","Artigo 26.º, n.º 1, alínea e) do Código dos Contratos Públicos","","",,,,Não aplicável.,Não aplicável.,
Aquisição de Tensão Capsular 11mm diamêtro para o Centro Oftalmologico de Lisboa,Ajuste Direto Regime Geral,Aquisição de bens móveis,"33662100-9, Medicamentos usados em oftalmologia","Administração Regional de Saúde de Lisboa e Vale do Tejo, I.P. (503148776)",Abbott Medical Optics Spain SL (980262364),"4.738,50 €",04-03-2011,21-02-2011,30 dias,"Portugal, Lisboa, Lisboa","Artigo 26.º, n.º 1, alínea e) do Código dos Contratos Públicos","","",,,,Não aplicável.,Não aplicável.,
Aquisição de Triptorrelina Injectavel 11.25mg/2ml,Ajuste Direto Regime Geral,Aquisição de bens móveis,"33140000-3, Material médico de consumo","Administração Regional de Saúde de Lisboa e Vale do Tejo, I.P. (503148776)",IPSEN PORTUGAL SA (502609800),"27.429,00 €",04-03-2011,07-02-2011,30 dias,"Portugal, Lisboa, Lisboa","Artigo 24.º, n.º 1, alínea e) do Código dos Contratos Públicos","","",,,,Não aplicável.,Não aplicável.,
PREDNISOLONA PÓ - SOL. INJ. DE 50MG E DE 250MG,Ajuste Direto Regime Geral,Outros Tipos (artº 26 al. e) nº 1),"33692500-2, Soluções injectáveis","Administração Regional de Saúde de Lisboa e Vale do Tejo, I.P. (503148776)","MERCK, S.A. (500650870)","42.852,00 €",03-03-2011,25-02-2011,4 dias,"Portugal, Lisboa, Lisboa","Artigo 26.º, n.º 1, alínea e) do Código dos Contratos Públicos","","",,,,Não aplicável.,Não aplicável.,
CARBOXIMETILCELULOSE SODICA COM PRATA 10X10,Ajuste Direto Regime Geral,Outros Tipos (artº 26 al. e) nº 1),"33141110-4, Pensos","Administração Regional de Saúde de Lisboa e Vale do Tejo, I.P. (503148776)","KVTECH PORTUGAL, Lda. (Convatec) (508671531)","856.320,00 €",03-03-2011,23-02-2011,2 dias,"Portugal, Lisboa, Lisboa","Artigo 26.º, n.º 1, alínea e) do Código dos Contratos Públicos","","",,,,Não aplicável.,Não aplicável.,
CARBOXIMETILCELULOSE SODICA 10X10,Ajuste Direto Regime Geral,Outros Tipos (artº 26 al. e) nº 1),"33141110-4, Pensos","Administração Regional de Saúde de Lisboa e Vale do Tejo, I.P. (503148776)","KVTECH PORTUGAL, Lda. (Convatec) (508671531)","321.666,00 €",03-03-2011,23-02-2011,2 dias,"Portugal, Lisboa, Lisboa","Artigo 26.º, n.º 1, alínea e) do Código dos Contratos Públicos","","",,,,Não aplicável.,Não aplicável.,
POLIURETANO S/ REBORDO NÃO ADES 10X10,Ajuste Direto Regime Geral,Outros Tipos (artº 26 al. e) nº 1),"33141110-4, Pensos","Administração Regional de Saúde de Lisboa e Vale do Tejo, I.P. (503148776)","SMITH & NEPHEW, Lda. (503552461)","90.600,00 €",03-03-2011,22-02-2011,1 dias,"Portugal, Lisboa, Lisboa","Artigo 26.º, n.º 1, alínea e) do Código dos Contratos Públicos","","",,,,Não aplicável.,Não aplicável.,
POLIURETANO SACROCOCCIGEO C/ REBORDO ADES 18X18,Ajuste Direto Regime Geral,Outros Tipos (artº 26 al. e) nº 1),"33141111-1, Pensos adesivos","Administração Regional de Saúde de Lisboa e Vale do Tejo, I.P. (503148776)","SMITH & NEPHEW, Lda. (503552461)","245.000,00 €",03-03-2011,22-02-2011,1 dias,"Portugal, Lisboa, Lisboa","Artigo 26.º, n.º 1, alínea e) do Código dos Contratos Públicos","","",,,,Não aplicável.,Não aplicável.,
GAZE PARAFINADA 10X10,Ajuste Direto Regime Geral,Outros Tipos (artº 26 al. e) nº 1),"33141119-7, Compressas","Administração Regional de Saúde de Lisboa e Vale do Tejo, I.P. (503148776)","SMITH & NEPHEW, Lda. (503552461)","20.424,00 €",03-03-2011,22-02-2011,1 dias,"Portugal, Lisboa, Lisboa","Artigo 26.º, n.º 1, alínea e) do Código dos Contratos Públicos","","",,,,Não aplicável.,Não aplicável.,
"GAZE IMPREGNADA COM VASELINA 7,5X7,5 (ADAPTIC)",Ajuste Direto Regime Geral,Outros Tipos (artº 26 al. e) nº 1),"33141119-7, Compressas","Administração Regional de Saúde de Lisboa e Vale do Tejo, I.P. (503148776)",SYSTAGENIX WOUND MANAGEMENT (SPAIN) - SUCURSAL EM PORTUGAL (980402298),"6.750,00 €",03-03-2011,22-02-2011,1 dias,"Portugal, Lisboa, Lisboa","Artigo 26.º, n.º 1, alínea e) do Código dos Contratos Públicos","","",,,,Não aplicável.,Não aplicável.,
ALGINATO CALCIO C/ PRATA S/ REBORDO 10X10,Ajuste Direto Regime Geral,Outros Tipos (artº 26 al. e) nº 1),"33141110-4, Pensos","Administração Regional de Saúde de Lisboa e Vale do Tejo, I.P. (503148776)","3M PORTUGAL, Lda. (500193940)","131.600,00 €",03-03-2011,15-02-2011,2 dias,"Portugal, Lisboa, Lisboa","Artigo 26.º, n.º 1, alínea e) do Código dos Contratos Públicos","","",,,,Não aplicável.,Não aplicável.,
ALGINATO CALCIO 10X10,Ajuste Direto Regime Geral,Outros Tipos (artº 26 al. e) nº 1),"33141110-4, Pensos","Administração Regional de Saúde de Lisboa e Vale do Tejo, I.P. (503148776)","SMITH & NEPHEW, Lda. (503552461)","103.028,00 €",03-03-2011,15-02-2011,1 dias,"Portugal, Lisboa, Lisboa","Artigo 26.º, n.º 1, alínea e) do Código dos Contratos Públicos","","",,,,Não aplicável.,Não aplicável.,
Reparação do esterilizador do CS de Alcanena,Ajuste Direto Regime Geral,Aquisição de serviços,"50000000-5, Serviços de reparação e manutenção","Administração Regional de Saúde de Lisboa e Vale do Tejo, I.P. (503148776)",STERYL SER (508051711),"352,00 €",02-03-2011,20-01-2011,1 dias,"Portugal, Santarém, Alcanena","Artigo 24.º, n.º 1, alínea e) do Código dos Contratos Públicos",20-01-2011,"352,00 €",,,,Não aplicável.,Não aplicável.,
Aquisição de oxigénio medicinal garrafa 50L e oxigénio medicinal Compact BB5,Ajuste Direto Regime Geral,Aquisição de bens móveis,"24111900-4, Oxigénio","Administração Regional de Saúde de Lisboa e Vale do Tejo, I.P. (503148776)",Air Liquide (501576436),"225,60 €",02-03-2011,19-01-2011,1 dias,"Portugal, Santarém, Ourém","Artigo 24.º, n.º 1, alínea e) do Código dos Contratos Públicos",19-01-2011,"225,60 €",,,,Não aplicável.,Não aplicável.,
POLIURETANO PELICULA TRANSPARENTE ADESIVA 10M X 10M - ROLO,Ajuste Direto Regime Geral,Outros Tipos (artº 26 al. e) nº 1),"33141111-1, Pensos adesivos","Administração Regional de Saúde de Lisboa e Vale do Tejo, I.P. (503148776)","3M PORTUGAL, Lda. (500193940)","80.000,00 €",02-03-2011,22-02-2011,2 dias,"Portugal, Lisboa, Lisboa","Artigo 26.º, n.º 1, alínea e) do Código dos Contratos Públicos","","",,,,Não aplicável.,Não aplicável.,
HIDROGEL - GEL (Bisnaga),Ajuste Direto Regime Geral,Outros Tipos (artº 26 al. e) nº 1),"33690000-3, Medicamentos vários","Administração Regional de Saúde de Lisboa e Vale do Tejo, I.P. (503148776)","3M PORTUGAL, Lda. (500193940)","72.022,50 €",02-03-2011,22-02-2011,2 dias,"Portugal, Lisboa, Lisboa","Artigo 26.º, n.º 1, alínea e) do Código dos Contratos Públicos","","",,,,Não aplicável.,Não aplicável.,
Aquisição de equipamento audio visual para a USF Eça de Queiróz - ACES Arco Ribeirinho.,Ajuste Direto Regime Geral,Aquisição de bens móveis,"30230000-0, Equipamento informático","Administração Regional de Saúde de Lisboa e Vale do Tejo, I.P. (503148776)",Absolutus  Lda (503703745),"867,40 €",02-03-2011,16-02-2011,1 dias,"Portugal, Setúbal, Barreiro","Artigo 1.º do Decreto-Lei n.º 48/2008, de 13.03","","",,,,Não aplicável.,Não aplicável.,
"POLIURETANO C/ REBORDO ADESIVADO 9,5 X 9,5",Ajuste Direto Regime Geral,Outros Tipos (artº 26 al. e) nº 1),"33141111-1, Pensos adesivos","Administração Regional de Saúde de Lisboa e Vale do Tejo, I.P. (503148776)",SYSTAGENIX WOUND MANAGEMENT (SPAIN) - SUCURSAL EM PORTUGAL (980402298),"141.075,00 €",02-03-2011,22-02-2011,1 dias,"Portugal, Lisboa, Lisboa","Artigo 26.º, n.º 1, alínea e) do Código dos Contratos Públicos","","",,,,Não aplicável.,Não aplicável.,
LUVAS LATEX NÃO ESTERILIZADAS DIVERSAS,Ajuste Direto Regime Geral,Outros Tipos (artº 26 al. e) nº 1),"18424300-0, Luvas descartáveis","Administração Regional de Saúde de Lisboa e Vale do Tejo, I.P. (503148776)","VWR INTERNATIONAL, Lda. (503842770)","199.800,00 €",02-03-2011,15-02-2011,5 dias,"Portugal, Lisboa, Lisboa","Artigo 26.º, n.º 1, alínea e) do Código dos Contratos Públicos","","",,,,Não aplicável.,Não aplicável.,
Aquisição de equipamento médico para a USF Eça de Queiróz - ACES Arco Ribeirinho.,Ajuste Direto Regime Geral,Aquisição de bens móveis,"33100000-1, Equipamento médico","Administração Regional de Saúde de Lisboa e Vale do Tejo, I.P. (503148776)",M.M. Cunha Lda (507374843),"2.184,62 €",02-03-2011,22-02-2011,30 dias,"Portugal, Setúbal, Barreiro","Artigo 1.º do Decreto-Lei n.º 48/2008, de 13.03","","",,,,Não aplicável.,Não aplicável.,
"POLIURETANO C/ REBORDO ADESIVADO 14,5 X 14,5",Ajuste Direto Regime Geral,Outros Tipos (artº 26 al. e) nº 1),"33141111-1, Pensos adesivos","Administração Regional de Saúde de Lisboa e Vale do Tejo, I.P. (503148776)",SYSTAGENIX WOUND MANAGEMENT (SPAIN) - SUCURSAL DE PORTUGAL (980402298),"256.500,00 €",02-03-2011,22-02-2011,1 dias,"Portugal, Lisboa, Lisboa","Artigo 26.º, n.º 1, alínea e) do Código dos Contratos Públicos","","",,,,Não aplicável.,Não aplicável.,
Aquisição de equipamento para a USF Eça de Queiróz - ACES Arco Ribeirinho.,Ajuste Direto Regime Geral,Aquisição de bens móveis,"33100000-1, Equipamento médico","Administração Regional de Saúde de Lisboa e Vale do Tejo, I.P. (503148776)",Speculum SA (502996323),"230,00 €",02-03-2011,17-02-2011,20 dias,"Portugal, Setúbal, Barreiro","Artigo 1.º do Decreto-Lei n.º 48/2008, de 13.03","","",,,,Não aplicável.,Não aplicável.,
Aquisição de mobiliário médico para a USF Eça de Queiróz - ACES Arco Ribeirinho.,Ajuste Direto Regime Geral,Aquisição de bens móveis,"33192000-2, Mobiliário para fins médicos","Administração Regional de Saúde de Lisboa e Vale do Tejo, I.P. (503148776)",Eugenio Pereira Lda (503989525),"5.095,00 €",02-03-2011,16-02-2011,15 dias,"Portugal, Lisboa, Odivelas","Artigo 1.º do Decreto-Lei n.º 48/2008, de 13.03","","",,,,Não aplicável.,Não aplicável.,
Aquisição de equipamento para a USF Eça de Queiróz - ACES Arco Ribeirinho.,Ajuste Direto Regime Geral,Aquisição de bens móveis,"33100000-1, Equipamento médico","Administração Regional de Saúde de Lisboa e Vale do Tejo, I.P. (503148776)",Dignum Lda (509569188),"160,00 €",02-03-2011,17-02-2011,15 dias,"Portugal, Setúbal, Barreiro","Artigo 1.º do Decreto-Lei n.º 48/2008, de 13.03","","",,,,Não aplicável.,Não aplicável.,
Aquisição de Mobiliário médico para a USF Eça de Queiróz - ACES Arco Ribeirinho.,Ajuste Direto Regime Geral,Aquisição de bens móveis,"33192000-2, Mobiliário para fins médicos","Administração Regional de Saúde de Lisboa e Vale do Tejo, I.P. (503148776)",Ergotec Lda (503455105),"1.577,48 €",02-03-2011,22-02-2011,20 dias,"Portugal, Setúbal, Barreiro","Artigo 1.º do Decreto-Lei n.º 48/2008, de 13.03","","",,,,Não aplicável.,Não aplicável.,
Aquisição de equipamento de fisioterapia para a USF Eça de Queiróz - ACES Arco Ribeirinho.,Ajuste Direto Regime Geral,Aquisição de bens móveis,"33192000-2, Mobiliário para fins médicos","Administração Regional de Saúde de Lisboa e Vale do Tejo, I.P. (503148776)",Sorisa SA (500990441),"1.342,38 €",02-03-2011,16-02-2011,30 dias,"Portugal, Setúbal, Barreiro","Artigo 1.º do Decreto-Lei n.º 48/2008, de 13.03","","",,,,Não aplicável.,Não aplicável.,
"Cloreto de Sódio 0,9% para irrigação - 45ml",Concurso público,Aquisição de bens móveis,"33000000-0, Equipamento médico, medicamentos e produtos para cuidados pessoais","Administração Regional de Saúde de Lisboa e Vale do Tejo, I.P. (503148776)","OVERPHARMA - Produtos Médicos e Farmacêuticos, Lda. (505792362)","60.200,00 €",01-03-2011,26-11-2010,2 dias,"Portugal, Lisboa, Lisboa","Artigo 155.º, alínea a) do Código dos Contratos Públicos","","",,,,Não aplicável.,Não aplicável.,
DINITRATO DE ISOSSORBIDA COMP. 5MG,Ajuste Direto Regime Geral,Outros Tipos (artº 26 al. e) nº 1),"33690000-3, Medicamentos vários","Administração Regional de Saúde de Lisboa e Vale do Tejo, I.P. (503148776)","LAB. VITORIA, S.A. (500162220)","208,26 €",01-03-2011,23-02-2011,5 dias,"Portugal, Lisboa, Lisboa","Artigo 26.º, n.º 1, alínea e) do Código dos Contratos Públicos","","",,,,Não aplicável.,Não aplicável.,
REAGENTES DIVERSOS PARA BIOQUIMICA/IMUNOQUIMICA,Ajuste Direto Regime Geral,Outros Tipos (artº 24 al. e) nº 1),"33696500-0, Reagentes de laboratório","Administração Regional de Saúde de Lisboa e Vale do Tejo, I.P. (503148776)","ROCHE - Sistemas Diagnostico Soc. Unipessoal, Lda. (504282921)","1.814,24 €",01-03-2011,25-02-2011,3 dias,"Portugal, Lisboa, Lisboa","Artigo 24.º, n.º 1, alínea e) do Código dos Contratos Públicos","","",,,,Não aplicável.,Não aplicável.,
HIDROXIZINA COMP 25MG,Ajuste Direto Regime Geral,Outros Tipos (artº 26 al. e) nº 1),"33690000-3, Medicamentos vários","Administração Regional de Saúde de Lisboa e Vale do Tejo, I.P. (503148776)","UCB PHARMA, Lda. (500291322)","380,82 €",01-03-2011,25-02-2011,1 dias,"Portugal, Lisboa, Lisboa","Artigo 26.º, n.º 1, alínea e) do Código dos Contratos Públicos","","",,,,Não aplicável.,Não aplicável.,
Aquisição de Linha de Sutura Sintetica Absorvível Atraumática Lanceolada 4/0,Ajuste Direto Regime Geral,Aquisição de bens móveis,"33140000-3, Material médico de consumo","Administração Regional de Saúde de Lisboa e Vale do Tejo, I.P. (503148776)","Johnson & Johnson, Lda (500153370)","1.843,20 €",01-03-2011,21-02-2011,30 dias,"Portugal, Lisboa, Lisboa","Artigo 24.º, n.º 1, alínea e) do Código dos Contratos Públicos","","",,,,Não aplicável.,Não aplicável.,
Aquisição de Bicarbonato de NA Inj 84mg/ml - 20ml,Ajuste Direto Regime Geral,Aquisição de bens móveis,"33140000-3, Material médico de consumo","Administração Regional de Saúde de Lisboa e Vale do Tejo, I.P. (503148776)","B Braun Medical, Lda (501506543)","86,85 €",01-03-2011,24-02-2011,30 dias,"Portugal, Lisboa, Lisboa","Artigo 26.º, n.º 1, alínea e) do Código dos Contratos Públicos","","",,,,Não aplicável.,Não aplicável.,
