freguesia,acronym,validVotesPercentage,votes,dicofre
Paços,PS,49.69,80,171007
Paços,PPD/PSD.CDS-PP,24.84,40,171007
Paços,MPT,6.83,11,171007
Paços,PCP-PEV,6.21,10,171007
Paços,B.E.,4.35,7,171007
Paços,PAN,1.86,3,171007
Paços,L,1.24,2,171007
Paços,PCTP/MRPP,1.24,2,171007
Paços,PTP,1.24,2,171007
Paços,PDA,0.62,1,171007
Paços,PND,0.62,1,171007
Paços,POUS,0.62,1,171007
Paços,PPM,0.62,1,171007
Paços,MAS,0,0,171007
Paços,PNR,0,0,171007
Paços,PPV,0,0,171007
