freguesia,acronym,validVotesPercentage,votes,dicofre
Rogil,PS,43.22,137,080304
Rogil,PCP-PEV,15.77,50,080304
Rogil,PPD/PSD.CDS-PP,7.89,25,080304
Rogil,MPT,6.62,21,080304
Rogil,B.E.,6.31,20,080304
Rogil,PCTP/MRPP,5.05,16,080304
Rogil,L,3.79,12,080304
Rogil,PAN,3.79,12,080304
Rogil,PND,2.21,7,080304
Rogil,PPV,1.26,4,080304
Rogil,PTP,1.26,4,080304
Rogil,MAS,0.95,3,080304
Rogil,PPM,0.95,3,080304
Rogil,PDA,0.63,2,080304
Rogil,PNR,0.32,1,080304
Rogil,POUS,0,0,080304
