Objeto do Contrato,Tipo de Procedimento,Tipo(s) de Contrato,CPVs,Entidade(s) Adjudicante(s),Entidade(s) Adjudicatária(s),Preço Contratual,Data de Publicação,Data de Celebração do Contrato,Prazo de Execução,Local de Execução,Fundamentação,Data de Fecho do Contrato,Preço Total Efetivo,Causas das Alterações ao Prazo,Causas das Alterações ao Preço,Estado,N.º registo do Acordo Quadro,Descrição do Acordo Quadro,Procedimento Centralizado
Aquisição de serviços para realização de ações de Saúde no Trabalho no âmbito do PNSOC,Ajuste Direto Regime Geral,Aquisição de serviços,"79900000-3, Serviços empresariais diversos e afins",Direcção-Geral da Saúde (DGS) (600037100),"JOCOLAR, Sociedade de Construções e Consultoria, Lda. (501502181)","11.675,00 €",21-03-2017,10-02-2017,365 dias,"Portugal, Lisboa","Artigo 20.º, n.º 1, alínea a) do Código dos Contratos Públicos",,,,,,Não aplicável.,Não aplicável.,FALSE
Aquisição de serviços de manutenção e assistência técnica ao sistema de ar condicionado da DGS para o ano 2017,Ajuste Direto Regime Geral,Aquisição de serviços,"79900000-3, Serviços empresariais diversos e afins",Direção-Geral da Saúde (600037100),"Granjair, Lda. (508626692)","7.754,87 €",20-03-2017,16-03-2017,365 dias,"Portugal, Lisboa","Artigo 20.º, n.º 1, alínea a) do Código dos Contratos Públicos",,,,,,Não aplicável.,Não aplicável.,FALSE
