freguesia,acronym,validVotesPercentage,votes,dicofre
Santa Eulália,PPD/PSD,37.6,235,010416
Santa Eulália,PS,32.8,205,010416
Santa Eulália,CDS-PP,13.76,86,010416
Santa Eulália,B.E.,5.28,33,010416
Santa Eulália,PAN,2.88,18,010416
Santa Eulália,PCP-PEV,2.4,15,010416
Santa Eulália,IL,0.96,6,010416
Santa Eulália,NC,0.96,6,010416
Santa Eulália,PDR,0.96,6,010416
Santa Eulália,L,0.64,4,010416
Santa Eulália,PNR,0.48,3,010416
Santa Eulália,PPM.PPV/CDC,0.48,3,010416
Santa Eulália,A,0.32,2,010416
Santa Eulália,PCTP/MRPP,0.16,1,010416
Santa Eulália,PTP,0.16,1,010416
Santa Eulália,PURP,0.16,1,010416
Santa Eulália,MAS,0,0,010416
