Objeto do Contrato,Tipo de Procedimento,Tipo(s) de Contrato,CPVs,Entidade(s) Adjudicante(s),Entidade(s) Adjudicatária(s),Preço Contratual,Data de Publicação,Data de Celebração do Contrato,Prazo de Execução,Local de Execução,Fundamentação,Data de Fecho do Contrato,Preço Total Efetivo,Causas das Alterações ao Prazo,Causas das Alterações ao Preço,Estado,N.º registo do Acordo Quadro,Descrição do Acordo Quadro,Procedimento Centralizado
1018E17 Agregação urgente - etanercept biossimilar - Novembro,Ajuste Direto Regime Geral,Aquisição de bens móveis,"33600000-6, Produtos farmacêuticos","Centro Hospitalar de Leiria, E. P. E. (509822932)","BIOGEN IDEC PORTUGAL-SOC.FARM.UNIP., LDA (506415740)","9.505,90 €",11-12-2017,06-12-2017,20 dias,"Portugal, Leiria, Leiria","Artigo 24.º, n.º 1, alínea e) do Código dos Contratos Públicos","","",,,,Não aplicável.,Não aplicável.,FALSE
1073E17 Agregação Urgente Interferão beta 1 b 8m - Novembro,Ajuste Direto Regime Geral,Aquisição de bens móveis,"33600000-6, Produtos farmacêuticos","Centro Hospitalar de Leiria, E. P. E. (509822932)","BAYER PORTUGAL, LDA (500043256)","26.100,00 €",11-12-2017,06-12-2017,20 dias,"Portugal, Leiria, Leiria","Artigo 24.º, n.º 1, alínea e) do Código dos Contratos Públicos","","",,,,Não aplicável.,Não aplicável.,FALSE
Agulhas punção aspirativa,Ajuste Direto Regime Geral,Aquisição de bens móveis,"33141323-0, Agulhas de biópsia","Centro Hospitalar de Leiria, E. P. E. (509822932)","BIOSONDA-COM.MATERIAL HOSPITALAR, LDA (501463313)","14.200,00 €",07-12-2017,28-11-2017,120 dias,"Portugal, Leiria, Leiria","Artigo 20.º, n.º 1, alínea a) do Código dos Contratos Públicos","","",,,,Não aplicável.,Não aplicável.,FALSE
Balão para ecoeda,Ajuste Direto Regime Geral,Aquisição de bens móveis,"33140000-3, Material médico de consumo","Centro Hospitalar de Leiria, E. P. E. (509822932)","SIMMEDICA - SISTEMAS INTEGRALES DE LA MEDICINA, SA. (980488842)","2.345,00 €",07-12-2017,28-11-2017,120 dias,"Portugal, Leiria, Leiria","Artigo 20.º, n.º 1, alínea a) do Código dos Contratos Públicos","","",,,,Não aplicável.,Não aplicável.,FALSE
Cateteres,Ao abrigo de acordo-quadro (art.º 259.º),Aquisição de bens móveis,"33141200-2, Cateteres","Centro Hospitalar de Leiria, E. P. E. (509822932)","SMITHS MEDICAL (PORTUGAL),UNIPESSOAL,LDA (507445937)","1.117,20 €",07-12-2017,07-12-2017,1 dias,"Portugal, Leiria, Leiria","Artigo 20.º, n.º 1, alínea b) do Código dos Contratos Públicos",07-12-2017,"1.117,20 €",,,,1212278,"CONCURSO PÚBLICO PARA A CELEBRAÇÃO DE CONTRATOS PÚBLICOS DE APROVISIONAMENTO PARA A ÁREA DA SAÚDE, COM VISTA AO FORNECIMENTO DE CATETERES, ÀS INSTITUIÇÕES E SERVIÇOS DO SERVIÇO NACIONAL DE SAÚDE",FALSE
Medicamentos Antipsicóticos - Clozapina 100 mg,Ao abrigo de acordo-quadro (art.º 259.º),Aquisição de bens móveis,"33600000-6, Produtos farmacêuticos","Centro Hospitalar de Leiria, E. P. E. (509822932)","LABESFAL - LABORATÓRIOS ALMIRO, S.A.    (501169580)","26,28 €",06-12-2017,05-12-2017,30 dias,"Portugal, Leiria, Leiria",Artigo 259.º do Código dos Contratos Públicos,"","",,,,2356543,CP 2016/19 - Medicamentos Antipsicóticos,FALSE
Medicamento Exclusivo Pirfenidona,Ajuste Direto Regime Geral,Aquisição de bens móveis,"33600000-6, Produtos farmacêuticos","Centro Hospitalar de Leiria, E. P. E. (509822932)",ROCHE FARMACEUTICA QUIMICA LDA (500233810),"3.860,64 €",06-12-2017,05-12-2017,30 dias,"Portugal, Leiria, Leiria","Artigo 24.º, n.º 1, alínea e) do Código dos Contratos Públicos","","",,,,Não aplicável.,Não aplicável.,FALSE
Reagentes para Anatomia Patológica,Ajuste Direto Regime Geral,Aquisição de bens móveis,"33696000-5, Reagentes e meios de contraste","Centro Hospitalar de Leiria, E. P. E. (509822932)"," VWR INTERNATIONAL- MATERIAL DE LABORATORIO, LDA (503842770)","267,00 €",06-12-2017,06-12-2017,20 dias,"Portugal, Leiria, Leiria","Artigo 20.º, n.º 1, alínea a) do Código dos Contratos Públicos","","",,,,Não aplicável.,Não aplicável.,FALSE
Medicamentos Sistema Nervoso Cerebrospinal - gabapentina,Ao abrigo de acordo-quadro (art.º 259.º),Aquisição de bens móveis,"33600000-6, Produtos farmacêuticos","Centro Hospitalar de Leiria, E. P. E. (509822932)","GENERIS FARMACÊUTICA,SA    (508107997)","5,64 €",06-12-2017,06-12-2017,30 dias,"Portugal, Leiria, Leiria",Artigo 259.º do Código dos Contratos Públicos,"","",,,,1179911,"CONCURSO PÚBLICO PARA A CELEBRAÇÃO DE CONTRATOS PÚBLICOS DE APROVISIONAMENTO PARA A ÁREA DA SAÚDE, MEDICAMENTOS DO SISTEMA NERVOSO CEREBROSPINAL, EXCETO: ANESTÉSICOS, RELAXANTES MUSCULARES, ANALGÉSICOS, ANTIPIRÉTICOS, ANTIDEPRESSORES E ANTIPSICÓTICOS, ÀS INSTITUIÇÕES E SERVIÇOS DO SERVIÇO NACIONAL DE SAÚDE",FALSE
