freguesia,acronym,validVotesPercentage,votes,dicofre
Constance,PS,44.96,214,130705
Constance,PPD/PSD.CDS-PP,27.52,131,130705
Constance,MPT,10.29,49,130705
Constance,PCP-PEV,7.56,36,130705
Constance,B.E.,2.73,13,130705
Constance,L,2.1,10,130705
Constance,PCTP/MRPP,1.89,9,130705
Constance,PPM,0.84,4,130705
Constance,MAS,0.63,3,130705
Constance,PAN,0.63,3,130705
Constance,PND,0.42,2,130705
Constance,PNR,0.21,1,130705
Constance,PTP,0.21,1,130705
Constance,PDA,0,0,130705
Constance,POUS,0,0,130705
Constance,PPV,0,0,130705
