freguesia,acronym,validVotesPercentage,votes,dicofre
Grilo,PS,46.21,61,130207
Grilo,PPD/PSD,30.3,40,130207
Grilo,B.E.,9.09,12,130207
Grilo,PCP-PEV,3.79,5,130207
Grilo,PAN,3.03,4,130207
Grilo,PDR,3.03,4,130207
Grilo,CDS-PP,2.27,3,130207
Grilo,MAS,0.76,1,130207
Grilo,PCTP/MRPP,0.76,1,130207
Grilo,PPM.PPV/CDC,0.76,1,130207
Grilo,A,0,0,130207
Grilo,IL,0,0,130207
Grilo,L,0,0,130207
Grilo,NC,0,0,130207
Grilo,PNR,0,0,130207
Grilo,PTP,0,0,130207
Grilo,PURP,0,0,130207
