freguesia,acronym,validVotesPercentage,votes,dicofre
Beijós,PPD/PSD.CDS-PP,47.08,121,180201
Beijós,PS,36.19,93,180201
Beijós,MPT,5.06,13,180201
Beijós,B.E.,4.28,11,180201
Beijós,PCP-PEV,3.11,8,180201
Beijós,L,0.78,2,180201
Beijós,PTP,0.78,2,180201
Beijós,MAS,0.39,1,180201
Beijós,PAN,0.39,1,180201
Beijós,PCTP/MRPP,0.39,1,180201
Beijós,PDA,0.39,1,180201
Beijós,PND,0.39,1,180201
Beijós,PNR,0.39,1,180201
Beijós,PPM,0.39,1,180201
Beijós,POUS,0,0,180201
Beijós,PPV,0,0,180201
