freguesia,acronym,validVotesPercentage,votes,dicofre
União das freguesias de Aldeia do Mato e Souto,PPD/PSD.CDS-PP,60.21,230,140121
União das freguesias de Aldeia do Mato e Souto,PS,23.56,90,140121
União das freguesias de Aldeia do Mato e Souto,PCP-PEV,3.4,13,140121
União das freguesias de Aldeia do Mato e Souto,MPT,2.88,11,140121
União das freguesias de Aldeia do Mato e Souto,B.E.,2.62,10,140121
União das freguesias de Aldeia do Mato e Souto,PND,2.36,9,140121
União das freguesias de Aldeia do Mato e Souto,PAN,1.83,7,140121
União das freguesias de Aldeia do Mato e Souto,L,0.52,2,140121
União das freguesias de Aldeia do Mato e Souto,MAS,0.52,2,140121
União das freguesias de Aldeia do Mato e Souto,PCTP/MRPP,0.52,2,140121
União das freguesias de Aldeia do Mato e Souto,PNR,0.52,2,140121
União das freguesias de Aldeia do Mato e Souto,PTP,0.52,2,140121
União das freguesias de Aldeia do Mato e Souto,PDA,0.26,1,140121
União das freguesias de Aldeia do Mato e Souto,PPM,0.26,1,140121
União das freguesias de Aldeia do Mato e Souto,POUS,0,0,140121
União das freguesias de Aldeia do Mato e Souto,PPV,0,0,140121
