freguesia,acronym,validVotesPercentage,votes,dicofre
"União das freguesias de Cambeses do Rio, Donões e Mourilhe",PS,54.81,74,170636
"União das freguesias de Cambeses do Rio, Donões e Mourilhe",PPD/PSD.CDS-PP,33.33,45,170636
"União das freguesias de Cambeses do Rio, Donões e Mourilhe",MPT,4.44,6,170636
"União das freguesias de Cambeses do Rio, Donões e Mourilhe",PTP,2.22,3,170636
"União das freguesias de Cambeses do Rio, Donões e Mourilhe",L,1.48,2,170636
"União das freguesias de Cambeses do Rio, Donões e Mourilhe",B.E.,0.74,1,170636
"União das freguesias de Cambeses do Rio, Donões e Mourilhe",MAS,0.74,1,170636
"União das freguesias de Cambeses do Rio, Donões e Mourilhe",PCP-PEV,0.74,1,170636
"União das freguesias de Cambeses do Rio, Donões e Mourilhe",PND,0.74,1,170636
"União das freguesias de Cambeses do Rio, Donões e Mourilhe",PPV,0.74,1,170636
"União das freguesias de Cambeses do Rio, Donões e Mourilhe",PAN,0,0,170636
"União das freguesias de Cambeses do Rio, Donões e Mourilhe",PCTP/MRPP,0,0,170636
"União das freguesias de Cambeses do Rio, Donões e Mourilhe",PDA,0,0,170636
"União das freguesias de Cambeses do Rio, Donões e Mourilhe",PNR,0,0,170636
"União das freguesias de Cambeses do Rio, Donões e Mourilhe",POUS,0,0,170636
"União das freguesias de Cambeses do Rio, Donões e Mourilhe",PPM,0,0,170636
