freguesia,acronym,validVotesPercentage,votes,dicofre
União das freguesias de Lagos da Beira e Lajeosa,PS,50,187,061123
União das freguesias de Lagos da Beira e Lajeosa,PPD/PSD.CDS-PP,34.22,128,061123
União das freguesias de Lagos da Beira e Lajeosa,MPT,6.42,24,061123
União das freguesias de Lagos da Beira e Lajeosa,B.E.,2.14,8,061123
União das freguesias de Lagos da Beira e Lajeosa,PCP-PEV,2.14,8,061123
União das freguesias de Lagos da Beira e Lajeosa,PTP,1.34,5,061123
União das freguesias de Lagos da Beira e Lajeosa,L,1.07,4,061123
União das freguesias de Lagos da Beira e Lajeosa,PCTP/MRPP,0.8,3,061123
União das freguesias de Lagos da Beira e Lajeosa,PND,0.8,3,061123
União das freguesias de Lagos da Beira e Lajeosa,MAS,0.27,1,061123
União das freguesias de Lagos da Beira e Lajeosa,PAN,0.27,1,061123
União das freguesias de Lagos da Beira e Lajeosa,PNR,0.27,1,061123
União das freguesias de Lagos da Beira e Lajeosa,PPV,0.27,1,061123
União das freguesias de Lagos da Beira e Lajeosa,PDA,0,0,061123
União das freguesias de Lagos da Beira e Lajeosa,POUS,0,0,061123
União das freguesias de Lagos da Beira e Lajeosa,PPM,0,0,061123
