freguesia,acronym,validVotesPercentage,votes,dicofre
União das freguesias de Painho e Figueiros,PS,43.6,211,110413
União das freguesias de Painho e Figueiros,PPD/PSD,31.4,152,110413
União das freguesias de Painho e Figueiros,B.E.,6.82,33,110413
União das freguesias de Painho e Figueiros,PCP-PEV,5.17,25,110413
União das freguesias de Painho e Figueiros,PAN,3.93,19,110413
União das freguesias de Painho e Figueiros,CDS-PP,2.89,14,110413
União das freguesias de Painho e Figueiros,A,1.24,6,110413
União das freguesias de Painho e Figueiros,L,1.03,5,110413
União das freguesias de Painho e Figueiros,PPM.PPV/CDC,1.03,5,110413
União das freguesias de Painho e Figueiros,NC,0.62,3,110413
União das freguesias de Painho e Figueiros,PCTP/MRPP,0.62,3,110413
União das freguesias de Painho e Figueiros,PNR,0.41,2,110413
União das freguesias de Painho e Figueiros,PURP,0.41,2,110413
União das freguesias de Painho e Figueiros,IL,0.21,1,110413
União das freguesias de Painho e Figueiros,MAS,0.21,1,110413
União das freguesias de Painho e Figueiros,PDR,0.21,1,110413
União das freguesias de Painho e Figueiros,PTP,0.21,1,110413
