freguesia,acronym,validVotesPercentage,votes,dicofre
União das freguesias de São João da Ribeira e Ribeira de São João,PS,32.95,116,141418
União das freguesias de São João da Ribeira e Ribeira de São João,PPD/PSD,26.99,95,141418
União das freguesias de São João da Ribeira e Ribeira de São João,B.E.,10.8,38,141418
União das freguesias de São João da Ribeira e Ribeira de São João,PCP-PEV,8.24,29,141418
União das freguesias de São João da Ribeira e Ribeira de São João,CDS-PP,6.53,23,141418
União das freguesias de São João da Ribeira e Ribeira de São João,A,4.26,15,141418
União das freguesias de São João da Ribeira e Ribeira de São João,PPM.PPV/CDC,2.56,9,141418
União das freguesias de São João da Ribeira e Ribeira de São João,PAN,2.27,8,141418
União das freguesias de São João da Ribeira e Ribeira de São João,NC,1.42,5,141418
União das freguesias de São João da Ribeira e Ribeira de São João,L,1.14,4,141418
União das freguesias de São João da Ribeira e Ribeira de São João,PCTP/MRPP,1.14,4,141418
União das freguesias de São João da Ribeira e Ribeira de São João,PNR,0.85,3,141418
União das freguesias de São João da Ribeira e Ribeira de São João,MAS,0.57,2,141418
União das freguesias de São João da Ribeira e Ribeira de São João,IL,0.28,1,141418
União das freguesias de São João da Ribeira e Ribeira de São João,PDR,0,0,141418
União das freguesias de São João da Ribeira e Ribeira de São João,PTP,0,0,141418
União das freguesias de São João da Ribeira e Ribeira de São João,PURP,0,0,141418
