Objeto do Contrato,Tipo de Procedimento,Tipo(s) de Contrato,CPVs,Entidade(s) Adjudicante(s),Entidade(s) Adjudicatária(s),Preço Contratual,Data de Publicação,Data de Celebração do Contrato,Prazo de Execução,Local de Execução,Fundamentação,Data de Fecho do Contrato,Preço Total Efetivo,Causas das Alterações ao Prazo,Causas das Alterações ao Preço,Estado,N.º registo do Acordo Quadro,Descrição do Acordo Quadro,Procedimento Centralizado
"Prestação de Serviços Médicos na Especialidade de Gastroenterologia, na ULSNA, EPE (Ano 2018)",Ajuste Direto Regime Geral,Aquisição de serviços,"85100000-0, Serviços de saúde","Unidade Local de Saúde do Norte Alentejano, E. P. E. (508094461)","Clinalbi, Lda (508272912)","90.200,00 €",12-02-2018,26-01-2018,365 dias,"Portugal, Portalegre, Portalegre","Artigo 27.º, n.º 1, alínea a) do Código dos Contratos Públicos","","",,,,Não aplicável.,Não aplicável.,FALSE
"Prestação de Serviços Médicos na Especialidade de Gastroenterologia, na ULSNA, EPE (Ano 2017)",Ajuste Direto Regime Geral,Aquisição de serviços,"85100000-0, Serviços de saúde","Unidade Local de Saúde do Norte Alentejano, E. P. E. (508094461)","Clinalbi, Lda (508272912)","91.784,00 €",17-02-2017,10-01-2017,365 dias,"Portugal, Portalegre, Portalegre","Artigo 27.º, n.º 1, alínea a) do Código dos Contratos Públicos",10-01-2017,"91.784,00 €",,,,Não aplicável.,Não aplicável.,FALSE
Prestação de serviços médicos - Gastroenterologia,Ajuste Direto Regime Geral,Aquisição de serviços,"85121251-7, Serviços de gastroenterologia","Centro Hospitalar Cova da Beira, EPE (506361659)",Clinalbi (508272912),"55,00 €",27-10-2015,10-10-2014,365 dias,"Portugal, Castelo Branco, Covilhã","Artigo 20.º, n.º 1, alínea a) do Código dos Contratos Públicos","","",,,,Não aplicável.,Não aplicável.,FALSE
"Prestação de Serviços Médicos na Especialidade de Gastroenterologia na ULSNA, EPE",Concurso público,Aquisição de serviços,"85100000-0, Serviços de saúde","Unidade Local de Saúde do Norte Alentejano, E. P. E. (508094461)","Clinalbi - Clinica de Gastroenterologia Albicastrense, Lda. (508272912)","90.890,00 €",20-10-2015,09-10-2015,365 dias,"Portugal, Portalegre, Portalegre","Artigo 20.º, n.º 1, alínea b) do Código dos Contratos Públicos",20-10-2015,"90.890,00 €",,,,Não aplicável.,Não aplicável.,FALSE
"Prestação de Serviços Médicos na Especialidade de Gastroenterologia na ULSNA, EPE (Ano 2015)",Ajuste Direto Regime Geral,Aquisição de serviços,"85100000-0, Serviços de saúde","Unidade Local de Saúde do Norte Alentejano, E. P. E. (508094461)","Clinalbi - Clinica de Gastroenterologia Albicastrense, Lda. (508272912)","92.342,42 €",19-02-2015,29-12-2014,365 dias,"Portugal, Portalegre, Portalegre","Artigo 27.º, n.º 1, alínea a) do Código dos Contratos Públicos",19-02-2015,"92.342,42 €",,,,Não aplicável.,Não aplicável.,FALSE
"Prestação de Serviços Médicos, na Especialidade de Gastroenterologia, na ULSNA, EPE (ano de 2014",Ajuste Direto Regime Geral,Aquisição de serviços,"85100000-0, Serviços de saúde","Unidade Local de Saúde do Norte Alentejano, E. P. E. (508094461)","Clinalbi - Clínica de Gastrenterologia Albicastrense, Lda (508272912)","80.411,03 €",17-02-2014,16-01-2014,365 dias,"Portugal, Portalegre, Portalegre","Artigo 24.º, n.º 1, alínea c) do Código dos Contratos Públicos",16-01-2014,"80.411,03 €",,,,Não aplicável.,Não aplicável.,FALSE
"Prestação de Serviços de Médicos, na Especialidade de Gastroenterologia, na ULSNA, EPE",Ajuste Direto Regime Geral,Aquisição de serviços,"85100000-0, Serviços de saúde","Unidade Local de Saúde do Norte Alentejano, E.P.E. (508094461)","Clinalbi - Clinica de Gastroenterologia Albicastrense, Lda. (508272912)","64.238,36 €",21-11-2012,16-11-2012,275 dias,"Portugal, Portalegre, Portalegre","Artigo 20.º, n.º 1, alínea a) do Código dos Contratos Públicos",31-12-2012,"64.238,36 €",,,,Não aplicável.,Não aplicável.,
