freguesia,acronym,validVotesPercentage,votes,dicofre
Beato,PS,39.22,1757,110607
Beato,PPD/PSD.CDS-PP,19.69,882,110607
Beato,PCP-PEV,18.28,819,110607
Beato,MPT,6.09,273,110607
Beato,B.E.,5.94,266,110607
Beato,L,3.46,155,110607
Beato,PAN,2.14,96,110607
Beato,PCTP/MRPP,1.81,81,110607
Beato,PNR,0.67,30,110607
Beato,PND,0.58,26,110607
Beato,PTP,0.58,26,110607
Beato,PPM,0.54,24,110607
Beato,PPV,0.42,19,110607
Beato,PDA,0.25,11,110607
Beato,MAS,0.2,9,110607
Beato,POUS,0.13,6,110607
