Objeto do Contrato,Tipo de Procedimento,Tipo(s) de Contrato,CPVs,Entidade(s) Adjudicante(s),Entidade(s) Adjudicatária(s),Preço Contratual,Data de Publicação,Data de Celebração do Contrato,Prazo de Execução,Local de Execução,Fundamentação,Data de Fecho do Contrato,Preço Total Efetivo,Causas das Alterações ao Prazo,Causas das Alterações ao Preço,Estado,N.º registo do Acordo Quadro,Descrição do Acordo Quadro,Procedimento Centralizado
AQUISICAO DE REAGENTES,Ajuste Direto Regime Geral,Aquisição de bens móveis,"33696500-0, Reagentes de laboratório",Centro Hospitalar Psiquiatrico de Lisboa (508338476),HORIBA (980158583),"5.059,00 €",10-01-2013,20-12-2012,0 dias,"Portugal, Lisboa, Lisboa","Artigo 24.º, n.º 1, alínea e) do Código dos Contratos Públicos",20-12-2012,"5.059,00 €",,,,Não aplicável.,Não aplicável.,
"ACIDO VALPROICO 250MG, GRAN. LM SAQUETAS",Ajuste Direto Regime Geral,Aquisição de bens móveis,"33600000-6, Produtos farmacêuticos",Centro Hospitalar Psiquiatrico de Lisboa (508338476),SANOFI-PRODUTOS FARMACEUTICOS (500134960),"87,98 €",10-01-2013,20-12-2012,0 dias,"Portugal, Lisboa, Lisboa","Artigo 24.º, n.º 1, alínea e) do Código dos Contratos Públicos",20-12-2012,"87,98 €",,,,Não aplicável.,Não aplicável.,
AQUISICAO DE REAGENTES,Ajuste Direto Regime Geral,Aquisição de bens móveis,"33696500-0, Reagentes de laboratório",Centro Hospitalar Psiquiatrico de Lisboa (508338476),BIOMERIEUX (501524177),"9.783,60 €",10-01-2013,28-12-2012,0 dias,"Portugal, Lisboa, Lisboa","Artigo 24.º, n.º 1, alínea e) do Código dos Contratos Públicos",31-12-2012,"9.783,60 €",,,,Não aplicável.,Não aplicável.,
Aquisição de Medicamentos,Ajuste Direto Regime Geral,Aquisição de bens móveis,"33600000-6, Produtos farmacêuticos",Centro Hospitalar Psiquiatrico de Lisboa (508338476),Norgine Portugal (508676746),"306,00 €",08-01-2013,28-12-2011,0 dias,"Portugal, Lisboa, Lisboa","Artigo 24.º, n.º 1, alínea e) do Código dos Contratos Públicos",31-12-2012,"306,00 €",,,,Não aplicável.,Não aplicável.,
AQUISICAO DE REAGENTES,Ajuste Direto Regime Geral,Aquisição de bens móveis,"33696500-0, Reagentes de laboratório",Centro Hospitalar Psiquiatrico de Lisboa (508338476),HORIBA (980158583),"2.386,68 €",07-01-2013,14-12-2012,0 dias,"Portugal, Lisboa, Lisboa","Artigo 24.º, n.º 1, alínea e) do Código dos Contratos Públicos",14-12-2012,"2.386,68 €",,,,Não aplicável.,Não aplicável.,
AQUISICAO DE REAGENTES,Ajuste Direto Regime Geral,Aquisição de bens móveis,"33696500-0, Reagentes de laboratório",Centro Hospitalar Psiquiatrico de Lisboa (508338476),HORIBA (980158583),"562,53 €",07-01-2013,18-12-2012,0 dias,"Portugal, Lisboa, Lisboa","Artigo 24.º, n.º 1, alínea e) do Código dos Contratos Públicos",18-12-2012,"562,53 €",,,,Não aplicável.,Não aplicável.,
AQUISICAO DE MEDICAMENTOS,Ajuste Direto Regime Geral,Aquisição de bens móveis,"33600000-6, Produtos farmacêuticos",Centro Hospitalar Psiquiatrico de Lisboa (508338476),LILLY PORTUGAL (500165602),"2.353,20 €",07-01-2013,18-12-2012,6 dias,"Portugal, Lisboa, Lisboa","Artigo 24.º, n.º 1, alínea e) do Código dos Contratos Públicos",18-12-2012,"2.353,20 €",,,,Não aplicável.,Não aplicável.,
AQUISICAO DE REAGENTES,Ajuste Direto Regime Geral,Aquisição de bens móveis,"33696500-0, Reagentes de laboratório",Centro Hospitalar Psiquiatrico de Lisboa (508338476),BIOMERIEUX (501524177),"5.073,94 €",07-01-2013,18-12-2012,0 dias,"Portugal, Lisboa, Lisboa","Artigo 24.º, n.º 2, alínea b) do Código dos Contratos Públicos",18-12-2012,"5.073,94 €",,,,Não aplicável.,Não aplicável.,
AQUISICAO DE MEDICAMENTOS,Ajuste Direto Regime Geral,Aquisição de bens móveis,"33690000-3, Medicamentos vários",Centro Hospitalar Psiquiatrico de Lisboa (508338476),DESMA (980300649),"1.087,20 €",07-01-2013,18-12-2012,6 dias,"Portugal, Lisboa, Lisboa","Artigo 24.º, n.º 1, alínea e) do Código dos Contratos Públicos",18-12-2012,"1.087,20 €",,,,Não aplicável.,Não aplicável.,
AQUISICAO DE MEDICAMENTOS,Ajuste Direto Regime Geral,Aquisição de bens móveis,"33600000-6, Produtos farmacêuticos",Centro Hospitalar Psiquiatrico de Lisboa (508338476),GILEAD (503604704),"1.049,90 €",07-01-2013,18-12-2012,7 dias,"Portugal, Lisboa, Lisboa","Artigo 24.º, n.º 1, alínea e) do Código dos Contratos Públicos",18-12-2012,"1.049,90 €",,,,Não aplicável.,Não aplicável.,
AQUISICAO DE MEDICAMENTOS,Ajuste Direto Regime Geral,Aquisição de bens móveis,"33690000-3, Medicamentos vários",Centro Hospitalar Psiquiatrico de Lisboa (508338476),LABORATORIOS PFIZER (500162166),"2.259,60 €",07-01-2013,18-12-2012,7 dias,"Portugal, Lisboa, Lisboa","Artigo 24.º, n.º 1, alínea e) do Código dos Contratos Públicos",18-12-2012,"2.259,60 €",,,,Não aplicável.,Não aplicável.,
