Objeto do Contrato,Tipo de Procedimento,Tipo(s) de Contrato,CPVs,Entidade(s) Adjudicante(s),Entidade(s) Adjudicatária(s),Preço Contratual,Data de Publicação,Data de Celebração do Contrato,Prazo de Execução,Local de Execução,Fundamentação,Data de Fecho do Contrato,Preço Total Efetivo,Causas das Alterações ao Prazo,Causas das Alterações ao Preço,Estado,N.º registo do Acordo Quadro,Descrição do Acordo Quadro,Procedimento Centralizado
"Renovação do contrato de aquisição de licenciamento e assistência técnica à plataforma que suporta a solução de email, webmail e de virtualização de postos de trabalho existente no CHSJ, EPE,para o ano de 2017",Ajuste Direto Regime Geral,Aquisição de serviços,"50000000-5, Serviços de reparação e manutenção","Centro Hospitalar de São João, E. P. E. (509821197)",IPBrick International (504837958),"9.228,00 €",30-01-2017,30-01-2017,365 dias,"Portugal, Porto, Porto","Artigo 20.º, n.º 1, alínea a) do Código dos Contratos Públicos",,,,,,Não aplicável.,Não aplicável.,FALSE
"Contrato de Manutenção, Licenciamento, Atualização e Assistência Técnica do Software LANTIS existente no CHSJ, EPE, para o ano de 2017",Ajuste Direto Regime Geral,Aquisição de serviços,"50000000-5, Serviços de reparação e manutenção","Centro Hospitalar de São João, E. P. E. (509821197)","Siemens Healthcare, Lda (507925173)","4.000,00 €",30-01-2017,30-01-2017,365 dias,"Portugal, Porto, Porto","Artigo 24.º, n.º 1, alínea e) do Código dos Contratos Públicos",,,,,,Não aplicável.,Não aplicável.,FALSE
"Aquisição de Sonda Ecográfica Laparoscópica para Cirurgia Geral do CHSJ, EPE",Ajuste Direto Regime Geral,Aquisição de bens móveis,"33112000-8, Equipamento de imagiologia por ecos, ultra-sons e doppler","Centro Hospitalar de São João, E. P. E. (509821197)","Siemens Healthcare, Lda. (507925173)","18.000,00 €",27-01-2017,03-01-2017,30 dias,"Portugal, Porto, Porto","Artigo 24.º, n.º 1, alínea e) do Código dos Contratos Públicos",,,,,,Não aplicável.,Não aplicável.,FALSE
Aquisição de serviços de desenvolvimento de software,Ajuste Direto Regime Geral,Aquisição de serviços,"72000000-5, Serviços de TI: consultoria, desenvolvimento de software, Internet e apoio","Centro Hospitalar de São João, E. P. E. (509821197)","Glintt - HealthCare Solutions, S.A.,  (502479418)","36.200,00 €",27-01-2017,30-12-2016,365 dias,"Portugal, Porto, Porto","Artigo 24.º, n.º 1, alínea e) do Código dos Contratos Públicos",,,,,,Não aplicável.,Não aplicável.,FALSE
"Renovação do Contrato de Manutenção e Assistência Técnica ao Software SINGAP e Plataforma de Balcão Único, existentes no CHSJ E.P.E.,para o ano de 2017",Ajuste Direto Regime Geral,Aquisição de serviços,"50000000-5, Serviços de reparação e manutenção","Centro Hospitalar de São João, E. P. E. (509821197)","QUIDGEST - Consultores de Gestão, S.A. (501989978)","17.500,00 €",27-01-2017,18-01-2017,365 dias,"Portugal, Porto, Porto","Artigo 24.º, n.º 1, alínea e) do Código dos Contratos Públicos",,,,,,Não aplicável.,Não aplicável.,FALSE
"Renovação do Contrato de manutenção e assistência técnica aos Dispensadores Automáticos de Medicamentos PYXIS, existentes no CHSJ,EPE, para o ano 2017",Ajuste Direto Regime Geral,Aquisição de serviços,"50000000-5, Serviços de reparação e manutenção","Centro Hospitalar de São João, E. P. E. (509821197)","GRIFOLS PORTUGAL,LDA. (502041285)","25.307,55 €",27-01-2017,18-01-2017,365 dias,"Portugal, Porto, Porto","Artigo 24.º, n.º 1, alínea e) do Código dos Contratos Públicos",,,,,,Não aplicável.,Não aplicável.,FALSE
"Renovação do Contrato de Manutenção e Assistência Técnica aos equipamentos ABBOTT, instalados no CHSJ,EPE, para o ano 2017",Ajuste Direto Regime Geral,Aquisição de serviços,"50000000-5, Serviços de reparação e manutenção","Centro Hospitalar de São João, E. P. E. (509821197)","ABBOTT LABORATORIOS, LDA (500006148)","85.968,00 €",27-01-2017,11-01-2017,365 dias,"Portugal, Porto, Porto","Artigo 24.º, n.º 1, alínea e) do Código dos Contratos Públicos",,,,,,Não aplicável.,Não aplicável.,FALSE
"Renovação do Contrato de Manutenção ao Acelerador Clinac 600 instalado no Serviço de Radioterapia do CHSJ,EPE, para o ano de 2017",Ajuste Direto Regime Geral,Aquisição de serviços,"50000000-5, Serviços de reparação e manutenção","Centro Hospitalar de São João, E. P. E. (509821197)","VARIAN IBERICA, S.L. (980236436)","50.523,80 €",27-01-2017,12-01-2017,270 dias,"Portugal, Porto, Porto","Artigo 24.º, n.º 1, alínea e) do Código dos Contratos Públicos",,,,,,Não aplicável.,Não aplicável.,FALSE
Aquisição de Serviços de Aluguer de Equipamentos de Tosse Assistida (Cough-Assist) para Diversos Serviços,Ajuste Direto Regime Geral,Locação de bens móveis,"33157000-5, Aparelhos para assistência respiratória e oxigenoterapia","Centro Hospitalar de São João, E. P. E. (509821197)","LINDE SAÚDE, LDA. (500125546)","7.960,50 €",25-01-2017,24-08-2016,90 dias,"Portugal, Porto, Porto","Artigo 20.º, n.º 1, alínea a) do Código dos Contratos Públicos",,,,,,Não aplicável.,Não aplicável.,FALSE
Aquisição de serviços de auditoria energética e emissão de certificado energético,Ajuste Direto Regime Geral,Aquisição de serviços,"90700000-4, Serviços ambientais","Centro Hospitalar de São João, E. P. E. (509821197)","Cruzesboço, Unipessoal, Lda. (508710600)","28.000,00 €",24-01-2017,21-12-2016,90 dias,"Portugal, Porto, Porto","Artigo 20.º, n.º 1, alínea a) do Código dos Contratos Públicos",,,,,,Não aplicável.,Não aplicável.,FALSE
Aquisição de serviços jurídicos para o ano 2016,Ajuste Direto Regime Geral,Aquisição de serviços,"79000000-4, Serviços a empresas: direito, comercialização, consultoria, recrutamento, impressão e segurança","Centro Hospitalar de São João, E. P. E. (509821197)","Cuatrecasas, Gonçalves Pereira & Associados, Sociedade de Advogados, R.L. (502101210)","36.000,00 €",24-01-2017,08-11-2016,90 dias,"Portugal, Porto, Porto","Artigo 20.º, n.º 1, alínea a) do Código dos Contratos Públicos",,,,,,Não aplicável.,Não aplicável.,FALSE
"Renovação do Contrato de Manutenção para os Equipamentos marca “Sterrad” instalados no CHSJ, EPE., para o ano de 2017",Ajuste Direto Regime Geral,Aquisição de serviços,"50000000-5, Serviços de reparação e manutenção","Centro Hospitalar de São João, E. P. E. (509821197)","Johnson & Johnson, Lda. (500153370)","15.768,00 €",23-01-2017,18-01-2017,365 dias,"Portugal, Porto, Porto","Artigo 24.º, n.º 1, alínea e) do Código dos Contratos Públicos",,,,,,Não aplicável.,Não aplicável.,FALSE
"Renovação do Contrato de Serviços de Manutenção do Hardware e Software da Infraestrutura instalada no DataCenter do CHSJ, EPE., para o ano 2017",Ajuste Direto Regime Geral,Aquisição de serviços,"50000000-5, Serviços de reparação e manutenção","Centro Hospitalar de São João, E. P. E. (509821197)","Hewlett-Packard Portugal, Lda (502407697)","194.647,08 €",23-01-2017,12-01-2017,365 dias,"Portugal, Porto, Porto","Artigo 20.º, n.º 1, alínea a) do Código dos Contratos Públicos",,,,,,Não aplicável.,Não aplicável.,FALSE
