Objeto do Contrato,Tipo de Procedimento,Tipo(s) de Contrato,CPVs,Entidade(s) Adjudicante(s),Entidade(s) Adjudicatária(s),Preço Contratual,Data de Publicação,Data de Celebração do Contrato,Prazo de Execução,Local de Execução,Fundamentação,Data de Fecho do Contrato,Preço Total Efetivo,Causas das Alterações ao Prazo,Causas das Alterações ao Preço,Estado,N.º registo do Acordo Quadro,Descrição do Acordo Quadro,Procedimento Centralizado
Prestação de Serviços de Enfermagem,Ajuste Direto Regime Geral,Aquisição de serviços,"85141200-1, Serviços prestados pelo pessoal de enfermagem",Centro de Medicina de Reabilitação da Região Centro - Rovisco Pais (503767336),Iberico Ferreira Saude (505646200),"48.374,97 €",11-08-2011,10-05-2011,90 dias,"Portugal, Coimbra, Cantanhede","Artigo 26.º, n.º 1, alínea a) do Código dos Contratos Públicos",,,,,,Não aplicável.,Não aplicável.,
Prest Serv Assistente Social,Ajuste Direto Regime Geral,Aquisição de serviços,"85310000-5, Serviços de acção social",Centro de Medicina de Reabilitação da Região Centro - Rovisco Pais (503767336),Analise Revista (509094848),"1.975,40 €",11-08-2011,10-05-2011,30 dias,"Portugal, Coimbra, Cantanhede","Artigo 26.º, n.º 1, alínea a) do Código dos Contratos Públicos",,,,,,Não aplicável.,Não aplicável.,
Prest Serviços de Fisoterapia,Ajuste Direto Regime Geral,Aquisição de serviços,"85142100-7, Serviços de fisioterapia",Centro de Medicina de Reabilitação da Região Centro - Rovisco Pais (503767336),Iberico Ferreira Saude (505646200),"2.795,00 €",11-08-2011,10-05-2011,30 dias,"Portugal, Coimbra, Cantanhede","Artigo 26.º, n.º 1, alínea a) do Código dos Contratos Públicos",,,,,,Não aplicável.,Não aplicável.,
Prestaçao de serviços de 1 Farmaceutico,Ajuste Direto Regime Geral,Aquisição de serviços,"85149000-5, Serviços farmacêuticos",Centro de Medicina de Reabilitação da Região Centro - Rovisco Pais (503767336),Iberico Ferreira Saude (505646200),"6.705,91 €",11-08-2011,10-05-2011,90 dias,"Portugal, Coimbra, Cantanhede","Artigo 26.º, n.º 1, alínea a) do Código dos Contratos Públicos",,,,,,Não aplicável.,Não aplicável.,
Prestação de Serviços de 1 Assistente Social,Ajuste Direto Regime Geral,Aquisição de serviços,"85310000-5, Serviços de acção social",Centro de Medicina de Reabilitação da Região Centro - Rovisco Pais (503767336),Analise Revista - Gestão na àrea da Saude (509094848),"5.926,20 €",11-08-2011,10-05-2011,90 dias,"Portugal, Coimbra, Cantanhede","Artigo 26.º, n.º 1, alínea a) do Código dos Contratos Públicos",,,,,,Não aplicável.,Não aplicável.,
Prestação de Serviços de 2 Fisioterapeutas,Ajuste Direto Regime Geral,Aquisição de serviços,"85142100-7, Serviços de fisioterapia",Centro de Medicina de Reabilitação da Região Centro - Rovisco Pais (503767336),Iberico Ferreira Saude (505646200),"6.987,50 €",11-08-2011,10-05-2011,90 dias,"Portugal, Coimbra, Cantanhede","Artigo 26.º, n.º 1, alínea a) do Código dos Contratos Públicos",,,,,,Não aplicável.,Não aplicável.,
Prestação de Serviços de 11 Enfermeiros,Ajuste Direto Regime Geral,Aquisição de serviços,"85141200-1, Serviços prestados pelo pessoal de enfermagem",Centro de Medicina de Reabilitação da Região Centro - Rovisco Pais (503767336),Iberici Ferreira Saude (505646200),"14.028,78 €",11-08-2011,10-05-2011,90 dias,"Portugal, Coimbra, Cantanhede","Artigo 26.º, n.º 1, alínea a) do Código dos Contratos Públicos",,,,,,Não aplicável.,Não aplicável.,
Prestação de Serviços de 13 Assistentes Operacionais,Ajuste Direto Regime Geral,Aquisição de serviços,"85112000-7, Serviços de assistência hospitalar",Centro de Medicina de Reabilitação da Região Centro - Rovisco Pais (503767336),Iberico Ferreira Saude (505646200),"31.328,61 €",11-08-2011,10-05-2011,90 dias,"Portugal, Coimbra, Cantanhede","Artigo 26.º, n.º 1, alínea a) do Código dos Contratos Públicos",,,,,,Não aplicável.,Não aplicável.,
