freguesia,acronym,validVotesPercentage,votes,dicofre
Alvorninha,PPD/PSD,41.72,335,100602
Alvorninha,PS,30.88,248,100602
Alvorninha,B.E.,6.48,52,100602
Alvorninha,CDS-PP,6.1,49,100602
Alvorninha,PAN,3.74,30,100602
Alvorninha,A,2.37,19,100602
Alvorninha,PCP-PEV,2.12,17,100602
Alvorninha,L,1.62,13,100602
Alvorninha,PPM.PPV/CDC,1.25,10,100602
Alvorninha,PDR,0.75,6,100602
Alvorninha,IL,0.62,5,100602
Alvorninha,PURP,0.62,5,100602
Alvorninha,PNR,0.5,4,100602
Alvorninha,NC,0.37,3,100602
Alvorninha,PCTP/MRPP,0.37,3,100602
Alvorninha,PTP,0.37,3,100602
Alvorninha,MAS,0.12,1,100602
