freguesia,acronym,validVotesPercentage,votes,dicofre
Carnide,PS,31.85,2351,110611
Carnide,PPD/PSD,18.6,1373,110611
Carnide,B.E.,10.28,759,110611
Carnide,PCP-PEV,9.41,695,110611
Carnide,CDS-PP,8.75,646,110611
Carnide,PAN,6.23,460,110611
Carnide,L,4.19,309,110611
Carnide,A,3.51,259,110611
Carnide,IL,1.73,128,110611
Carnide,PPM.PPV/CDC,1.68,124,110611
Carnide,NC,1.3,96,110611
Carnide,PCTP/MRPP,0.93,69,110611
Carnide,PNR,0.46,34,110611
Carnide,PURP,0.37,27,110611
Carnide,PDR,0.3,22,110611
Carnide,MAS,0.22,16,110611
Carnide,PTP,0.19,14,110611
