Objeto do Contrato,Tipo de Procedimento,Tipo(s) de Contrato,CPVs,Entidade(s) Adjudicante(s),Entidade(s) Adjudicatária(s),Preço Contratual,Data de Publicação,Data de Celebração do Contrato,Prazo de Execução,Local de Execução,Fundamentação,Data de Fecho do Contrato,Preço Total Efetivo,Causas das Alterações ao Prazo,Causas das Alterações ao Preço,Estado,N.º registo do Acordo Quadro,Descrição do Acordo Quadro,Procedimento Centralizado
Aquisição de Solução Antivírus para a ULSG,Ajuste Direto Regime Geral,Aquisição de bens móveis,"48761000-0, Pacote de software antivírus","Unidade Local de Saúde da Guarda, E. P. E. (508752000)",ORBCOM - Equipamentos e Serviços de Informática Lda. (506172813),"19.900,25 €",10-11-2016,19-08-2016,30 dias,"Portugal, Guarda, Guarda","Artigo 20.º, n.º 1, alínea a) do Código dos Contratos Públicos",,,,,,Não aplicável.,Não aplicável.,FALSE
Renovação do Contrato de Aluguer do Equipamento ‘Elisa’ (Sistema Triturus) para o Laboratório de Patologia Clínica,Ajuste Direto Regime Geral,Aquisição de serviços,"98300000-6, Serviços diversos","UNIDADE LOCAL DE SAÚDE DA GUARDA, E.P.E (508752000)",Grifols (502041285),"6.000,00 €",10-11-2016,23-06-2016,365 dias,"Portugal, Guarda, Guarda","Artigo 20.º, n.º 1, alínea a) do Código dos Contratos Públicos",,,,,,Não aplicável.,Não aplicável.,FALSE
Transferência e Montagem de Depósitos de Águas Quentes Sanitárias do HSM,Ajuste Direto Regime Geral,Aquisição de serviços,"51800000-0, Serviços de instalação de recipientes de metal","Unidade Local de Saúde da Guarda, E.P.E (508752000)","Norinstelnor – Instalações Especiais, S.A. (503433888)","6.380,00 €",10-11-2016,28-04-2016,30 dias,"Portugal, Guarda, Guarda","Artigo 20.º, n.º 1, alínea a) do Código dos Contratos Públicos",,,,,,Não aplicável.,Não aplicável.,FALSE
"Aquisição de 50 Licenças do Sistema Syngo.Plaza para ULS Guarda, E.P.E",Ajuste Direto Regime Geral,Aquisição de bens móveis,"33197000-7, Equipamento informático para fins médicos","UNIDADE LOCAL DE SAÚDE DA GUARDA, E.P.E (508752000)","Siemens Healthcare, Lda (507925173)","13.990,00 €",10-11-2016,30-05-2016,30 dias,"Portugal, Guarda, Guarda","Artigo 20.º, n.º 1, alínea a) do Código dos Contratos Públicos",,,,,,Não aplicável.,Não aplicável.,FALSE
Aquisição de 2 Detetores de Imagem para RX da Urgência do HSM,Ajuste Direto Regime Geral,Aquisição de bens móveis,"33111000-1, Aparelhos para radiologia","UNIDADE LOCAL DE SAÚDE DA GUARDA, E.P.E (508752000)",Fujifilm Europe GMBH - Portugal (980456517),"60.394,00 €",10-11-2016,24-05-2016,30 dias,"Portugal, Guarda, Guarda","Artigo 20.º, n.º 1, alínea a) do Código dos Contratos Públicos",,,,,,Não aplicável.,Não aplicável.,FALSE
Aquisição de Câmara de Fluxo Laminar,Ajuste Direto Regime Geral,Aquisição de bens móveis,"33100000-1, Equipamento médico","Unidade Local de Saúde da Guarda, E. P. E. (508752000)","Frilabo II, Lda (507958861)","13.387,50 €",10-11-2016,19-04-2016,30 dias,"Portugal, Guarda, Guarda","Artigo 20.º, n.º 1, alínea a) do Código dos Contratos Públicos",,,,,,Não aplicável.,Não aplicável.,FALSE
Aquisição de Mesas-de-cabeceira para Unidade de Oncologia do HSM,Ajuste Direto Regime Geral,Aquisição de bens móveis,"39143123-4, Mesas de cabeceira","Unidade Local de Saúde da Guarda, E. P. E. (508752000)",MUNDINTER (500199906),"5.670,72 €",10-11-2016,21-03-2016,10 dias,"Portugal, Guarda, Guarda","Artigo 20.º, n.º 1, alínea a) do Código dos Contratos Públicos",,,,,,Não aplicável.,Não aplicável.,FALSE
Aquisição de 6 Cadeirões Elétricos reclináveis para Serviço de Cirurgia de Ambulatório do HSM,Ajuste Direto Regime Geral,Aquisição de bens móveis,"33192000-2, Mobiliário para fins médicos","Unidade Local de Saúde da Guarda, E. P. E. (508752000)","EPJMÉDICA - Artigos Médicos e Hospitalares, Lda.  (506820513)","10.704,00 €",10-11-2016,20-07-2016,30 dias,"Portugal, Guarda, Guarda","Artigo 20.º, n.º 1, alínea a) do Código dos Contratos Públicos",,,,,,Não aplicável.,Não aplicável.,FALSE
Aquisição de Serviços de Assessoria Jurídica 2015,Ajuste Direto Regime Geral,Aquisição de serviços,"79100000-5, Serviços jurídicos","Unidade Local de Saúde da Guarda, E. P. E. (508752000)",Ana Graciela Moura Amaro (239838076),"7.208,88 €",10-11-2016,23-07-2015,240 dias,"Portugal, Guarda, Guarda","Artigo 20.º, n.º 1, alínea a) do Código dos Contratos Públicos",,,,,,Não aplicável.,Não aplicável.,FALSE
Aquisição de 2 Carros Unidose para o Serviço de Cirurgia do HSM,Ajuste Direto Regime Geral,Aquisição de bens móveis,"33192000-2, Mobiliário para fins médicos","UNIDADE LOCAL DE SAÚDE DA GUARDA, E.P.E (508752000)","PARAMÉDICA – Equipamentos Médicos, Lda.  (501393005)","12.040,00 €",10-11-2016,20-07-2016,30 dias,"Portugal, Guarda, Guarda","Artigo 20.º, n.º 1, alínea a) do Código dos Contratos Públicos",,,,,,Não aplicável.,Não aplicável.,FALSE
Locação Financeira de duas viaturas automóveis para a ULSG - 2016,Ajuste Direto Regime Geral,Aquisição de serviços,"66114000-2, Serviços de leasing financeiro","Unidade Local de Saúde da Guarda, E. P. E. (508752000)",Banco Santander Totta SA  (500844321),"25.011,75 €",09-11-2016,22-08-2016,1440 dias,"Portugal, Guarda, Guarda","Artigo 20.º, n.º 1, alínea a) do Código dos Contratos Públicos",,,,,,Não aplicável.,Não aplicável.,FALSE
Aquisição de Serviços de Alimentação para o ano de 2015,Ajuste Direto Regime Geral,Aquisição de serviços,"55520000-1, Serviços de fornecimento de refeições (catering)","Unidade Local de Saúde da Guarda, E. P. E. (508752000)","SOLNAVE - RESTAURANTES E ALIMENTAÇÃO, S.A.,  (500272328)","695.070,60 €",09-11-2016,24-02-2015,365 dias,"Portugal, Guarda, Guarda","Artigo 20.º, n.º 1, alínea a) do Código dos Contratos Públicos",,,,,,Não aplicável.,Não aplicável.,FALSE
Prestação de Serviços de Lavandaria para a ULSG durante o ano 2015,Ajuste Direto Regime Geral,Aquisição de serviços,"98311000-6, Serviços de recolha de roupa por lavandarias","Unidade Local de Saúde da Guarda, E. P. E. (508752000)",SERVIÇO DE UTILIZAÇÃO COMUM DOS HOSPITAIS (S.U.C.H.) (500900469),"67.059,60 €",09-11-2016,09-04-2015,365 dias,"Portugal, Guarda, Seia","Artigo 20.º, n.º 1, alínea a) do Código dos Contratos Públicos",,,,,,Não aplicável.,Não aplicável.,FALSE
Prestação de Serviços de Lavandaria para a ULSG durante o ano 2015,Ajuste Direto Regime Geral,Aquisição de serviços,"98311000-6, Serviços de recolha de roupa por lavandarias","Unidade Local de Saúde da Guarda, E. P. E. (508752000)","LIN - LAVANDARIA INDUSTRIAL, LDA (503240435)","313.470,00 €",09-11-2016,09-04-2015,365 dias,"Portugal, Guarda, Guarda","Artigo 20.º, n.º 1, alínea a) do Código dos Contratos Públicos",,,,,,Não aplicável.,Não aplicável.,FALSE
Aquisição de Consultoria e Apoio de Sistemas Informáticos SIDC e RHV durante o ano de 2015,Ajuste Direto Regime Geral,Aquisição de serviços,"72220000-3, Serviços de consultoria técnica e em matéria de sistemas","Unidade Local de Saúde da Guarda, E. P. E. (508752000)",Antonio Silva Pires LDa (507041674),"8.780,48 €",08-11-2016,26-03-2015,280 dias,"Portugal, Guarda, Guarda","Artigo 20.º, n.º 1, alínea a) do Código dos Contratos Públicos",,,,,,Não aplicável.,Não aplicável.,FALSE
AQUISIÇÃO DE SERVIÇOS PARA ANÁLISE DO REEQUÍLIBRIO FINANCEIRO APRESENTADO PELO ACE CONSTRUTOR NO ÂMBITO DA EMPREITADA DE CONSTRUÇÃO DO NOVO EDIFÍCIO DO HOSPITAL SOUSA MARTINS,Ajuste Direto Regime Geral,Aquisição de serviços,"79200000-6, Serviços de contabilidade, de auditoria e fiscais","Unidade Local de Saúde da Guarda, E. P. E. (508752000)","Luis Monsanto, Unipessoal Lda (505841126)","48.720,00 €",08-11-2016,23-09-2014,50 dias,"Portugal, Guarda, Guarda","Artigo 20.º, n.º 1, alínea a) do Código dos Contratos Públicos",,,,,,Não aplicável.,Não aplicável.,FALSE
Aquisição de Serviços para análise de erros e omissões de arquitetura,Ajuste Direto Regime Geral,Aquisição de serviços,"71210000-3, Serviços de assessoria em matéria de arquitectura","Unidade Local de Saúde da Guarda, E. P. E. (508752000)","Luis Monsanto, Unipessoal Lda (505841126)","13.000,00 €",08-11-2016,23-09-2014,60 dias,"Portugal, Guarda, Guarda","Artigo 20.º, n.º 1, alínea a) do Código dos Contratos Públicos",,,,,,Não aplicável.,Não aplicável.,FALSE
Aquisição de Serviços para elaboração de análise de custo-benefício e respetivo estudo de viabilidade económica e financeira do projeto Ampliação do HSM,Ajuste Direto Regime Geral,Aquisição de serviços,"66171000-9, Serviços de consultoria financeira","Unidade Local de Saúde da Guarda, E. P. E. (508752000)","IUL GLOBAL – SOCIEDADE UNIPESSOAL, LDA (509863477)","74.500,00 €",08-11-2016,07-05-2015,45 dias,"Portugal, Guarda, Guarda","Artigo 20.º, n.º 1, alínea a) do Código dos Contratos Públicos",,,,,,Não aplicável.,Não aplicável.,FALSE
Aquisição de serviços para elaboração de projeto de Instalações Técnicas Especiais do Edifício 5 do HSM,Ajuste Direto Regime Geral,Aquisição de serviços,"71200000-0, Serviços de arquitectura e afins","UNIDADE LOCAL DE SAÚDE DA GUARDA, E.P.E (508752000)",João Madalena Lda (507206045),"56.721,00 €",02-11-2016,02-11-2016,30 dias,"Portugal, Guarda, Guarda","Artigo 20.º, n.º 1, alínea a) do Código dos Contratos Públicos",,,,,,Não aplicável.,Não aplicável.,FALSE
