freguesia,acronym,validVotesPercentage,votes,dicofre
Numão,PS,51.82,57,091411
Numão,PPD/PSD.CDS-PP,38.18,42,091411
Numão,MPT,4.55,5,091411
Numão,PCTP/MRPP,1.82,2,091411
Numão,PND,1.82,2,091411
Numão,B.E.,0.91,1,091411
Numão,POUS,0.91,1,091411
Numão,L,0,0,091411
Numão,MAS,0,0,091411
Numão,PAN,0,0,091411
Numão,PCP-PEV,0,0,091411
Numão,PDA,0,0,091411
Numão,PNR,0,0,091411
Numão,PPM,0,0,091411
Numão,PPV,0,0,091411
Numão,PTP,0,0,091411
