freguesia,acronym,validVotesPercentage,votes,dicofre
União das freguesias de Ruivães e Campos,PPD/PSD.CDS-PP,48.98,192,031125
União das freguesias de Ruivães e Campos,PS,39.29,154,031125
União das freguesias de Ruivães e Campos,PCP-PEV,2.55,10,031125
União das freguesias de Ruivães e Campos,MPT,2.3,9,031125
União das freguesias de Ruivães e Campos,PCTP/MRPP,1.79,7,031125
União das freguesias de Ruivães e Campos,B.E.,1.53,6,031125
União das freguesias de Ruivães e Campos,PTP,1.53,6,031125
União das freguesias de Ruivães e Campos,PND,0.77,3,031125
União das freguesias de Ruivães e Campos,L,0.26,1,031125
União das freguesias de Ruivães e Campos,MAS,0.26,1,031125
União das freguesias de Ruivães e Campos,PAN,0.26,1,031125
União das freguesias de Ruivães e Campos,PPM,0.26,1,031125
União das freguesias de Ruivães e Campos,PPV,0.26,1,031125
União das freguesias de Ruivães e Campos,PDA,0,0,031125
União das freguesias de Ruivães e Campos,PNR,0,0,031125
União das freguesias de Ruivães e Campos,POUS,0,0,031125
