freguesia,acronym,validVotesPercentage,votes,dicofre
Aldeia Viçosa,PS,41.61,62,090704
Aldeia Viçosa,PPD/PSD.CDS-PP,34.9,52,090704
Aldeia Viçosa,MPT,8.72,13,090704
Aldeia Viçosa,PCP-PEV,8.72,13,090704
Aldeia Viçosa,PAN,2.01,3,090704
Aldeia Viçosa,B.E.,1.34,2,090704
Aldeia Viçosa,PCTP/MRPP,1.34,2,090704
Aldeia Viçosa,MAS,0.67,1,090704
Aldeia Viçosa,PND,0.67,1,090704
Aldeia Viçosa,L,0,0,090704
Aldeia Viçosa,PDA,0,0,090704
Aldeia Viçosa,PNR,0,0,090704
Aldeia Viçosa,POUS,0,0,090704
Aldeia Viçosa,PPM,0,0,090704
Aldeia Viçosa,PPV,0,0,090704
Aldeia Viçosa,PTP,0,0,090704
