Objeto do Contrato,Tipo de Procedimento,Tipo(s) de Contrato,CPVs,Entidade(s) Adjudicante(s),Entidade(s) Adjudicatária(s),Preço Contratual,Data de Publicação,Data de Celebração do Contrato,Prazo de Execução,Local de Execução,Fundamentação,Data de Fecho do Contrato,Preço Total Efetivo,Causas das Alterações ao Prazo,Causas das Alterações ao Preço,Estado,N.º registo do Acordo Quadro,Descrição do Acordo Quadro,Procedimento Centralizado
"Aquisição de serviços não médicos - serviços  técnicos de radiologia para o ACES Feira/ Arouca - SUB/ Arouca. Sendo o numero de horas contratadas semanais 125 com o valor de 6,06€.",Ajuste Direto Regime Geral,Aquisição de serviços,"85121232-8, Serviços especializados pulmonares","Administração Regional de Saúde do Norte, I. P. (503135593)","Radianticélebre - Prestação de Serviços de Saúde, Lda  (510530630)","39.390,00 €",02-08-2016,04-03-2016,366 dias,"Portugal, Aveiro, Arouca","Artigo 24.º, n.º 1, alínea c) do Código dos Contratos Públicos",31-12-2016,"38.990,04 €",,Numero de horas realizadas inferior ao numero de horas previstas.,,Não aplicável.,Não aplicável.,FALSE
"Aquisição de serviços de técnicos de radiologia para a Sub de Arouca de janeiro a dezembro. Numero de horas contratadas 125 semanais com valor hora de 6,06€.",Ajuste Direto Regime Geral,Aquisição de serviços,"79620000-6, Serviços de fornecimento de pessoal, inclusive temporário","Administração Regional de Saúde do Norte, I. P. (503135593)","Radianticélebre - Prestação de Serviços de Saúde, Lda (510530630)","39.390,00 €",29-09-2015,31-03-2015,366 dias,"Portugal, Aveiro, Arouca","Artigo 20.º, n.º 1, alínea a) do Código dos Contratos Públicos",31-12-2015,"33.172,44 €",,Não foram realizadas o numero de horas previstas.,,Não aplicável.,Não aplicável.,FALSE
