freguesia,acronym,validVotesPercentage,votes,dicofre
Oldrões,PS,38.03,208,131121
Oldrões,PPD/PSD,34.55,189,131121
Oldrões,B.E.,6.76,37,131121
Oldrões,PAN,5.12,28,131121
Oldrões,PCP-PEV,4.94,27,131121
Oldrões,CDS-PP,4.75,26,131121
Oldrões,L,1.65,9,131121
Oldrões,PDR,0.91,5,131121
Oldrões,A,0.73,4,131121
Oldrões,PPM.PPV/CDC,0.73,4,131121
Oldrões,PCTP/MRPP,0.55,3,131121
Oldrões,PNR,0.55,3,131121
Oldrões,NC,0.37,2,131121
Oldrões,IL,0.18,1,131121
Oldrões,PTP,0.18,1,131121
Oldrões,MAS,0,0,131121
Oldrões,PURP,0,0,131121
