Objeto do Contrato,Tipo de Procedimento,Tipo(s) de Contrato,CPVs,Entidade(s) Adjudicante(s),Entidade(s) Adjudicatária(s),Preço Contratual,Data de Publicação,Data de Celebração do Contrato,Prazo de Execução,Local de Execução,Fundamentação,Data de Fecho do Contrato,Preço Total Efetivo,Causas das Alterações ao Prazo,Causas das Alterações ao Preço,Estado,N.º registo do Acordo Quadro,Descrição do Acordo Quadro,Procedimento Centralizado
4S0072/2016 SERVIÇOS MÉDICOS NO AMBITO DA VMER - DR. JUNIOR PASIN,Ajuste Direto Regime Geral,Aquisição de serviços,"85140000-2, Serviços de saúde diversos","Centro Hospitalar Barreiro Montijo, E. P. E. (509186998)","PASIN & PASIN, LDA. (513880690)","31.500,00 €",15-02-2017,29-04-2016,245 dias,"Portugal, Setúbal, Barreiro","Artigo 20.º, n.º 1, alínea a) do Código dos Contratos Públicos",31-12-2016,"7.560,00 €",,Consumo efetivo inferior ao inicialmente estimado,,Não aplicável.,Não aplicável.,FALSE
PRESTAÇÃO DE SERVIÇOS MÉDICOS DE MEDICINA INTERNA - Aj. Directo nº 8403626,Ajuste Direto Regime Geral,Aquisição de serviços,"85141000-9, Serviços prestados pelo pessoal médico","Hospital Garcia de Orta, E. P. E. (506361470)","PASIN & PASIN, LDA. (513880690)","71.455,00 €",18-11-2016,13-04-2016,365 dias,"Portugal, Setúbal, Almada","Artigo 20.º, n.º 1, alínea a) do Código dos Contratos Públicos","","",,"",,Não aplicável.,Não aplicável.,FALSE
4S0041/2016 SERV MED MEDICINA INTERNA - DR. JUNIOR PASIN,Ajuste Direto Regime Geral,Aquisição de serviços,"85141000-9, Serviços prestados pelo pessoal médico","Centro Hospitalar Barreiro Montijo, E. P. E. (509186998)","PASIN & PASIN, LDA. (513880690)","28.800,00 €",14-11-2016,15-03-2016,275 dias,"Portugal, Setúbal, Barreiro","Artigo 20.º, n.º 1, alínea a) do Código dos Contratos Públicos",30-04-2016,"1.080,00 €",,A prestação de serviços médicos terminou antes do prazo previsto,,Não aplicável.,Não aplicável.,FALSE
