freguesia,acronym,validVotesPercentage,votes,dicofre
Moreira,PPD/PSD,49.34,75,160418
Moreira,PS,18.42,28,160418
Moreira,CDS-PP,13.82,21,160418
Moreira,B.E.,6.58,10,160418
Moreira,A,2.63,4,160418
Moreira,PPM.PPV/CDC,2.63,4,160418
Moreira,PAN,1.97,3,160418
Moreira,IL,1.32,2,160418
Moreira,NC,1.32,2,160418
Moreira,L,0.66,1,160418
Moreira,PCP-PEV,0.66,1,160418
Moreira,PNR,0.66,1,160418
Moreira,MAS,0,0,160418
Moreira,PCTP/MRPP,0,0,160418
Moreira,PDR,0,0,160418
Moreira,PTP,0,0,160418
Moreira,PURP,0,0,160418
