Objeto do Contrato,Tipo de Procedimento,Tipo(s) de Contrato,CPVs,Entidade(s) Adjudicante(s),Entidade(s) Adjudicatária(s),Preço Contratual,Data de Publicação,Data de Celebração do Contrato,Prazo de Execução,Local de Execução,Fundamentação,Data de Fecho do Contrato,Preço Total Efetivo,Causas das Alterações ao Prazo,Causas das Alterações ao Preço,Estado,N.º registo do Acordo Quadro,Descrição do Acordo Quadro,Procedimento Centralizado
Cateter Guia,Concurso público,Aquisição de bens móveis,"33140000-3, Material médico de consumo","Centro Hospitalar de Lisboa Central, E. P. E. (508080142)",Merit medical (513157816),"5.500,00 €",21-04-2017,30-03-2017,276 dias,"Portugal, Lisboa, Lisboa","Artigo 20.º, n.º 1, alínea b) do Código dos Contratos Públicos",,,,,,Não aplicável.,Não aplicável.,FALSE
Cateter Guia,Concurso público,Aquisição de bens móveis,"33140000-3, Material médico de consumo","Centro Hospitalar de Lisboa Central, E. P. E. (508080142)","BSC PORTUGAL, LDA. (504988964)","6.460,00 €",21-04-2017,30-03-2017,276 dias,"Portugal, Lisboa, Lisboa","Artigo 20.º, n.º 1, alínea b) do Código dos Contratos Públicos",,,,,,Não aplicável.,Não aplicável.,FALSE
cateter guia,Concurso público,Aquisição de bens móveis,"33140000-3, Material médico de consumo","Centro Hospitalar de Lisboa Central, E. P. E. (508080142)",Cardinal Health Portugal (513620834),"22.800,00 €",21-04-2017,30-03-2017,276 dias,"Portugal, Lisboa, Lisboa","Artigo 20.º, n.º 1, alínea b) do Código dos Contratos Públicos",,,,,,Não aplicável.,Não aplicável.,FALSE
Cateter Guia,Concurso público,Aquisição de bens móveis,"33140000-3, Material médico de consumo","Centro Hospitalar de Lisboa Central, E. P. E. (508080142)","MEDTRONIC PORTUGAL, LDA (504223933)","49.400,00 €",21-04-2017,30-03-2017,276 dias,"Portugal, Lisboa, Lisboa","Artigo 20.º, n.º 1, alínea b) do Código dos Contratos Públicos",,,,,,Não aplicável.,Não aplicável.,FALSE
Cateter Guia p/Angioplastia,Concurso público,Aquisição de bens móveis,"33140000-3, Material médico de consumo","Centro Hospitalar de Lisboa Central, E. P. E. (508080142)",TERUMO EUROPE ESPANA SL (PORTUGAL) (PT980472024),"12.920,00 €",21-04-2017,30-03-2017,276 dias,"Portugal, Lisboa, Lisboa","Artigo 20.º, n.º 1, alínea b) do Código dos Contratos Públicos",,,,,,Não aplicável.,Não aplicável.,FALSE
4-2.0408/17 - Sistema de Monitorização invasiva p/2017,Ajuste Direto Regime Geral,Aquisição de bens móveis,"33140000-3, Material médico de consumo","Centro Hospitalar de Lisboa Central, E. P. E. (508080142)",Edwards Lifesciences (Portugal) (508014832),"19.580,00 €",20-04-2017,10-03-2017,265 dias,"Portugal, Lisboa, Lisboa","Artigo 20.º, n.º 1, alínea a) do Código dos Contratos Públicos",,,,,,Não aplicável.,Não aplicável.,FALSE
4-2.0470/17 - Material para Vácuo p/2017,Ajuste Direto Regime Geral,Aquisição de bens móveis,"33140000-3, Material médico de consumo","Centro Hospitalar de Lisboa Central, E. P. E. (508080142)",MEDICINALIA CORMEDICA (500684324),"12.650,00 €",20-04-2017,10-04-2017,264 dias,"Portugal, Lisboa, Lisboa","Artigo 20.º, n.º 1, alínea a) do Código dos Contratos Públicos",,,,,,Não aplicável.,Não aplicável.,FALSE
Cateter de Ablação Irrigado p/ 2017,Concurso público,Aquisição de bens móveis,"33140000-3, Material médico de consumo","Centro Hospitalar de Lisboa Central, E. P. E. (508080142)","Biotronik Portugal (510726941), JOHNSON & JOHNSON MEDICAL (500153370), ST. JUDE MEDICAL PORTUGAL (504180746)","174.492,50 €",20-04-2017,22-03-2017,284 dias,"Portugal, Lisboa, Lisboa","Artigo 20.º, n.º 1, alínea b) do Código dos Contratos Públicos",,,,,,Não aplicável.,Não aplicável.,FALSE
HCV GENOTIPAGEM E RNA AMPLIFICAÇÃO,Ajuste Direto Regime Geral,Aquisição de bens móveis,"33694000-1, Meios de diagnóstico","Centro Hospitalar de Lisboa Central, E. P. E. (508080142)",SIEMENS HEALTHCARE DIAGNOSTICO LDA          (507925173),"7.729,82 €",20-04-2017,29-03-2017,30 dias,"Portugal, Lisboa, Lisboa","Artigo 20.º, n.º 1, alínea a) do Código dos Contratos Públicos",,,,,,Não aplicável.,Não aplicável.,FALSE
Sistema de Transferência 6 vias para Nutrição Parentérica,Ajuste Direto Regime Geral,Aquisição de bens móveis,"33100000-1, Equipamento médico","Centro Hospitalar de Lisboa Central, E. P. E. (508080142)",Ibervoxel (506716899),"16.263,00 €",20-04-2017,29-03-2017,277 dias,"Portugal, Lisboa, Lisboa","Artigo 20.º, n.º 1, alínea a) do Código dos Contratos Públicos",,,,,,Não aplicável.,Não aplicável.,FALSE
URINA TIPO II,Ajuste Direto Regime Geral,Aquisição de bens móveis,"33694000-1, Meios de diagnóstico","Centro Hospitalar de Lisboa Central, E. P. E. (508080142)",Beckman Coulter Portugal (509035167),"7.860,00 €",20-04-2017,10-03-2017,30 dias,"Portugal, Lisboa, Lisboa","Artigo 20.º, n.º 1, alínea a) do Código dos Contratos Públicos",,,,,,Não aplicável.,Não aplicável.,FALSE
Sistema de Lavagem / Aspiração para osso - Disposable,Ajuste Direto Regime Geral,Aquisição de bens móveis,"33140000-3, Material médico de consumo","Centro Hospitalar de Lisboa Central, E.P.E. (CHLC) (508080142)","Zimmer Biomet Portugal Unipessoal, Lda (500254990)","4.188,00 €",20-04-2017,27-03-2017,279 dias,"Portugal, Lisboa, Lisboa","Artigo 20.º, n.º 1, alínea a) do Código dos Contratos Públicos",,,,,,Não aplicável.,Não aplicável.,FALSE
consumiveis compativeis com os equipamentos de marca ultracision,Concurso público,Aquisição de bens móveis,"33140000-3, Material médico de consumo","Centro Hospitalar de Lisboa Central, E. P. E. (508080142)",JOHNSON & JOHNSON MEDICAL (500153370),"317.550,00 €",20-04-2017,30-03-2017,276 dias,"Portugal, Lisboa, Lisboa","Artigo 20.º, n.º 1, alínea b) do Código dos Contratos Públicos",,,,,,Não aplicável.,Não aplicável.,FALSE
"Sonda p/ Manometria adulto, lote não adjudicado do ajuste 4-2.0033/17",Ajuste Direto Regime Geral,Aquisição de bens móveis,"33140000-3, Material médico de consumo","Centro Hospitalar de Lisboa Central, E.P.E. (CHLC) (508080142)","Teprel - Equipamentos Médicos, SA. (502262184)","8.850,00 €",20-04-2017,28-03-2017,278 dias,"Portugal, Lisboa, Lisboa","Artigo 20.º, n.º 1, alínea a) do Código dos Contratos Públicos",,,,,,Não aplicável.,Não aplicável.,FALSE
Kit de plasmaferese para equipamento prismaflex,Concurso público,Aquisição de bens móveis,"33140000-3, Material médico de consumo","Centro Hospitalar de Lisboa Central, E. P. E. (508080142)","BAXTER MEDICO - FARMACÊUTICA, LDA (503347345)","74.400,00 €",20-04-2017,20-01-2017,345 dias,"Portugal, Lisboa, Lisboa","Artigo 20.º, n.º 1, alínea b) do Código dos Contratos Públicos",,,,,,Não aplicável.,Não aplicável.,FALSE
Fios de poliamida e poliester,Concurso público,Aquisição de bens móveis,"33140000-3, Material médico de consumo","Centro Hospitalar de Lisboa Central, E. P. E. (508080142)","H.R. -  HOSPITALAR, LDA (501895558), SOCIME MEDICAL, LDA. (504453939), Johnson  (500153370), BBraun Medical, Lda (501506543), Medtronic (504223933)","64.290,36 €",20-04-2017,22-03-2017,286 dias,"Portugal, Lisboa, Lisboa","Artigo 20.º, n.º 1, alínea b) do Código dos Contratos Públicos",,,,,,Não aplicável.,Não aplicável.,FALSE
Stents coronários revestidos para perfusões coronárias agudas,Ajuste Direto Regime Geral,Aquisição de bens móveis,"33184100-4, Implantes cirúrgicos","Centro Hospitalar de Lisboa Central, E.P.E. (CHLC) (508080142)",Biotronik Portugal (510726941),"8.340,00 €",20-04-2017,07-04-2017,269 dias,"Portugal, Lisboa, Lisboa","Artigo 20.º, n.º 1, alínea a) do Código dos Contratos Públicos",,,,,,Não aplicável.,Não aplicável.,FALSE
HCV GENOTIPAGEM E HCV RNA REAGENTE P AMPLIFICAÇÃO,Ajuste Direto Regime Geral,Aquisição de bens móveis,"33694000-1, Meios de diagnóstico","Centro Hospitalar de Lisboa Central, E. P. E. (508080142)","SIEMENS HEALTHCARE, LDA. (507925173)","7.489,88 €",20-04-2017,06-02-2017,30 dias,"Portugal, Lisboa, Lisboa","Artigo 20.º, n.º 1, alínea a) do Código dos Contratos Públicos",,,,,,Não aplicável.,Não aplicável.,FALSE
Aditivo p/ resolução de cromossomas,Ajuste Direto Regime Geral,Aquisição de bens móveis,"33696500-0, Reagentes de laboratório","Centro Hospitalar de Lisboa Central, E.P.E. (CHLC) (508080142)",Emilio Azevedo Campos S.A. (500094853),"215,25 €",19-04-2017,22-03-2017,265 dias,"Portugal, Lisboa, Lisboa","Artigo 20.º, n.º 1, alínea a) do Código dos Contratos Públicos",,,,,,Não aplicável.,Não aplicável.,FALSE
"Aquisição de """"Electrof. HB PH Alc eEletrof hemoglobina PH ácido (Conj)",Ajuste Direto Regime Geral,Aquisição de bens móveis,"33696500-0, Reagentes de laboratório","Centro Hospitalar de Lisboa Central, E.P.E. (CHLC) (508080142)","THERMO FISHER DIAGNOSTICS, SOCIEDADE UNIPESSOAL, LDA (506916243)","444,40 €",19-04-2017,22-03-2017,265 dias,"Portugal, Lisboa, Lisboa","Artigo 20.º, n.º 1, alínea a) do Código dos Contratos Públicos",,,,,,Não aplicável.,Não aplicável.,FALSE
PROTEÍNAS ESPECIFICAS,Ajuste Direto Regime Geral,Aquisição de bens móveis,"33696200-7, Reagentes para análises ao sangue","Centro Hospitalar de Lisboa Central, E. P. E. (508080142)","SIEMENS HEALTHCARE, LDA. (507925173)","23.116,50 €",19-04-2017,26-01-2017,180 dias,"Portugal, Lisboa, Lisboa","Artigo 20.º, n.º 1, alínea a) do Código dos Contratos Públicos",,,,,,Não aplicável.,Não aplicável.,FALSE
Gene PML-Rara BCR1 p/ PCR tempo real (conj reagentes),Ajuste Direto Regime Geral,Aquisição de bens móveis,"33696500-0, Reagentes de laboratório","Centro Hospitalar de Lisboa Central, E.P.E. (CHLC) (508080142)","QUILABAN-QUIM. LAB. ANALITICA,LDA   (500399670)","6.837,60 €",19-04-2017,03-04-2017,265 dias,"Portugal, Lisboa, Lisboa","Artigo 20.º, n.º 1, alínea a) do Código dos Contratos Públicos",,,,,,Não aplicável.,Não aplicável.,FALSE
INFLUENZA VIRUS,Ajuste Direto Regime Geral,Aquisição de bens móveis,"33696500-0, Reagentes de laboratório","Centro Hospitalar de Lisboa Central, E. P. E. (508080142)","WERFEN PORTUGAL, LDA (501086110)","14.220,00 €",19-04-2017,16-01-2017,60 dias,"Portugal, Lisboa, Lisboa","Artigo 20.º, n.º 1, alínea a) do Código dos Contratos Públicos",,,,,,Não aplicável.,Não aplicável.,FALSE
REAGENTES PARA FERTILIZAÇÃO IN VITRO,Ajuste Direto Regime Geral,Aquisição de bens móveis,"33696300-8, Reagentes químicos","Centro Hospitalar de Lisboa Central, E.P.E. (CHLC) (508080142)"," VWR INTERNATIONAL- MATERIAL DE LABORATORIO, LDA (503842770)","149,80 €",19-04-2017,15-02-2017,365 dias,"Portugal, Lisboa, Lisboa","Artigo 20.º, n.º 1, alínea a) do Código dos Contratos Públicos",,,,,,Não aplicável.,Não aplicável.,FALSE
"4-2.0930/17 - Aquisição de Papel para Esterilização, Lote não Adjudicado no AD n.º 4-2.0930/17",Ajuste Direto Regime Geral,Aquisição de bens móveis,"33140000-3, Material médico de consumo","Centro Hospitalar de Lisboa Central, E.P.E. (CHLC) (508080142)","BASTOS VIEGAS, SA (500042772)","6.375,00 €",19-04-2017,19-04-2017,255 dias,"Portugal, Lisboa, Lisboa","Artigo 20.º, n.º 1, alínea a) do Código dos Contratos Públicos",,,,,,Não aplicável.,Não aplicável.,FALSE
Reagentes para fertilização in vitro,Ajuste Direto Regime Geral,Aquisição de bens móveis,"33696300-8, Reagentes químicos","Centro Hospitalar de Lisboa Central, E.P.E. (CHLC) (508080142)","EMB - EQUIPAMENTOS MÉDICOS BIOLÓGICOS, LDA (507364457)","504,00 €",19-04-2017,15-02-2017,365 dias,"Portugal, Lisboa, Lisboa","Artigo 20.º, n.º 1, alínea a) do Código dos Contratos Públicos",,,,,,Não aplicável.,Não aplicável.,FALSE
Balão para fio guia,Ajuste Direto Regime Geral,Aquisição de bens móveis,"33000000-0, Equipamento médico, medicamentos e produtos para cuidados pessoais","Centro Hospitalar de Lisboa Central, E. P. E. (508080142)",Terumo Europe España S.L. (980472024),"6.045,00 €",19-04-2017,19-04-2017,10 dias,"Portugal, Lisboa, Lisboa","Artigo 20.º, n.º 1, alínea a) do Código dos Contratos Públicos",,,,,,Não aplicável.,Não aplicável.,FALSE
"Balões, bainhas e stents",Ajuste Direto Regime Geral,Aquisição de bens móveis,"33000000-0, Equipamento médico, medicamentos e produtos para cuidados pessoais","Centro Hospitalar de Lisboa Central, E. P. E. (508080142)",Cardinal Health Portugal (513620834),"6.240,00 €",19-04-2017,19-04-2017,10 dias,"Portugal, Lisboa, Lisboa","Artigo 20.º, n.º 1, alínea a) do Código dos Contratos Públicos",,,,,,Não aplicável.,Não aplicável.,FALSE
Reagente para fertilização in Vitro,Ajuste Direto Regime Geral,Aquisição de bens móveis,"33696300-8, Reagentes químicos","Centro Hospitalar de Lisboa Central, E.P.E. (CHLC) (508080142)","Iberlab & Imunoreage, LDA. (503406694)","335,23 €",19-04-2017,15-02-2017,365 dias,"Portugal, Lisboa, Lisboa","Artigo 20.º, n.º 1, alínea a) do Código dos Contratos Públicos",,,,,,Não aplicável.,Não aplicável.,FALSE
Aquisição de Gene BCR-ABL p/ PCR tempo real (conjunto reagentes),Ajuste Direto Regime Geral,Aquisição de bens móveis,"33696500-0, Reagentes de laboratório","Centro Hospitalar de Lisboa Central, E.P.E. (CHLC) (508080142)","WERFEN PORTUGAL, LDA (501086110)","36.250,00 €",19-04-2017,10-04-2017,265 dias,"Portugal, Lisboa, Lisboa","Artigo 20.º, n.º 1, alínea a) do Código dos Contratos Públicos",,,,,,Não aplicável.,Não aplicável.,FALSE
Reagentes para fertilização in Vitro,Ajuste Direto Regime Geral,Aquisição de bens móveis,"33696300-8, Reagentes químicos","Centro Hospitalar de Lisboa Central, E.P.E. (CHLC) (508080142)",origio (10975077),"20.262,26 €",19-04-2017,24-02-2017,365 dias,"Portugal, Lisboa, Lisboa","Artigo 20.º, n.º 1, alínea a) do Código dos Contratos Públicos",,,,,,Não aplicável.,Não aplicável.,FALSE
Microcateter Médico de Consumo,Ajuste Direto Regime Geral,Aquisição de bens móveis,"33140000-3, Material médico de consumo","Centro Hospitalar de Lisboa Central, E.P.E. (CHLC) (508080142)",Boston Scientific Porugal (504988964),"10.150,00 €",19-04-2017,31-03-2017,256 dias,"Portugal, Lisboa, Lisboa","Artigo 20.º, n.º 1, alínea a) do Código dos Contratos Públicos",,,,,,Não aplicável.,Não aplicável.,FALSE
"4-2.0339/17 - Aquisição de Algálias, Rolhas de Plástico e Sacos de Urina, lotes desertos e não adjudicados no CP 1-2.0013/17",Ajuste Direto Regime Geral,Aquisição de bens móveis,"33140000-3, Material médico de consumo","Centro Hospitalar de Lisboa Central, E.P.E. (CHLC) (508080142)","H.R. - Produtos Químicos, Lda (501895558)","1.240,20 €",19-04-2017,19-04-2017,255 dias,"Portugal, Lisboa, Lisboa","Artigo 20.º, n.º 1, alínea a) do Código dos Contratos Públicos",,,,,,Não aplicável.,Não aplicável.,FALSE
"4-2.0339/17 - Aquisição de Algálias, Rolhas de Plástico e Sacos de Urina, lotes desertos e não adjudicados no CP 1-2.0013/17",Ajuste Direto Regime Geral,Aquisição de bens móveis,"33140000-3, Material médico de consumo","Centro Hospitalar de Lisboa Central, E.P.E. (CHLC) (508080142)","B. Braun Medical, Lda. (501506543)","294,00 €",19-04-2017,19-04-2017,255 dias,"Portugal, Lisboa, Lisboa","Artigo 20.º, n.º 1, alínea a) do Código dos Contratos Públicos",,,,,,Não aplicável.,Não aplicável.,FALSE
cateter suporte,Ajuste Direto Regime Geral,Aquisição de bens móveis,"33000000-0, Equipamento médico, medicamentos e produtos para cuidados pessoais","Centro Hospitalar de Lisboa Central, E. P. E. (508080142)",Merit medical (513157816),"5.250,00 €",19-04-2017,18-04-2017,309 dias,"Portugal, Lisboa, Lisboa","Artigo 20.º, n.º 1, alínea a) do Código dos Contratos Públicos",,,,,,Não aplicável.,Não aplicável.,FALSE
GRUPO HERPES PCR,Ajuste Direto Regime Geral,Aquisição de bens móveis,"33696500-0, Reagentes de laboratório","Centro Hospitalar de Lisboa Central, E. P. E. (508080142)","QUILABAN-QUIM. LAB. ANALITICA,LDA   (500399670)","7.507,20 €",19-04-2017,06-04-2017,30 dias,"Portugal, Lisboa, Lisboa","Artigo 20.º, n.º 1, alínea a) do Código dos Contratos Públicos",,,,,,Não aplicável.,Não aplicável.,FALSE
REAGENTES PARA O LAB. DE HEMATOLOGIA DO HSAC – BIOLOGIA MOLECULAR - 41508817,Ajuste Direto Regime Geral,Aquisição de bens móveis,"33696500-0, Reagentes de laboratório","Centro Hospitalar de Lisboa Central, E.P.E. (CHLC) (508080142)","WERFEN PORTUGAL, LDA (501086110)","28.515,30 €",19-04-2017,10-04-2017,265 dias,"Portugal, Lisboa, Lisboa","Artigo 20.º, n.º 1, alínea a) do Código dos Contratos Públicos",,,,,,Não aplicável.,Não aplicável.,FALSE
Material de Encavilhamento,Concurso público,Aquisição de bens móveis,"33183300-9, Aparelhos para osteossíntese","Centro Hospitalar de Lisboa Central, E.P.E. (CHLC) (508080142)","STRYKER PORTUGAL - PRODUTOS MEDICOS, UNIPESSOAL,LDA. (504594214)","508.650,00 €",19-04-2017,30-03-2017,365 dias,"Portugal, Lisboa, Lisboa","Artigo 20.º, n.º 1, alínea b) do Código dos Contratos Públicos",,,,,,Não aplicável.,Não aplicável.,FALSE
Suspensores de Vasos Vermelhos Estéreis Finos e Perfuradores da Aorta Descartáveis desertas e não adjudicadas do AD 4-2.0026/17,Ajuste Direto Regime Geral,Aquisição de bens móveis,"33100000-1, Equipamento médico","Centro Hospitalar de Lisboa Central, E.P.E. (CHLC) (508080142)","Overpharma, Lda (505792362)","58,00 €",19-04-2017,19-04-2017,256 dias,"Portugal, Lisboa, Lisboa","Artigo 20.º, n.º 1, alínea a) do Código dos Contratos Públicos",,,,,,Não aplicável.,Não aplicável.,FALSE
Material de Traumatologia,Concurso público,Aquisição de bens móveis,"33183300-9, Aparelhos para osteossíntese","Centro Hospitalar de Lisboa Central, E. P. E. (508080142)","STRYKER PORTUGAL - PRODUTOS MEDICOS, UNIPESSOAL,LDA. (504594214)","630.873,00 €",19-04-2017,30-03-2017,365 dias,"Portugal, Lisboa, Lisboa","Artigo 20.º, n.º 1, alínea b) do Código dos Contratos Públicos",,,,,,Não aplicável.,Não aplicável.,FALSE
Kits para Ligamentoplastia,Concurso público,Aquisição de bens móveis,"33183100-7, Implantes ortopédicos","Centro Hospitalar de Lisboa Central, E.P.E. (CHLC) (508080142)","STRYKER PORTUGAL - PRODUTOS MEDICOS, UNIPESSOAL,LDA. (504594214)","117.750,00 €",19-04-2017,26-01-2017,365 dias,"Portugal, Lisboa, Lisboa","Artigo 20.º, n.º 1, alínea b) do Código dos Contratos Públicos",,,,,,Não aplicável.,Não aplicável.,FALSE
Kits para Ligamentoplastia,Concurso público,Aquisição de bens móveis,"33183100-7, Implantes ortopédicos","Centro Hospitalar de Lisboa Central, E.P.E. (CHLC) (508080142)",JOHNSON & JOHNSON MEDICAL (500153370),"40.200,00 €",19-04-2017,26-01-2017,365 dias,"Portugal, Lisboa, Lisboa","Artigo 20.º, n.º 1, alínea b) do Código dos Contratos Públicos",,,,,,Não aplicável.,Não aplicável.,FALSE
Kits Cirurgia Percutânea Pé,Ajuste Direto Regime Geral,Aquisição de bens móveis,"33140000-3, Material médico de consumo","Centro Hospitalar de Lisboa Central, E.P.E. (CHLC) (508080142)",M.U.C.-MATERIAL DE UTILIDADE CLINICA LDA (502379308),"26.850,00 €",19-04-2017,07-02-2017,365 dias,"Portugal, Lisboa, Lisboa","Artigo 20.º, n.º 1, alínea a) do Código dos Contratos Públicos",,,,,,Não aplicável.,Não aplicável.,FALSE
Material Osteossintese para Cranioplastia,Ajuste Direto Regime Geral,Aquisição de bens móveis,"33140000-3, Material médico de consumo","Centro Hospitalar de Lisboa Central, E.P.E. (CHLC) (508080142)","Overpharma, Lda (505792362)","40.779,00 €",19-04-2017,05-04-2017,365 dias,"Portugal, Lisboa, Lisboa","Artigo 20.º, n.º 1, alínea a) do Código dos Contratos Públicos",,,,,,Não aplicável.,Não aplicável.,FALSE
Material Osteossintese Externa,Concurso público,Aquisição de bens móveis,"33183300-9, Aparelhos para osteossíntese","Centro Hospitalar de Lisboa Central, E. P. E. (508080142)","STRYKER PORTUGAL - PRODUTOS MEDICOS, UNIPESSOAL,LDA. (504594214)","131.526,00 €",19-04-2017,17-01-2017,365 dias,"Portugal, Lisboa, Lisboa","Artigo 20.º, n.º 1, alínea b) do Código dos Contratos Públicos",,,,,,Não aplicável.,Não aplicável.,FALSE
Stents coronários,Ajuste Direto Regime Geral,Aquisição de bens móveis,"33184100-4, Implantes cirúrgicos","Centro Hospitalar de Lisboa Central, E.P.E. (CHLC) (508080142)",Terumo Europe España SL (980472024),"35.100,00 €",18-04-2017,29-03-2017,310 dias,"Portugal, Lisboa, Lisboa","Artigo 24.º, n.º 1, alínea c) do Código dos Contratos Públicos",,,,,,Não aplicável.,Não aplicável.,FALSE
Stents coronários,Ajuste Direto Regime Geral,Aquisição de bens móveis,"33184100-4, Implantes cirúrgicos","Centro Hospitalar de Lisboa Central, E.P.E. (CHLC) (508080142)","Cardinal Health Portugal 513, Unipessoal, Lda (513620834)","36.720,00 €",18-04-2017,24-03-2017,310 dias,"Portugal, Lisboa, Lisboa","Artigo 24.º, n.º 1, alínea c) do Código dos Contratos Públicos",,,,,,Não aplicável.,Não aplicável.,FALSE
Stents coronários,Ajuste Direto Regime Geral,Aquisição de bens móveis,"33184100-4, Implantes cirúrgicos","Centro Hospitalar de Lisboa Central, E.P.E. (CHLC) (508080142)",Boston Scientific Porugal (504988964),"54.400,00 €",18-04-2017,29-03-2017,310 dias,"Portugal, Lisboa, Lisboa","Artigo 24.º, n.º 1, alínea c) do Código dos Contratos Públicos",,,,,,Não aplicável.,Não aplicável.,FALSE
4-2.0471/17 - Shunt para carotídea e Sistema de proteção embolico por infusão de fluxo p/2017,Ajuste Direto Regime Geral,Aquisição de bens móveis,"33140000-3, Material médico de consumo","Centro Hospitalar de Lisboa Central, E.P.E. (CHLC) (508080142)",C.R. Bard Portugal (502438274),"545,00 €",18-04-2017,18-04-2017,257 dias,"Portugal, Lisboa, Lisboa","Artigo 20.º, n.º 1, alínea a) do Código dos Contratos Públicos",,,,,,Não aplicável.,Não aplicável.,FALSE
Stents coronários,Ajuste Direto Regime Geral,Aquisição de bens móveis,"33184100-4, Implantes cirúrgicos","Centro Hospitalar de Lisboa Central, E.P.E. (CHLC) (508080142)",Abbott Laboratórios (500006148),"62.640,19 €",18-04-2017,30-03-2017,310 dias,"Portugal, Lisboa, Lisboa","Artigo 24.º, n.º 1, alínea c) do Código dos Contratos Públicos",,,,,,Não aplicável.,Não aplicável.,FALSE
Stents coronários,Ajuste Direto Regime Geral,Aquisição de bens móveis,"33184100-4, Implantes cirúrgicos","Centro Hospitalar de Lisboa Central, E.P.E. (CHLC) (508080142)",Biotronik Portugal (510726941),"44.550,00 €",18-04-2017,20-03-2017,310 dias,"Portugal, Lisboa, Lisboa","Artigo 24.º, n.º 1, alínea c) do Código dos Contratos Públicos",,,,,,Não aplicável.,Não aplicável.,FALSE
Stents coronários,Ajuste Direto Regime Geral,Aquisição de bens móveis,"33184100-4, Implantes cirúrgicos","Centro Hospitalar de Lisboa Central, E.P.E. (CHLC) (508080142)",Medtronic Portugal (504223933),"58.500,00 €",18-04-2017,24-03-2017,310 dias,"Portugal, Lisboa, Lisboa","Artigo 24.º, n.º 1, alínea c) do Código dos Contratos Públicos",,,,,,Não aplicável.,Não aplicável.,FALSE
Diverso Material Osteossintese Pediátrico,Concurso público,Aquisição de bens móveis,"33183300-9, Aparelhos para osteossíntese","Centro Hospitalar de Lisboa Central, E. P. E. (508080142)",M.U.C.-MATERIAL DE UTILIDADE CLINICA LDA (502379308),"126.957,00 €",17-04-2017,29-03-2017,365 dias,"Portugal, Lisboa, Lisboa","Artigo 20.º, n.º 1, alínea b) do Código dos Contratos Públicos",,,,,,Não aplicável.,Não aplicável.,FALSE
Diverso Material Osteossintese Pediátrico,Concurso público,Aquisição de bens móveis,"33140000-3, Material médico de consumo","Centro Hospitalar de Lisboa Central, E. P. E. (508080142)","Zimmer Biomet Portugal Unipessoal, Lda (500254990)","30.600,00 €",17-04-2017,29-03-2017,365 dias,"Portugal, Lisboa, Lisboa","Artigo 20.º, n.º 1, alínea b) do Código dos Contratos Públicos",,,,,,Não aplicável.,Não aplicável.,FALSE
4-2.0500/17 - Aquisição de Placas de Paciente,Ajuste Direto Regime Geral,Aquisição de bens móveis,"33140000-3, Material médico de consumo","Centro Hospitalar de Lisboa Central, E.P.E. (CHLC) (508080142)","NOSBET - Equipamentos, Lda (513514872)","6.090,00 €",17-04-2017,17-04-2017,258 dias,"Portugal, Lisboa, Lisboa","Artigo 20.º, n.º 1, alínea a) do Código dos Contratos Públicos",,,,,,Não aplicável.,Não aplicável.,FALSE
4-2.0500/17 - Aquisição de Placas de Paciente,Ajuste Direto Regime Geral,Aquisição de bens móveis,"33140000-3, Material médico de consumo","Centro Hospitalar de Lisboa Central, E.P.E. (CHLC) (508080142)","Eurocasmédica, S.A. (503322105)","142,50 €",17-04-2017,17-04-2017,258 dias,"Portugal, Lisboa, Lisboa","Artigo 20.º, n.º 1, alínea a) do Código dos Contratos Públicos",,,,,,Não aplicável.,Não aplicável.,FALSE
4-2.0500/17 - Aquisição de Placas de Paciente,Ajuste Direto Regime Geral,Aquisição de bens móveis,"33140000-3, Material médico de consumo","Centro Hospitalar de Lisboa Central, E.P.E. (CHLC) (508080142)",CLINIFAR - PROD. CLIN. FARMACÊUTICOS S.A.     (503281115),"245,00 €",17-04-2017,17-04-2017,258 dias,"Portugal, Lisboa, Lisboa","Artigo 20.º, n.º 1, alínea a) do Código dos Contratos Públicos",,,,,,Não aplicável.,Não aplicável.,FALSE
4-2.0680/17 - Cateter e Guia CIA para 2017,Ajuste Direto Regime Geral,Aquisição de bens móveis,"33140000-3, Material médico de consumo","Centro Hospitalar de Lisboa Central, E.P.E. (CHLC) (508080142)",ST. JUDE MEDICAL PORTUGAL (504180746),"17.005,00 €",17-04-2017,10-04-2017,265 dias,"Portugal, Lisboa, Lisboa","Artigo 20.º, n.º 1, alínea a) do Código dos Contratos Públicos",,,,,,Não aplicável.,Não aplicável.,FALSE
"4-2.0502/17 - Aquisição de Fios Kirchner, lotes desertos e não adjudicados no AD42000917",Ajuste Direto Regime Geral,Aquisição de bens móveis,"33140000-3, Material médico de consumo","Centro Hospitalar de Lisboa Central, E. P. E. (508080142)","B BRAUN MEDICAL, LDA (501506543)","220,00 €",17-04-2017,17-04-2017,258 dias,"Portugal, Lisboa, Lisboa","Artigo 20.º, n.º 1, alínea a) do Código dos Contratos Públicos",,,,,,Não aplicável.,Não aplicável.,FALSE
Imunossupressores,Ajuste Direto Regime Geral,Aquisição de bens móveis,"33696500-0, Reagentes de laboratório","Centro Hospitalar de Lisboa Central, E. P. E. (508080142)",Roche (504282921),"15.860,00 €",17-04-2017,05-04-2017,30 dias,"Portugal, Lisboa, Lisboa","Artigo 24.º, n.º 1, alínea c) do Código dos Contratos Públicos",,,,,,Não aplicável.,Não aplicável.,FALSE
"1-2.0111/17 - Diverso material de gastro, lotes desertos e não adjudicados do concurso 1-2.0069/17",Concurso público,Aquisição de bens móveis,"33140000-3, Material médico de consumo","Centro Hospitalar de Lisboa Central, E. P. E. (508080142)",BIOSONDA-COMERC MATERIAL HOSPITALAR (501463313),"8.250,00 €",17-04-2017,17-04-2017,258 dias,"Portugal, Lisboa, Lisboa","Artigo 20.º, n.º 1, alínea b) do Código dos Contratos Públicos",,,,,,Não aplicável.,Não aplicável.,FALSE
Cardiversores desfibrilhador implantáveis,Ajuste Direto Regime Geral,Aquisição de bens móveis,"33182100-0, Desfibrilhador","Centro Hospitalar de Lisboa Central, E.P.E. (CHLC) (508080142)",LIVANOVA (505514010),"115.345,00 €",13-04-2017,24-03-2017,215 dias,"Portugal, Lisboa, Lisboa","Artigo 24.º, n.º 1, alínea c) do Código dos Contratos Públicos",,,,,,Não aplicável.,Não aplicável.,FALSE
Cardiversores desfibrilhadores implntáveis,Ajuste Direto Regime Geral,Aquisição de bens móveis,"33182100-0, Desfibrilhador","Centro Hospitalar de Lisboa Central, E.P.E. (CHLC) (508080142)",Boston Scientific Portugal (504988964),"134.946,95 €",13-04-2017,24-03-2017,215 dias,"Portugal, Lisboa, Lisboa","Artigo 24.º, n.º 1, alínea c) do Código dos Contratos Públicos",,,,,,Não aplicável.,Não aplicável.,FALSE
Cardioversores desfibrilhadores implantáveis,Ajuste Direto Regime Geral,Aquisição de bens móveis,"33182100-0, Desfibrilhador","Centro Hospitalar de Lisboa Central, E.P.E. (CHLC) (508080142)",Medtronic Portugal (504223933),"108.092,35 €",13-04-2017,31-03-2017,215 dias,"Portugal, Lisboa, Lisboa","Artigo 24.º, n.º 1, alínea c) do Código dos Contratos Públicos",,,,,,Não aplicável.,Não aplicável.,FALSE
Cardioversores desfibrilhadores implantáveis,Ajuste Direto Regime Geral,Aquisição de bens móveis,"33000000-0, Equipamento médico, medicamentos e produtos para cuidados pessoais","Centro Hospitalar de Lisboa Central, E.P.E. (CHLC) (508080142)",Livanova (505514010),"80.100,00 €",13-04-2017,24-03-2017,215 dias,"Portugal, Lisboa, Lisboa","Artigo 24.º, n.º 1, alínea c) do Código dos Contratos Públicos",,,,,,Não aplicável.,Não aplicável.,FALSE
Cardioversores desfibrilhadores implantáveis,Ajuste Direto Regime Geral,Aquisição de bens móveis,"33000000-0, Equipamento médico, medicamentos e produtos para cuidados pessoais","Centro Hospitalar de Lisboa Central, E.P.E. (CHLC) (508080142)",Biotronik Portugal (510726941),"93.474,50 €",13-04-2017,29-03-2017,215 dias,"Portugal, Lisboa, Lisboa","Artigo 24.º, n.º 1, alínea c) do Código dos Contratos Públicos",,,,,,Não aplicável.,Não aplicável.,FALSE
4-2.0208/17 - Kit de Biópsia Renal 18G x 20CM,Ajuste Direto Regime Geral,Aquisição de bens móveis,"33140000-3, Material médico de consumo","Centro Hospitalar de Lisboa Central, E.P.E. (CHLC) (508080142)","MEDICINALIA - CORMEDICA,LDA. (500684324)","2.320,00 €",13-04-2017,04-04-2017,271 dias,"Portugal, Lisboa, Lisboa","Artigo 20.º, n.º 1, alínea a) do Código dos Contratos Públicos",,,,,,Não aplicável.,Não aplicável.,FALSE
"Contentores, pensos higiénicos, colares cervicais e outros ",Ajuste Direto Regime Geral,Aquisição de bens móveis,"33100000-1, Equipamento médico","Centro Hospitalar de Lisboa Central, E.P.E. (CHLC) (508080142)",AVIQUIMICA IMPORT E MANUFATURA (500039720),"2.756,25 €",12-04-2017,24-03-2017,282 dias,"Portugal, Lisboa, Lisboa","Artigo 20.º, n.º 1, alínea a) do Código dos Contratos Públicos",,,,,,Não aplicável.,Não aplicável.,FALSE
"Contentores, pensos higiénicos, colares cervicais e outros",Ajuste Direto Regime Geral,Aquisição de bens móveis,"33100000-1, Equipamento médico","Centro Hospitalar de Lisboa Central, E.P.E. (CHLC) (508080142)","Z-MED, Equipamentos Médicos e Hospitalares, Lda (508531535)","6.432,80 €",12-04-2017,24-03-2017,282 dias,"Portugal, Lisboa, Lisboa","Artigo 20.º, n.º 1, alínea a) do Código dos Contratos Públicos",,,,,,Não aplicável.,Não aplicável.,FALSE
"Contentores, pensos higiénicos, colares cervicais e outros",Ajuste Direto Regime Geral,Aquisição de bens móveis,"33100000-1, Equipamento médico","Centro Hospitalar de Lisboa Central, E.P.E. (CHLC) (508080142)","Bastos Viegas, S.A  (500042772)","125,00 €",12-04-2017,24-03-2017,282 dias,"Portugal, Lisboa, Lisboa","Artigo 20.º, n.º 1, alínea a) do Código dos Contratos Públicos",,,,,,Não aplicável.,Não aplicável.,FALSE
"Contentores, pensos higiénicos, colares cervicais e outros",Ajuste Direto Regime Geral,Aquisição de bens móveis,"33100000-1, Equipamento médico","Centro Hospitalar de Lisboa Central, E.P.E. (CHLC) (508080142)","EZEQUIEL PANAO JORGE, LDA (501412727)","550,50 €",12-04-2017,24-03-2017,282 dias,"Portugal, Lisboa, Lisboa","Artigo 20.º, n.º 1, alínea a) do Código dos Contratos Públicos",,,,,,Não aplicável.,Não aplicável.,FALSE
"Dispositivos p/ encerramento da artéria femoral, lotes desertos dos concursos 1-2.0046/17 e 1-2.0083/17 p/ 2017",Ajuste Direto Regime Geral,Aquisição de bens móveis,"33140000-3, Material médico de consumo","Centro Hospitalar de Lisboa Central, E.P.E. (CHLC) (508080142)","J. M. FARMACÊUTICA, LDA (503550558)","55.675,00 €",11-04-2017,30-03-2017,264 dias,"Portugal, Lisboa, Lisboa","Artigo 20.º, n.º 1, alínea a) do Código dos Contratos Públicos",,,,,,Não aplicável.,Não aplicável.,FALSE
Serras e Brocas para Craniotomia,Ajuste Direto Regime Geral,Aquisição de bens móveis,"33100000-1, Equipamento médico","Centro Hospitalar de Lisboa Central, E. P. E. (508080142)","MEDTRONIC PORTUGAL, LDA (504223933)","27.361,10 €",11-04-2017,03-04-2017,264 dias,"Portugal, Lisboa, Lisboa","Artigo 20.º, n.º 1, alínea a) do Código dos Contratos Públicos",,,,,,Não aplicável.,Não aplicável.,FALSE
1-2.0109/17 - Colas Sintéticas e Colas Cirurgicas,Concurso público,Aquisição de bens móveis,"33140000-3, Material médico de consumo","Centro Hospitalar de Lisboa Central, E. P. E. (508080142)","Lusopalex, Lda (503531588)","110.356,45 €",11-04-2017,30-03-2017,276 dias,"Portugal, Lisboa, Lisboa","Artigo 20.º, n.º 1, alínea b) do Código dos Contratos Públicos",,,,,,Não aplicável.,Não aplicável.,FALSE
"Bosentano 62,5mg comp",Ajuste Direto Regime Geral,Aquisição de bens móveis,"33000000-0, Equipamento médico, medicamentos e produtos para cuidados pessoais","Centro Hospitalar de Lisboa Central, E. P. E. (508080142)",Actelion  (507336488),"28.851,20 €",11-04-2017,06-04-2017,30 dias,"Portugal, Lisboa, Lisboa","Artigo 24.º, n.º 1, alínea c) do Código dos Contratos Públicos",,,,,,Não aplicável.,Não aplicável.,FALSE
"Aquisição de Bosentano 32 e 62,5mg comp",Ajuste Direto Regime Geral,Aquisição de bens móveis,"33000000-0, Equipamento médico, medicamentos e produtos para cuidados pessoais","Centro Hospitalar de Lisboa Central, E. P. E. (508080142)",Actelion Pharmaceuticals (507336488),"32.658,08 €",11-04-2017,19-01-2017,30 dias,"Portugal, Lisboa, Lisboa","Artigo 24.º, n.º 1, alínea c) do Código dos Contratos Públicos",,,,,,Não aplicável.,Não aplicável.,FALSE
"Prestação de Serviços de lavagem e tratamento de roupa hospitalar e dos fardamentos dos profissionais do CHLC, EPE ",Concurso público,Aquisição de serviços,"98311000-6, Serviços de recolha de roupa por lavandarias","Centro Hospitalar de Lisboa Central, E. P. E. (508080142)","LRH - Lavandaria Roupa Hospitalar, Lda (514051990)","160.718,20 €",11-04-2017,27-02-2017,306 dias,"Portugal, Lisboa, Lisboa","Artigo 20.º, n.º 1, alínea b) do Código dos Contratos Públicos",,,,,,Não aplicável.,Não aplicável.,FALSE
Aquisição de Fatores VIII e IX da Coagulação Humana,Ajuste Direto Regime Geral,Aquisição de bens móveis,"33000000-0, Equipamento médico, medicamentos e produtos para cuidados pessoais","Centro Hospitalar de Lisboa Central, E. P. E. (508080142)",Octapharma produtos  farmacêuticos Lda (502820780),"146.045,00 €",11-04-2017,06-04-2017,30 dias,"Portugal, Lisboa, Lisboa","Artigo 24.º, n.º 1, alínea c) do Código dos Contratos Públicos",,,,,,Não aplicável.,Não aplicável.,FALSE
"Prestação de Serviços de lavagem e tratamento de roupa hospitalar e dos fardamentos dos profissionais do CHLC, EPE ",Concurso público,Aquisição de serviços,"98311000-6, Serviços de recolha de roupa por lavandarias","Centro Hospitalar de Lisboa Central, E. P. E. (508080142)","LRH - Lavandaria Roupa Hospitalar, Lda (514051990)","86.217,60 €",11-04-2017,27-02-2017,306 dias,"Portugal, Lisboa, Lisboa","Artigo 20.º, n.º 1, alínea b) do Código dos Contratos Públicos",,,,,,Não aplicável.,Não aplicável.,FALSE
"Prestação de Serviços de lavagem e tratamento de roupa hospitalar e dos fardamentos dos profissionais do CHLC, EPE",Concurso público,Aquisição de serviços,"98311000-6, Serviços de recolha de roupa por lavandarias","Centro Hospitalar de Lisboa Central, E. P. E. (508080142)","LRH - Lavandaria Roupa Hospitalar, Lda (514051990)","168.645,30 €",11-04-2017,27-02-2017,306 dias,"Portugal, Lisboa, Lisboa","Artigo 20.º, n.º 1, alínea b) do Código dos Contratos Públicos",,,,,,Não aplicável.,Não aplicável.,FALSE
"Prestação de Serviços de lavagem e tratamento de roupa hospitalar e dos fardamentos dos profissionais do CHLC, EPE ",Concurso público,Aquisição de serviços,"98311000-6, Serviços de recolha de roupa por lavandarias","Centro Hospitalar de Lisboa Central, E. P. E. (508080142)","LRH - Lavandaria Roupa Hospitalar, Lda (514051990)","125.235,50 €",11-04-2017,27-02-2017,306 dias,"Portugal, Lisboa, Lisboa","Artigo 20.º, n.º 1, alínea b) do Código dos Contratos Públicos",,,,,,Não aplicável.,Não aplicável.,FALSE
"Prestação de Serviços de lavagem e tratamento de roupa hospitalar e dos fardamentos dos profissionais do CHLC, EPE",Concurso público,Aquisição de serviços,"98311000-6, Serviços de recolha de roupa por lavandarias","Centro Hospitalar de Lisboa Central, E. P. E. (508080142)","LRH - Lavandaria Roupa Hospitalar, Lda (514051990)","333.645,80 €",11-04-2017,27-02-2017,306 dias,"Portugal, Lisboa, Lisboa","Artigo 20.º, n.º 1, alínea b) do Código dos Contratos Públicos",,,,,,Não aplicável.,Não aplicável.,FALSE
4-2.0469/17 - Material para Polissonografia p/2017,Ajuste Direto Regime Geral,Aquisição de bens móveis,"33140000-3, Material médico de consumo","Centro Hospitalar de Lisboa Central, E. P. E. (508080142)"," Air Liquide Medicinal, S.A (501576436)","2.000,00 €",11-04-2017,11-04-2017,264 dias,"Portugal, Lisboa, Lisboa","Artigo 20.º, n.º 1, alínea a) do Código dos Contratos Públicos",,,,,,Não aplicável.,Não aplicável.,FALSE
