freguesia,acronym,validVotesPercentage,votes,dicofre
União das freguesias de Rapa e Cadafaz,PS,54.7,64,090326
União das freguesias de Rapa e Cadafaz,PPD/PSD,32.48,38,090326
União das freguesias de Rapa e Cadafaz,CDS-PP,3.42,4,090326
União das freguesias de Rapa e Cadafaz,A,2.56,3,090326
União das freguesias de Rapa e Cadafaz,B.E.,2.56,3,090326
União das freguesias de Rapa e Cadafaz,PPM.PPV/CDC,1.71,2,090326
União das freguesias de Rapa e Cadafaz,IL,0.85,1,090326
União das freguesias de Rapa e Cadafaz,PAN,0.85,1,090326
União das freguesias de Rapa e Cadafaz,PCTP/MRPP,0.85,1,090326
União das freguesias de Rapa e Cadafaz,L,0,0,090326
União das freguesias de Rapa e Cadafaz,MAS,0,0,090326
União das freguesias de Rapa e Cadafaz,NC,0,0,090326
União das freguesias de Rapa e Cadafaz,PCP-PEV,0,0,090326
União das freguesias de Rapa e Cadafaz,PDR,0,0,090326
União das freguesias de Rapa e Cadafaz,PNR,0,0,090326
União das freguesias de Rapa e Cadafaz,PTP,0,0,090326
União das freguesias de Rapa e Cadafaz,PURP,0,0,090326
