Objeto do Contrato,Tipo de Procedimento,Tipo(s) de Contrato,CPVs,Entidade(s) Adjudicante(s),Entidade(s) Adjudicatária(s),Preço Contratual,Data de Publicação,Data de Celebração do Contrato,Prazo de Execução,Local de Execução,Fundamentação,Data de Fecho do Contrato,Preço Total Efetivo,Causas das Alterações ao Prazo,Causas das Alterações ao Preço,Estado,N.º registo do Acordo Quadro,Descrição do Acordo Quadro,Procedimento Centralizado
"Droperidol 2,5 mg/ 1 ml Sol inj  IM, IV",Ao abrigo de acordo-quadro (art.º 258.º),Aquisição de bens móveis,"33600000-6, Produtos farmacêuticos",Instituto de Oftalmologia do Dr. Gama Pinto (600000052),OVERPHARMA - PRODUTOS MEDICOS E FARM.              (505792362),"40,00 €",20-10-2017,20-10-2017,20 dias,"Portugal, Lisboa, Lisboa",Artigo 258.º do Código dos Contratos Públicos,26-10-2017,"40,00 €",,,,2356543,CP 2016/19 - Medicamentos Antipsicóticos,FALSE
Lubrificante Ocular gel 10 g,Ajuste Direto Regime Geral,Aquisição de bens móveis,"33600000-6, Produtos farmacêuticos",Instituto de Oftalmologia do Dr. Gama Pinto (600000052),Bausch & Lomb (980218764),"420,00 €",20-10-2017,20-10-2017,20 dias,"Portugal, Lisboa, Lisboa","Artigo 20.º, n.º 1, alínea a) do Código dos Contratos Públicos",06-11-2017,"420,00 €",,,,Não aplicável.,Não aplicável.,FALSE
Alfentanil 1 mg/2 ml Sol inj  IV,Ajuste Direto Regime Geral,Aquisição de bens móveis,"33600000-6, Produtos farmacêuticos",Instituto de Oftalmologia do Dr. Gama Pinto (600000052),"Janssen-Cilag Farmacêutica, Lda. (500189412)","96,30 €",20-10-2017,20-10-2017,20 dias,"Portugal, Lisboa, Lisboa","Artigo 20.º, n.º 1, alínea a) do Código dos Contratos Públicos",21-11-2017,"96,30 €",,,,Não aplicável.,Não aplicável.,FALSE
Hidroxizina 25 mg cp,Ajuste Direto Regime Geral,Aquisição de bens móveis,"33600000-6, Produtos farmacêuticos",Instituto de Oftalmologia do Dr. Gama Pinto (600000052),"UCB Pharma, Lda. (500291322)","21,36 €",20-10-2017,20-10-2017,20 dias,"Portugal, Lisboa, Lisboa","Artigo 24.º, n.º 1, alínea e) do Código dos Contratos Públicos",25-10-2017,"21,36 €",,,,Não aplicável.,Não aplicável.,FALSE
"Apraclonidina 5 mg/ml  (0,5%) Col, sol  5 ml",Ao abrigo de acordo-quadro (art.º 258.º),Aquisição de bens móveis,"33600000-6, Produtos farmacêuticos",Instituto de Oftalmologia do Dr. Gama Pinto (600000052),"NOVARTIS FARMA-PROD.FARMACÊUTICOS,SA.              (500063524)","227,40 €",20-10-2017,20-10-2017,20 dias,"Portugal, Lisboa, Lisboa",Artigo 258.º do Código dos Contratos Públicos,30-10-2017,"227,40 €",,,,2124520,CP 2016/55 - Medicamentos Diversos,FALSE
Lidocaína 50 mg / 5 ml  (1%) Sol inj  IV -SC,Ao abrigo de acordo-quadro (art.º 259.º),Aquisição de bens móveis,"33600000-6, Produtos farmacêuticos",Instituto de Oftalmologia do Dr. Gama Pinto (600000052),"B. Braun Medical, Lda. (501506543)","119,50 €",20-10-2017,20-10-2017,20 dias,"Portugal, Lisboa, Lisboa",Artigo 259.º do Código dos Contratos Públicos,26-10-2017,"119,50 €",,,,461372,CP 2012/45 - MEDICAMENTOS ANESTÉSICOS E RELAXANTES MUSCULARES,FALSE
Iodopovidona 100 mg/ml Sol cut Fr 10 ml,Ao abrigo de acordo-quadro (art.º 258.º),Aquisição de bens móveis,"33600000-6, Produtos farmacêuticos",Instituto de Oftalmologia do Dr. Gama Pinto (600000052),"MEDA PHARMA - PRODUTOS FARMACÊUTICOS, SA.          (500082090)","100,00 €",20-10-2017,20-10-2017,20 dias,"Portugal, Lisboa, Lisboa",Artigo 258.º do Código dos Contratos Públicos,25-10-2017,"100,00 €",,,,1406003,CP 2015/8,FALSE
"HIALURONATO DE SODIO 10mg/ml (1%), amp.  0.85ml",Ajuste Direto Regime Geral,Aquisição de bens móveis,"33600000-6, Produtos farmacêuticos",Instituto de Oftalmologia do Dr. Gama Pinto (600000052),ALCON PORTUGAL (501251685),"7.984,00 €",20-10-2017,20-10-2017,60 dias,"Portugal, Lisboa, Lisboa","Artigo 20.º, n.º 1, alínea a) do Código dos Contratos Públicos",20-12-2017,"7.984,00 €",,,,Não aplicável.,Não aplicável.,FALSE
Alteplase 10 mg Pó sol inj Fr IV,Ao abrigo de acordo-quadro (art.º 258.º),Aquisição de bens móveis,"33600000-6, Produtos farmacêuticos",Instituto de Oftalmologia do Dr. Gama Pinto (600000052),"UNILFARMA -UNIÃO INTERNACIONAL SDE LABORATÓRIOS FARMACEUTICODD , LDA (500293023)","95,88 €",18-10-2017,16-10-2017,20 dias,"Portugal, Lisboa, Lisboa",Artigo 258.º do Código dos Contratos Públicos,27-10-2017,"95,88 €",,,,2489595,CP 2016/18 - Acordo quadro para fornecimento de Medicamentos do Grupo 4: Sangue às Instituições e Serviços do Serviço Nacional de Saúde,FALSE
"Pilocarpina 20 mg/ ml (2%) Col, sol unid 0,5 ml",Ajuste Direto Regime Geral,Aquisição de bens móveis,"33600000-6, Produtos farmacêuticos",Instituto de Oftalmologia do Dr. Gama Pinto (600000052),"Laboratório Edol - Produtos Farmacêuticos, SA (507072642)","320,00 €",13-10-2017,13-10-2017,20 dias,"Portugal, Lisboa, Lisboa","Artigo 24.º, n.º 1, alínea e) do Código dos Contratos Públicos",16-10-2017,"320,00 €",,,,Não aplicável.,Não aplicável.,FALSE
Implante n/ absorvível de drenagem cirurgia de glaucoma,Ajuste Direto Regime Geral,Aquisição de bens móveis,"33140000-3, Material médico de consumo",Instituto de Oftalmologia do Dr. Gama Pinto (600000052),ALCON PORTUGAL-PROD.EQUIP.OFTALMOLOGICOS (501251685),"7.920,00 €",12-10-2017,12-10-2017,94 dias,"Portugal, Lisboa, Lisboa","Artigo 24.º, n.º 1, alínea e) do Código dos Contratos Públicos",12-10-2017,"7.920,00 €",,,,Não aplicável.,Não aplicável.,FALSE
