Objeto do Contrato,Tipo de Procedimento,Tipo(s) de Contrato,CPVs,Entidade(s) Adjudicante(s),Entidade(s) Adjudicatária(s),Preço Contratual,Data de Publicação,Data de Celebração do Contrato,Prazo de Execução,Local de Execução,Fundamentação,Data de Fecho do Contrato,Preço Total Efetivo,Causas das Alterações ao Prazo,Causas das Alterações ao Preço,Estado,N.º registo do Acordo Quadro,Descrição do Acordo Quadro,Procedimento Centralizado
Prestação de Serviços de Actualização de Plataforma Janela Aberta à Família,Ajuste Direto Regime Geral,Aquisição de serviços,"72266000-7, Serviços de consultoria em matéria de software","Administração Regional de Saúde do Algarve, I. P. (503148709)",ADJ3 Sistemas (504026127),"8.130,00 €",30-07-2018,30-07-2018,153 dias,"Portugal, Faro, Faro","Artigo 20.º, n.º 1, alínea d) do Código dos Contratos Públicos",31-12-2018,"8.130,00 €",,,,Não aplicável.,Não aplicável.,FALSE
Aquisição de Material de Penso efeito Terapêutico - carboximetilceluose,Ao abrigo de acordo-quadro (art.º 259.º),Aquisição de bens móveis,"33140000-3, Material médico de consumo","Administração Regional de Saúde do Algarve, I. P. (503148709)","Kvtech Portugal - Produtos Médicos, Unipessoal, Lda. (508671531)","72.188,10 €",30-07-2018,30-07-2018,150 dias,"Portugal, Faro",Artigo 259.º do Código dos Contratos Públicos,21-11-2018,"72.188,10 €",,,,1315192,Acordo Quadro para fornecimento de material de penso de efeito terapêutico às Instituições e Serviços do Serviço Nacional de Saúde,FALSE
AM 275/2018 - Aquisição de reagentes e consumiveis para o setor quimica de aguas,Ajuste Direto Regime Geral,Aquisição de bens móveis,"33696000-5, Reagentes e meios de contraste","Administração Regional de Saúde do Algarve, I. P. (503148709)","Tecnilab Portugal Soc Planeamento Tecnico e Cientifico, SA (500758158)","512,44 €",30-07-2018,30-07-2018,30 dias,"Portugal, Faro, Faro","Artigo 24.º, n.º 1, alínea e), subalínea iii) do Código dos Contratos Públicos","","",,,,Não aplicável.,Não aplicável.,FALSE
SC/255/2018-Fornecimento de equipamentos de saúde oral,Ao abrigo de acordo-quadro (art.º 259.º),Aquisição de bens móveis,"33126000-9, Aparelhos para estomatologia","Administração Regional de Saúde do Algarve, I. P. (503148709)","MONTELLANO, LDA (500196494)","11.894,00 €",24-07-2018,18-07-2018,30 dias,"Portugal, Faro, Loulé<BR/>Portugal, Faro, Lagos",Artigo 259.º do Código dos Contratos Públicos,24-08-2018,"11.894,00 €",,,,3053244,CP 2017/209 - Acordo quadro para fornecimento de Equipamentos de saúde oral para as Unidades Dentárias das Instituições e Serviços do Serviço Nacional de Saúde,FALSE
