Objeto do Contrato,Tipo de Procedimento,Tipo(s) de Contrato,CPVs,Entidade(s) Adjudicante(s),Entidade(s) Adjudicatária(s),Preço Contratual,Data de Publicação,Data de Celebração do Contrato,Prazo de Execução,Local de Execução,Fundamentação,Data de Fecho do Contrato,Preço Total Efetivo,Causas das Alterações ao Prazo,Causas das Alterações ao Preço,Estado,N.º registo do Acordo Quadro,Descrição do Acordo Quadro,Procedimento Centralizado
Aquisição de combinados de Laboratório,Ajuste Direto Regime Geral,Aquisição de bens móveis,"42513200-7, Equipamento de refrigeração","Instituto Nacional de Saúde Dr. Ricardo Jorge, I.P. (501427511)",CONCESSUS (500070040),"6.475,50 €",04-01-2013,20-12-2012,30 dias,"Portugal, Lisboa, Lisboa","Artigo 20.º, n.º 1, alínea a) do Código dos Contratos Públicos",,,,,,Não aplicável.,Não aplicável.,
Aquisição de Arca Vertical,Ajuste Direto Regime Geral,Aquisição de bens móveis,"42513200-7, Equipamento de refrigeração","Instituto Nacional de Saúde Dr. Ricardo Jorge, I.P. (501427511)",SUPPLYLAB (508453534),"8.121,50 €",04-01-2013,20-12-2012,30 dias,"Portugal, Lisboa, Lisboa","Artigo 20.º, n.º 1, alínea a) do Código dos Contratos Públicos",,,,,,Não aplicável.,Não aplicável.,
AQUISIÇÃO DE EQUIPAMENTO,Ajuste Direto Regime Geral,Aquisição de serviços<br/>Aquisição de bens móveis,"43329000-5, Conjuntos de equipamento","Instituto Nacional de Saúde Dr. Ricardo Jorge, I.P. (501427511)",SALICRU (502359536),"335,00 €",04-01-2013,28-12-2012,30 dias,"Portugal, Lisboa, Lisboa","Artigo 20.º, n.º 1, alínea a) do Código dos Contratos Públicos",,,,,,Não aplicável.,Não aplicável.,
Aquisição de centrífuga refigerada.,Ajuste Direto Regime Geral,Aquisição de bens móveis,"42513200-7, Equipamento de refrigeração","Instituto Nacional de Saúde Dr. Ricardo Jorge, I.P. (501427511)",VWR (503842770),"6.910,96 €",04-01-2013,21-12-2012,30 dias,"Portugal, Lisboa, Lisboa","Artigo 20.º, n.º 1, alínea a) do Código dos Contratos Públicos",,,,,,Não aplicável.,Não aplicável.,
Fornecimento de diversas peças para elevadores,Ajuste Direto Regime Geral,Aquisição de bens móveis,"42419510-4, Peças para elevadores","Instituto Nacional de Saúde Dr. Ricardo Jorge, I.P. (501427511)","Schindler Ascensores e Escadas Rolantes, S.A. (502353740)","22.536,03 €",03-01-2013,28-12-2012,3 dias,"Portugal, Lisboa, Lisboa","Artigo 26.º, n.º 1, alínea a) do Código dos Contratos Públicos",,,,,,Não aplicável.,Não aplicável.,
