freguesia,acronym,validVotesPercentage,votes,dicofre
Bárrio,PS,43.59,221,100104
Bárrio,PPD/PSD,23.67,120,100104
Bárrio,B.E.,7.5,38,100104
Bárrio,PCP-PEV,7.3,37,100104
Bárrio,CDS-PP,7.1,36,100104
Bárrio,PAN,3.75,19,100104
Bárrio,L,1.78,9,100104
Bárrio,PPM.PPV/CDC,1.38,7,100104
Bárrio,A,0.99,5,100104
Bárrio,IL,0.79,4,100104
Bárrio,NC,0.79,4,100104
Bárrio,PCTP/MRPP,0.39,2,100104
Bárrio,PDR,0.39,2,100104
Bárrio,PNR,0.39,2,100104
Bárrio,MAS,0.2,1,100104
Bárrio,PTP,0,0,100104
Bárrio,PURP,0,0,100104
