freguesia,acronym,validVotesPercentage,votes,dicofre
Rapoula do Côa,PPD/PSD.CDS-PP,52.11,37,091125
Rapoula do Côa,PS,29.58,21,091125
Rapoula do Côa,MPT,8.45,6,091125
Rapoula do Côa,PCP-PEV,2.82,2,091125
Rapoula do Côa,L,1.41,1,091125
Rapoula do Côa,MAS,1.41,1,091125
Rapoula do Côa,PAN,1.41,1,091125
Rapoula do Côa,PND,1.41,1,091125
Rapoula do Côa,PPM,1.41,1,091125
Rapoula do Côa,B.E.,0,0,091125
Rapoula do Côa,PCTP/MRPP,0,0,091125
Rapoula do Côa,PDA,0,0,091125
Rapoula do Côa,PNR,0,0,091125
Rapoula do Côa,POUS,0,0,091125
Rapoula do Côa,PPV,0,0,091125
Rapoula do Côa,PTP,0,0,091125
