Objeto do Contrato,Tipo de Procedimento,Tipo(s) de Contrato,CPVs,Entidade(s) Adjudicante(s),Entidade(s) Adjudicatária(s),Preço Contratual,Data de Publicação,Data de Celebração do Contrato,Prazo de Execução,Local de Execução,Fundamentação,Data de Fecho do Contrato,Preço Total Efetivo,Causas das Alterações ao Prazo,Causas das Alterações ao Preço,Estado,N.º registo do Acordo Quadro,Descrição do Acordo Quadro,Procedimento Centralizado
"mifepristona, mesna",Ajuste Direto Regime Geral,Aquisição de bens móveis,"33690000-3, Medicamentos vários","Centro Hospitalar de Setúbal, E. P. E. (507606787)",Distrifarma (502041285),"18.600,00 €",08-05-2014,16-01-2014,365 dias,"Portugal, Setúbal, Setúbal","Artigo 26.º, n.º 1, alínea e) do Código dos Contratos Públicos",,"",,"",,Não aplicável.,Não aplicável.,FALSE
morotocog alfa 2000,Ajuste Direto Regime Geral,Aquisição de bens móveis,"33690000-3, Medicamentos vários","Centro Hospitalar de Setúbal, E. P. E. (507606787)",laboratorios Pfizer (500162166),"344.997,50 €",08-05-2014,08-01-2014,365 dias,"Portugal, Setúbal, Setúbal","Artigo 26.º, n.º 1, alínea e) do Código dos Contratos Públicos",,"",,"",,Não aplicável.,Não aplicável.,FALSE
"Azacitadina, lenalidomida 15mg e 25mg, paclitaxel 5mg, talidomida 50mg.",Ajuste Direto Regime Geral,Aquisição de bens móveis,"33690000-3, Medicamentos vários","Centro Hospitalar de Setúbal, E. P. E. (507606787)",Celgene sociedade unipessoal (507791690),"264.750,45 €",06-05-2014,08-01-2014,365 dias,"Portugal, Setúbal, Setúbal","Artigo 26.º, n.º 1, alínea e) do Código dos Contratos Públicos",,"",,"",,Não aplicável.,Não aplicável.,FALSE
"vinorelbina 20mg, 50mg",Ajuste Direto Regime Geral,Aquisição de bens móveis,"33690000-3, Medicamentos vários","Centro Hospitalar de Setúbal, E. P. E. (507606787)",PIERRE FABRE MEDICAMENT (500230366),"93.125,00 €",05-05-2014,08-01-2014,365 dias,"Portugal, Setúbal, Setúbal","Artigo 26.º, n.º 1, alínea e) do Código dos Contratos Públicos",,"",,"",,Não aplicável.,Não aplicável.,FALSE
"tenofovir 245mg, anfotericina B lipossomica.",Ajuste Direto Regime Geral,Aquisição de bens móveis,"33690000-3, Medicamentos vários","Centro Hospitalar de Setúbal, E. P. E. (507606787)",GILEAD  (503604704),"328.654,39 €",05-05-2014,02-04-2014,365 dias,"Portugal, Setúbal, Setúbal","Artigo 26.º, n.º 1, alínea e) do Código dos Contratos Públicos",,"",,"",,Não aplicável.,Não aplicável.,FALSE
Comunicações Móveis - ano 2014,Ajuste Direto Regime Geral,Aquisição de serviços,"64000000-6, Serviços postais e de telecomunicações","Centro Hospitalar de Setúbal, E. P. E. (507606787)",meo (502600268),"27.000,00 €",02-05-2014,19-02-2014,365 dias,"Portugal, Setúbal, Setúbal","Artigo 21.º, n.º 1, alínea a) do Código dos Contratos Públicos",,"",,"",,Não aplicável.,Não aplicável.,FALSE
Comunicação Dados - HSB/HOSO,Ajuste Direto Regime Geral,Aquisição de serviços,"98000000-3, Outros serviços comunitários, sociais e pessoais","Centro Hospitalar de Setúbal, E. P. E. (507606787)",PT Comunicações (504615947),"24.914,40 €",02-05-2014,09-01-2014,365 dias,"Portugal, Setúbal, Setúbal","Artigo 21.º, n.º 1, alínea a) do Código dos Contratos Públicos",,"",,"",,Não aplicável.,Não aplicável.,FALSE
DERIVADOS PLASMA HUMANO,Ajuste Direto Regime Geral,Aquisição de bens móveis,"33690000-3, Medicamentos vários","Centro Hospitalar de Setúbal, E. P. E. (507606787)",OCTAPHARMA  (502820780),"49.980,00 €",02-05-2014,21-03-2014,365 dias,"Portugal, Setúbal, Setúbal","Artigo 26.º, n.º 1, alínea e) do Código dos Contratos Públicos",,"",,"",,Não aplicável.,Não aplicável.,FALSE
Serviços Médicos Dermatologia - Janeiro a Junho 2014,Ajuste Direto Regime Geral,Aquisição de serviços,"85000000-9, Serviços de saúde e acção social","Centro Hospitalar de Setúbal, E. P. E. (507606787)",Urgimédica (501663878),"17.700,00 €",02-05-2014,24-01-2014,183 dias,"Portugal, Setúbal, Setúbal","Artigo 21.º, n.º 1, alínea a) do Código dos Contratos Públicos",,"9.882,50 €",,menos serviços/hrs prestadas mês,,Não aplicável.,Não aplicável.,FALSE
