freguesia,acronym,validVotesPercentage,votes,dicofre
Rio de Mouro,PS,31.53,3483,111108
Rio de Mouro,PPD/PSD.CDS-PP,20.57,2272,111108
Rio de Mouro,PCP-PEV,18.97,2096,111108
Rio de Mouro,MPT,8.19,905,111108
Rio de Mouro,B.E.,7.47,825,111108
Rio de Mouro,L,3.31,366,111108
Rio de Mouro,PAN,3.23,357,111108
Rio de Mouro,PCTP/MRPP,2.46,272,111108
Rio de Mouro,PNR,0.95,105,111108
Rio de Mouro,PPM,0.79,87,111108
Rio de Mouro,PTP,0.62,68,111108
Rio de Mouro,PND,0.55,61,111108
Rio de Mouro,PPV,0.55,61,111108
Rio de Mouro,MAS,0.54,60,111108
Rio de Mouro,PDA,0.14,16,111108
Rio de Mouro,POUS,0.12,13,111108
