freguesia,acronym,validVotesPercentage,votes,dicofre
Paranhos,PPD/PSD,42.19,127,091208
Paranhos,PS,36.21,109,091208
Paranhos,CDS-PP,5.65,17,091208
Paranhos,B.E.,4.98,15,091208
Paranhos,A,2.99,9,091208
Paranhos,PCP-PEV,2.66,8,091208
Paranhos,NC,1.66,5,091208
Paranhos,PAN,1,3,091208
Paranhos,PURP,1,3,091208
Paranhos,IL,0.33,1,091208
Paranhos,L,0.33,1,091208
Paranhos,PDR,0.33,1,091208
Paranhos,PNR,0.33,1,091208
Paranhos,PPM.PPV/CDC,0.33,1,091208
Paranhos,MAS,0,0,091208
Paranhos,PCTP/MRPP,0,0,091208
Paranhos,PTP,0,0,091208
