Objeto do Contrato,Tipo de Procedimento,Tipo(s) de Contrato,CPVs,Entidade(s) Adjudicante(s),Entidade(s) Adjudicatária(s),Preço Contratual,Data de Publicação,Data de Celebração do Contrato,Prazo de Execução,Local de Execução,Fundamentação,Data de Fecho do Contrato,Preço Total Efetivo,Causas das Alterações ao Prazo,Causas das Alterações ao Preço,Estado,N.º registo do Acordo Quadro,Descrição do Acordo Quadro,Procedimento Centralizado
Aquisição de Uma Incubadora para a Neonatologia,Ajuste Direto Regime Geral,Aquisição de bens móveis,"33152000-0, Incubadoras","Hospital Professor Doutor Fernando Fonseca, E. P. E. (503035416)",SPACEINSP (514126329),"16.990,00 €",11-10-2018,20-03-2018,45 dias,"Portugal, Lisboa, Amadora","Artigo 20.º, n.º 1, alínea d) do Código dos Contratos Públicos",,,,,,Não aplicável.,Não aplicável.,FALSE
Aquisição de 2 Microscópios de Diagnóstico Anatomoclínico com 1 e 2 observadores,Ajuste Direto Regime Geral,Aquisição de bens móveis,"38510000-3, Microscópios",Hospital Prof. Doutor Fernando Fonseca E.P.E. (503035416),OLYMPUS IBERIA S.A. SUCURSAL EM PORTUGAL (980474710),"10.055,00 €",11-10-2018,12-03-2018,30 dias,"Portugal, Lisboa, Amadora","Artigo 20.º, n.º 1, alínea d) do Código dos Contratos Públicos",,,,,,Não aplicável.,Não aplicável.,FALSE
Aquisição de 2 Carros Transporte Refeição e 60 Tabuleiros,Consulta Prévia,Aquisição de bens móveis,"39310000-8, Equipamento para fornecimento de refeições (catering)","Hospital Professor Doutor Fernando Fonseca, E. P. E. (503035416)",Higiomed (504130617),"30.084,60 €",11-10-2018,28-09-2018,20 dias,"Portugal, Lisboa, Amadora","Artigo 20.º, n.º 1, alínea c) do Código dos Contratos Públicos",,,,,,Não aplicável.,Não aplicável.,FALSE
Aquisição de 1 Ventilador Neonatal Fabian,Ajuste Direto Regime Geral,Aquisição de bens móveis,"39714100-1, Ventiladores",Hospital Prof. Doutor Fernando Fonseca E.P.E. (503035416),SPACEINSP (514126329),"16.500,00 €",11-10-2018,04-06-2018,30 dias,"Portugal, Lisboa, Amadora","Artigo 20.º, n.º 1, alínea d) do Código dos Contratos Públicos",,,,,,Não aplicável.,Não aplicável.,FALSE
Aquisição de 1 Aparelho de Capnografia,Ajuste Direto Regime Geral,Aquisição de bens móveis,"33124100-6, Aparelhos para diagnóstico","Hospital Professor Doutor Fernando Fonseca, E. P. E. (503035416)",Radiometer (980201667),"9.252,86 €",10-10-2018,10-10-2018,30 dias,"Portugal, Lisboa, Amadora","Artigo 20.º, n.º 1, alínea d) do Código dos Contratos Públicos",,,,,,Não aplicável.,Não aplicável.,FALSE
Aquisição de Um Ecógrafo para a Urologia,Ajuste Direto Regime Geral,Aquisição de bens móveis,"33124120-2, Aparelhos de ultra-sons","Hospital Professor Doutor Fernando Fonseca, E. P. E. (503035416)",LUSOPALEX UNIPESSOAL LDA (503531588),"70.000,00 €",09-10-2018,02-10-2018,30 dias,"Portugal, Lisboa, Amadora","Artigo 24.º, n.º 1, alínea e), subalínea ii) do Código dos Contratos Públicos",,,,,,Não aplicável.,Não aplicável.,FALSE
"Aquisição E Instalação De Três Ecógrafos E Respetivas Sondas, Para O Serviço De Imagiologia",Concurso público,Aquisição de bens móveis,"33124120-2, Aparelhos de ultra-sons","Hospital Professor Doutor Fernando Fonseca, E. P. E. (503035416)","GENERAL ELECTRIC HEALTHCARE PORTUGAL, SOC UNIP LDA (500357129)","227.500,00 €",09-10-2018,08-10-2018,30 dias,"Portugal, Lisboa, Amadora","Artigo 20.º, n.º 1, alínea a) do Código dos Contratos Públicos",,,,,,Não aplicável.,Não aplicável.,FALSE
Aquisição de Equipamento Laser para a Ginecologia,Ajuste Direto Regime Geral,Aquisição de bens móveis,"33169100-3, Laser cirúrgico","Hospital Professor Doutor Fernando Fonseca, E.P.E. (503035416)","MEDICINALIA CORMEDICA - COMER. PROD. MED. HOSP.,LD (500684324)","79.700,00 €",08-10-2018,08-06-2018,30 dias,"Portugal, Lisboa, Amadora","Artigo 24.º, n.º 1, alínea b) do Código dos Contratos Públicos",,,,,,Não aplicável.,Não aplicável.,FALSE
