Objeto do Contrato,Tipo de Procedimento,Tipo(s) de Contrato,CPVs,Entidade(s) Adjudicante(s),Entidade(s) Adjudicatária(s),Preço Contratual,Data de Publicação,Data de Celebração do Contrato,Prazo de Execução,Local de Execução,Fundamentação,Data de Fecho do Contrato,Preço Total Efetivo,Causas das Alterações ao Prazo,Causas das Alterações ao Preço,Estado,N.º registo do Acordo Quadro,Descrição do Acordo Quadro,Procedimento Centralizado
Aquisição de Gás Natural 2016_UMC_GAS NATURAL,Concurso público,Aquisição de bens móveis,"09123000-7, Gás natural","Unidade Local de Saúde de Castelo Branco, E.P.E. (509309844)",Galp Power (504723456),"136.488,52 €",16-01-2017,05-02-2016,365 dias,"Portugal, Castelo Branco, Castelo Branco",Artigo 239.º do Código dos Contratos Públicos,,,,,,Não aplicável.,Não aplicável.,TRUE
Fornecimento de Eletricidade 2016_UMC_EE_LOTE5,Ao abrigo de acordo-quadro (art.º 259.º),Aquisição de bens móveis,"09310000-5, Electricidade","Unidade Local de Saúde de Castelo Branco, E.P.E. (509309844)","EDP Comercial - Comercialização de Energia, S.A. (503504564)","243.178,86 €",16-01-2017,21-12-2015,365 dias,"Portugal, Castelo Branco, Castelo Branco",Artigo 259.º do Código dos Contratos Públicos,,,,,,314294,Acordo quadro para o fornecimento de electricidade em regime de mercado livre para Portugal Continental,TRUE
Aquisição de papel para fotocópia e impressão 2016_UMC_PECON_L1,Ao abrigo de acordo-quadro (art.º 259.º),Aquisição de bens móveis,"30197643-5, Papel para fotocópia","Unidade Local de Saúde de Castelo Branco, E. P. E. (509309844)",OHM Técnica (504059521),"19.605,60 €",16-01-2017,01-01-2016,365 dias,"Portugal, Castelo Branco, Castelo Branco",Artigo 259.º do Código dos Contratos Públicos,,,,,,1351201,Acordo quadro de fornecimento de papel e economato,TRUE
Aquisição de economato para 2016_UMC_PECON_L2,Ao abrigo de acordo-quadro (art.º 259.º),Aquisição de bens móveis,"30192000-1, Material de escritório","Unidade Local de Saúde de Castelo Branco, E.P.E. (509309844)",OHM Técnica (504059521),"3.789,24 €",16-01-2017,01-01-2016,365 dias,"Portugal, Castelo Branco, Castelo Branco",Artigo 259.º do Código dos Contratos Públicos,,,,,,1351201,Acordo quadro de fornecimento de papel e economato,TRUE
