freguesia,acronym,validVotesPercentage,votes,dicofre
União das freguesias de Crespos e Pousada,PS,41.02,169,030368
União das freguesias de Crespos e Pousada,PPD/PSD,35.68,147,030368
União das freguesias de Crespos e Pousada,B.E.,7.77,32,030368
União das freguesias de Crespos e Pousada,CDS-PP,4.85,20,030368
União das freguesias de Crespos e Pousada,PCP-PEV,3.64,15,030368
União das freguesias de Crespos e Pousada,PAN,2.43,10,030368
União das freguesias de Crespos e Pousada,PCTP/MRPP,1.46,6,030368
União das freguesias de Crespos e Pousada,A,1.21,5,030368
União das freguesias de Crespos e Pousada,L,0.49,2,030368
União das freguesias de Crespos e Pousada,NC,0.49,2,030368
União das freguesias de Crespos e Pousada,PURP,0.49,2,030368
União das freguesias de Crespos e Pousada,PPM.PPV/CDC,0.24,1,030368
União das freguesias de Crespos e Pousada,PTP,0.24,1,030368
União das freguesias de Crespos e Pousada,IL,0,0,030368
União das freguesias de Crespos e Pousada,MAS,0,0,030368
União das freguesias de Crespos e Pousada,PDR,0,0,030368
União das freguesias de Crespos e Pousada,PNR,0,0,030368
