Objeto do Contrato,Tipo de Procedimento,Tipo(s) de Contrato,CPVs,Entidade(s) Adjudicante(s),Entidade(s) Adjudicatária(s),Preço Contratual,Data de Publicação,Data de Celebração do Contrato,Prazo de Execução,Local de Execução,Fundamentação,Data de Fecho do Contrato,Preço Total Efetivo,Causas das Alterações ao Prazo,Causas das Alterações ao Preço,Estado,N.º registo do Acordo Quadro,Descrição do Acordo Quadro,Procedimento Centralizado
"O presente contrato tem por objecto a prestação de serviços de Manutenção e Assistência Técnica aos Equipamentos de Ar Condicionado, Ventilação, Instalações Frigoríficas e Outros do Centro Hospitalar Universitário do Algarve, E.P.E.",Ajuste Direto Regime Geral,Aquisição de serviços,"50000000-5, Serviços de reparação e manutenção","Centro Hospitalar Universitário do Algarve, E. P. E. (510745997)",SUCH | Serviço de Utilização Comum dos Hospitais (500900469),"45.258,00 €",21-01-2019,01-01-2019,90 dias,"Portugal, Faro, Portimão<BR/>Portugal, Faro, Faro<BR/>Portugal, Faro, Lagos<BR/>Portugal, Faro, Vila Real Sto Antonio<BR/>Portugal, Faro, Loulé<BR/>Portugal, Faro, Albufeira","Artigo 24.º, n.º 1, alínea c) do Código dos Contratos Públicos",,,,,,Não aplicável.,Não aplicável.,FALSE
Prestação de Serviços de Transporte de Doentes em Ambulância (Avença),Ajuste Direto Regime Geral,Aquisição de serviços,"85143000-3, Serviços de ambulâncias","Centro Hospitalar Universitário do Algarve, E. P. E. (510745997)",TRANSPORTES FLOR DA RIA (502606460),"296.460,00 €",21-01-2019,01-01-2019,90 dias,"Portugal, Faro","Artigo 24.º, n.º 1, alínea c) do Código dos Contratos Públicos",,,,,,Não aplicável.,Não aplicável.,FALSE
"O presente contrato tem por objecto a prestação, pelo Segundo Outorgante ao Primeiro Outorgante, de serviços de vigilância e segurança no Centro Hospitalar Universitário do Algarve, EPE, nomeadamente nas Unidades Hospitalares de Faro, Portimão e Lagos, incluindo ainda Departamento de Psiquiatria e Saúde Mental, Centro de Medicina de Reabilitação do Sul, Serviço de Urgência Básica de Vila Real Santo António (SUB VRSA), Serviço de Urgência Básica de Loulé (SUB Loulé) e Serviço de Urgência Básica de Albufeira (SUB Albufeira).",Ajuste Direto Regime Geral,Aquisição de serviços,"79710000-4, Serviços de segurança","Centro Hospitalar Universitário do Algarve, E. P. E. (510745997)","Securitas - Serviços e Tecnologia de Segurança, S.A. (500243719)","318.369,00 €",21-01-2019,01-01-2019,90 dias,"Portugal, Faro, São Brás de Alportel<BR/>Portugal, Faro, Faro<BR/>Portugal, Faro, Vila Real Sto Antonio<BR/>Portugal, Faro, Albufeira<BR/>Portugal, Faro, Portimão<BR/>Portugal, Faro, Loulé<BR/>Portugal, Faro, Lagos","Artigo 24.º, n.º 1, alínea c) do Código dos Contratos Públicos",,,,,,Não aplicável.,Não aplicável.,FALSE
31/1341/2018-Nifedipina 60 mg,Ao abrigo de acordo-quadro (art.º 258.º),Aquisição de bens móveis,"33600000-6, Produtos farmacêuticos","Centro Hospitalar Universitário do Algarve, E.P.E. (510745997)",bayer (500043256),"1.708,56 €",21-01-2019,26-02-2018,270 dias,"Portugal, Faro, Faro","Artigo 26.º, n.º 1, alínea e) do Código dos Contratos Públicos",,,,,,2335591,CP 2016/01 - Acordo Quadro para fornecimento de Medicamentos do Aparelho Cardiovascular   às Instituições e Serviços do Serviço Nacional de Saúde,FALSE
31/1343/2018-toxina botulinica A 100 U,Ao abrigo de acordo-quadro (art.º 258.º),Aquisição de bens móveis,"33600000-6, Produtos farmacêuticos","Centro Hospitalar Universitário do Algarve, E.P.E. (510745997)",profarin (500223238),"38.918,00 €",21-01-2019,07-03-2018,270 dias,"Portugal, Faro, Faro","Artigo 26.º, n.º 1, alínea e) do Código dos Contratos Públicos",,,,,,2211341,Medicamentos anestésicos e relaxantes musculares,FALSE
31/1382/2018-Sugamadex 100 mg,Ao abrigo de acordo-quadro (art.º 258.º),Aquisição de bens móveis,"33600000-6, Produtos farmacêuticos","Centro Hospitalar Universitário do Algarve, E.P.E. (510745997)",msd (500191360),"26.003,60 €",21-01-2019,07-03-2018,270 dias,"Portugal, Faro, Faro","Artigo 26.º, n.º 1, alínea e) do Código dos Contratos Públicos",,,,,,2775699,"CP 2017/50 - Medicação antialérgica, vitaminas e sais minerais, medicamentos usados no tratamento de intoxicações e grupo 20.9",FALSE
31/1383/2018-Erlotinib 25 mg,Ao abrigo de acordo-quadro (art.º 258.º),Aquisição de bens móveis,"33600000-6, Produtos farmacêuticos","Centro Hospitalar Universitário do Algarve, E.P.E. (510745997)",roche fatmaceutica (500233810),"2.549,70 €",21-01-2019,22-02-2018,300 dias,"Portugal, Faro, Faro","Artigo 26.º, n.º 1, alínea e) do Código dos Contratos Públicos",,,,,,1771819,CP 2015/6 - Acordo quadro para o fornecimento de Medicamentos do Foro Oncológico,FALSE
31/1385/2018-Enoxaparina 20 mg,Ao abrigo de acordo-quadro (art.º 258.º),Aquisição de bens móveis,"33600000-6, Produtos farmacêuticos","Centro Hospitalar Universitário do Algarve, E. P. E. (510745997)",sanofi (500134960),"3.720,00 €",21-01-2019,22-02-2018,300 dias,"Portugal, Faro, Faro","Artigo 26.º, n.º 1, alínea e) do Código dos Contratos Públicos",,,,,,2489595,CP 2016/18 - Acordo quadro para fornecimento de Medicamentos do Grupo 4: Sangue às Instituições e Serviços do Serviço Nacional de Saúde,FALSE
Prestação de Serviços de Manutenção das Instalações,Ajuste Direto Regime Geral,Aquisição de serviços,"50000000-5, Serviços de reparação e manutenção","Centro Hospitalar Universitário do Algarve, E. P. E. (510745997)","Acciona Facility Services, S.A. (503431397)","131.846,07 €",21-01-2019,01-01-2019,90 dias,"Portugal, Faro, Portimão<BR/>Portugal, Faro, Faro<BR/>Portugal, Faro, Lagos<BR/>Portugal, Faro, Loulé<BR/>Portugal, Faro, Albufeira<BR/>Portugal, Faro, Vila Real Sto Antonio","Artigo 24.º, n.º 1, alínea c) do Código dos Contratos Públicos",,,,,,Não aplicável.,Não aplicável.,FALSE
Prestação de Serviços de Manutenção das Instalações do Centro de Medicina Física e Reabilitação do Sul - Meses de Janeiro e Fevereiro de 2019,Ajuste Direto Regime Geral,Aquisição de serviços,"50000000-5, Serviços de reparação e manutenção","Centro Hospitalar Universitário do Algarve, E. P. E. (510745997)","Veolia Portugal, S.A. (502876581)","18.100,00 €",18-01-2019,01-01-2019,59 dias,"Portugal, Faro, São Brás de Alportel","Artigo 24.º, n.º 1, alínea c) do Código dos Contratos Públicos",,,,,,Não aplicável.,Não aplicável.,FALSE
Prestação de Serviços de Higiene e Limpeza,Ajuste Direto Regime Geral,Aquisição de serviços,"90910000-9, Serviços de limpeza","Centro Hospitalar Universitário do Algarve, E. P. E. (510745997)",CLECE S.A (513789995),"116.333,25 €",18-01-2019,01-01-2019,90 dias,"Portugal, Faro, Portimão<BR/>Portugal, Faro, São Brás de Alportel<BR/>Portugal, Faro, Lagos<BR/>Portugal, Faro, Faro","Artigo 24.º, n.º 1, alínea c) do Código dos Contratos Públicos",,,,,,Não aplicável.,Não aplicável.,FALSE
62/0502/2018- Aquisição de Agulhas,Ajuste Direto Regime Geral,Aquisição de bens móveis,"33140000-3, Material médico de consumo","Centro Hospitalar Universitário do Algarve, E.P.E. (510745997)",CATETER-PROD.MEDICOS HOSP.LDA. (502914319),"1.096,20 €",18-01-2019,15-01-2019,350 dias,"Portugal, Faro, Faro","Artigo 24.º, n.º 1, alínea e), subalínea iii) do Código dos Contratos Públicos",,,,,,Não aplicável.,Não aplicável.,FALSE
62/0501/2019- Aquisição de Agulhas,Ajuste Direto Regime Geral,Aquisição de bens móveis,"33140000-3, Material médico de consumo","Centro Hospitalar Universitário do Algarve, E.P.E. (510745997)","C.R BARD PORTUGAL - PRODUCTOS E ARTIGOS MEDICOS FARM, LDA. (502438274)","25.340,00 €",18-01-2019,17-01-2019,349 dias,"Portugal, Faro, Faro","Artigo 24.º, n.º 1, alínea e), subalínea iii) do Código dos Contratos Públicos",,,,,,Não aplicável.,Não aplicável.,FALSE
Aquisição de Dispositivos de evacuação e outro material,Ao abrigo de acordo-quadro (art.º 259.º),Aquisição de bens móveis,"33600000-6, Produtos farmacêuticos","Centro Hospitalar Universitário do Algarve, E.P.E. (510745997)","EZEQUIEL PANAO JORGE,LDA (501412727)","100,20 €",18-01-2019,07-12-2018,1095 dias,"Portugal, Faro, Faro<BR/>Portugal, Faro, Portimão<BR/>Portugal",Artigo 259.º do Código dos Contratos Públicos,,,,,,2349400,Acordo quadro para o fornecimento de Dispositivos para evacuação e para banho.,FALSE
Aquisição de Dispositivos de evacuação e outro material,Ao abrigo de acordo-quadro (art.º 259.º),Aquisição de bens móveis,"33140000-3, Material médico de consumo","Centro Hospitalar Universitário do Algarve, E.P.E. (510745997)",AVIQUIMICA IMPORT E MANUFATURA (500039720),"58.439,01 €",18-01-2019,07-12-2018,1095 dias,"Portugal, Faro, Faro<BR/>Portugal, Faro, Portimão<BR/>Portugal",Artigo 259.º do Código dos Contratos Públicos,,,,,,2349400,Acordo quadro para o fornecimento de Dispositivos para evacuação e para banho.,FALSE
Aquisição de Campos Operatórios,Ao abrigo de acordo-quadro (art.º 259.º),Aquisição de bens móveis,"39518200-8, Lençóis para blocos operatórios","Centro Hospitalar Universitário do Algarve, E.P.E. (510745997)","ANASTACIO SALDANHA UNIPESSOAL, LDA. (505804441)","6.535,20 €",18-01-2019,10-12-2018,1095 dias,"Portugal, Faro, Faro<BR/>Portugal<BR/>Portugal, Faro, Portimão",Artigo 259.º do Código dos Contratos Públicos,,,,,,2497138,CP 2016/42 - Acordo quadro para o fornecimento de Campos Operatórios,FALSE
Aquisição de Campos Operatórios,Ao abrigo de acordo-quadro (art.º 259.º),Aquisição de bens móveis,"39518200-8, Lençóis para blocos operatórios","Centro Hospitalar Universitário do Algarve, E.P.E. (510745997)","PAUL HARTMANN, LDA. (502271728)","5.120,79 €",18-01-2019,10-12-2018,1095 dias,"Portugal<BR/>Portugal, Faro, Faro<BR/>Portugal, Faro, Portimão",Artigo 259.º do Código dos Contratos Públicos,,,,,,2497138,CP 2016/42 - Acordo quadro para o fornecimento de Campos Operatórios,FALSE
Aquisição de Campos Operatórios,Ao abrigo de acordo-quadro (art.º 259.º),Aquisição de bens móveis,"39518200-8, Lençóis para blocos operatórios","Centro Hospitalar Universitário do Algarve, E.P.E. (510745997)","OVERPHARMA,LDA. (505792362)","583,00 €",18-01-2019,10-12-2018,1095 dias,"Portugal, Faro, Faro<BR/>Portugal<BR/>Portugal, Faro, Portimão",Artigo 259.º do Código dos Contratos Públicos,,,,,,2497138,CP 2016/42 - Acordo quadro para o fornecimento de Campos Operatórios,FALSE
Aquisição de Campos Operatórios,Ao abrigo de acordo-quadro (art.º 259.º),Aquisição de bens móveis,"39518200-8, Lençóis para blocos operatórios","Centro Hospitalar Universitário do Algarve, E.P.E. (510745997)","OASIPOR-IMPORTAÇÃO E EXPORTAÇÃO, S.A. (502260750)","16.214,64 €",18-01-2019,10-12-2018,1095 dias,"Portugal, Faro, Faro<BR/>Portugal<BR/>Portugal, Faro, Portimão",Artigo 259.º do Código dos Contratos Públicos,,,,,,2497138,CP 2016/42 - Acordo quadro para o fornecimento de Campos Operatórios,FALSE
Ligaduras Protetoras e Redes Tubulares,Ao abrigo de acordo-quadro (art.º 259.º),Aquisição de bens móveis,"33140000-3, Material médico de consumo","Centro Hospitalar Universitário do Algarve, E. P. E. (510745997)","Bastos Viegas, S.A. (500042772)","13.794,13 €",18-01-2019,19-12-2018,1095 dias,"Portugal, Faro, Portimão<BR/>Portugal, Faro, Faro",Artigo 259.º do Código dos Contratos Públicos,,,,,,2196665,"Ligaduras Medicadas, de Fixação e Proteção",FALSE
Ligaduras Protetoras e Redes Tubulares,Ao abrigo de acordo-quadro (art.º 259.º),Aquisição de bens móveis,"33140000-3, Material médico de consumo","Centro Hospitalar Universitário do Algarve, E. P. E. (510745997)","Abílio Freira, Lda. (500432600)","7.435,44 €",18-01-2019,19-12-2018,1095 dias,"Portugal, Faro, Faro<BR/>Portugal, Faro, Portimão",Artigo 259.º do Código dos Contratos Públicos,,,,,,2196665,"Ligaduras Medicadas, de Fixação e Proteção",FALSE
Licenciamento VMWare (6) para CHUAlgarve,Ajuste Direto Regime Geral,Aquisição de serviços,"50800000-3, Serviços de reparação e manutenção diversos","Centro Hospitalar Universitário do Algarve, E. P. E. (510745997)","SHARETECH - CONSULTING, LDA (513056114)","8.373,66 €",17-01-2019,20-12-2018,10 dias,"Portugal, Faro, Faro","Artigo 20.º, n.º 1, alínea d) do Código dos Contratos Públicos",,,,,,Não aplicável.,Não aplicável.,FALSE
31/3992/2018-Dolutegravir 50 mg,Ao abrigo de acordo-quadro (art.º 258.º),Aquisição de bens móveis,"33600000-6, Produtos farmacêuticos","Centro Hospitalar Universitário do Algarve, E. P. E. (510745997)",viiv (509117961),"103.400,24 €",16-01-2019,07-12-2018,20 dias,"Portugal, Faro, Faro","Artigo 26.º, n.º 1, alínea e) do Código dos Contratos Públicos",,,,,,2545980,CP 2017/61 - Acordo quadro para fornecimento de Medicamentos Diversos   às Instituições e Serviços do Serviço Nacional de Saúde,FALSE
31/3993/2018-Pertuzumab 420 mg,Ao abrigo de acordo-quadro (art.º 258.º),Aquisição de bens móveis,"33600000-6, Produtos farmacêuticos","Centro Hospitalar Universitário do Algarve, E. P. E. (510745997)",roche farmaceutica (500233810),"46.948,05 €",16-01-2019,07-12-2018,20 dias,"Portugal, Faro, Faro","Artigo 26.º, n.º 1, alínea e) do Código dos Contratos Públicos",,,,,,2969238,"CP 2017/6 - Acordo Quadro para fornecimento de Medicamentos do Foro Oncológico e Imunomoduladores, às Instituições e Serviços do Serviço Nacional de Saúde",FALSE
31/4049/2018-Adalimumab 40 mg,Ao abrigo de acordo-quadro (art.º 258.º),Aquisição de bens móveis,"33600000-6, Produtos farmacêuticos","Centro Hospitalar Universitário do Algarve, E. P. E. (510745997)",abbvie (510229050),"187.231,20 €",16-01-2019,21-12-2018,10 dias,"Portugal, Faro, Faro","Artigo 26.º, n.º 1, alínea e) do Código dos Contratos Públicos",,,,,,2969238,"CP 2017/6 - Acordo Quadro para fornecimento de Medicamentos do Foro Oncológico e Imunomoduladores, às Instituições e Serviços do Serviço Nacional de Saúde",FALSE
31/4129/2018-Butilescopolamina 20 mg,Ao abrigo de acordo-quadro (art.º 258.º),Aquisição de bens móveis,"33600000-6, Produtos farmacêuticos","Centro Hospitalar Universitário do Algarve, E. P. E. (510745997)",sanofi (500134960),"786,01 €",16-01-2019,19-12-2018,10 dias,"Portugal, Faro, Faro","Artigo 26.º, n.º 1, alínea e) do Código dos Contratos Públicos",,,,,,2222779,Medicamentos do aparelho digestivo,FALSE
31/4163/2018-Eltrombopag 25 mg,Ao abrigo de acordo-quadro (art.º 258.º),Aquisição de bens móveis,"33600000-6, Produtos farmacêuticos","Centro Hospitalar Universitário do Algarve, E. P. E. (510745997)",novartis (500063524),"13.120,49 €",16-01-2019,21-12-2018,10 dias,"Portugal, Faro, Faro","Artigo 26.º, n.º 1, alínea e) do Código dos Contratos Públicos",,,,,,2489595,CP 2016/18 - Acordo quadro para fornecimento de Medicamentos do Grupo 4: Sangue às Instituições e Serviços do Serviço Nacional de Saúde,FALSE
Aquisição de 2 Máquinas de Selar Mangas Mistas,Consulta Prévia,Aquisição de bens móveis,"33100000-1, Equipamento médico","Centro Hospitalar Universitário do Algarve, E.P.E. (510745997)","HELDER GONÇALVES ASSISTENCIA TEC. QUIPAMENTO, LDA (503855421)","12.220,00 €",16-01-2019,26-12-2018,6 dias,"Portugal, Faro, Portimão<BR/>Portugal, Faro, Faro<BR/>Portugal","Artigo 20.º, n.º 1, alínea c) do Código dos Contratos Públicos",,,,,,Não aplicável.,Não aplicável.,FALSE
Cadeiras de Rodas,Ajuste Direto Regime Geral,Aquisição de bens móveis,"33100000-1, Equipamento médico","Centro Hospitalar Universitário do Algarve, E. P. E. (510745997)",LISMEDICA (507474538),"19.849,79 €",16-01-2019,26-12-2018,6 dias,"Portugal, Faro, Faro<BR/>Portugal, Faro, Portimão","Artigo 20.º, n.º 1, alínea d) do Código dos Contratos Públicos",,,,,,Não aplicável.,Não aplicável.,FALSE
Prestação de Serviços de Radioterapia,Ajuste Direto Regime Geral,Aquisição de serviços,"85100000-0, Serviços de saúde","Centro Hospitalar Universitário do Algarve, E. P. E. (510745997)","Quadrantes Faro, Unidade de Radioterapia do Algarve, Lda. (505446120)","314.724,60 €",15-01-2019,19-12-2018,13 dias,"Portugal, Faro, Faro","Artigo 24.º, n.º 1, alínea e), subalínea ii) do Código dos Contratos Públicos",,,,,,Não aplicável.,Não aplicável.,FALSE
upgrade Software ( 67/4219/19),Ajuste Direto Regime Geral,Aquisição de bens móveis,"48180000-3, Pacote de software para medicina","Centro Hospitalar Universitário do Algarve, E. P. E. (510745997)","SIEMENS  HEALTHCARE , LDA (507925173)","60.000,00 €",15-01-2019,27-12-2018,20 dias,"Portugal, Faro, Faro","Artigo 24.º, n.º 1, alínea e), subalínea iii) do Código dos Contratos Públicos",,,,,,Não aplicável.,Não aplicável.,FALSE
Apoio Domiciliário de Nutrição Entérica,Ajuste Direto Regime Geral,Aquisição de serviços,"85100000-0, Serviços de saúde","Centro Hospitalar Universitário do Algarve, E. P. E. (510745997)","FRESENIUS- KABI PHARMA PORTUGAL, LD (504293753)","17.651,40 €",15-01-2019,01-01-2019,31 dias,"Portugal, Faro, Faro","Artigo 20.º, n.º 1, alínea d) do Código dos Contratos Públicos",,,,,,Não aplicável.,Não aplicável.,FALSE
31/3348/82018-Rilpivirina e darunavir,Ao abrigo de acordo-quadro (art.º 258.º),Aquisição de bens móveis,"33600000-6, Produtos farmacêuticos","Centro Hospitalar Universitário do Algarve, E. P. E. (510745997)",janssen (500189412),"172.719,27 €",14-01-2019,11-10-2018,60 dias,"Portugal, Faro, Faro","Artigo 26.º, n.º 1, alínea e) do Código dos Contratos Públicos",,,,,,2183729,Medicamentos antirretrovíricos para o tratamento da infeção por VIH,FALSE
31/3349/2018-Ruxolitinib 5 mg,Ao abrigo de acordo-quadro (art.º 258.º),Aquisição de bens móveis,"33600000-6, Produtos farmacêuticos","Centro Hospitalar Universitário do Algarve, E. P. E. (510745997)",novartis (500063524),"60.505,20 €",14-01-2019,30-10-2018,60 dias,"Portugal, Faro, Faro","Artigo 26.º, n.º 1, alínea e) do Código dos Contratos Públicos",,,,,,2969238,"CP 2017/6 - Acordo Quadro para fornecimento de Medicamentos do Foro Oncológico e Imunomoduladores, às Instituições e Serviços do Serviço Nacional de Saúde",FALSE
31/3400/2018-Doulegravir 50 mg+Abacavir 600 mg+lamivudina 300 mg,Ao abrigo de acordo-quadro (art.º 258.º),Aquisição de bens móveis,"33600000-6, Produtos farmacêuticos","Centro Hospitalar Universitário do Algarve, E. P. E. (510745997)",viiv (509117961),"470.121,84 €",14-01-2019,05-12-2018,30 dias,"Portugal, Faro, Faro","Artigo 26.º, n.º 1, alínea e) do Código dos Contratos Públicos",,,,,,2545980,CP 2017/61 - Acordo quadro para fornecimento de Medicamentos Diversos   às Instituições e Serviços do Serviço Nacional de Saúde,FALSE
31/3401/2018-Adalimumab 40 mg/0.4 ml,Ao abrigo de acordo-quadro (art.º 258.º),Aquisição de bens móveis,"33600000-6, Produtos farmacêuticos","Centro Hospitalar Universitário do Algarve, E. P. E. (510745997)",abbvie (510229050),"331.255,20 €",14-01-2019,13-12-2018,30 dias,"Portugal, Faro, Faro","Artigo 26.º, n.º 1, alínea e) do Código dos Contratos Públicos",,,,,,2969238,"CP 2017/6 - Acordo Quadro para fornecimento de Medicamentos do Foro Oncológico e Imunomoduladores, às Instituições e Serviços do Serviço Nacional de Saúde",FALSE
