Objeto do Contrato,Tipo de Procedimento,Tipo(s) de Contrato,CPVs,Entidade(s) Adjudicante(s),Entidade(s) Adjudicatária(s),Preço Contratual,Data de Publicação,Data de Celebração do Contrato,Prazo de Execução,Local de Execução,Fundamentação,Data de Fecho do Contrato,Preço Total Efetivo,Causas das Alterações ao Prazo,Causas das Alterações ao Preço,Estado,N.º registo do Acordo Quadro,Descrição do Acordo Quadro,Procedimento Centralizado
"Concurso Público n.º 27/2014 - Aquisição de Algálias, Colectores, Sacos de Urina e Sondas",Concurso público,Aquisição de bens móveis,"33141641-5, Sondas","Administração Regional de Saúde do Algarve, I. P. (503148709)","Teleflex Medical, S.A. - Sucursal em Portugal (980249783)","90.994,80 €",29-05-2014,22-05-2014,223 dias,"Portugal, Faro","Artigo 20.º, n.º 1, alínea b) do Código dos Contratos Públicos",31-12-2014,"85.757,73 €","",Quantidades fornecidas.,,Não aplicável.,Não aplicável.,FALSE
"Concurso Público n.º 27/2014 - Aquisição de Algálias, Colectores, Sacos de Urina e Sondas",Concurso público,Aquisição de bens móveis,"33141641-5, Sondas","Administração Regional de Saúde do Algarve, I. P. (503148709)"," Mundinter Intercâmbio Mundial Comércio, S.A. (500199906)","602,50 €",29-05-2014,22-05-2014,223 dias,"Portugal, Faro","Artigo 20.º, n.º 1, alínea b) do Código dos Contratos Públicos",31-12-2014,"602,50 €","","",,Não aplicável.,Não aplicável.,FALSE
"SP/9/2014- ARS Algarve (lotes 5 ) - Aquisição de equipamento informático ao abrigo do acordo quadro celebrado pela ESPAP, procedimento desenvolvido pelos SPMS, ref.ª20140075",Ao abrigo de acordo-quadro (art.º 259.º),Aquisição de bens móveis,"30230000-0, Equipamento informático","Administração Regional de Saúde do Algarve, I. P. (503148709)","Basedois  - Informática e Telecomunicações, Lda (501333401)","42.073,00 €",29-05-2014,30-04-2014,45 dias,"Portugal, Faro, Tavira<BR/>Portugal, Faro, Portimão<BR/>Portugal, Faro, Faro",Artigo 259.º do Código dos Contratos Públicos,17-12-2014,"41.753,00 €",Quantidades fornecidas.,Quantidades fornecidas.,,181482,Concurso limitado por prévia qualificação para a celebração de acordo quadro de equipamento informático.,FALSE
"SP/9/2014- ARS Algarve (lotes 1 e 4 ) - Aquisição de equipamento informático ao abrigo do acordo quadro celebrado pela ESPAP, procedimento desenvolvido pelos SPMS, ref.ª20140075",Ao abrigo de acordo-quadro (art.º 259.º),Aquisição de bens móveis,"30230000-0, Equipamento informático","Administração Regional de Saúde do Algarve, I. P. (503148709)","Companhia Portuguesa de Computadores, informática e Sistemas, S.A. (501267255)","62.578,02 €",29-05-2014,30-04-2014,45 dias,"Portugal, Faro, Tavira<BR/>Portugal, Faro, Faro<BR/>Portugal, Faro, Portimão",Artigo 259.º do Código dos Contratos Públicos,16-12-2014,"62.578,02 €",Relacionados com assistência técnica prevista no contrato.,"",,181482,Concurso limitado por prévia qualificação para a celebração de acordo quadro de equipamento informático.,FALSE
AD/109/2014 - Aquisição de Material de Electromedicina,Ajuste Direto Regime Geral,Aquisição de bens móveis,"33141000-0, Material médico não químico descartável e produtos hematológicos","Administração Regional de Saúde do Algarve, I. P. (503148709)","Covidien Portugal - Produtos de Saúde Unipessoal, Lda. (503413410)","9.727,50 €",21-05-2014,19-05-2014,225 dias,"Portugal, Faro","Artigo 20.º, n.º 1, alínea a) do Código dos Contratos Públicos","","","","",,Não aplicável.,Não aplicável.,FALSE
