freguesia,acronym,validVotesPercentage,votes,dicofre
Lusinde,PS,45.45,30,181106
Lusinde,PPD/PSD,37.88,25,181106
Lusinde,CDS-PP,7.58,5,181106
Lusinde,B.E.,4.55,3,181106
Lusinde,PCP-PEV,3.03,2,181106
Lusinde,A,1.52,1,181106
Lusinde,IL,0,0,181106
Lusinde,L,0,0,181106
Lusinde,MAS,0,0,181106
Lusinde,NC,0,0,181106
Lusinde,PAN,0,0,181106
Lusinde,PCTP/MRPP,0,0,181106
Lusinde,PDR,0,0,181106
Lusinde,PNR,0,0,181106
Lusinde,PPM.PPV/CDC,0,0,181106
Lusinde,PTP,0,0,181106
Lusinde,PURP,0,0,181106
