freguesia,acronym,validVotesPercentage,votes,dicofre
Cinfães,PS,46.61,364,180403
Cinfães,PPD/PSD.CDS-PP,30.35,237,180403
Cinfães,MPT,6.66,52,180403
Cinfães,PCP-PEV,6.66,52,180403
Cinfães,B.E.,2.94,23,180403
Cinfães,PCTP/MRPP,1.28,10,180403
Cinfães,PND,1.28,10,180403
Cinfães,L,1.02,8,180403
Cinfães,PAN,1.02,8,180403
Cinfães,PPM,1.02,8,180403
Cinfães,PTP,0.9,7,180403
Cinfães,MAS,0.13,1,180403
Cinfães,PPV,0.13,1,180403
Cinfães,PDA,0,0,180403
Cinfães,PNR,0,0,180403
Cinfães,POUS,0,0,180403
