Objeto do Contrato,Tipo de Procedimento,Tipo(s) de Contrato,CPVs,Entidade(s) Adjudicante(s),Entidade(s) Adjudicatária(s),Preço Contratual,Data de Publicação,Data de Celebração do Contrato,Prazo de Execução,Local de Execução,Fundamentação,Data de Fecho do Contrato,Preço Total Efetivo,Causas das Alterações ao Prazo,Causas das Alterações ao Preço,Estado,N.º registo do Acordo Quadro,Descrição do Acordo Quadro,Procedimento Centralizado
MATERIAL PARA HIGIENE PESSOAL,Ajuste Direto Regime Geral,Aquisição de bens móveis,"33700000-7, Produtos para cuidados pessoais","Instituto Português de Oncologia de Coimbra Francisco Gentil, E. P. E. (506361438)","PROCTER & GAMBLE, S.A. (503037753)","148,00 €",21-10-2015,20-06-2014,194 dias,"Portugal, Coimbra, Coimbra","Artigo 20.º, n.º 1, alínea a) do Código dos Contratos Públicos",19-12-2014,"2.072,00 €","","",,Não aplicável.,Não aplicável.,FALSE
MATERIAL PARA HIGIENE PESSOAL,Ajuste Direto Regime Geral,Aquisição de bens móveis,"33700000-7, Produtos para cuidados pessoais","Instituto Português de Oncologia de Coimbra Francisco Gentil, E. P. E. (506361438)","AJO-A.J.OLIVEIRA, LDA (502293748)","2.032,62 €",21-10-2015,20-06-2014,194 dias,"Portugal, Coimbra, Coimbra","Artigo 20.º, n.º 1, alínea a) do Código dos Contratos Públicos",29-12-2014,"1.555,23 €","",Diminuição das necessidades,,Não aplicável.,Não aplicável.,FALSE
REAGENTE P/DETERMINAÇÃO DE GLICÉMIA,Ajuste Direto Regime Geral,Aquisição de bens móveis,"24000000-4, Produtos químicos","Instituto Português de Oncologia de Coimbra Francisco Gentil, E. P. E. (506361438)","ROCHE SIST.DIAG., SOC. UNIP. LDA (504282921)","6.000,00 €",21-10-2015,14-02-2014,321 dias,"Portugal, Coimbra, Coimbra","Artigo 20.º, n.º 1, alínea a) do Código dos Contratos Públicos",16-12-2014,"4.800,00 €","",Diminuição das necessidades,,Não aplicável.,Não aplicável.,FALSE
MATERIAL IRRECUPERAVEL GINECOLOGIA,Ajuste Direto Regime Geral,Aquisição de bens móveis,"33100000-1, Equipamento médico","Instituto Português de Oncologia de Coimbra Francisco Gentil, E. P. E. (506361438)",SPECULUM - ARTIGOS MEDICOS (502996323),"494,00 €",21-10-2015,16-05-2014,230 dias,"Portugal, Coimbra, Coimbra","Artigo 20.º, n.º 1, alínea a) do Código dos Contratos Públicos",16-05-2014,"","",Diminuição das necessidades previstas,,Não aplicável.,Não aplicável.,FALSE
MATERIAL IRRECUPERAVEL GINECOLOGIA,Ajuste Direto Regime Geral,Aquisição de bens móveis,"33100000-1, Equipamento médico","Instituto Português de Oncologia de Coimbra Francisco Gentil, E. P. E. (506361438)","EZEQUIEL PANÃO JORGE , LDA (501412727)","565,86 €",21-10-2015,16-05-2014,230 dias,"Portugal, Coimbra, Coimbra","Artigo 20.º, n.º 1, alínea a) do Código dos Contratos Públicos",19-11-2014,"458,35 €",Diminuição das necessidades previstas,Diminuição das necessidades previstas,,Não aplicável.,Não aplicável.,FALSE
CADEIRA ESTOMATOLOGICA,Ajuste Direto Regime Geral,Aquisição de bens móveis,"33000000-0, Equipamento médico, medicamentos e produtos para cuidados pessoais","Instituto Português de Oncologia de Coimbra Francisco Gentil, E. P. E. (506361438)",Batadec comercio de equipamentos Dentarios Lda (505668408),"15.699,58 €",21-10-2015,27-06-2014,20 dias,"Portugal, Coimbra, Coimbra","Artigo 20.º, n.º 1, alínea a) do Código dos Contratos Públicos",19-08-2014,"15.699,58 €","","",,Não aplicável.,Não aplicável.,FALSE
INSTALAÇÃO E FORNECIMENTO DE CORTINAS E CALHAS,Ajuste Direto Regime Geral,Aquisição de bens móveis,"33000000-0, Equipamento médico, medicamentos e produtos para cuidados pessoais","Instituto Português de Oncologia de Coimbra Francisco Gentil, E. P. E. (506361438)",Movelobo (502786400),"1.940,00 €",21-10-2015,13-06-2014,10 dias,"Portugal, Coimbra, Coimbra","Artigo 20.º, n.º 1, alínea a) do Código dos Contratos Públicos",23-12-2014,"912,00 €","",Redução das necessidades.,,Não aplicável.,Não aplicável.,FALSE
MACA ELÉCTRICA BIPARTIDA COM RODADO,Ajuste Direto Regime Geral,Aquisição de bens móveis,"33000000-0, Equipamento médico, medicamentos e produtos para cuidados pessoais","Instituto Português de Oncologia de Coimbra Francisco Gentil, E. P. E. (506361438)",Iberdata (501904921),"3.225,59 €",21-10-2015,20-06-2014,60 dias,"Portugal, Coimbra, Coimbra","Artigo 20.º, n.º 1, alínea a) do Código dos Contratos Públicos",20-10-2014,"3.225,19 €","",Redução do valor faturado,,Não aplicável.,Não aplicável.,FALSE
"OCTREOTIDO 0,1 MG",Ajuste Direto Regime Geral,Aquisição de bens móveis,"33600000-6, Produtos farmacêuticos","Instituto Português de Oncologia de Coimbra Francisco Gentil, E. P. E. (506361438)","SANDOZ FARMACEUTICA, LDA (506985261)","1.260,00 €",21-10-2015,06-02-2014,329 dias,"Portugal, Coimbra, Coimbra","Artigo 20.º, n.º 1, alínea a) do Código dos Contratos Públicos",16-12-2014,"2.520,00 €","","",,Não aplicável.,Não aplicável.,FALSE
SOFTWARE APLICACIONAL DE LISTA DE ESPERA E BLOCO OPERATORIO,Ajuste Direto Regime Geral,Aquisição de bens móveis,"48000000-8, Pacotes de software e sistemas de informação","Instituto Português de Oncologia de Coimbra Francisco Gentil, E. P. E. (506361438)","SHI - Software Hospitalar Integrado, Lda (507603907)","9.300,00 €",21-10-2015,16-05-2014,15 dias,"Portugal, Coimbra, Coimbra","Artigo 20.º, n.º 1, alínea a) do Código dos Contratos Públicos",20-05-2014,"9.300,00 €","","",,Não aplicável.,Não aplicável.,FALSE
APOIO DE PERNAS INDEXÁVEIS A BASE COMBIFIX,Ajuste Direto Regime Geral,Aquisição de bens móveis,"33000000-0, Equipamento médico, medicamentos e produtos para cuidados pessoais","Instituto Português de Oncologia de Coimbra Francisco Gentil, E. P. E. (506361438)","Soc. Avanço, SA (500264236)","2.237,00 €",21-10-2015,08-05-2014,30 dias,"Portugal, Coimbra, Coimbra","Artigo 20.º, n.º 1, alínea a) do Código dos Contratos Públicos",30-12-2014,"2.237,00 €","","",,Não aplicável.,Não aplicável.,FALSE
UPGRADE DE VERSÃO DO DOCGASTRO,Ajuste Direto Regime Geral,Aquisição de bens móveis,"48000000-8, Pacotes de software e sistemas de informação","Instituto Português de Oncologia de Coimbra Francisco Gentil, E. P. E. (506361438)",Mobilwave tecnologia informação SA (506929183),"2.741,25 €",21-10-2015,10-04-2014,20 dias,"Portugal, Coimbra, Coimbra","Artigo 24.º, n.º 1, alínea e) do Código dos Contratos Públicos",29-07-2014,"2.741,25 €","","",,Não aplicável.,Não aplicável.,FALSE
SUBSTITUIÇÃO DO THYRATRON DO ONCOR AVANT GRADE,Ajuste Direto Regime Geral,Aquisição de bens móveis,"33000000-0, Equipamento médico, medicamentos e produtos para cuidados pessoais","Instituto Português de Oncologia de Coimbra Francisco Gentil, E. P. E. (506361438)","Siemens, SA (500247480)","12.836,00 €",21-10-2015,01-04-2014,20 dias,"Portugal, Coimbra, Coimbra","Artigo 20.º, n.º 1, alínea a) do Código dos Contratos Públicos",30-12-2014,"12.836,00 €","","",,Não aplicável.,Não aplicável.,FALSE
MATERIAL PARA HIGIENE PESSOAL,Ajuste Direto Regime Geral,Aquisição de bens móveis,"33700000-7, Produtos para cuidados pessoais","Instituto Português de Oncologia de Coimbra Francisco Gentil, E. P. E. (506361438)","EZEQUIEL PANÃO JORGE, LDA (501412727)","214,56 €",21-10-2015,20-06-2014,194 dias,"Portugal, Coimbra, Coimbra","Artigo 20.º, n.º 1, alínea a) do Código dos Contratos Públicos",15-12-2014,"119,20 €","",Diminuição das necessidades,,Não aplicável.,Não aplicável.,FALSE
MATERIAL PARA HIGIENE PESSOAL,Ajuste Direto Regime Geral,Aquisição de bens móveis,"33700000-7, Produtos para cuidados pessoais","Instituto Português de Oncologia de Coimbra Francisco Gentil, E. P. E. (506361438)","FLEX 2000, PRODUTOS FLEXIVEIS,S.A. (504663232)","620,17 €",21-10-2015,20-06-2014,194 dias,"Portugal, Coimbra, Coimbra","Artigo 20.º, n.º 1, alínea a) do Código dos Contratos Públicos",01-12-2014,"413,33 €","",Diminuição das necessidades,,Não aplicável.,Não aplicável.,FALSE
MATERIAL PARA HIGIENE PESSOAL,Ajuste Direto Regime Geral,Aquisição de bens móveis,"33700000-7, Produtos para cuidados pessoais","Instituto Português de Oncologia de Coimbra Francisco Gentil, E. P. E. (506361438)","CENTROQUIMICA, LDA (501863150)","204,30 €",21-10-2015,20-06-2014,194 dias,"Portugal, Coimbra, Coimbra","Artigo 20.º, n.º 1, alínea a) do Código dos Contratos Públicos",04-11-2014,"126,60 €","",Diminuição das necessidades,,Não aplicável.,Não aplicável.,FALSE
MATERIAL PARA HIGIENE PESSOAL,Ajuste Direto Regime Geral,Aquisição de bens móveis,"33700000-7, Produtos para cuidados pessoais","Instituto Português de Oncologia de Coimbra Francisco Gentil, E. P. E. (506361438)","BASTOS VIEGAS, S.A. (500042772)","456,00 €",21-10-2015,20-06-2014,194 dias,"Portugal, Coimbra, Coimbra","Artigo 20.º, n.º 1, alínea a) do Código dos Contratos Públicos",05-12-2014,"364,81 €","",Diminuição das necessidades,,Não aplicável.,Não aplicável.,FALSE
MATERIAL PARA HIGIENE PESSOAL,Ajuste Direto Regime Geral,Aquisição de bens móveis,"33700000-7, Produtos para cuidados pessoais","Instituto Português de Oncologia de Coimbra Francisco Gentil, E. P. E. (506361438)","AVIQUIMICA, LDA (500039720)","484,00 €",21-10-2015,20-06-2014,194 dias,"Portugal, Coimbra, Coimbra","Artigo 20.º, n.º 1, alínea a) do Código dos Contratos Públicos",22-12-2014,"458,00 €","",Diminuição das necessidades,,Não aplicável.,Não aplicável.,FALSE
SUBSTITUIÇÃO DE CABOS DE SUSPENSÃO,Ajuste Direto Regime Geral,Aquisição de bens móveis,"42400000-0, Equipamento de elevação e de movimentação e suas partes","Instituto Português de Oncologia de Coimbra Francisco Gentil, E. P. E. (506361438)",Otis elevadores (500069824),"5.907,00 €",21-10-2015,25-03-2014,15 dias,"Portugal, Coimbra, Coimbra","Artigo 20.º, n.º 1, alínea a) do Código dos Contratos Públicos",22-05-2014,"5.907,00 €","","",,Não aplicável.,Não aplicável.,FALSE
SACOS PLASTICOS,Ajuste Direto Regime Geral,Aquisição de bens móveis,"19640000-4, Sacos de polietileno para recolha de lixo e resíduos","Instituto Português de Oncologia de Coimbra Francisco Gentil, E. P. E. (506361438)","PLASGAL, LDA (500219419)","14.106,50 €",21-10-2015,20-02-2014,315 dias,"Portugal, Coimbra, Coimbra","Artigo 20.º, n.º 1, alínea a) do Código dos Contratos Públicos",23-12-2014,"10.072,03 €","",DIMINUIÇÃO DAS NECESSIDADES,,Não aplicável.,Não aplicável.,FALSE
MODULO ARQUIVADOR DE BLOCOS DE PARAFINA,Ajuste Direto Regime Geral,Aquisição de bens móveis,"38000000-5, Equipamento laboratorial, óptico e de precisão (exc. óculos)","Instituto Português de Oncologia de Coimbra Francisco Gentil, E. P. E. (506361438)","ZmWay, Lda (508085349)","10.709,30 €",21-10-2015,07-04-2014,20 dias,"Portugal, Coimbra, Coimbra","Artigo 24.º, n.º 1, alínea e) do Código dos Contratos Públicos",01-12-2014,"10.709,30 €","","",,Não aplicável.,Não aplicável.,FALSE
ESTAÇÃO DE TRABALHO DE IMAGIOLOGIA,Ajuste Direto Regime Geral,Aquisição de bens móveis,"33110000-4, Equipamento de imagiologia para uso médico, dentário e veterinário","Instituto Português de Oncologia de Coimbra Francisco Gentil, E. P. E. (506361438)",Fujifilm Europe GMBH SUC Portugal (980456517),"9.900,00 €",21-10-2015,16-05-2014,20 dias,"Portugal, Coimbra, Coimbra","Artigo 20.º, n.º 1, alínea a) do Código dos Contratos Públicos",18-07-2014,"9.900,00 €","","",,Não aplicável.,Não aplicável.,FALSE
NUTRIÇÃO ENTERICA,Ajuste Direto Regime Geral,Aquisição de bens móveis,"33692000-7, Soluções medicinais","Instituto Português de Oncologia de Coimbra Francisco Gentil, E. P. E. (506361438)",NUTRICIA ADVANC. MEDICAL NUTRIC.UNIP.LDA (507558286),"44.998,00 €",21-10-2015,15-01-2014,351 dias,"Portugal, Coimbra, Coimbra","Artigo 20.º, n.º 1, alínea a) do Código dos Contratos Públicos",26-12-2014,"49.517,20 €","",Necessidade de aumento das quantidades consumidas em virtude do aumento do nº de doentes,,Não aplicável.,Não aplicável.,FALSE
BEBIDAS - 2014,Ajuste Direto Regime Geral,Aquisição de bens móveis,"15000000-8, Produtos alimentares, bebidas, tabaco e produtos afins","Instituto Português de Oncologia de Coimbra Francisco Gentil, E. P. E. (506361438)","PAC E BOM- COMERCIO E SERVICOS, LDA (503554049)","34.525,00 €",21-10-2015,08-01-2014,358 dias,"Portugal, Coimbra, Coimbra","Artigo 20.º, n.º 1, alínea a) do Código dos Contratos Públicos",29-12-2014,"28.908,17 €","",diminuição das quantidades previstas,,Não aplicável.,Não aplicável.,FALSE
NUTRIÇÃO ENTERICA,Ajuste Direto Regime Geral,Aquisição de bens móveis,"33692000-7, Soluções medicinais","Instituto Português de Oncologia de Coimbra Francisco Gentil, E. P. E. (506361438)","NESTLE PORTUGAL, SA (500201307)","1.170,00 €",21-10-2015,03-01-2014,363 dias,"Portugal, Coimbra, Coimbra","Artigo 20.º, n.º 1, alínea a) do Código dos Contratos Públicos",30-12-2014,"1.138,80 €","",Diminuição das necessidades,,Não aplicável.,Não aplicável.,FALSE
SISTEMA DE PROTECÇÃO E SEGURANÇA CONTRA INCENDIOS DA MEDICINA NUCLEAR,Ajuste Direto Regime Geral,Aquisição de bens móveis,"31625100-4, Sistemas de detecção de incêndios","Instituto Português de Oncologia de Coimbra Francisco Gentil, E. P. E. (506361438)","Siemens, SA (500247480)","1.463,96 €",21-10-2015,21-03-2014,30 dias,"Portugal, Coimbra, Coimbra","Artigo 20.º, n.º 1, alínea a) do Código dos Contratos Públicos",09-05-2014,"1.463,96 €","","",,Não aplicável.,Não aplicável.,FALSE
NUTRIÇÃO ENTERICA,Ajuste Direto Regime Geral,Aquisição de bens móveis,"33692000-7, Soluções medicinais","Instituto Português de Oncologia de Coimbra Francisco Gentil, E. P. E. (506361438)",FRESENIUS KABI PHARMA PORTUGAL LDA (504293753),"14.786,64 €",21-10-2015,15-01-2014,351 dias,"Portugal, Coimbra, Coimbra","Artigo 20.º, n.º 1, alínea a) do Código dos Contratos Públicos",15-12-2014,"17.727,12 €","","",,Não aplicável.,Não aplicável.,FALSE
BEBIDAS - 2014,Ajuste Direto Regime Geral,Aquisição de bens móveis,"15000000-8, Produtos alimentares, bebidas, tabaco e produtos afins","Instituto Português de Oncologia de Coimbra Francisco Gentil, E. P. E. (506361438)","ANTONIO EZEQUIEL, LDA (502046511)","1.381,30 €",21-10-2015,19-12-2013,365 dias,"Portugal, Coimbra, Coimbra","Artigo 20.º, n.º 1, alínea a) do Código dos Contratos Públicos",26-12-2014,"1.273,07 €","",diminuição das quantidades previstas,,Não aplicável.,Não aplicável.,FALSE
BEBIDAS - 2014,Ajuste Direto Regime Geral,Aquisição de bens móveis,"15000000-8, Produtos alimentares, bebidas, tabaco e produtos afins","Instituto Português de Oncologia de Coimbra Francisco Gentil, E. P. E. (506361438)","PEREIRA & SANTOS, S.A. (500395691)","2.209,04 €",21-10-2015,19-12-2013,365 dias,"Portugal, Coimbra, Coimbra","Artigo 20.º, n.º 1, alínea a) do Código dos Contratos Públicos",26-12-2014,"295,11 €","",diminuição das quantidades previstas,,Não aplicável.,Não aplicável.,FALSE
SUBSTITUIÇÃO DE TUBAGEM DE ALIMENTAÇÃO E FORNECIMENTOS DE VENTILOCONVECTORES,Ajuste Direto Regime Geral,Aquisição de bens móveis,"31000000-6, Maquinaria, aparelhagem, equipamento e consumíveis eléctricos; iluminação","Instituto Português de Oncologia de Coimbra Francisco Gentil, E. P. E. (506361438)","Ambitermo - Eng. e Equip. termicos, Lda (502790326)","3.613,00 €",21-10-2015,27-06-2014,14 dias,"Portugal, Coimbra, Coimbra","Artigo 20.º, n.º 1, alínea a) do Código dos Contratos Públicos",22-09-2014,"3.613,00 €","","",,Não aplicável.,Não aplicável.,FALSE
BEBIDAS - 2014,Ajuste Direto Regime Geral,Aquisição de bens móveis,"15000000-8, Produtos alimentares, bebidas, tabaco e produtos afins","Instituto Português de Oncologia de Coimbra Francisco Gentil, E. P. E. (506361438)",ARLINDO DAS NEVES ANDRADE (174515227),"570,00 €",21-10-2015,19-12-2013,365 dias,"Portugal, Coimbra, Coimbra","Artigo 20.º, n.º 1, alínea a) do Código dos Contratos Públicos",09-09-2014,"144,00 €","",diminuição das quantidades previstas,,Não aplicável.,Não aplicável.,FALSE
SUBSTITUIÇÃO DE TUBAGEM DE ALIMENTAÇÃO E FORNECIMENTOS DE VENTILOCONVECTORES,Ajuste Direto Regime Geral,Aquisição de bens móveis,"31000000-6, Maquinaria, aparelhagem, equipamento e consumíveis eléctricos; iluminação","Instituto Português de Oncologia de Coimbra Francisco Gentil, E. P. E. (506361438)","Ambitermo - Eng. e Equip. termicos, Lda (502790326)","4.762,00 €",21-10-2015,17-03-2014,14 dias,"Portugal, Coimbra, Coimbra","Artigo 20.º, n.º 1, alínea a) do Código dos Contratos Públicos",06-05-2014,"4.762,00 €","","",,Não aplicável.,Não aplicável.,FALSE
DETECTOR 2D ARRAY SEVEN29,Ajuste Direto Regime Geral,Aquisição de bens móveis,"33000000-0, Equipamento médico, medicamentos e produtos para cuidados pessoais","Instituto Português de Oncologia de Coimbra Francisco Gentil, E. P. E. (506361438)",Interphysix - Equipamento Tecnicos Unip. Lda (509187030),"15.000,00 €",21-10-2015,15-04-2014,28 dias,"Portugal, Coimbra, Coimbra","Artigo 20.º, n.º 1, alínea a) do Código dos Contratos Públicos",29-05-2014,"15.000,00 €","","",,Não aplicável.,Não aplicável.,FALSE
MALA TÉRMICA PARA TRANSPORTE DE COMPONENTES SANGUÍNEOS,Ajuste Direto Regime Geral,Aquisição de bens móveis,"33000000-0, Equipamento médico, medicamentos e produtos para cuidados pessoais","Instituto Português de Oncologia de Coimbra Francisco Gentil, E. P. E. (506361438)",Hemovision Lda (509717853),"348,66 €",21-10-2015,07-04-2014,20 dias,"Portugal, Coimbra, Coimbra","Artigo 20.º, n.º 1, alínea a) do Código dos Contratos Públicos",09-05-2014,"348,66 €","","",,Não aplicável.,Não aplicável.,FALSE
HEPARINA,Ajuste Direto Regime Geral,Aquisição de bens móveis,"33690000-3, Medicamentos vários","Instituto Português de Oncologia de Coimbra Francisco Gentil, E. P. E. (506361438)","LAB.FARMACEUTICOS ROVI, S.A. (980166705)","8.000,00 €",20-10-2015,16-01-2014,350 dias,"Portugal, Coimbra, Coimbra","Artigo 24.º, n.º 1, alínea e) do Código dos Contratos Públicos",19-12-2014,"8.800,00 €","",Necessidade de aumento das quantidades consumidas em virtude do aumento do nº de doentes,,Não aplicável.,Não aplicável.,FALSE
GADOBUTROL,Ajuste Direto Regime Geral,Aquisição de bens móveis,"33600000-6, Produtos farmacêuticos","Instituto Português de Oncologia de Coimbra Francisco Gentil, E. P. E. (506361438)","BAYER PORTUGAL, S.A. (500043256)","8.685,00 €",20-10-2015,10-04-2014,266 dias,"Portugal, Coimbra, Coimbra","Artigo 24.º, n.º 1, alínea e) do Código dos Contratos Públicos",15-09-2014,"8.685,00 €","","",,Não aplicável.,Não aplicável.,FALSE
MATERIAL ESCRITORIO,Ajuste Direto Regime Geral,Aquisição de bens móveis,"30190000-7, Equipamento e material de escritório diverso","Instituto Português de Oncologia de Coimbra Francisco Gentil, E. P. E. (506361438)","VISIPAPEL, LDA (502020733)","24,66 €",20-10-2015,28-02-2014,307 dias,"Portugal, Coimbra, Coimbra","Artigo 20.º, n.º 1, alínea a) do Código dos Contratos Públicos",10-12-2014,"21,44 €","",Diminuição das necessidades,,Não aplicável.,Não aplicável.,FALSE
MATERIAL ESCRITORIO,Ajuste Direto Regime Geral,Aquisição de bens móveis,"30190000-7, Equipamento e material de escritório diverso","Instituto Português de Oncologia de Coimbra Francisco Gentil, E. P. E. (506361438)","MARTHAS&CA, S.A (500185913)","356,00 €",20-10-2015,28-02-2014,307 dias,"Portugal, Coimbra, Coimbra","Artigo 20.º, n.º 1, alínea a) do Código dos Contratos Públicos",27-06-2014,"162,40 €","",Diminuição das necessidades,,Não aplicável.,Não aplicável.,FALSE
MATERIAL ESCRITORIO,Ajuste Direto Regime Geral,Aquisição de bens móveis,"30190000-7, Equipamento e material de escritório diverso","Instituto Português de Oncologia de Coimbra Francisco Gentil, E. P. E. (506361438)","GRIFOLS PORTUGAL, LDA (502041285)","2.768,50 €",20-10-2015,28-02-2014,307 dias,"Portugal, Coimbra, Coimbra","Artigo 20.º, n.º 1, alínea a) do Código dos Contratos Públicos",16-10-2014,"2.309,49 €","",Diminuição das necessidades,,Não aplicável.,Não aplicável.,FALSE
MATERIAL ESCRITORIO,Ajuste Direto Regime Geral,Aquisição de bens móveis,"30190000-7, Equipamento e material de escritório diverso","Instituto Português de Oncologia de Coimbra Francisco Gentil, E. P. E. (506361438)","ENVELOPRINTEER, LDA (508469830)","6.904,36 €",20-10-2015,28-02-2014,307 dias,"Portugal, Coimbra, Coimbra","Artigo 20.º, n.º 1, alínea a) do Código dos Contratos Públicos",22-12-2014,"3.826,20 €","",Diminuição das necessidades,,Não aplicável.,Não aplicável.,FALSE
FOTEMUSTINA,Ajuste Direto Regime Geral,Aquisição de bens móveis,"33690000-3, Medicamentos vários","Instituto Português de Oncologia de Coimbra Francisco Gentil, E. P. E. (506361438)","D.L.A. FARMACEUTICA, S.A. (503894427)","3.006,00 €",20-10-2015,23-04-2014,253 dias,"Portugal, Coimbra, Coimbra","Artigo 24.º, n.º 1, alínea e) do Código dos Contratos Públicos",15-12-2014,"6.012,00 €","","",,Não aplicável.,Não aplicável.,FALSE
SOFTWARE GESTÃO DE RISCO,Ajuste Direto Regime Geral,Aquisição de bens móveis,"48000000-8, Pacotes de software e sistemas de informação","Instituto Português de Oncologia de Coimbra Francisco Gentil, E. P. E. (506361438)","Recursos, ideias soluções informaticas Lda - RISI (503754803)","4.520,00 €",20-10-2015,03-06-2014,5 dias,"Portugal, Coimbra, Coimbra","Artigo 20.º, n.º 1, alínea a) do Código dos Contratos Públicos",16-09-2014,"4.520,00 €","","",,Não aplicável.,Não aplicável.,FALSE
CAIXAS SUC,Ajuste Direto Regime Geral,Aquisição de bens móveis,"30000000-9, Máquinas, equipamento e material de escritório e de informática, excepto mobiliário e pacotes de programas (software)","Instituto Português de Oncologia de Coimbra Francisco Gentil, E. P. E. (506361438)","MOVELOBO, LDA (502786400)","824,80 €",20-10-2015,10-02-2014,324 dias,"Portugal, Coimbra, Coimbra","Artigo 20.º, n.º 1, alínea a) do Código dos Contratos Públicos",20-10-2014,"145,96 €","",Diminuição das necessidades,,Não aplicável.,Não aplicável.,FALSE
SUBSTITUIÇÃO KLYSTRON NO ONCOR 2,Ajuste Direto Regime Geral,Aquisição de bens móveis,"33000000-0, Equipamento médico, medicamentos e produtos para cuidados pessoais","Instituto Português de Oncologia de Coimbra Francisco Gentil, E. P. E. (506361438)","Siemens, SA (500247480)","71.693,25 €",20-10-2015,18-02-2014,20 dias,"Portugal, Coimbra, Coimbra","Artigo 24.º, n.º 1, alínea e) do Código dos Contratos Públicos",07-03-2014,"71.693,25 €","","",,Não aplicável.,Não aplicável.,FALSE
RENOVAÇÃO DO LICENCIAMENTO DO ANTI VIRUS,Ajuste Direto Regime Geral,Aquisição de bens móveis,"48000000-8, Pacotes de software e sistemas de informação","Instituto Português de Oncologia de Coimbra Francisco Gentil, E. P. E. (506361438)","CIL - Centro de Informática, SA (500809690)","7.255,50 €",20-10-2015,14-02-2014,20 dias,"Portugal, Coimbra, Coimbra","Artigo 24.º, n.º 1, alínea e) do Código dos Contratos Públicos",06-03-2014,"7.255,50 €","","",,Não aplicável.,Não aplicável.,FALSE
LENTE 0º PARA URETROTOMO,Ajuste Direto Regime Geral,Aquisição de bens móveis,"33000000-0, Equipamento médico, medicamentos e produtos para cuidados pessoais","Instituto Português de Oncologia de Coimbra Francisco Gentil, E. P. E. (506361438)",Dimedica - Antonio Diogo Unipessoal (504824597),"2.660,00 €",20-10-2015,26-09-2014,20 dias,"Portugal, Coimbra, Coimbra","Artigo 20.º, n.º 1, alínea a) do Código dos Contratos Públicos",07-11-2014,"2.660,00 €","","",,Não aplicável.,Não aplicável.,FALSE
FARMACOS MARCADOS COM 99mTc,Ajuste Direto Regime Geral,Aquisição de bens móveis,"33690000-3, Medicamentos vários","Instituto Português de Oncologia de Coimbra Francisco Gentil, E. P. E. (506361438)","SATIS- UNIPESSOAL, LDA (500098140)","16.806,00 €",20-10-2015,06-12-2013,358 dias,"Portugal, Coimbra, Coimbra","Artigo 20.º, n.º 1, alínea a) do Código dos Contratos Públicos",21-11-2014,"14.085,00 €","",Diminuição das necessidades,,Não aplicável.,Não aplicável.,FALSE
UROTROTOMO,Ajuste Direto Regime Geral,Aquisição de bens móveis,"33000000-0, Equipamento médico, medicamentos e produtos para cuidados pessoais","Instituto Português de Oncologia de Coimbra Francisco Gentil, E. P. E. (506361438)",Dimedica - Antonio Diogo Unipessoal (504824597),"1.800,76 €",20-10-2015,07-04-2014,20 dias,"Portugal, Coimbra, Coimbra","Artigo 20.º, n.º 1, alínea a) do Código dos Contratos Públicos",21-04-2014,"1.800,76 €","","",,Não aplicável.,Não aplicável.,FALSE
FARMACOS MARCADOS COM 99mTc,Ajuste Direto Regime Geral,Aquisição de bens móveis,"33690000-3, Medicamentos vários","Instituto Português de Oncologia de Coimbra Francisco Gentil, E. P. E. (506361438)",ADVANCED ACCELARATOR APPLICATIONS PORT UNIP LDA (509917267),"5.430,00 €",20-10-2015,06-12-2013,365 dias,"Portugal, Coimbra, Coimbra","Artigo 20.º, n.º 1, alínea a) do Código dos Contratos Públicos",26-11-2014,"5.469,00 €","",Necessidade de aumento das quantidades consumidas em virtude do aumento do nº de doentes,,Não aplicável.,Não aplicável.,FALSE
FARMACOS MARCADOS COM 99mTc,Ajuste Direto Regime Geral,Aquisição de bens móveis,"33690000-3, Medicamentos vários","Instituto Português de Oncologia de Coimbra Francisco Gentil, E. P. E. (506361438)","ISODER, S.A. (502241594)","2.997,50 €",20-10-2015,06-12-2013,365 dias,"Portugal, Coimbra, Coimbra","Artigo 20.º, n.º 1, alínea a) do Código dos Contratos Públicos",12-12-2014,"1.935,00 €","",Diminuição das necessidades,,Não aplicável.,Não aplicável.,FALSE
DROPERIDOL,Ajuste Direto Regime Geral,Aquisição de bens móveis,"33600000-6, Produtos farmacêuticos","Instituto Português de Oncologia de Coimbra Francisco Gentil, E. P. E. (506361438)","LAB.VITORIA, S.A. (500162220)","6.400,00 €",20-10-2015,06-01-2014,360 dias,"Portugal, Coimbra, Coimbra","Artigo 24.º, n.º 1, alínea e) do Código dos Contratos Públicos",02-12-2014,"4.160,00 €","",Diminuição das necessidades,,Não aplicável.,Não aplicável.,FALSE
Aquisição de Reagentes para realização de testes de Imunohistoquimica com disponibilização de equipamento,Concurso público,Aquisição de bens móveis,"33696500-0, Reagentes de laboratório",Instituto Português de Oncologia de Coimbra - Francisco Gentil E.P.E. (506361438),"Roche Sistemas de Diagnósticos, Lda. (504282921)","127.120,00 €",20-10-2015,15-01-2014,355 dias,"Portugal, Coimbra, Coimbra","Artigo 20.º, n.º 1, alínea b) do Código dos Contratos Públicos",17-12-2014,"130.604,81 €","",necessidade do aumento das quantidades consumidas em virtude do número de doentes,,Não aplicável.,Não aplicável.,FALSE
APARELHO DE PRESSOTERAPIA LYMPHA-MAT DIGITAL GRADIENT DE 12 CÂMARAS,Ajuste Direto Regime Geral,Aquisição de bens móveis,"33000000-0, Equipamento médico, medicamentos e produtos para cuidados pessoais","Instituto Português de Oncologia de Coimbra Francisco Gentil, E. P. E. (506361438)","Medicineto, Lda (504158562)","2.850,00 €",20-10-2015,24-02-2014,20 dias,"Portugal, Coimbra, Coimbra","Artigo 20.º, n.º 1, alínea a) do Código dos Contratos Públicos",31-03-2014,"2.850,00 €","","",,Não aplicável.,Não aplicável.,FALSE
SOFTWARE RADCALC MODULO,Ajuste Direto Regime Geral,Aquisição de bens móveis,"48000000-8, Pacotes de software e sistemas de informação","Instituto Português de Oncologia de Coimbra Francisco Gentil, E. P. E. (506361438)",Interphysix - Equipamento Tecnicos Unip. Lda (509187030),"9.009,60 €",20-10-2015,17-01-2014,2 dias,"Portugal, Coimbra, Coimbra","Artigo 24.º, n.º 1, alínea e) do Código dos Contratos Públicos",30-01-2014,"9.009,60 €","","",,Não aplicável.,Não aplicável.,FALSE
UNIDADE DE ALIMENTAÇÃO ININTERRUPTA (UPS),Ajuste Direto Regime Geral,Aquisição de bens móveis,"31156000-4, Fontes de alimentação interruptas","Instituto Português de Oncologia de Coimbra Francisco Gentil, E. P. E. (506361438)","SCR de Rui Miguel Brito, Unipessoal, Lda (510611010)","9.280,00 €",20-10-2015,09-01-2014,20 dias,"Portugal, Coimbra, Coimbra","Artigo 20.º, n.º 1, alínea a) do Código dos Contratos Públicos",03-11-2014,"9.851,14 €","",Aumento das necessidades,,Não aplicável.,Não aplicável.,FALSE
COLESTIRAMINA,Ajuste Direto Regime Geral,Aquisição de bens móveis,"33690000-3, Medicamentos vários","Instituto Português de Oncologia de Coimbra Francisco Gentil, E. P. E. (506361438)","BRISTOL-MYERS SQUIBB FARM.PORT.,S.A. (500048193)","136,92 €",20-10-2015,09-04-2014,267 dias,"Portugal, Coimbra, Coimbra","Artigo 24.º, n.º 1, alínea e) do Código dos Contratos Públicos",02-09-2014,"136,92 €","","",,Não aplicável.,Não aplicável.,FALSE
CARROS TRANSPORTE DE REFEIÇÕES,Ajuste Direto Regime Geral,Aquisição de bens móveis,"34000000-7, Equipamento e produtos auxiliares de transporte","Instituto Português de Oncologia de Coimbra Francisco Gentil, E. P. E. (506361438)",Barros & villas - Representações e equipamentos tec. (506078310),"56.751,02 €",20-10-2015,13-05-2014,56 dias,"Portugal, Coimbra, Coimbra","Artigo 20.º, n.º 1, alínea a) do Código dos Contratos Públicos",23-07-2014,"56.751,02 €","","",,Não aplicável.,Não aplicável.,FALSE
CAPECITABINA 150MG E 500MG - 3 IPO,Ajuste Direto Regime Geral,Aquisição de bens móveis,"33600000-6, Produtos farmacêuticos","Instituto Português de Oncologia de Coimbra Francisco Gentil, E. P. E. (506361438)",MEDAC SUCURSAL EM PORTUGAL (980369959),"8.040,40 €",20-10-2015,16-07-2014,169 dias,"Portugal, Coimbra, Coimbra","Artigo 20.º, n.º 1, alínea a) do Código dos Contratos Públicos",18-12-2014,"8.034,70 €","",Diminuição das necessidades,,Não aplicável.,Não aplicável.,FALSE
CAL SODADA,Ajuste Direto Regime Geral,Aquisição de bens móveis,"24000000-4, Produtos químicos","Instituto Português de Oncologia de Coimbra Francisco Gentil, E. P. E. (506361438)","INTERSURGICAL PORTUGAL, LDª. (503480045)","1.470,00 €",20-10-2015,14-02-2014,321 dias,"Portugal, Coimbra, Coimbra","Artigo 20.º, n.º 1, alínea a) do Código dos Contratos Públicos",07-11-2014,"924,00 €","",Diminuição das necessidades,,Não aplicável.,Não aplicável.,FALSE
ANFOTERICINA B LIPOSSOMICA,Ajuste Direto Regime Geral,Aquisição de bens móveis,"33690000-3, Medicamentos vários","Instituto Português de Oncologia de Coimbra Francisco Gentil, E. P. E. (506361438)","GILEAD SCIENCES, LDA (503604704)","3.901,83 €",19-10-2015,24-01-2014,342 dias,"Portugal, Coimbra, Coimbra","Artigo 24.º, n.º 1, alínea e) do Código dos Contratos Públicos",31-12-2014,"","",Diminuição das necessidades,,Não aplicável.,Não aplicável.,FALSE
IMPRESSOS 2014,Ajuste Direto Regime Geral,Aquisição de bens móveis,"22000000-0, Material impresso e afins","Instituto Português de Oncologia de Coimbra Francisco Gentil, E. P. E. (506361438)","TIPOGRAFIA LITOTIPO,LDA (500834857)","714,00 €",19-10-2015,10-02-2014,325 dias,"Portugal, Coimbra, Coimbra","Artigo 20.º, n.º 1, alínea a) do Código dos Contratos Públicos",07-07-2014,"742,80 €","",Aumento das necessidades,,Não aplicável.,Não aplicável.,FALSE
IMPRESSOS 2014,Ajuste Direto Regime Geral,Aquisição de bens móveis,"22000000-0, Material impresso e afins","Instituto Português de Oncologia de Coimbra Francisco Gentil, E. P. E. (506361438)",RAUL ABRANTES SARAIVA DIREITO (219575681),"3.028,07 €",19-10-2015,10-02-2014,325 dias,"Portugal, Coimbra, Coimbra","Artigo 20.º, n.º 1, alínea a) do Código dos Contratos Públicos",14-12-2014,"2.779,07 €","",Diminuição das necessidades,,Não aplicável.,Não aplicável.,FALSE
IMPRESSOS 2014,Ajuste Direto Regime Geral,Aquisição de bens móveis,"22000000-0, Material impresso e afins","Instituto Português de Oncologia de Coimbra Francisco Gentil, E. P. E. (506361438)","GRAFIBEIRA,LDA (501375066)","692,75 €",19-10-2015,10-02-2014,325 dias,"Portugal, Coimbra, Coimbra","Artigo 20.º, n.º 1, alínea a) do Código dos Contratos Públicos",26-02-2014,"585,25 €","",Diminuição das necessidades,,Não aplicável.,Não aplicável.,FALSE
IMPRESSOS 2014,Ajuste Direto Regime Geral,Aquisição de bens móveis,"22000000-0, Material impresso e afins","Instituto Português de Oncologia de Coimbra Francisco Gentil, E. P. E. (506361438)","ENVELOPRINTER, LDA (508469830)","2.335,50 €",19-10-2015,10-02-2014,325 dias,"Portugal, Coimbra, Coimbra","Artigo 20.º, n.º 1, alínea a) do Código dos Contratos Públicos",08-12-2014,"2.205,49 €","",Diminuição das necessidades,,Não aplicável.,Não aplicável.,FALSE
ALPRAZOLAM,Ajuste Direto Regime Geral,Aquisição de bens móveis,"33600000-6, Produtos farmacêuticos","Instituto Português de Oncologia de Coimbra Francisco Gentil, E. P. E. (506361438)","LAB.ATRAL, S.A. (500162085)","198,00 €",19-10-2015,06-02-2014,329 dias,"Portugal, Coimbra, Coimbra","Artigo 20.º, n.º 1, alínea a) do Código dos Contratos Públicos",17-12-2014,"253,50 €","","",,Não aplicável.,Não aplicável.,FALSE
ALCOOL ISO-PROPILICO,Ajuste Direto Regime Geral,Aquisição de bens móveis,"24000000-4, Produtos químicos","Instituto Português de Oncologia de Coimbra Francisco Gentil, E. P. E. (506361438)",VWR INTERNACIONAL - MAT. DE LABORATORIO (503842770),"1.290,00 €",19-10-2015,04-04-2014,272 dias,"Portugal, Coimbra, Coimbra","Artigo 20.º, n.º 1, alínea a) do Código dos Contratos Públicos",31-12-2014,"1.290,00 €","","",,Não aplicável.,Não aplicável.,FALSE
GERADORES TC,Ajuste Direto Regime Geral,Aquisição de bens móveis,"33690000-3, Medicamentos vários",Instituto Português de Oncologia de Coimbra - Francisco Gentil E.P.E. (506361438),ADVANCED ACCELARATOR APPLICATIONS PORT UNIP LDA (509917267),"42.111,16 €",19-10-2015,02-01-2014,364 dias,"Portugal, Coimbra, Coimbra","Artigo 20.º, n.º 1, alínea a) do Código dos Contratos Públicos",30-12-2014,"42.093,50 €","",Diminuição das necessidades,,Não aplicável.,Não aplicável.,FALSE
CICLOFOSFAMIDA-IFOSFAMIDA-MESNA,Ajuste Direto Regime Geral,Aquisição de bens móveis,"33600000-6, Produtos farmacêuticos",Instituto Português de Oncologia de Coimbra - Francisco Gentil E.P.E. (506361438),"BAXTER MEDICO-FARMACEUTICA, LDA (503347345)","59.134,50 €",19-10-2015,02-01-2014,364 dias,"Portugal, Coimbra, Coimbra","Artigo 24.º, n.º 1, alínea e) do Código dos Contratos Públicos",16-12-2014,"36.138,60 €","",Diminuição das necessidades,,Não aplicável.,Não aplicável.,FALSE
RADIOFARMACOS,Ajuste Direto Regime Geral,Aquisição de bens móveis,"33690000-3, Medicamentos vários",Instituto Português de Oncologia de Coimbra - Francisco Gentil E.P.E. (506361438),"SATIS- UNIPESSOAL, LDA (500098140)","8.222,22 €",19-10-2015,06-12-2013,365 dias,"Portugal, Coimbra, Coimbra","Artigo 24.º, n.º 1, alínea e) do Código dos Contratos Públicos",24-11-2014,"3.112,56 €","",Diminuição das necessidades,,Não aplicável.,Não aplicável.,FALSE
RADIOFARMACOS PARA TERAPÊUTICA,Ajuste Direto Regime Geral,Aquisição de bens móveis,"33690000-3, Medicamentos vários",Instituto Português de Oncologia de Coimbra - Francisco Gentil E.P.E. (506361438),"SATIS- UNIPESSOAL, LDA (500098140)","38.372,00 €",19-10-2015,02-01-2014,364 dias,"Portugal, Coimbra, Coimbra","Artigo 20.º, n.º 1, alínea a) do Código dos Contratos Públicos",10-12-2014,"19.765,00 €","",Diminuição das necessidades,,Não aplicável.,Não aplicável.,FALSE
ALCOOL,Ajuste Direto Regime Geral,Aquisição de bens móveis,"24000000-4, Produtos químicos","Instituto Português de Oncologia de Coimbra Francisco Gentil, E. P. E. (506361438)","PROCLINICA-EQUIP. PROD.CLINICOS, LDA (500222665)","10.847,97 €",19-10-2015,22-01-2014,344 dias,"Portugal, Coimbra, Coimbra","Artigo 20.º, n.º 1, alínea a) do Código dos Contratos Públicos",30-12-2014,"8.495,76 €","",Diminuição das necessidades,,Não aplicável.,Não aplicável.,FALSE
AGULHAS E SERINGAS GERAIS,Ajuste Direto Regime Geral,Aquisição de bens móveis,"33100000-1, Equipamento médico","Instituto Português de Oncologia de Coimbra Francisco Gentil, E. P. E. (506361438)","SIEMENS HEALTHCARE DIAGNOSTICS, LDA (507925173)","300,00 €",16-10-2015,07-10-2014,86 dias,"Portugal, Coimbra, Coimbra","Artigo 20.º, n.º 1, alínea a) do Código dos Contratos Públicos",15-12-2014,"100,00 €","",diminuição das necessidades previstas,,Não aplicável.,Não aplicável.,FALSE
AGULHAS E SERINGAS GERAIS,Ajuste Direto Regime Geral,Aquisição de bens móveis,"33100000-1, Equipamento médico","Instituto Português de Oncologia de Coimbra Francisco Gentil, E. P. E. (506361438)","RADIOMETER IBERICA, SL (980201667)","6.300,00 €",16-10-2015,07-10-2014,86 dias,"Portugal, Coimbra, Coimbra","Artigo 20.º, n.º 1, alínea a) do Código dos Contratos Públicos",19-12-2014,"9.480,00 €","","",,Não aplicável.,Não aplicável.,FALSE
LOUÇA E TALHERES,Ajuste Direto Regime Geral,Aquisição de bens móveis,"39000000-2, Mobiliário (incl. de escritório), acessórios, aparelhos domésticos (excl. iluminação) e produtos de limpeza","Instituto Português de Oncologia de Coimbra Francisco Gentil, E. P. E. (506361438)","ROBALO, S.A. (500654573)","643,31 €",16-10-2015,10-02-2014,325 dias,"Portugal, Coimbra, Coimbra","Artigo 20.º, n.º 1, alínea a) do Código dos Contratos Públicos",21-11-2014,"643,31 €","","",,Não aplicável.,Não aplicável.,FALSE
LOUÇA E TALHERES,Ajuste Direto Regime Geral,Aquisição de bens móveis,"39000000-2, Mobiliário (incl. de escritório), acessórios, aparelhos domésticos (excl. iluminação) e produtos de limpeza","Instituto Português de Oncologia de Coimbra Francisco Gentil, E. P. E. (506361438)","PALAMENTA -COMERCIO DE UTILIDADES HOTELEIRAS, UNIPESSOAL, LDA (508615100)","551,48 €",16-10-2015,10-02-2014,325 dias,"Portugal, Coimbra, Coimbra","Artigo 20.º, n.º 1, alínea a) do Código dos Contratos Públicos",19-06-2014,"551,48 €","","",,Não aplicável.,Não aplicável.,FALSE
AGULHAS E SERINGAS GERAIS,Ajuste Direto Regime Geral,Aquisição de bens móveis,"33100000-1, Equipamento médico","Instituto Português de Oncologia de Coimbra Francisco Gentil, E. P. E. (506361438)",PERGUT PORTUGAL (501799729),"50,17 €",16-10-2015,07-10-2014,86 dias,"Portugal, Coimbra, Coimbra","Artigo 20.º, n.º 1, alínea a) do Código dos Contratos Públicos",28-10-2014,"50,17 €","","",,Não aplicável.,Não aplicável.,FALSE
AGULHAS E SERINGAS GERAIS,Ajuste Direto Regime Geral,Aquisição de bens móveis,"33100000-1, Equipamento médico","Instituto Português de Oncologia de Coimbra Francisco Gentil, E. P. E. (506361438)","ARIUM, LDA (502501880)","175,94 €",16-10-2015,07-10-2014,86 dias,"Portugal, Coimbra, Coimbra","Artigo 20.º, n.º 1, alínea a) do Código dos Contratos Públicos",15-12-2014,"321,77 €","","",,Não aplicável.,Não aplicável.,FALSE
AGULHAS E SERINGAS GERAIS,Ajuste Direto Regime Geral,Aquisição de bens móveis,"33100000-1, Equipamento médico","Instituto Português de Oncologia de Coimbra Francisco Gentil, E. P. E. (506361438)","B.BRAUN MEDICAL,LDA (501506543)","145,00 €",16-10-2015,07-10-2014,86 dias,"Portugal, Coimbra, Coimbra","Artigo 20.º, n.º 1, alínea a) do Código dos Contratos Públicos",24-11-2014,"100,00 €","",diminuição das necessidades previstas,,Não aplicável.,Não aplicável.,FALSE
DETERGENTES HOSPITALARES,Ajuste Direto Regime Geral,Aquisição de bens móveis,"39000000-2, Mobiliário (incl. de escritório), acessórios, aparelhos domésticos (excl. iluminação) e produtos de limpeza","Instituto Português de Oncologia de Coimbra Francisco Gentil, E. P. E. (506361438)",HIGIMARTO (504512218),"885,00 €",15-10-2015,08-08-2014,145 dias,"Portugal, Coimbra, Coimbra","Artigo 20.º, n.º 1, alínea a) do Código dos Contratos Públicos",16-12-2014,"737,51 €","",Diminuição das quantidades,,Não aplicável.,Não aplicável.,FALSE
DETERGENTES HOSPITALARES,Ajuste Direto Regime Geral,Aquisição de bens móveis,"39000000-2, Mobiliário (incl. de escritório), acessórios, aparelhos domésticos (excl. iluminação) e produtos de limpeza","Instituto Português de Oncologia de Coimbra Francisco Gentil, E. P. E. (506361438)","FRANKLAB, LDA. (506058654)","2.913,00 €",15-10-2015,08-08-2014,145 dias,"Portugal, Coimbra, Coimbra","Artigo 20.º, n.º 1, alínea a) do Código dos Contratos Públicos",12-12-2014,"2.808,06 €","",diminuição das quantidades previstas,,Não aplicável.,Não aplicável.,FALSE
DETERGENTES HOSPITALARES,Ajuste Direto Regime Geral,Aquisição de bens móveis,"39000000-2, Mobiliário (incl. de escritório), acessórios, aparelhos domésticos (excl. iluminação) e produtos de limpeza","Instituto Português de Oncologia de Coimbra Francisco Gentil, E. P. E. (506361438)","OLYMPUS PORTUGAL-OPTO-DIGITAL TEC., SA (503581429)","6.690,76 €",15-10-2015,08-08-2014,145 dias,"Portugal, Coimbra, Coimbra","Artigo 20.º, n.º 1, alínea a) do Código dos Contratos Públicos",23-12-2014,"7.954,28 €","",necessidade do aumento das quantidades consumidas em virtude do número de doentes,,Não aplicável.,Não aplicável.,FALSE
DETERGENTES HOSPITALARES,Ajuste Direto Regime Geral,Aquisição de bens móveis,"39000000-2, Mobiliário (incl. de escritório), acessórios, aparelhos domésticos (excl. iluminação) e produtos de limpeza","Instituto Português de Oncologia de Coimbra Francisco Gentil, E. P. E. (506361438)",JOHNSON & JOHNSON (500153370),"114,48 €",14-10-2015,08-08-2014,145 dias,"Portugal, Coimbra, Coimbra","Artigo 20.º, n.º 1, alínea a) do Código dos Contratos Públicos",22-09-2014,"57,60 €","",diminuição das quantidades previstas,,Não aplicável.,Não aplicável.,FALSE
DETERGENTES HOSPITALARES,Ajuste Direto Regime Geral,Aquisição de bens móveis,"39000000-2, Mobiliário (incl. de escritório), acessórios, aparelhos domésticos (excl. iluminação) e produtos de limpeza","Instituto Português de Oncologia de Coimbra Francisco Gentil, E. P. E. (506361438)","TITO & FIDALGOS, LDA (502629703)","197,76 €",14-10-2015,08-08-2014,145 dias,"Portugal, Coimbra, Coimbra","Artigo 20.º, n.º 1, alínea a) do Código dos Contratos Públicos",09-12-2014,"156,67 €","",diminuição das quantidades previstas,,Não aplicável.,Não aplicável.,FALSE
DETERGENTES GERAIS,Ajuste Direto Regime Geral,Aquisição de bens móveis,"39000000-2, Mobiliário (incl. de escritório), acessórios, aparelhos domésticos (excl. iluminação) e produtos de limpeza","Instituto Português de Oncologia de Coimbra Francisco Gentil, E. P. E. (506361438)","Higimarto - Industria e Comercio de Higiene e Limpeza, Lda (504512218)","161,28 €",14-10-2015,06-06-2014,205 dias,"Portugal, Coimbra, Coimbra","Artigo 20.º, n.º 1, alínea a) do Código dos Contratos Públicos",23-12-2014,"181,46 €","",necessidade do aumento das quantidades consumidas em virtude do número de doentes,,Não aplicável.,Não aplicável.,FALSE
DETERGENTES GERAIS,Ajuste Direto Regime Geral,Aquisição de bens móveis,"39000000-2, Mobiliário (incl. de escritório), acessórios, aparelhos domésticos (excl. iluminação) e produtos de limpeza","Instituto Português de Oncologia de Coimbra Francisco Gentil, E. P. E. (506361438)","AJO - A.J.Oliveira, Lda (502293748)","1.836,55 €",14-10-2015,06-06-2014,205 dias,"Portugal, Coimbra, Coimbra","Artigo 20.º, n.º 1, alínea a) do Código dos Contratos Públicos",29-12-2014,"1.610,78 €","",diminuição das quantidades consumidas,,Não aplicável.,Não aplicável.,FALSE
DETERGENTES GERAIS,Ajuste Direto Regime Geral,Aquisição de bens móveis,"39000000-2, Mobiliário (incl. de escritório), acessórios, aparelhos domésticos (excl. iluminação) e produtos de limpeza","Instituto Português de Oncologia de Coimbra Francisco Gentil, E. P. E. (506361438)","Jonhson & Johnson, Lda (500153370)","1.260,00 €",14-10-2015,06-06-2014,205 dias,"Portugal, Coimbra, Coimbra","Artigo 20.º, n.º 1, alínea a) do Código dos Contratos Públicos",19-12-2014,"1.260,00 €","","",,Não aplicável.,Não aplicável.,FALSE
DETERGENTES GERAIS,Ajuste Direto Regime Geral,Aquisição de bens móveis,"39000000-2, Mobiliário (incl. de escritório), acessórios, aparelhos domésticos (excl. iluminação) e produtos de limpeza","Instituto Português de Oncologia de Coimbra Francisco Gentil, E. P. E. (506361438)","Centroquimica, Lda (501863150)","9.204,79 €",14-10-2015,06-06-2014,205 dias,"Portugal, Coimbra, Coimbra","Artigo 20.º, n.º 1, alínea a) do Código dos Contratos Públicos",23-12-2014,"7.487,06 €","",diminuição das quantidades,,Não aplicável.,Não aplicável.,FALSE
