Objeto do Contrato,Tipo de Procedimento,Tipo(s) de Contrato,CPVs,Entidade(s) Adjudicante(s),Entidade(s) Adjudicatária(s),Preço Contratual,Data de Publicação,Data de Celebração do Contrato,Prazo de Execução,Local de Execução,Fundamentação,Data de Fecho do Contrato,Preço Total Efetivo,Causas das Alterações ao Prazo,Causas das Alterações ao Preço,Estado,N.º registo do Acordo Quadro,Descrição do Acordo Quadro,Procedimento Centralizado
Ligaduras,Ajuste Direto Regime Geral,Aquisição de bens móveis,"33141126-9, Ligaduras","Hospital Professor Doutor Fernando Fonseca, E. P. E. (503035416)",Paul Hartmann LDA (502271728),"2.369,50 €",11-08-2016,03-08-2016,135 dias,"Portugal, Lisboa, Amadora",Artigo 258.º do Código dos Contratos Públicos,,,,,,Não aplicável.,Não aplicável.,FALSE
Aquisição de MCDT's,Ajuste Direto Regime Geral,Aquisição de serviços,"85150000-5, Serviços de imagiologia médica",Hospital Prof. Doutor Fernando Fonseca E.P.E. (503035416),Ressonancia Magnética - Sociedade de Diagnóstico e Investigação (501834249),"99.309,00 €",11-08-2016,14-07-2016,151 dias,"Portugal, Lisboa, Amadora","Artigo 24.º, n.º 1, alínea c) do Código dos Contratos Públicos",,,,,,Não aplicável.,Não aplicável.,FALSE
Ligaduras,Ajuste Direto Regime Geral,Aquisição de bens móveis,"33141126-9, Ligaduras","Hospital Professor Doutor Fernando Fonseca, E. P. E. (503035416)","Bastos Viegas, S.A. (500042772)","638,56 €",11-08-2016,03-08-2016,135 dias,"Portugal, Lisboa, Amadora",Artigo 258.º do Código dos Contratos Públicos,,,,,,Não aplicável.,Não aplicável.,FALSE
Ligaduras,Ajuste Direto Regime Geral,Aquisição de bens móveis,"33141126-9, Ligaduras","Hospital Professor Doutor Fernando Fonseca, E. P. E. (503035416)",OVERPHARMA - PRODUTOS MEDICOS FARMACEUTICOS LDA (505792362),"146,80 €",11-08-2016,03-08-2016,135 dias,"Portugal, Lisboa, Amadora",Artigo 258.º do Código dos Contratos Públicos,,,,,,Não aplicável.,Não aplicável.,FALSE
Ligaduras,Ajuste Direto Regime Geral,Aquisição de bens móveis,"33141126-9, Ligaduras","Hospital Professor Doutor Fernando Fonseca, E. P. E. (503035416)",BSN MEDICAL S.A. (505385058),"7.430,70 €",11-08-2016,03-08-2016,135 dias,"Portugal, Lisboa, Amadora",Artigo 258.º do Código dos Contratos Públicos,,,,,,Não aplicável.,Não aplicável.,FALSE
Ligaduras,Ajuste Direto Regime Geral,Aquisição de bens móveis,"33141126-9, Ligaduras","Hospital Professor Doutor Fernando Fonseca, E. P. E. (503035416)","ALBINO DIAS DE ANDRADE, LDA (500013810)","4.284,60 €",11-08-2016,02-08-2016,135 dias,"Portugal, Lisboa, Amadora",Artigo 258.º do Código dos Contratos Públicos,,,,,,Não aplicável.,Não aplicável.,FALSE
SERVIÇOS DE SEGUROS (ACIDENTES DE TRABALHO),Ajuste Direto Regime Geral,Aquisição de serviços,"66512100-3, Serviços de seguros de acidentes",Hospital Prof. Doutor Fernando Fonseca E.P.E. (503035416),"Fidelidade – Companhia de Seguros, S.A (500918880)","606.346,54 €",05-08-2016,30-12-2015,365 dias,"Portugal, Lisboa, Amadora","Artigo 24.º, n.º 1, alínea c) do Código dos Contratos Públicos",,,,,,Não aplicável.,Não aplicável.,FALSE
Dolutegravir Oral 50mg Comprimido,Ajuste Direto Regime Geral,Aquisição de bens móveis,"33600000-6, Produtos farmacêuticos",Hospital Prof. Doutor Fernando Fonseca E.P.E. (503035416),VIIVHIV Healthcare (509117961),"245.520,56 €",05-08-2016,28-04-2016,334 dias,"Portugal, Lisboa, Amadora","Artigo 24.º, n.º 1, alínea e) do Código dos Contratos Públicos",,,,,,Não aplicável.,Não aplicável.,FALSE
Exames de Medicina Nuclear,Concurso público,Aquisição de serviços,"85150000-5, Serviços de imagiologia médica","Hospital Professor Doutor Fernando Fonseca, E. P. E. (503035416)",Fundação Champalimaud (507131827),"137.651,00 €",05-08-2016,04-07-2016,180 dias,"Portugal, Lisboa, Amadora","Artigo 20.º, n.º 1, alínea b) do Código dos Contratos Públicos",,,,,,Não aplicável.,Não aplicável.,FALSE
Suporte Byme,Ajuste Direto Regime Geral,Aquisição de serviços,"72212100-0, Serviços de desenvolvimento de software para sectores específicos",Hospital Prof. Doutor Fernando Fonseca E.P.E. (503035416),"Byme - Information technology, Lda (507790960)","21.520,00 €",04-08-2016,12-07-2016,21520 dias,"Portugal, Lisboa, Amadora","Artigo 24.º, n.º 1, alínea e) do Código dos Contratos Públicos",,,,,,Não aplicável.,Não aplicável.,FALSE
CONTRATO DE PRESTAÇÃO DE SERVIÇOS PROFISSIONAIS,Ajuste Direto Regime Geral,Aquisição de serviços,"85121270-6, Serviços de psiquiatria ou psicologia","Hospital Professor Doutor Fernando Fonseca, E. P. E. (503035416)",Adriana Carolina Domingos Pedras de Almeida Santos (234115238),"5.378,40 €",03-08-2016,19-07-2016,120 dias,"Portugal, Lisboa, Amadora","Artigo 20.º, n.º 1, alínea a) do Código dos Contratos Públicos",,,,,,Não aplicável.,Não aplicável.,FALSE
Contrato de Aquisição de Reagentes Abbott,Ajuste Direto Regime Geral,Aquisição de bens móveis,"33696000-5, Reagentes e meios de contraste","Hospital Professor Doutor Fernando Fonseca, E. P. E. (503035416)","Abbott Laboratórios, Lda. (500006148)","103.900,00 €",03-08-2016,22-07-2016,212 dias,"Portugal, Lisboa, Amadora","Artigo 20.º, n.º 1, alínea a) do Código dos Contratos Públicos",,,,,,Não aplicável.,Não aplicável.,FALSE
Cardioversores,Ao abrigo de acordo-quadro (art.º 259.º),Aquisição de bens móveis,"33123000-8, Aparelhos para fins cardiovasculares","Hospital Professor Doutor Fernando Fonseca, E. P. E. (503035416)","Boston Scientific Portugal, Disp Médicos,Lda (504988964)","137.600,00 €",03-08-2016,03-06-2016,180 dias,"Portugal, Lisboa, Amadora",Artigo 259.º do Código dos Contratos Públicos,,,,,,600027,"CONCURSO PÚBLICO PARA A CELEBRAÇÃO DE CONTRATOS PÚBLICOS DE APROVISIONAMENTO PARA A ÁREA DA SAÚDE, COM VISTA AO FORNECIMENTO DE SISTEMAS DE CARDIOVERSORES DESFIBRILHADORES IMPLANTÁVEIS ÀS INSTITUIÇÕES E SERVIÇOS DO SERVIÇO NACIONAL DE SAÚDE",FALSE
Cardioversores,Ao abrigo de acordo-quadro (art.º 259.º),Aquisição de bens móveis,"33123000-8, Aparelhos para fins cardiovasculares","Hospital Professor Doutor Fernando Fonseca, E. P. E. (503035416)",BIOTRONIK PORTUGAL UNIPESSOAL LDA (510726941),"23.900,00 €",03-08-2016,24-05-2016,180 dias,"Portugal, Lisboa, Amadora",Artigo 259.º do Código dos Contratos Públicos,,,,,,600027,"CONCURSO PÚBLICO PARA A CELEBRAÇÃO DE CONTRATOS PÚBLICOS DE APROVISIONAMENTO PARA A ÁREA DA SAÚDE, COM VISTA AO FORNECIMENTO DE SISTEMAS DE CARDIOVERSORES DESFIBRILHADORES IMPLANTÁVEIS ÀS INSTITUIÇÕES E SERVIÇOS DO SERVIÇO NACIONAL DE SAÚDE",FALSE
Cardioversores,Ao abrigo de acordo-quadro (art.º 259.º),Aquisição de bens móveis,"33123000-8, Aparelhos para fins cardiovasculares","Hospital Professor Doutor Fernando Fonseca, E. P. E. (503035416)","St Jude Medical Portugal, Lda (504180746)","152.000,00 €",03-08-2016,27-05-2016,180 dias,"Portugal, Lisboa, Amadora",Artigo 259.º do Código dos Contratos Públicos,,,,,,600027,"CONCURSO PÚBLICO PARA A CELEBRAÇÃO DE CONTRATOS PÚBLICOS DE APROVISIONAMENTO PARA A ÁREA DA SAÚDE, COM VISTA AO FORNECIMENTO DE SISTEMAS DE CARDIOVERSORES DESFIBRILHADORES IMPLANTÁVEIS ÀS INSTITUIÇÕES E SERVIÇOS DO SERVIÇO NACIONAL DE SAÚDE",FALSE
Cardioversores,Ao abrigo de acordo-quadro (art.º 259.º),Aquisição de bens móveis,"33123000-8, Aparelhos para fins cardiovasculares","Hospital Professor Doutor Fernando Fonseca, E. P. E. (503035416)","MEDTRONIC PORTUGAL, LDA. (504223933)","90.800,00 €",03-08-2016,01-06-2016,180 dias,"Portugal, Lisboa, Amadora",Artigo 259.º do Código dos Contratos Públicos,,,,,,600027,"CONCURSO PÚBLICO PARA A CELEBRAÇÃO DE CONTRATOS PÚBLICOS DE APROVISIONAMENTO PARA A ÁREA DA SAÚDE, COM VISTA AO FORNECIMENTO DE SISTEMAS DE CARDIOVERSORES DESFIBRILHADORES IMPLANTÁVEIS ÀS INSTITUIÇÕES E SERVIÇOS DO SERVIÇO NACIONAL DE SAÚDE",FALSE
Cardioversores,Ao abrigo de acordo-quadro (art.º 259.º),Aquisição de bens móveis,"33123000-8, Aparelhos para fins cardiovasculares","Hospital Professor Doutor Fernando Fonseca, E. P. E. (503035416)","LIVANOVA PORTUGAL, LDA (505514010)","27.976,00 €",03-08-2016,30-05-2016,180 dias,"Portugal, Lisboa, Amadora",Artigo 259.º do Código dos Contratos Públicos,,,,,,600027,"CONCURSO PÚBLICO PARA A CELEBRAÇÃO DE CONTRATOS PÚBLICOS DE APROVISIONAMENTO PARA A ÁREA DA SAÚDE, COM VISTA AO FORNECIMENTO DE SISTEMAS DE CARDIOVERSORES DESFIBRILHADORES IMPLANTÁVEIS ÀS INSTITUIÇÕES E SERVIÇOS DO SERVIÇO NACIONAL DE SAÚDE",FALSE
Contrato de Prestação de Serviços Médicos,Ajuste Direto Regime Geral,Aquisição de serviços,"85141000-9, Serviços prestados pelo pessoal médico","Hospital Professor Doutor Fernando Fonseca, E. P. E. (503035416)",Mandragora - Assistência e Formação Médica Lda. (510693873),"7.280,00 €",01-08-2016,13-06-2016,182 dias,"Portugal, Lisboa, Amadora","Artigo 20.º, n.º 1, alínea a) do Código dos Contratos Públicos",,,,,,Não aplicável.,Não aplicável.,FALSE
