Objeto do Contrato,Tipo de Procedimento,Tipo(s) de Contrato,CPVs,Entidade(s) Adjudicante(s),Entidade(s) Adjudicatária(s),Preço Contratual,Data de Publicação,Data de Celebração do Contrato,Prazo de Execução,Local de Execução,Fundamentação,Data de Fecho do Contrato,Preço Total Efetivo,Causas das Alterações ao Prazo,Causas das Alterações ao Preço,Estado,N.º registo do Acordo Quadro,Descrição do Acordo Quadro,Procedimento Centralizado
MICOFENOLATO DE MOFETIL 250 MG CÁPS - Aj. Directo Nª 11029417,Ao abrigo de acordo-quadro (art.º 259.º),Aquisição de bens móveis,"33000000-0, Equipamento médico, medicamentos e produtos para cuidados pessoais","Hospital Garcia de Orta, E. P. E. (506361470)","ROCHE Farmacêutica Quimica, Lda (500233810)","7.612,50 €",21-02-2017,31-01-2017,90 dias,"Portugal, Setúbal, Almada",Artigo 259.º do Código dos Contratos Públicos,,,,,,1771819,CP 2015/6 - Acordo quadro para o fornecimento de Medicamentos do Foro Oncológico,FALSE
DEXMEDETOMIDINA 100 ΜG/ML SOL INJ FR 10 ML IV - Aj. Directo Nº 14028517,Ajuste Direto Regime Geral,Aquisição de bens móveis,"33000000-0, Equipamento médico, medicamentos e produtos para cuidados pessoais","Hospital Garcia de Orta, E. P. E. (506361470)",ORIONFIN UNIPESSOAL LDA.                           (508907365),"36.000,00 €",21-02-2017,25-01-2017,90 dias,"Portugal, Setúbal, Almada","Artigo 24.º, n.º 1, alínea e) do Código dos Contratos Públicos",,,,,,Não aplicável.,Não aplicável.,FALSE
CETOROLAC 10 MG COMP - Aj. Directo Nº 14028317,Ajuste Direto Regime Geral,Aquisição de bens móveis,"33000000-0, Equipamento médico, medicamentos e produtos para cuidados pessoais","Hospital Garcia de Orta, E. P. E. (506361470)",DILOFAR DISTRIBUICAO TRANSPORTES E LOGISTICA       (500563004),"7.590,00 €",21-02-2017,24-01-2017,365 dias,"Portugal, Setúbal, Almada","Artigo 24.º, n.º 1, alínea e) do Código dos Contratos Públicos",,,,,,Não aplicável.,Não aplicável.,FALSE
BEVACIZUMAB 25 MG/ML SOL INJ FR 4 ML IV- Aj. Directo Nº 11027617,Ao abrigo de acordo-quadro (art.º 259.º),Aquisição de bens móveis,"33000000-0, Equipamento médico, medicamentos e produtos para cuidados pessoais","Hospital Garcia de Orta, E. P. E. (506361470)","ROCHE Farmacêutica Quimica, Lda (500233810)","29.916,00 €",21-02-2017,23-01-2017,90 dias,"Portugal, Setúbal, Almada",Artigo 259.º do Código dos Contratos Públicos,,,,,,1771819,CP 2015/6 - Acordo quadro para o fornecimento de Medicamentos do Foro Oncológico,FALSE
MATERIAL DE CATETERES - Aj. Directo Nº 2401017,Ajuste Direto Regime Geral,Aquisição de bens móveis,"33000000-0, Equipamento médico, medicamentos e produtos para cuidados pessoais","Hospital Garcia de Orta, E. P. E. (506361470)","SMITHS MEDICAL(PORTUGAL),LDA. (507445937)","30.104,80 €",21-02-2017,13-01-2017,365 dias,"Portugal, Setúbal, Almada","Artigo 20.º, n.º 1, alínea a) do Código dos Contratos Públicos",,,,,,Não aplicável.,Não aplicável.,FALSE
PEMETREXEDO 500 MG PÓ E CONC SOL INJ FR IV - Aj. Directo Nº 11026517,Ao abrigo de acordo-quadro (art.º 259.º),Aquisição de bens móveis,"33000000-0, Equipamento médico, medicamentos e produtos para cuidados pessoais","Hospital Garcia de Orta, E. P. E. (506361470)",LILLY PORTUGAL - PRODUTOS FARMACEUTICOS LDA (500165602),"131.935,50 €",21-02-2017,26-01-2017,90 dias,"Portugal, Setúbal, Almada",Artigo 259.º do Código dos Contratos Públicos,,,,,,1771819,CP 2015/6 - Acordo quadro para o fornecimento de Medicamentos do Foro Oncológico,FALSE
TRASTUZUMAB 600 MG  SOL INJ FR SC - Aj. Directo Nº 11026017,Ao abrigo de acordo-quadro (art.º 259.º),Aquisição de bens móveis,"33000000-0, Equipamento médico, medicamentos e produtos para cuidados pessoais","Hospital Garcia de Orta, E. P. E. (506361470)","ROCHE Farmacêutica Quimica, Lda (500233810)","122.358,60 €",21-02-2017,23-01-2017,90 dias,"Portugal, Setúbal, Almada",Artigo 259.º do Código dos Contratos Públicos,,,,,,1771819,CP 2015/6 - Acordo quadro para o fornecimento de Medicamentos do Foro Oncológico,FALSE
ETANERCEPT CANETA 50 MG/1 ML SOL INJ  1 ML SC - Aj. Directo Nº 11025817,Ao abrigo de acordo-quadro (art.º 259.º),Aquisição de bens móveis,"33000000-0, Equipamento médico, medicamentos e produtos para cuidados pessoais","Hospital Garcia de Orta, E. P. E. (506361470)","PFIZER Biofarmacêutica, Soc. Unip., Lda (513300376)","43.427,98 €",21-02-2017,27-01-2017,90 dias,"Portugal, Setúbal, Almada",Artigo 259.º do Código dos Contratos Públicos,,,,,,1771819,CP 2015/6 - Acordo quadro para o fornecimento de Medicamentos do Foro Oncológico,FALSE
ACIDO MICOFENÓLICO 180 MG COMP GR - Aj. Directo Nº 11025617,Ao abrigo de acordo-quadro (art.º 259.º),Aquisição de bens móveis,"33000000-0, Equipamento médico, medicamentos e produtos para cuidados pessoais","Hospital Garcia de Orta, E. P. E. (506361470)","Novartis Farma - Produtos Farmacêuticos, SA (500063524)","7.878,78 €",21-02-2017,20-01-2017,90 dias,"Portugal, Setúbal, Almada",Artigo 259.º do Código dos Contratos Públicos,,,,,,1771819,CP 2015/6 - Acordo quadro para o fornecimento de Medicamentos do Foro Oncológico,FALSE
FERRO (CARBOXIMALTOSE) 500 MG/10ML SOL INJ FR IV -FERINJECT - Aj. Directo Nº 11025417,Ajuste Direto Regime Geral,Aquisição de bens móveis,"33000000-0, Equipamento médico, medicamentos e produtos para cuidados pessoais","Hospital Garcia de Orta, E. P. E. (506361470)","OM PORTUGUESA-LAB. ESP. FARMACEUTICAS,SA (500207410)","0,00 €",21-02-2017,23-01-2017,90 dias,"Portugal, Setúbal, Almada",Artigo 258.º do Código dos Contratos Públicos,,,,,,2608897,FERRO (CARBOXIMALTOSE) 500 MG/10ML SOL INJ FR IV -FERINJECT,FALSE
INTERFERÃO BETA-1A 24 M.U.I./ML (REBIF 44)CARTUCHO SOL INJ - Aj. Directo Nº 11025317,Ao abrigo de acordo-quadro (art.º 259.º),Aquisição de bens móveis,"33000000-0, Equipamento médico, medicamentos e produtos para cuidados pessoais","Hospital Garcia de Orta, E. P. E. (506361470)","Merck, SA (500650870)","85.717,88 €",21-02-2017,26-01-2017,90 dias,"Portugal, Setúbal, Almada",Artigo 259.º do Código dos Contratos Públicos,,,,,,1771819,CP 2015/6 - Acordo quadro para o fornecimento de Medicamentos do Foro Oncológico,FALSE
ENOXAPARINA SÓDICA 80 MG/0.8 ML SOL INJ SER 0.8 ML SC - Aj. Directo Nº 11024917,Ajuste Direto Regime Geral,Aquisição de bens móveis,"33000000-0, Equipamento médico, medicamentos e produtos para cuidados pessoais","Hospital Garcia de Orta, E. P. E. (506361470)","SANOFI - PRODUTOS FARMACÊUTICOS, LDA. (500134960)","0,00 €",21-02-2017,23-01-2017,90 dias,"Portugal, Setúbal, Almada",Artigo 258.º do Código dos Contratos Públicos,,,,,,2608427,ENOXAPARINA SÓDICA 80 MG/0.8 ML SOL INJ SER 0.8 ML SC,FALSE
DOLUTEGRAVIR 50 MG + ABACAVIR 600 MG + LAMIVUDINA 300 MG COMP - Aj. Directo Nº 14024017,Ajuste Direto Regime Geral,Aquisição de bens móveis,"33000000-0, Equipamento médico, medicamentos e produtos para cuidados pessoais","Hospital Garcia de Orta, E. P. E. (506361470)","VIIVHIV HEALTHCARE, UNIPESSOAL LDA (509117961)","56.010,00 €",21-02-2017,26-01-2017,90 dias,"Portugal, Setúbal, Almada","Artigo 24.º, n.º 1, alínea e) do Código dos Contratos Públicos",,,,,,Não aplicável.,Não aplicável.,FALSE
CLORO-HEXIDINA 2 MG/ML SOL LAV BOCA FR 300 ML - Aj. Directo Nº 14020117,Ajuste Direto Regime Geral,Aquisição de bens móveis,"33000000-0, Equipamento médico, medicamentos e produtos para cuidados pessoais","Hospital Garcia de Orta, E. P. E. (506361470)","Laboratórios Inibsa, SA (500139571)","5.070,00 €",20-02-2017,24-01-2017,90 dias,"Portugal, Setúbal, Almada","Artigo 20.º, n.º 1, alínea a) do Código dos Contratos Públicos",,,,,,Não aplicável.,Não aplicável.,FALSE
PARACETAMOL 10 MG/ML SOL INJ FR 100 ML IV - Aj. Directo Nº 11024817,Ao abrigo de acordo-quadro (art.º 259.º),Aquisição de bens móveis,"33000000-0, Equipamento médico, medicamentos e produtos para cuidados pessoais","Hospital Garcia de Orta, E. P. E. (506361470)","FRESENIUS KABI PHARMA PORTUGAL,LDA (504293753)","8.052,00 €",20-02-2017,25-01-2017,90 dias,"Portugal, Setúbal, Almada",Artigo 259.º do Código dos Contratos Públicos,,,,,,1974985,"Medicamentos Analgésicos, Antipiréticos e Antidepressivos",FALSE
CLINDAMICINA 600 MG/4 ML SOL INJ FR 4 ML IM IV - Aj. Directo Nº 11022517,Ajuste Direto Regime Geral,Aquisição de bens móveis,"33000000-0, Equipamento médico, medicamentos e produtos para cuidados pessoais","Hospital Garcia de Orta, E. P. E. (506361470)","LABESFAL-LABORATORIOS ALMIRO, SA (501169580)","0,00 €",20-02-2017,20-01-2017,180 dias,"Portugal, Setúbal, Almada",Artigo 258.º do Código dos Contratos Públicos,,,,,,2607543,CLINDAMICINA 600 MG/4 ML SOL INJ FR 4 ML IM IV,FALSE
OSIMERTINIB 80 MG COMP - Aj. Directo Nº 14023417,Ajuste Direto Regime Geral,Aquisição de bens móveis,"33000000-0, Equipamento médico, medicamentos e produtos para cuidados pessoais","Hospital Garcia de Orta, E. P. E. (506361470)",AstraZeneca (502942240),"17.400,00 €",20-02-2017,20-01-2017,30 dias,"Portugal, Setúbal, Almada","Artigo 24.º, n.º 1, alínea e) do Código dos Contratos Públicos",,,,,,Não aplicável.,Não aplicável.,FALSE
CERITINIB 150 MG CÁPS - Aj. Directo Nº 14023317,Ajuste Direto Regime Geral,Aquisição de bens móveis,"33000000-0, Equipamento médico, medicamentos e produtos para cuidados pessoais","Hospital Garcia de Orta, E. P. E. (506361470)","Novartis Farma - Produtos Farmacêuticos, SA (500063524)","17.490,02 €",20-02-2017,20-01-2017,90 dias,"Portugal, Setúbal, Almada","Artigo 24.º, n.º 1, alínea e) do Código dos Contratos Públicos",,,,,,Não aplicável.,Não aplicável.,FALSE
DACLATASVIR 60 MG COMP - Aj. Directo Nº 14023217,Ajuste Direto Regime Geral,Aquisição de bens móveis,"33000000-0, Equipamento médico, medicamentos e produtos para cuidados pessoais","Hospital Garcia de Orta, E. P. E. (506361470)",BRISTOL-MYERS SQUIBB PORTUGAL (500207879),"25.601,97 €",20-02-2017,23-01-2017,90 dias,"Portugal, Setúbal, Almada","Artigo 24.º, n.º 1, alínea e) do Código dos Contratos Públicos",,,,,,Não aplicável.,Não aplicável.,FALSE
"CELULOSE OXIDADA 5X7,5 CM (SURGICEL/CURACEL) - Aj. Directo Nº 14022417",Ajuste Direto Regime Geral,Aquisição de bens móveis,"33000000-0, Equipamento médico, medicamentos e produtos para cuidados pessoais","Hospital Garcia de Orta, E. P. E. (506361470)","Johnson & Johnson, Lda (500153370)","5.682,00 €",17-02-2017,26-01-2017,120 dias,"Portugal, Setúbal, Almada","Artigo 20.º, n.º 1, alínea a) do Código dos Contratos Públicos",,,,,,Não aplicável.,Não aplicável.,FALSE
"CELULOSE OXIDADA 5X7,5 CM (SURGICEL/CURACEL) - Aj. Directo Nº 14022417",Ajuste Direto Regime Geral,Aquisição de bens móveis,"33000000-0, Equipamento médico, medicamentos e produtos para cuidados pessoais","Hospital Garcia de Orta, E. P. E. (506361470)",Clinifar Produtos Farmacêuticos (503281115),"2.370,00 €",17-02-2017,26-01-2017,90 dias,"Portugal, Setúbal, Almada","Artigo 20.º, n.º 1, alínea a) do Código dos Contratos Públicos",,,,,,Não aplicável.,Não aplicável.,FALSE
ENOXAPARINA SÓDICA 40 MG/0.4 ML SOL INJ SER 0.4 ML SC - Aj. Directo Nº 11021817,Ajuste Direto Regime Geral,Aquisição de bens móveis,"33000000-0, Equipamento médico, medicamentos e produtos para cuidados pessoais","Hospital Garcia de Orta, E. P. E. (506361470)","SANOFI - PRODUTOS FARMACÊUTICOS, LDA. (500134960)","0,00 €",17-02-2017,23-01-2017,90 dias,"Portugal, Setúbal, Almada",Artigo 258.º do Código dos Contratos Públicos,,,,,,2606612,ENOXAPARINA SÓDICA 40 MG/0.4 ML SOL INJ SER 0.4 ML SC,FALSE
RALTEGRAVIR 400 MG COMP - Aj. Directo Nº 11021717,Ao abrigo de acordo-quadro (art.º 259.º),Aquisição de bens móveis,"33000000-0, Equipamento médico, medicamentos e produtos para cuidados pessoais","Hospital Garcia de Orta, E. P. E. (506361470)","MERCK SHARP DOHME, LDA (500191360)","79.350,48 €",17-02-2017,09-02-2017,90 dias,"Portugal, Setúbal, Almada",Artigo 259.º do Código dos Contratos Públicos,,,,,,2183729,Medicamentos antirretrovíricos para o tratamento da infeção por VIH,FALSE
SAQUINAVIR 500 MG COMP - Aj. Directo Nº 14021617,Ajuste Direto Regime Geral,Aquisição de bens móveis,"33000000-0, Equipamento médico, medicamentos e produtos para cuidados pessoais","Hospital Garcia de Orta, E. P. E. (506361470)",ROCHE FARMACÊUTICA (500233810),"0,00 €",17-02-2017,20-01-2017,90 dias,"Portugal, Setúbal, Almada",Artigo 258.º do Código dos Contratos Públicos,,,,,,2606136,SAQUINAVIR 500 MG COMP,FALSE
PROPOFOL 10 MG/ML AMP 20 ML - Aj. Directo 11021317,Ajuste Direto Regime Geral,Aquisição de bens móveis,"33000000-0, Equipamento médico, medicamentos e produtos para cuidados pessoais","Hospital Garcia de Orta, E. P. E. (506361470)","FRESENIUS KABI PHARMA PORTUGAL,LDA (504293753)","0,00 €",17-02-2017,25-01-2017,90 dias,"Portugal, Setúbal, Almada",Artigo 258.º do Código dos Contratos Públicos,,,,,,2605992,PROPOFOL 10 MG/ML AMP 20 ML,FALSE
ADALIMUMAB 40 MG/0.4 ML SOL INJ CANETA 0.4 ML SC - Aj. Directo Nº 11020717,Ao abrigo de acordo-quadro (art.º 259.º),Aquisição de bens móveis,"33000000-0, Equipamento médico, medicamentos e produtos para cuidados pessoais","Hospital Garcia de Orta, E. P. E. (506361470)","ABBVIE, LDA (510229050)","272.595,60 €",17-02-2017,26-01-2017,90 dias,"Portugal, Setúbal, Almada",Artigo 259.º do Código dos Contratos Públicos,,,,,,1771819,CP 2015/6 - Acordo quadro para o fornecimento de Medicamentos do Foro Oncológico,FALSE
ENOXAPARINA SÓDICA 60 MG/0.6 ML SOL INJ SER 0.6 ML SC - Aj. Directo Nº 11019917,Ajuste Direto Regime Geral,Aquisição de bens móveis,"33000000-0, Equipamento médico, medicamentos e produtos para cuidados pessoais","Hospital Garcia de Orta, E. P. E. (506361470)","Sanofi - Produtos Farmaceuticos, Lda (500134960)","0,00 €",17-02-2017,23-01-2017,90 dias,"Portugal, Setúbal, Almada",Artigo 258.º do Código dos Contratos Públicos,,,,,,2605764,ENOXAPARINA SÓDICA 60 MG/0.6 ML SOL INJ SER 0.6 ML SC,FALSE
DARUNAVIR 800 MG COMP - Aj. Directo Nº 11019817,Ao abrigo de acordo-quadro (art.º 259.º),Aquisição de bens móveis,"33000000-0, Equipamento médico, medicamentos e produtos para cuidados pessoais","Hospital Garcia de Orta, E. P. E. (506361470)",janssen Cilag  Farmacêutica  Lda (500189412),"317.061,00 €",17-02-2017,02-02-2017,90 dias,"Portugal, Setúbal, Almada",Artigo 259.º do Código dos Contratos Públicos,,,,,,2183729,Medicamentos antirretrovíricos para o tratamento da infeção por VIH,FALSE
FINGOLIMOD 0.5 MG CÁPS - Aj. Directo Nº 11018817,Ao abrigo de acordo-quadro (art.º 259.º),Aquisição de bens móveis,"33000000-0, Equipamento médico, medicamentos e produtos para cuidados pessoais","Hospital Garcia de Orta, E. P. E. (506361470)","Novartis Farma - Produtos Farmacêuticos, SA (500063524)","74.529,89 €",17-02-2017,26-01-2017,90 dias,"Portugal, Setúbal, Almada",Artigo 259.º do Código dos Contratos Públicos,,,,,,1771819,CP 2015/6 - Acordo quadro para o fornecimento de Medicamentos do Foro Oncológico,FALSE
TENOFOVIR 245 MG COMP - Aj. Directo Nº 11018717,Ao abrigo de acordo-quadro (art.º 259.º),Aquisição de bens móveis,"33000000-0, Equipamento médico, medicamentos e produtos para cuidados pessoais","Hospital Garcia de Orta, E. P. E. (506361470)",Gilead Sciences Lda (503604704),"102.009,60 €",17-02-2017,26-01-2017,90 dias,"Portugal, Setúbal, Almada",Artigo 259.º do Código dos Contratos Públicos,,,,,,2183729,Medicamentos antirretrovíricos para o tratamento da infeção por VIH,FALSE
PERTUZUMAB 420 MG/14 ML SOL INJ FR 14 ML IV - Aj. Directo Nº 11018317,Ao abrigo de acordo-quadro (art.º 259.º),Aquisição de bens móveis,"33000000-0, Equipamento médico, medicamentos e produtos para cuidados pessoais","Hospital Garcia de Orta, E. P. E. (506361470)",ROCHE FARMACÊUTICA (500233810),"66.279,60 €",17-02-2017,26-01-2017,180 dias,"Portugal, Setúbal, Almada",Artigo 259.º do Código dos Contratos Públicos,,,,,,1771819,CP 2015/6 - Acordo quadro para o fornecimento de Medicamentos do Foro Oncológico,FALSE
EFAVIRENZ 600 MG COMP - Aj. Directo Nº 11017917,Ao abrigo de acordo-quadro (art.º 259.º),Aquisição de bens móveis,"33000000-0, Equipamento médico, medicamentos e produtos para cuidados pessoais","Hospital Garcia de Orta, E. P. E. (506361470)","TEVA PHARMA, PROD. FARMAC., LDA. (507045491)","13.050,00 €",17-02-2017,24-01-2017,90 dias,"Portugal, Setúbal, Almada",Artigo 259.º do Código dos Contratos Públicos,,,,,,2183729,Medicamentos antirretrovíricos para o tratamento da infeção por VIH,FALSE
RITUXIMAB 120 MG/ML SOL INJ FR 11.7 ML SC - Aj. Directo Nº 11017817,Ao abrigo de acordo-quadro (art.º 259.º),Aquisição de bens móveis,"33000000-0, Equipamento médico, medicamentos e produtos para cuidados pessoais","Hospital Garcia de Orta, E. P. E. (506361470)",Roche (500233810),"110.832,00 €",17-02-2017,26-01-2017,90 dias,"Portugal, Setúbal, Almada",Artigo 259.º do Código dos Contratos Públicos,,,,,,1771819,CP 2015/6 - Acordo quadro para o fornecimento de Medicamentos do Foro Oncológico,FALSE
TACROLÍMUS 1 MG CÁPS - Aj. Directo Nº 11017517,Ao abrigo de acordo-quadro (art.º 259.º),Aquisição de bens móveis,"33000000-0, Equipamento médico, medicamentos e produtos para cuidados pessoais","Hospital Garcia de Orta, E. P. E. (506361470)",Astellas Farma (502540249),"11.970,00 €",17-02-2017,24-01-2017,90 dias,"Portugal, Setúbal, Almada",Artigo 259.º do Código dos Contratos Públicos,,,,,,1771819,CP 2015/6 - Acordo quadro para o fornecimento de Medicamentos do Foro Oncológico,FALSE
INTERFERÃO BETA-1B 8 M.U.I. PÓ SOL INJ FR SC (BETAFERON) - Aj. Directo Nº 11017117,Ao abrigo de acordo-quadro (art.º 259.º),Aquisição de bens móveis,"33000000-0, Equipamento médico, medicamentos e produtos para cuidados pessoais","Hospital Garcia de Orta, E. P. E. (506361470)","BAYER PORTUGAL, S.A. (500043256)","33.750,00 €",17-02-2017,19-01-2017,180 dias,"Portugal, Setúbal, Almada",Artigo 259.º do Código dos Contratos Públicos,,,,,,1771819,CP 2015/6 - Acordo quadro para o fornecimento de Medicamentos do Foro Oncológico,FALSE
ILOPROST 10 ΜG/ML SOL INAL NEB FR 2 ML(VENTAVIS) - Aj. Directo Nº 11017017,Ajuste Direto Regime Geral,Aquisição de bens móveis,"33000000-0, Equipamento médico, medicamentos e produtos para cuidados pessoais","Hospital Garcia de Orta, E. P. E. (506361470)","BAYER PORTUGAL, S.A. (500043256)","0,00 €",17-02-2017,30-01-2017,90 dias,"Portugal, Setúbal, Almada",Artigo 258.º do Código dos Contratos Públicos,,,,,,2604499,ILOPROST 10 ΜG/ML SOL INAL NEB FR 2 ML(VENTAVIS),FALSE
INFLIXIMAB 100 MG PÓ CONC SOL INJ FR IV - Aj. Directo Nº 11016417,Ao abrigo de acordo-quadro (art.º 259.º),Aquisição de bens móveis,"33000000-0, Equipamento médico, medicamentos e produtos para cuidados pessoais","Hospital Garcia de Orta, E. P. E. (506361470)","MERCK SHARP DOHME, LDA. (500191360)","45.325,00 €",16-02-2017,19-01-2017,90 dias,"Portugal, Setúbal, Almada",Artigo 259.º do Código dos Contratos Públicos,,,,,,1771819,CP 2015/6 - Acordo quadro para o fornecimento de Medicamentos do Foro Oncológico,FALSE
INFLIXIMAB 100 MG (BIOSSIMILAR) PÓ CONC SOL INJ FR IV - Aj. Directo Nº 11016317,Ao abrigo de acordo-quadro (art.º 259.º),Aquisição de bens móveis,"33000000-0, Equipamento médico, medicamentos e produtos para cuidados pessoais","Hospital Garcia de Orta, E. P. E. (506361470)","PharmaKERN Portugal - Prod. Farmac., Lda (507002571)","81.421,20 €",16-02-2017,26-01-2017,90 dias,"Portugal, Setúbal, Almada",Artigo 259.º do Código dos Contratos Públicos,,,,,,1771819,CP 2015/6 - Acordo quadro para o fornecimento de Medicamentos do Foro Oncológico,FALSE
AQUISIÇÃO DE EQUIPAMENTO DE ANGIOGRAFIA DIGITAL DIRECTA - Aj. Directo nº. 7100953,Concurso público,Aquisição de bens móveis,"33123220-6, Aparelhos para angiografia cardíaca","Hospital Garcia de Orta, EPE (506361470)","Siemens, S.A. (500247480)","700.000,00 €",16-02-2017,17-04-2014,90 dias,"Portugal, Setúbal, Almada","Artigo 20.º, n.º 1, alínea b) do Código dos Contratos Públicos",,,,,,Não aplicável.,Não aplicável.,FALSE
EFAVIRENZ + EMTRICITABINA + TENOFOVIR (600+200+245) MG COMP.(ATRIPLA) - Aj. Directo Nº 11016217,Ao abrigo de acordo-quadro (art.º 259.º),Aquisição de bens móveis,"33000000-0, Equipamento médico, medicamentos e produtos para cuidados pessoais","Hospital Garcia de Orta, E. P. E. (506361470)",Gilead Sciences Lda (503604704),"185.295,60 €",16-02-2017,20-01-2017,90 dias,"Portugal, Setúbal, Almada",Artigo 259.º do Código dos Contratos Públicos,,,,,,2183729,Medicamentos antirretrovíricos para o tratamento da infeção por VIH,FALSE
MORFINA S/ CONSERV 10 MG/1 ML SOL INJ FR 1 ML IM IV SC - Aj. Directo Nº 11014717,Ao abrigo de acordo-quadro (art.º 259.º),Aquisição de bens móveis,"33000000-0, Equipamento médico, medicamentos e produtos para cuidados pessoais","Hospital Garcia de Orta, E. P. E. (506361470)","B BRAUN MEDICAL, LDA. (501506543)","1.449,60 €",16-02-2017,18-01-2017,180 dias,"Portugal, Setúbal, Almada",Artigo 259.º do Código dos Contratos Públicos,,,,,,1974985,"Medicamentos Analgésicos, Antipiréticos e Antidepressivos",FALSE
MORFINA S/ CONSERV 10 MG/1 ML SOL INJ FR 1 ML IM IV SC- Aj.Directo Nº 11014717,Ao abrigo de acordo-quadro (art.º 259.º),Aquisição de bens móveis,"33000000-0, Equipamento médico, medicamentos e produtos para cuidados pessoais","Hospital Garcia de Orta, E. P. E. (506361470)","LABESFAL, S.A. (501169580)","4.992,00 €",16-02-2017,18-01-2017,90 dias,"Portugal, Setúbal, Almada",Artigo 259.º do Código dos Contratos Públicos,,,,,,1974985,"Medicamentos Analgésicos, Antipiréticos e Antidepressivos",FALSE
AQUISIÇÃO DE DIVERSO EQUIPAMENTO MÉDICO-CIRÚRGICO - Aj. Directo 7400435,Ajuste Direto Regime Geral,Aquisição de bens móveis,"33000000-0, Equipamento médico, medicamentos e produtos para cuidados pessoais","Hospital Garcia de Orta, E. P. E. (506361470)",Drager (508771323),"24.800,00 €",16-02-2017,24-09-2015,90 dias,"Portugal, Setúbal, Almada","Artigo 20.º, n.º 1, alínea a) do Código dos Contratos Públicos",,,,,,Não aplicável.,Não aplicável.,FALSE
ETANERCEPT SERINGA 50 MG/1 ML SOL INJ  1 ML SC - Aj. Directo Nº 11016117,Ao abrigo de acordo-quadro (art.º 259.º),Aquisição de bens móveis,"33000000-0, Equipamento médico, medicamentos e produtos para cuidados pessoais","Hospital Garcia de Orta, E. P. E. (506361470)","PFIZER Biofarmacêutica, Soc. Unip., Lda (513300376)","118.467,00 €",16-02-2017,20-01-2017,90 dias,"Portugal, Setúbal, Almada",Artigo 259.º do Código dos Contratos Públicos,,,,,,1771819,CP 2015/6 - Acordo quadro para o fornecimento de Medicamentos do Foro Oncológico,FALSE
AQUISIÇÃO DE DIVERSO EQUIPAMENTO MÉDICO-CIRÚRGICO - Aj. Directo nº. 7400435,Ajuste Direto Regime Geral,Aquisição de bens móveis,"33000000-0, Equipamento médico, medicamentos e produtos para cuidados pessoais","Hospital Garcia de Orta, E. P. E. (506361470)","PARAMÉDICA - EQUIPAMENTOS MÉDICOS, LDA. (501393005)","570,00 €",16-02-2017,23-09-2015,90 dias,"Portugal, Setúbal, Almada","Artigo 20.º, n.º 1, alínea a) do Código dos Contratos Públicos",,,,,,Não aplicável.,Não aplicável.,FALSE
AQUISIÇÃO DE DIVERSO EQUIPAMENTO MÉDICO-CIRÚRGICO - Aj. Directo nº. 7400435,Ajuste Direto Regime Geral,Aquisição de bens móveis,"33000000-0, Equipamento médico, medicamentos e produtos para cuidados pessoais","Hospital Garcia de Orta, E. P. E. (506361470)","B BRAUN MEDICAL, LDA. (501506543)","5.000,00 €",16-02-2017,24-09-2015,90 dias,"Portugal, Setúbal, Almada","Artigo 20.º, n.º 1, alínea a) do Código dos Contratos Públicos",,,,,,Não aplicável.,Não aplicável.,FALSE
AQUISIÇÃO DE DIVERSO EQUIPAMENTO MÉDICO-CIRÚRGICO  - Aj. Directo nº. 7400435,Ajuste Direto Regime Geral,Aquisição de bens móveis,"33000000-0, Equipamento médico, medicamentos e produtos para cuidados pessoais","Hospital Garcia de Orta, E. P. E. (506361470)","Medicinália Cormédica, Lda. (500684324)","1.450,00 €",16-02-2017,23-09-2015,90 dias,"Portugal, Setúbal, Almada","Artigo 20.º, n.º 1, alínea a) do Código dos Contratos Públicos",,,,,,Não aplicável.,Não aplicável.,FALSE
AQUISIÇÃO DE DIVERSO EQUIPAMENTO MÉDICO-CIRÚRGICO - Aj. Directo nº 7400435,Ajuste Direto Regime Geral,Aquisição de bens móveis,"33000000-0, Equipamento médico, medicamentos e produtos para cuidados pessoais","Hospital Garcia de Orta, E. P. E. (506361470)",Mundinter (500199906),"3.388,65 €",16-02-2017,23-09-2015,90 dias,"Portugal, Setúbal, Almada","Artigo 20.º, n.º 1, alínea a) do Código dos Contratos Públicos",,,,,,Não aplicável.,Não aplicável.,FALSE
ALBUMINA HUMANA 200 MG/ML SOL INJ FR 50 ML IV - Aj. Directo Nª 11014817,Ao abrigo de acordo-quadro (art.º 259.º),Aquisição de bens móveis,"33000000-0, Equipamento médico, medicamentos e produtos para cuidados pessoais","Hospital Garcia de Orta, E. P. E. (506361470)","GRIFOLS PORTUGAL,LDA. (502041285)","26.220,00 €",16-02-2017,17-01-2017,90 dias,"Portugal, Setúbal, Almada",Artigo 259.º do Código dos Contratos Públicos,,,,,,2124520,CP 2016/55 - Medicamentos Diversos,FALSE
AQUISIÇÃO DE DIVERSO EQUIPAMENTO MÉDICO-CIRÚRGICO - Aj. Directo nº 7400435,Ajuste Direto Regime Geral,Aquisição de bens móveis,"33000000-0, Equipamento médico, medicamentos e produtos para cuidados pessoais","Hospital Garcia de Orta, E. P. E. (506361470)","Clinifar, S.A (503281115)","15.350,00 €",16-02-2017,24-09-2015,90 dias,"Portugal, Setúbal, Almada","Artigo 20.º, n.º 1, alínea a) do Código dos Contratos Públicos",,,,,,Não aplicável.,Não aplicável.,FALSE
PACLITAXEL-ALBUMINA 5 MG/ML PÓ SUSP INJ FR IV(100MG/20ML) - Aj. Directo Nº 14014517,Ajuste Direto Regime Geral,Aquisição de bens móveis,"33000000-0, Equipamento médico, medicamentos e produtos para cuidados pessoais","Hospital Garcia de Orta, E. P. E. (506361470)",CELGENE SOCIEDADE UNIPESSOAL LDA (507791690),"6.600,00 €",16-02-2017,17-01-2017,180 dias,"Portugal, Setúbal, Almada","Artigo 24.º, n.º 1, alínea e) do Código dos Contratos Públicos",,,,,,Não aplicável.,Não aplicável.,FALSE
MORFINA 40 MG/2 ML SOL INJ FR 2 ML IM IV SC - Aj. Directo Nº 11014617,Ao abrigo de acordo-quadro (art.º 259.º),Aquisição de bens móveis,"33000000-0, Equipamento médico, medicamentos e produtos para cuidados pessoais","Hospital Garcia de Orta, E. P. E. (506361470)",B BRAUN MEDICAL LDA (501506543),"2.652,00 €",16-02-2017,18-01-2017,180 dias,"Portugal, Setúbal, Almada",Artigo 259.º do Código dos Contratos Públicos,,,,,,1974985,"Medicamentos Analgésicos, Antipiréticos e Antidepressivos",FALSE
MORFINA 40 MG/2 ML SOL INJ FR 2 ML IM IV SC - Aj. Directo Nº 11014617,Ao abrigo de acordo-quadro (art.º 259.º),Aquisição de bens móveis,"33000000-0, Equipamento médico, medicamentos e produtos para cuidados pessoais","Hospital Garcia de Orta, E. P. E. (506361470)","LABESFAL, S.A. (501169580)","10.656,00 €",16-02-2017,18-01-2017,90 dias,"Portugal, Setúbal, Almada",Artigo 259.º do Código dos Contratos Públicos,,,,,,1974985,"Medicamentos Analgésicos, Antipiréticos e Antidepressivos",FALSE
TREPROSTINILO 5 MG/ML SOL INJ FR 20 ML SC - Aj. Directo Nº 11014317,Ajuste Direto Regime Geral,Aquisição de bens móveis,"33000000-0, Equipamento médico, medicamentos e produtos para cuidados pessoais","Hospital Garcia de Orta, E. P. E. (506361470)","FERRER PORTUGAL,SA (500069190)","0,00 €",16-02-2017,19-01-2017,180 dias,"Portugal, Setúbal, Almada",Artigo 258.º do Código dos Contratos Públicos,,,,,,2601835,TREPROSTINILO 5 MG/ML SOL INJ FR 20 ML SC,FALSE
CLORETO DE SÓDIO 9 MG/ML IRRIGAÇÃO 500 ML FR ROSCA - Aj. Directo Nª 11013617,Ajuste Direto Regime Geral,Aquisição de bens móveis,"33000000-0, Equipamento médico, medicamentos e produtos para cuidados pessoais","Hospital Garcia de Orta, E. P. E. (506361470)","FRESENIUS KABI PHARMA PORTUGAL,LDA (504293753)","0,00 €",16-02-2017,17-01-2017,180 dias,"Portugal, Setúbal, Almada",Artigo 258.º do Código dos Contratos Públicos,,,,,,2601467,CLORETO DE SÓDIO 9 MG/ML IRRIGAÇÃO 500 ML FR ROSCA,FALSE
IMUNOGLOBULINA HUMANA NORMAL 100 MG/ML SOL INJ FR 100 ML IV - Aj. Directo Nº 11013417,Ao abrigo de acordo-quadro (art.º 259.º),Aquisição de bens móveis,"33000000-0, Equipamento médico, medicamentos e produtos para cuidados pessoais","Hospital Garcia de Orta, E. P. E. (506361470)","CSL Behring, Lda                                (503047201)","140.328,00 €",16-02-2017,19-01-2017,90 dias,"Portugal, Setúbal, Almada",Artigo 259.º do Código dos Contratos Públicos,,,,,,2124520,CP 2016/55 - Medicamentos Diversos,FALSE
RILPIVIRINA 25 MG COMP - Aj. Directo Nº 11013017,Ao abrigo de acordo-quadro (art.º 259.º),Aquisição de bens móveis,"33000000-0, Equipamento médico, medicamentos e produtos para cuidados pessoais","Hospital Garcia de Orta, E. P. E. (506361470)","Janssen Cilag Farmacêutica, Lda (500189412)","13.084,20 €",15-02-2017,20-01-2017,90 dias,"Portugal, Setúbal, Almada",Artigo 259.º do Código dos Contratos Públicos,,,,,,2183729,Medicamentos antirretrovíricos para o tratamento da infeção por VIH,FALSE
OMALIZUMAB 150 MG/1 ML SOL INJ SER 1 ML SC - Aj. Directo Nº 11012617,Ao abrigo de acordo-quadro (art.º 259.º),Aquisição de bens móveis,"33000000-0, Equipamento médico, medicamentos e produtos para cuidados pessoais","Hospital Garcia de Orta, E. P. E. (506361470)","Novartis Farma - Produtos Farmacêuticos, SA (500063524)","12.323,60 €",15-02-2017,13-01-2017,60 dias,"Portugal, Setúbal, Almada",Artigo 259.º do Código dos Contratos Públicos,,,,,,1638654,CP 2015/12 - Acordo quadro para fornecimento de Medicamentos do Aparelho Respiratório às Instituições e Serviços do Serviço Nacional de Saúde,FALSE
ETANERCEPT CANETA 50 MG/1 ML SOL INJ  1 ML SC - Aj. Directo Nº 11012817,Ao abrigo de acordo-quadro (art.º 259.º),Aquisição de bens móveis,"33000000-0, Equipamento médico, medicamentos e produtos para cuidados pessoais","Hospital Garcia de Orta, E. P. E. (506361470)","PFIZER Biofarmacêutica, Soc. Unip., Lda (513300376)","19.740,00 €",15-02-2017,13-01-2017,90 dias,"Portugal, Setúbal, Almada",Artigo 259.º do Código dos Contratos Públicos,,,,,,1771819,CP 2015/6 - Acordo quadro para o fornecimento de Medicamentos do Foro Oncológico,FALSE
GLATIRÂMERO (ACETATO) 40 MG/ML SOL INJ SER 1 ML SC - Aj. Directo Nº 11012717,Ao abrigo de acordo-quadro (art.º 259.º),Aquisição de bens móveis,"33000000-0, Equipamento médico, medicamentos e produtos para cuidados pessoais","Hospital Garcia de Orta, E. P. E. (506361470)","TEVA PHARMA, PROD. FARMAC., LDA. (507045491)","41.628,60 €",15-02-2017,16-01-2017,180 dias,"Portugal, Setúbal, Almada",Artigo 259.º do Código dos Contratos Públicos,,,,,,1771819,CP 2015/6 - Acordo quadro para o fornecimento de Medicamentos do Foro Oncológico,FALSE
NILOTINIB 200 MG CÁPS - Aj. Directo Nº 11012117,Ao abrigo de acordo-quadro (art.º 259.º),Aquisição de bens móveis,"33000000-0, Equipamento médico, medicamentos e produtos para cuidados pessoais","Hospital Garcia de Orta, E. P. E. (506361470)","Novartis Farma - Produtos Farmacêuticos, SA (500063524)","9.195,72 €",15-02-2017,16-01-2017,90 dias,"Portugal, Setúbal, Almada",Artigo 259.º do Código dos Contratos Públicos,,,,,,1771819,CP 2015/6 - Acordo quadro para o fornecimento de Medicamentos do Foro Oncológico,FALSE
CATETER BALAO P/ANGIOPLASTIA CORONARIA / CATETER PTCA ANGIOPLASTIA C/ FARMACO - Aj. Directo Nº 2407147,Ajuste Direto Regime Geral,Aquisição de bens móveis,"33000000-0, Equipamento médico, medicamentos e produtos para cuidados pessoais","Hospital Garcia de Orta, E. P. E. (506361470)","BIOTRONIK PORTUGAL UNIPESSOAL, LDA. (510726941)","8.000,00 €",15-02-2017,03-02-2017,365 dias,"Portugal, Setúbal, Almada","Artigo 20.º, n.º 1, alínea a) do Código dos Contratos Públicos",,,,,,Não aplicável.,Não aplicável.,FALSE
CATETER BALAO P/ANGIOPLASTIA CORONARIA - Aj. Directo Nº 2407147,Ajuste Direto Regime Geral,Aquisição de bens móveis,"33000000-0, Equipamento médico, medicamentos e produtos para cuidados pessoais","Hospital Garcia de Orta, E. P. E. (506361470)",TERUMO EUROPE ESPANHA SL * (980472024),"7.000,00 €",15-02-2017,03-02-2017,365 dias,"Portugal, Setúbal, Almada","Artigo 20.º, n.º 1, alínea a) do Código dos Contratos Públicos",,,,,,Não aplicável.,Não aplicável.,FALSE
CATETER BALAO P/ANGIOPLASTIA CORONARIA / CATETER PTCA ANGIOPLASTIA C/ FARMACO - Aj. Directo Nº 2407147,Ajuste Direto Regime Geral,Aquisição de bens móveis,"33000000-0, Equipamento médico, medicamentos e produtos para cuidados pessoais","Hospital Garcia de Orta, E. P. E. (506361470)",Medtronic (504223933),"4.750,00 €",15-02-2017,03-02-2017,365 dias,"Portugal, Setúbal, Almada","Artigo 20.º, n.º 1, alínea a) do Código dos Contratos Públicos",,,,,,Não aplicável.,Não aplicável.,FALSE
CATETER PTCA ANGIOPLASTIA C/ FARMACO - Aj. Directo Nº 2407147,Ajuste Direto Regime Geral,Aquisição de bens móveis,"33000000-0, Equipamento médico, medicamentos e produtos para cuidados pessoais","Hospital Garcia de Orta, E. P. E. (506361470)","B. Braun Medical,Ldª (501506543)","750,00 €",15-02-2017,03-02-2017,365 dias,"Portugal, Setúbal, Almada","Artigo 20.º, n.º 1, alínea a) do Código dos Contratos Públicos",,,,,,Não aplicável.,Não aplicável.,FALSE
CATETER BALAO P/ANGIOPLASTIA CORONARIA - Aj. Directo Nº 2407147,Ajuste Direto Regime Geral,Aquisição de bens móveis,"33000000-0, Equipamento médico, medicamentos e produtos para cuidados pessoais","Hospital Garcia de Orta, E. P. E. (506361470)",Boston Scientific Portugal (504988964),"500,00 €",15-02-2017,03-02-2017,365 dias,"Portugal, Setúbal, Almada","Artigo 20.º, n.º 1, alínea a) do Código dos Contratos Públicos",,,,,,Não aplicável.,Não aplicável.,FALSE
CATETER BALAO P/ANGIOPLASTIA CORONARIA - Aj. Directo Nº 2407147,Ajuste Direto Regime Geral,Aquisição de bens móveis,"33000000-0, Equipamento médico, medicamentos e produtos para cuidados pessoais","Hospital Garcia de Orta, E. P. E. (506361470)","ABBOTT LABORATÓRIOS, LDA. (500006148)","1.500,00 €",15-02-2017,03-02-2017,365 dias,"Portugal, Setúbal, Almada","Artigo 20.º, n.º 1, alínea a) do Código dos Contratos Públicos",,,,,,Não aplicável.,Não aplicável.,FALSE
MICROCAT.10 2 MARCAS - Aj. Directo Nº 2407447,Ajuste Direto Regime Geral,Aquisição de bens móveis,"33000000-0, Equipamento médico, medicamentos e produtos para cuidados pessoais","Hospital Garcia de Orta, E. P. E. (506361470)",MEDICINÁLIA CORMEDICA (500684324),"7.056,00 €",15-02-2017,07-02-2017,365 dias,"Portugal, Setúbal, Almada","Artigo 20.º, n.º 1, alínea a) do Código dos Contratos Públicos",,,,,,Não aplicável.,Não aplicável.,FALSE
AQUISIÇÃO DE INTRODUTOR RADIAL - Aj. Directo Nº 2407297,Ajuste Direto Regime Geral,Aquisição de bens móveis,"33000000-0, Equipamento médico, medicamentos e produtos para cuidados pessoais","Hospital Garcia de Orta, E. P. E. (506361470)",TERUMO EUROPE ESPANHA SL * (980472024),"8.750,00 €",15-02-2017,06-02-2017,365 dias,"Portugal, Setúbal, Almada","Artigo 20.º, n.º 1, alínea a) do Código dos Contratos Públicos",,,,,,Não aplicável.,Não aplicável.,FALSE
SUNITINIB 50 MG CÁPS - Aj. Directo Nº 11011217,Ao abrigo de acordo-quadro (art.º 259.º),Aquisição de bens móveis,"33000000-0, Equipamento médico, medicamentos e produtos para cuidados pessoais","Hospital Garcia de Orta, E. P. E. (506361470)","PFIZER Biofarmacêutica, Soc. Unip., Lda (513300376)","15.419,68 €",15-02-2017,17-01-2017,120 dias,"Portugal, Setúbal, Almada",Artigo 259.º do Código dos Contratos Públicos,,,,,,1771819,CP 2015/6 - Acordo quadro para o fornecimento de Medicamentos do Foro Oncológico,FALSE
TOCILIZUMAB 162 MG/0.9 ML SOL INJ SER 0.9 ML SC - Aj. Directo Nº 11011117,Ao abrigo de acordo-quadro (art.º 259.º),Aquisição de bens móveis,"33000000-0, Equipamento médico, medicamentos e produtos para cuidados pessoais","Hospital Garcia de Orta, E. P. E. (506361470)",ROCHE FARMACEUTICA QUIMICA LDA (500233810),"35.803,80 €",15-02-2017,16-01-2017,90 dias,"Portugal, Setúbal, Almada",Artigo 259.º do Código dos Contratos Públicos,,,,,,1771819,CP 2015/6 - Acordo quadro para o fornecimento de Medicamentos do Foro Oncológico,FALSE
RALTEGRAVIR 400 MG COMP - Aj. Directo Nº 11011017,Ao abrigo de acordo-quadro (art.º 259.º),Aquisição de bens móveis,"33000000-0, Equipamento médico, medicamentos e produtos para cuidados pessoais","Hospital Garcia de Orta, E. P. E. (506361470)",Merck  Sharp e Dohme Lda. (500191360),"79.350,48 €",14-02-2017,12-01-2017,90 dias,"Portugal, Setúbal, Almada",Artigo 259.º do Código dos Contratos Públicos,,,,,,2183729,Medicamentos antirretrovíricos para o tratamento da infeção por VIH,FALSE
GOLIMUMAB 50 MG/0.5 ML SOL INJ CANETA 0.5 ML SC - Aj. Directo Nº 11010917,Ao abrigo de acordo-quadro (art.º 259.º),Aquisição de bens móveis,"33000000-0, Equipamento médico, medicamentos e produtos para cuidados pessoais","Hospital Garcia de Orta, E. P. E. (506361470)",Merck  Sharp e Dohme Lda. (500191360),"63.324,00 €",14-02-2017,12-01-2017,90 dias,"Portugal, Setúbal, Almada",Artigo 259.º do Código dos Contratos Públicos,,,,,,1771819,CP 2015/6 - Acordo quadro para o fornecimento de Medicamentos do Foro Oncológico,FALSE
LENALIDOMIDA 25 MG CÁPSULA - Aj. Directo Nº 14010617,Ajuste Direto Regime Geral,Aquisição de bens móveis,"33000000-0, Equipamento médico, medicamentos e produtos para cuidados pessoais","Hospital Garcia de Orta, E. P. E. (506361470)","CELGENE SOCIEDADE UNIPESSOAL, LDA (507791690)","32.502,83 €",14-02-2017,11-01-2017,60 dias,"Portugal, Setúbal, Almada","Artigo 24.º, n.º 1, alínea e) do Código dos Contratos Públicos",,,,,,Não aplicável.,Não aplicável.,FALSE
BECLOMETASONA 250 ΜG/DOSE SOL PRESSU INAL RECIP PRESSU 200 DOSE(S) - Aj. Directo Nº 11010117,Ao abrigo de acordo-quadro (art.º 259.º),Aquisição de bens móveis,"33000000-0, Equipamento médico, medicamentos e produtos para cuidados pessoais","Hospital Garcia de Orta, E. P. E. (506361470)","GLAXOSMITHKLINE PROD. FARMACÊUTICOS, LDA. (500139962)","8.600,00 €",14-02-2017,13-01-2017,90 dias,"Portugal, Setúbal, Almada",Artigo 259.º do Código dos Contratos Públicos,,,,,,1638654,CP 2015/12 - Acordo quadro para fornecimento de Medicamentos do Aparelho Respiratório às Instituições e Serviços do Serviço Nacional de Saúde,FALSE
LANREOTIDA 120 MG SOL INJ SER 0.5 ML SC - Aj. Directo Nº 11009517,Ao abrigo de acordo-quadro (art.º 259.º),Aquisição de bens móveis,"33000000-0, Equipamento médico, medicamentos e produtos para cuidados pessoais","Hospital Garcia de Orta, E. P. E. (506361470)","IPSEN-PRODUTOS FARMACEUTICOS, S.A. (502609800)","17.209,44 €",14-02-2017,11-01-2017,90 dias,"Portugal, Setúbal, Almada",Artigo 259.º do Código dos Contratos Públicos,,,,,,1415640,CP 2015/7 - ACORDO QUADRO PARA FORNECIMENTO DE HORMONAS E OUTROS MEDICAMENTOS USADOS NO TRATAMENTO DAS DOENÇAS ENDÓCRINAS ÀS INSTITUIÇÕES E SERVIÇOS DO SERVIÇO NACIONAL DE SAÚDE,FALSE
ABACAVIR 600 MG + LAMIVUDINA 300 MG COMP - Aj. Directo Nº 14009117,Ajuste Direto Regime Geral,Aquisição de bens móveis,"33000000-0, Equipamento médico, medicamentos e produtos para cuidados pessoais","Hospital Garcia de Orta, E. P. E. (506361470)","TEVA PHARMA, PROD. FARMAC., LDA. (507045491)","115.200,00 €",14-02-2017,19-01-2017,90 dias,"Portugal, Setúbal, Almada","Artigo 24.º, n.º 1, alínea c) do Código dos Contratos Públicos",,,,,,Não aplicável.,Não aplicável.,FALSE
VEMURAFENIB 240 MG COMP - Aj. Directo Nº 11008717,Ao abrigo de acordo-quadro (art.º 259.º),Aquisição de bens móveis,"33000000-0, Equipamento médico, medicamentos e produtos para cuidados pessoais","Hospital Garcia de Orta, E. P. E. (506361470)",ROCHE FARMACEUTICA QUIMICA LDA (500233810),"12.511,52 €",14-02-2017,09-01-2017,180 dias,"Portugal, Setúbal, Almada",Artigo 259.º do Código dos Contratos Públicos,,,,,,1771819,CP 2015/6 - Acordo quadro para o fornecimento de Medicamentos do Foro Oncológico,FALSE
NORADRENALINA 10MG/10ML SOL INJ FR10ML IV - Aj. Directo Nº 14008617,Ajuste Direto Regime Geral,Aquisição de bens móveis,"33000000-0, Equipamento médico, medicamentos e produtos para cuidados pessoais","Hospital Garcia de Orta, E. P. E. (506361470)","LABESFAL, S.A. (501169580)","28.440,00 €",14-02-2017,10-01-2017,90 dias,"Portugal, Setúbal, Almada","Artigo 20.º, n.º 1, alínea a) do Código dos Contratos Públicos",,,,,,Não aplicável.,Não aplicável.,FALSE
NORADRENALINA 10MG/10ML SOL INJ FR10ML IV - aJ. dIRECTO nº 14008617,Ajuste Direto Regime Geral,Aquisição de bens móveis,"33000000-0, Equipamento médico, medicamentos e produtos para cuidados pessoais","Hospital Garcia de Orta, E. P. E. (506361470)",GENERIS FARMACÊUTICA SA (505625520),"9.080,00 €",14-02-2017,10-01-2017,90 dias,"Portugal, Setúbal, Almada","Artigo 20.º, n.º 1, alínea a) do Código dos Contratos Públicos",,,,,,Não aplicável.,Não aplicável.,FALSE
DESFLUORANO LÍQ INAL VAPO FR 240 ML - Aj. Directo Nº 11008517,Ao abrigo de acordo-quadro (art.º 259.º),Aquisição de bens móveis,"33000000-0, Equipamento médico, medicamentos e produtos para cuidados pessoais","Hospital Garcia de Orta, E. P. E. (506361470)",BAXTER MEDICO FARMACEUTICA LDA (503347345),"12.090,24 €",14-02-2017,12-01-2017,90 dias,"Portugal, Setúbal, Almada",Artigo 259.º do Código dos Contratos Públicos,,,,,,2211341,Medicamentos anestésicos e relaxantes musculares,FALSE
LABETALOL 100 MG/20 ML SOL INJ - Aj. Directo Nº 14008317,Ajuste Direto Regime Geral,Aquisição de bens móveis,"33000000-0, Equipamento médico, medicamentos e produtos para cuidados pessoais","Hospital Garcia de Orta, E. P. E. (506361470)","Biojam, S.A. (513642749)","5.780,00 €",14-02-2017,09-01-2017,60 dias,"Portugal, Setúbal, Almada","Artigo 24.º, n.º 1, alínea e) do Código dos Contratos Públicos",,,,,,Não aplicável.,Não aplicável.,FALSE
CETUXIMAB 5 MG/ML SOL INJ FR 20 ML IV - Aj. Directo Nº 11007417,Ao abrigo de acordo-quadro (art.º 259.º),Aquisição de bens móveis,"33000000-0, Equipamento médico, medicamentos e produtos para cuidados pessoais","Hospital Garcia de Orta, E. P. E. (506361470)","Merck, SA (500650870)","109.190,40 €",14-02-2017,02-02-2017,90 dias,"Portugal, Setúbal, Almada",Artigo 259.º do Código dos Contratos Públicos,,,,,,1771819,CP 2015/6 - Acordo quadro para o fornecimento de Medicamentos do Foro Oncológico,FALSE
"CLORETO DE SÓDIO 9 MG/ML (0,9%) SOL INJ FR 100 ML IV - Aj. Directo N",Ajuste Direto Regime Geral,Aquisição de bens móveis,"33000000-0, Equipamento médico, medicamentos e produtos para cuidados pessoais","Hospital Garcia de Orta, E. P. E. (506361470)","LABESFAL, S.A. (501169580)","0,00 €",14-02-2017,17-01-2017,180 dias,"Portugal, Setúbal, Almada",Artigo 258.º do Código dos Contratos Públicos,,,,,,2596485,"CLORETO DE SÓDIO 9 MG/ML (0,9%) SOL INJ FR 100 ML IV ",FALSE
"CLORETO DE SÓDIO 9 MG/ML (0,9%) SOL INJ FR 250 ML IV - Aj. Directo Nº 11007117",Ajuste Direto Regime Geral,Aquisição de bens móveis,"33000000-0, Equipamento médico, medicamentos e produtos para cuidados pessoais","Hospital Garcia de Orta, E. P. E. (506361470)","B. Braun Medical, Lda (501506543)","0,00 €",14-02-2017,09-01-2017,180 dias,"Portugal, Setúbal, Almada",Artigo 258.º do Código dos Contratos Públicos,,,,,,2596399,"CLORETO DE SÓDIO 9 MG/ML (0,9%) SOL INJ FR 250 ML IV",FALSE
OCTREOTIDA 30 MG PÓ SUSP INJ FR IM - Aj. Directo Nº 11007017,Ao abrigo de acordo-quadro (art.º 259.º),Aquisição de bens móveis,"33000000-0, Equipamento médico, medicamentos e produtos para cuidados pessoais","Hospital Garcia de Orta, E. P. E. (506361470)","NOVARTIS FARMA, S.A. (500063524)","33.514,24 €",14-02-2017,09-01-2017,120 dias,"Portugal, Setúbal, Almada",Artigo 259.º do Código dos Contratos Públicos,,,,,,1415640,CP 2015/7 - ACORDO QUADRO PARA FORNECIMENTO DE HORMONAS E OUTROS MEDICAMENTOS USADOS NO TRATAMENTO DAS DOENÇAS ENDÓCRINAS ÀS INSTITUIÇÕES E SERVIÇOS DO SERVIÇO NACIONAL DE SAÚDE,FALSE
OCTREOTIDA 20 MG PÓ SUSP INJ FR IM - Aj. Directo Nº 11006917,Ao abrigo de acordo-quadro (art.º 259.º),Aquisição de bens móveis,"33000000-0, Equipamento médico, medicamentos e produtos para cuidados pessoais","Hospital Garcia de Orta, E. P. E. (506361470)","NOVARTIS FARMA, S.A. (500063524)","31.023,60 €",13-02-2017,09-01-2017,120 dias,"Portugal, Setúbal, Almada",Artigo 259.º do Código dos Contratos Públicos,,,,,,1415640,CP 2015/7 - ACORDO QUADRO PARA FORNECIMENTO DE HORMONAS E OUTROS MEDICAMENTOS USADOS NO TRATAMENTO DAS DOENÇAS ENDÓCRINAS ÀS INSTITUIÇÕES E SERVIÇOS DO SERVIÇO NACIONAL DE SAÚDE,FALSE
DIETA COMPLETA MODIFICADA ENRIQ. CELULÓSICO 500ML(FIBRA) - Aj. Directo Nº 14005917,Ajuste Direto Regime Geral,Aquisição de bens móveis,"33000000-0, Equipamento médico, medicamentos e produtos para cuidados pessoais","Hospital Garcia de Orta, E. P. E. (506361470)",Fresenius Kabi (504293753),"5.148,00 €",13-02-2017,11-01-2017,120 dias,"Portugal, Setúbal, Almada","Artigo 20.º, n.º 1, alínea a) do Código dos Contratos Públicos",,,,,,Não aplicável.,Não aplicável.,FALSE
CETUXIMAB 5 MG/ML SOL INJ FR 20 ML IV - Aj. Directo Nº 11005217,Ao abrigo de acordo-quadro (art.º 259.º),Aquisição de bens móveis,"33000000-0, Equipamento médico, medicamentos e produtos para cuidados pessoais","Hospital Garcia de Orta, E. P. E. (506361470)","Merck, SA (500650870)","38.051,20 €",13-02-2017,02-01-2017,60 dias,"Portugal, Setúbal, Almada",Artigo 259.º do Código dos Contratos Públicos,,,,,,2556219,CP2015/6 MEDICAMENTOS FORO ONCOLOGICO ABERTO PELA SPMS P259-AC-2016-89,FALSE
EVEROLÍMUS 5 MG COMP- Aj. Directo Nº 11005117,Ao abrigo de acordo-quadro (art.º 259.º),Aquisição de bens móveis,"33000000-0, Equipamento médico, medicamentos e produtos para cuidados pessoais","Hospital Garcia de Orta, E. P. E. (506361470)","NOVARTIS FARMA, S.A. (500063524)","5.679,00 €",13-02-2017,09-01-2017,90 dias,"Portugal, Setúbal, Almada",Artigo 259.º do Código dos Contratos Públicos,,,,,,2556219,CP2015/6 MEDICAMENTOS FORO ONCOLOGICO ABERTO PELA SPMS P259-AC-2016-89,FALSE
DOLUTEGRAVIR 50 MG + ABACAVIR 600 MG + LAMIVUDINA 300 MG COMP - Ajuste Directo Nº 14004917,Ajuste Direto Regime Geral,Aquisição de bens móveis,"33000000-0, Equipamento médico, medicamentos e produtos para cuidados pessoais","Hospital Garcia de Orta, E. P. E. (506361470)","VIIVHIV HEALTHCARE, UNIPESSOAL LDA (509117961)","56.010,00 €",13-02-2017,09-01-2017,90 dias,"Portugal, Setúbal, Almada","Artigo 24.º, n.º 1, alínea e) do Código dos Contratos Públicos",,,,,,Não aplicável.,Não aplicável.,FALSE
VORICONAZOL 200 MG COMP - Ajuste Directo Nº 11004517,Ao abrigo de acordo-quadro (art.º 259.º),Aquisição de bens móveis,"33000000-0, Equipamento médico, medicamentos e produtos para cuidados pessoais","Hospital Garcia de Orta, E. P. E. (506361470)",LAB. PFIZER (500162166),"21.887,58 €",13-02-2017,09-01-2017,90 dias,"Portugal, Setúbal, Almada",Artigo 259.º do Código dos Contratos Públicos,,,,,,1422736,CP 2015/41 - ACORDO QUADRO PARA FORNECIMENTO DE MEDICAMENTOS ANTI-INFECIOSOS: ANTIVÍRICOS E ANTIFÚNGICOS ÀS INSTITUIÇÕES E SERVIÇOS DO SERVIÇO NACIONAL DE SAÚDE,FALSE
HIDROCORTISONA 100 MG PÓ SOL INJ FR IM IV - Aj. Directo Nº 11004217,Ao abrigo de acordo-quadro (art.º 259.º),Aquisição de bens móveis,"33000000-0, Equipamento médico, medicamentos e produtos para cuidados pessoais","Hospital Garcia de Orta, E. P. E. (506361470)",LAB. PFIZER (500162166),"1.242,00 €",13-02-2017,11-01-2017,90 dias,"Portugal, Setúbal, Almada",Artigo 259.º do Código dos Contratos Públicos,,,,,,1415640,CP 2015/7 - ACORDO QUADRO PARA FORNECIMENTO DE HORMONAS E OUTROS MEDICAMENTOS USADOS NO TRATAMENTO DAS DOENÇAS ENDÓCRINAS ÀS INSTITUIÇÕES E SERVIÇOS DO SERVIÇO NACIONAL DE SAÚDE,FALSE
HIDROCORTISONA 100 MG PÓ SOL INJ FR IM IV - Aj. Directo Nº 11004217,Ao abrigo de acordo-quadro (art.º 259.º),Aquisição de bens móveis,"33000000-0, Equipamento médico, medicamentos e produtos para cuidados pessoais","Hospital Garcia de Orta, E. P. E. (506361470)",GENERIS FARMACÊUTICA SA (505625520),"4.680,00 €",13-02-2017,11-01-2017,90 dias,"Portugal, Setúbal, Almada",Artigo 259.º do Código dos Contratos Públicos,,,,,,1415640,CP 2015/7 - ACORDO QUADRO PARA FORNECIMENTO DE HORMONAS E OUTROS MEDICAMENTOS USADOS NO TRATAMENTO DAS DOENÇAS ENDÓCRINAS ÀS INSTITUIÇÕES E SERVIÇOS DO SERVIÇO NACIONAL DE SAÚDE,FALSE
CONT. NAO IONICO BAIXA OSMOLARIDADE I300-370MGI/ML 200ML -FRS - Aj. Directo Nº 14003417,Ajuste Direto Regime Geral,Aquisição de bens móveis,"33000000-0, Equipamento médico, medicamentos e produtos para cuidados pessoais","Hospital Garcia de Orta, E. P. E. (506361470)","BAYER PORTUGAL, S.A. (500043256)","32.889,00 €",13-02-2017,12-01-2017,180 dias,"Portugal, Setúbal, Almada","Artigo 24.º, n.º 1, alínea e) do Código dos Contratos Públicos",,,,,,Não aplicável.,Não aplicável.,FALSE
IMIGLUCERASE 400 U PÓ SOL INJ FR IV - Aj. Directo Nº 11003317,Ajuste Direto Regime Geral,Aquisição de bens móveis,"33000000-0, Equipamento médico, medicamentos e produtos para cuidados pessoais","Hospital Garcia de Orta, E. P. E. (506361470)","SANOFI - PRODUTOS FARMACÊUTICOS, LDA. (500134960)","0,00 €",13-02-2017,09-01-2017,60 dias,"Portugal, Setúbal, Almada",Artigo 258.º do Código dos Contratos Públicos,,,,,,2594686,IMIGLUCERASE 400 U PÓ SOL INJ FR IV,FALSE
FOSAPREPITANT 150 MG PÓ SOL INJ FR IV - Aj. Directo Nº 14002917,Ajuste Direto Regime Geral,Aquisição de bens móveis,"33000000-0, Equipamento médico, medicamentos e produtos para cuidados pessoais","Hospital Garcia de Orta, E. P. E. (506361470)",Merck Sharp e Dohme Lda. (500191360),"0,00 €",13-02-2017,03-01-2017,90 dias,"Portugal, Setúbal, Almada",Artigo 258.º do Código dos Contratos Públicos,,,,,,2594532,FOSAPREPITANT 150 MG PÓ SOL INJ FR IV,FALSE
AZACITIDINA 100 MG PÓ SUSP INJ - Aj. directo Nº 14002817,Ajuste Direto Regime Geral,Aquisição de bens móveis,"33000000-0, Equipamento médico, medicamentos e produtos para cuidados pessoais","Hospital Garcia de Orta, E. P. E. (506361470)","CELGENE SOCIEDADE UNIP., LDA (507791690)","15.930,00 €",13-02-2017,03-01-2017,90 dias,"Portugal, Setúbal, Almada","Artigo 24.º, n.º 1, alínea e) do Código dos Contratos Públicos",,,,,,Não aplicável.,Não aplicável.,FALSE
SELANTE HEMOSTÁTICO MATRIZ ESTÉRIL - Aj. Directo Nº 14002617,Ajuste Direto Regime Geral,Aquisição de bens móveis,"33000000-0, Equipamento médico, medicamentos e produtos para cuidados pessoais","Hospital Garcia de Orta, E. P. E. (506361470)","Baxter Médico Farmacêutica, Lda (503347345)","9.600,00 €",13-02-2017,03-01-2017,90 dias,"Portugal, Setúbal, Almada","Artigo 20.º, n.º 1, alínea a) do Código dos Contratos Públicos",,,,,,Não aplicável.,Não aplicável.,FALSE
"CLORETO DE SÓDIO 9 MG/ML (0,9%) SOL INJ FR 10 ML IV - Ajuste Directo Nº 11002117",Ajuste Direto Regime Geral,Aquisição de bens móveis,"33000000-0, Equipamento médico, medicamentos e produtos para cuidados pessoais","Hospital Garcia de Orta, E. P. E. (506361470)",B BRAUN MEDICAL LDA (501506543),"0,00 €",13-02-2017,09-01-2017,90 dias,"Portugal, Setúbal, Almada",Artigo 258.º do Código dos Contratos Públicos,,,,,,2593963,"CLORETO DE SÓDIO 9 MG/ML (0,9%) SOL INJ FR 10 ML IV",FALSE
"CLORETO DE SÓDIO 9 MG/ML (0,9%) SOL INJ FR 10 ML IV - Ajuste Directo Nº 11002117",Ajuste Direto Regime Geral,Aquisição de bens móveis,"33000000-0, Equipamento médico, medicamentos e produtos para cuidados pessoais","Hospital Garcia de Orta, E. P. E. (506361470)","LABESFAL, S.A. (501169580)","0,00 €",13-02-2017,09-01-2017,90 dias,"Portugal, Setúbal, Almada",Artigo 258.º do Código dos Contratos Públicos,,,,,,2593963,"CLORETO DE SÓDIO 9 MG/ML (0,9%) SOL INJ FR 10 ML IV",FALSE
EMTRICITABINA 200 MG + TENOFOVIR 245 MG COMP - Aj. Directo Nº 11001817,Ao abrigo de acordo-quadro (art.º 259.º),Aquisição de bens móveis,"33000000-0, Equipamento médico, medicamentos e produtos para cuidados pessoais","Hospital Garcia de Orta, E. P. E. (506361470)","GILEAD SCIENCES, LDA (503604704)","203.782,92 €",13-02-2017,05-01-2017,120 dias,"Portugal, Setúbal, Almada",Artigo 259.º do Código dos Contratos Públicos,,,,,,2183729,Medicamentos antirretrovíricos para o tratamento da infeção por VIH,FALSE
IPRATRÓPIO (BROMETO) 20 ΜG/DOSE SOL PRESSU INAL RECIP PRESSU 200 DOSE(S - Aj. Directo Nº 11001117,Ao abrigo de acordo-quadro (art.º 259.º),Aquisição de bens móveis,"33000000-0, Equipamento médico, medicamentos e produtos para cuidados pessoais","Hospital Garcia de Orta, E. P. E. (506361470)",Unilfarma (500293023),"5.340,00 €",13-02-2017,09-01-2017,90 dias,"Portugal, Setúbal, Almada",Artigo 259.º do Código dos Contratos Públicos,,,,,,1638654,CP 2015/12 - Acordo quadro para fornecimento de Medicamentos do Aparelho Respiratório às Instituições e Serviços do Serviço Nacional de Saúde,FALSE
PIPERACILINA 4000 MG + TAZOBACTAM 500 MG PÓ SOL INJ FR IV - Aj. Directo Nº 11000117,Ajuste Direto Regime Geral,Aquisição de bens móveis,"33000000-0, Equipamento médico, medicamentos e produtos para cuidados pessoais","Hospital Garcia de Orta, E. P. E. (506361470)","FRESENIUS KABI PHARMA PORTUGAL,LDA (504293753)","0,00 €",13-02-2017,09-01-2017,90 dias,"Portugal, Setúbal, Almada",Artigo 258.º do Código dos Contratos Públicos,,,,,,2593318,PIPERACILINA 4000 MG + TAZOBACTAM 500 MG PÓ SOL INJ FR IV,FALSE
