freguesia,acronym,validVotesPercentage,votes,dicofre
Encarnação,PPD/PSD,43.84,598,110904
Encarnação,PS,23.75,324,110904
Encarnação,CDS-PP,7.62,104,110904
Encarnação,B.E.,5.79,79,110904
Encarnação,PAN,5.65,77,110904
Encarnação,PCP-PEV,3.08,42,110904
Encarnação,A,2.27,31,110904
Encarnação,PPM.PPV/CDC,1.98,27,110904
Encarnação,L,1.69,23,110904
Encarnação,NC,0.95,13,110904
Encarnação,PNR,0.73,10,110904
Encarnação,IL,0.59,8,110904
Encarnação,PCTP/MRPP,0.59,8,110904
Encarnação,PURP,0.51,7,110904
Encarnação,PTP,0.44,6,110904
Encarnação,MAS,0.37,5,110904
Encarnação,PDR,0.15,2,110904
