Objeto do Contrato,Tipo de Procedimento,Tipo(s) de Contrato,CPVs,Entidade(s) Adjudicante(s),Entidade(s) Adjudicatária(s),Preço Contratual,Data de Publicação,Data de Celebração do Contrato,Prazo de Execução,Local de Execução,Fundamentação,Data de Fecho do Contrato,Preço Total Efetivo,Causas das Alterações ao Prazo,Causas das Alterações ao Preço,Estado,N.º registo do Acordo Quadro,Descrição do Acordo Quadro,Procedimento Centralizado
Aquisição de 10 Balanças de Bioimpedância para Consultas de Nutrição,Ajuste Direto Regime Geral,Aquisição de bens móveis,"38311000-8, Balanças electrónicas e acessórios","Administração Regional de Saúde do Algarve, I.P. (503148709)","Sorisa, Estética e Fisioterapia SA (500990441)","18.309,10 €",11-10-2018,20-09-2018,81 dias,"Portugal, Faro, Faro","Artigo 20.º, n.º 1, alínea d) do Código dos Contratos Públicos",31-12-2018,"18.309,10 €","","",,Não aplicável.,Não aplicável.,FALSE
PV 297/2018 - Empreitada de Adaptação Funcional para Gabinete de Medicina Dentária/Higiene Oral no Centro de Saúde de V. Real de Sto. António,Consulta Prévia,Empreitadas de obras públicas,"45454000-4, Obras de reestruturação","Administração Regional de Saúde do Algarve, I.P. (503148709)","ALGARELEVO II, LDA. (514772913)","16.936,19 €",11-10-2018,04-10-2018,60 dias,"Portugal, Faro, Vila Real Sto Antonio","Artigo 19.º, alínea c) do Código dos Contratos Públicos",04-01-2019,"16.936,19 €",A obra terminou antes do prazo de execução previsto.,"",,Não aplicável.,Não aplicável.,FALSE
Aquisição de Lâminas de Bisturi,Ao abrigo de acordo-quadro (art.º 259.º),Aquisição de bens móveis,"33100000-1, Equipamento médico","Administração Regional de Saúde do Algarve, I. P. (503148709)","Quilaban - Química Laboratorial Analítica, SA (500399670)","880,00 €",10-10-2018,10-10-2018,82 dias,"Portugal, Faro, Faro",Artigo 259.º do Código dos Contratos Públicos,"","","","",,2102851,CP 2016/74 - Acordo quadro para fornecimento de Material disposable de bloco operatório - Parte I-B às Instituições e Serviços do Serviço Nacional de Saúde,FALSE
PV 273/2018 - Empreitada de Conservação e Reabilitação da Envolvente Exterior do Centro de Saúde de Olhão,Consulta Prévia,Empreitadas de obras públicas,"45261910-6, Reparação de coberturas","Administração Regional de Saúde do Algarve, I. P. (503148709)","Rolear.On - Soluções de Engenharia, S.A. (501408304)","115.531,04 €",08-10-2018,27-09-2018,90 dias,"Portugal, Faro, Olhão","Artigo 20.º, n.º 1, alínea c) do Código dos Contratos Públicos","","","","",,Não aplicável.,Não aplicável.,FALSE
"AD-2018-30 - Aquisição da vacina V39 - VACINA DUPLA CONTRA TETANO E DIFTERIA (Td DOSE REDUZ.)[UDOSE], para cumprimento do Programa Nacional de Vacinação de 2018 para as Instituições de saúde",Ajuste Direto Regime Geral,Aquisição de bens móveis,"33600000-6, Produtos farmacêuticos","Administração Regional de Saúde do Algarve, I. P. (503148709)","J.M.Farmacêutica, S.A. (503550558)","69.600,25 €",08-10-2018,10-09-2018,90 dias,"Portugal, Faro, Faro","Artigo 24.º, n.º 1, alínea e), subalínea ii) do Código dos Contratos Públicos","","","","",,Não aplicável.,Não aplicável.,TRUE
Aquisição de Medicamentos Gerais - Hidrocortizona,Ao abrigo de acordo-quadro (art.º 259.º),Aquisição de bens móveis,"33690000-3, Medicamentos vários","Administração Regional de Saúde do Algarve, I. P. (503148709)","Generis, S.A. (508107997)","1.170,00 €",02-10-2018,02-10-2018,90 dias,"Portugal, Faro, Faro",Artigo 259.º do Código dos Contratos Públicos,"","","","",,3379938,Hormonas e outros medicamentos usados no tratamento de doenças endócrinas,FALSE
"AD-2018-75 - Aquisição de T222 e V22, para cumprimento do Programa Nacional de Vacinação de 2018 para as Administrações Regionais de Saúde e Direções Regionais de Saúde",Ajuste Direto Regime Geral,Aquisição de bens móveis,"33600000-6, Produtos farmacêuticos","Administração Regional de Saúde do Algarve, I. P. (503148709)","J.M.Farmacêutica, Lda. (503550558)","500,00 €",02-10-2018,18-09-2018,100 dias,Portugal,"Artigo 24.º, n.º 1, alínea e), subalínea ii) do Código dos Contratos Públicos","","","","",,Não aplicável.,Não aplicável.,TRUE
SC/300/2018 - Aquisição de Medicamentos Gerais - CPA 472015,Ao abrigo de acordo-quadro (art.º 259.º),Aquisição de bens móveis,"33690000-3, Medicamentos vários","Administração Regional de Saúde do Algarve, I. P. (503148709)","Labesfal, S.A. (501169580)","1.600,00 €",01-10-2018,10-09-2018,100 dias,"Portugal, Faro, Faro",Artigo 259.º do Código dos Contratos Públicos,"","","","",,3361713,CP 2018/47 - Medicamentos do aparelho locomotor,FALSE
SC/300/2018 - Aquisição de Medicamentos Gerais - CPA 472015,Ao abrigo de acordo-quadro (art.º 259.º),Aquisição de bens móveis,"33690000-3, Medicamentos vários","Administração Regional de Saúde do Algarve, I. P. (503148709)","Bial - Portela & CA., S.A. (500220913)","46,20 €",01-10-2018,10-09-2018,100 dias,"Portugal, Faro, Faro",Artigo 259.º do Código dos Contratos Públicos,"","","","",,3361713,CP 2018/47 - Medicamentos do aparelho locomotor,FALSE
SC/300/2018 - Aquisição de Medicamentos Gerais - CPA 472015,Ao abrigo de acordo-quadro (art.º 259.º),Aquisição de bens móveis,"33690000-3, Medicamentos vários","Administração Regional de Saúde do Algarve, I. P. (503148709)","Generis, S.A. (508107997)","78,50 €",01-10-2018,10-09-2018,100 dias,"Portugal, Faro, Faro",Artigo 259.º do Código dos Contratos Públicos,03-12-2018,"76,00 €","",Quantidades encomendadas.,,3361713,CP 2018/47 - Medicamentos do aparelho locomotor,FALSE
Aquisição de Medicamentos - Trolamina,Ajuste Direto Regime Geral,Aquisição de bens móveis,"33690000-3, Medicamentos vários","Administração Regional de Saúde do Algarve, I. P. (503148709)","Johnson & Johnson, Lda. (500153370)","7.196,00 €",01-10-2018,25-09-2018,95 dias,"Portugal, Faro, Faro","Artigo 24.º, n.º 1, alínea e), subalínea ii) do Código dos Contratos Públicos","","","","",,Não aplicável.,Não aplicável.,FALSE
