freguesia,acronym,validVotesPercentage,votes,dicofre
Fajã Grande,PS,48.44,31,480101
Fajã Grande,B.E.,15.63,10,480101
Fajã Grande,PPD/PSD,15.63,10,480101
Fajã Grande,A,4.69,3,480101
Fajã Grande,PAN,3.13,2,480101
Fajã Grande,PCTP/MRPP,3.13,2,480101
Fajã Grande,PURP,3.13,2,480101
Fajã Grande,CDS-PP,1.56,1,480101
Fajã Grande,L,1.56,1,480101
Fajã Grande,PCP-PEV,1.56,1,480101
Fajã Grande,PPM.PPV/CDC,1.56,1,480101
Fajã Grande,IL,0,0,480101
Fajã Grande,MAS,0,0,480101
Fajã Grande,NC,0,0,480101
Fajã Grande,PDR,0,0,480101
Fajã Grande,PNR,0,0,480101
Fajã Grande,PTP,0,0,480101
