Objeto do Contrato,Tipo de Procedimento,Tipo(s) de Contrato,CPVs,Entidade(s) Adjudicante(s),Entidade(s) Adjudicatária(s),Preço Contratual,Data de Publicação,Data de Celebração do Contrato,Prazo de Execução,Local de Execução,Fundamentação,Data de Fecho do Contrato,Preço Total Efetivo,Causas das Alterações ao Prazo,Causas das Alterações ao Preço,Estado,N.º registo do Acordo Quadro,Descrição do Acordo Quadro,Procedimento Centralizado
Aquisição de serviços de mapeamento de fontes de dados e de desenvolvimento do quadro de indicadores estratégicos.,Ajuste Direto Regime Geral,Aquisição de serviços,"79420000-4, Serviços relacionados com a gestão","Administração Central do Sistema de Saúde, I. P. (508188423)",Instituto Superior de Estatística e Gestão de Informação da Universidade Nova de Lisboa - Nova Information Management School (502322152),"74.000,00 €",22-09-2015,25-08-2015,90 dias,"Portugal, Lisboa, Lisboa","Artigo 20.º, n.º 1, alínea a) do Código dos Contratos Públicos",07-01-2016,"74.000,00 €",,"",,Não aplicável.,Não aplicável.,FALSE
"Aquisição de ações de formação inicial para os novos trabalhadores da Administração Central do Sistema de Saúde, I.P. no âmbito do Plano de Formação para o ano de 2015.",Ajuste Direto Regime Geral,Aquisição de serviços,"80500000-9, Serviços de formação","Administração Central do Sistema de Saúde, I. P. (508188423)",Direcção Geral da Qualificação dos Trabalhadores em Funções Públicas (600084876),"20.510,00 €",22-09-2015,07-07-2015,177 dias,"Portugal, Lisboa, Lisboa","Artigo 24.º, n.º 1, alínea e) do Código dos Contratos Públicos",30-12-2015,"12.352,20 €",,foi faturado a menos,,Não aplicável.,Não aplicável.,FALSE
