Objeto do Contrato,Tipo de Procedimento,Tipo(s) de Contrato,CPVs,Entidade(s) Adjudicante(s),Entidade(s) Adjudicatária(s),Preço Contratual,Data de Publicação,Data de Celebração do Contrato,Prazo de Execução,Local de Execução,Fundamentação,Data de Fecho do Contrato,Preço Total Efetivo,Causas das Alterações ao Prazo,Causas das Alterações ao Preço,Estado,N.º registo do Acordo Quadro,Descrição do Acordo Quadro,Procedimento Centralizado
"Aquisição de Dispositivos Médicos - Cateteres para a ULSLA, EPE",Ao abrigo de acordo-quadro (art.º 259.º),Aquisição de bens móveis,"33100000-1, Equipamento médico","Unidade Local de Saúde do Litoral Alentejano, E. P. E. (510445152)","BECTON DICKINSON PORTUGAL UNIPESSOAL, LDA (514239743)","4.500,00 €",20-07-2018,19-07-2018,160 dias,"Portugal, Setúbal, Santiago do Cacém",Artigo 259.º do Código dos Contratos Públicos,,,,,,2622225,CP 2017/26 - Acordo Quadro para Fornecimento de Cateteres   às Instituições e Serviços do Serviço Nacional de Saúde,FALSE
"Aquisição de Dispositivos Médicos - Cateteres para a ULSLA, EPE",Ao abrigo de acordo-quadro (art.º 259.º),Aquisição de bens móveis,"33100000-1, Equipamento médico","Unidade Local de Saúde do Litoral Alentejano, E. P. E. (510445152)",OVERPHARMA PROD MEDICOS E FARMACEUTICOS LDA (505792362),"7.560,00 €",20-07-2018,19-07-2018,160 dias,"Portugal, Setúbal, Santiago do Cacém",Artigo 259.º do Código dos Contratos Públicos,,,,,,2622225,CP 2017/26 - Acordo Quadro para Fornecimento de Cateteres   às Instituições e Serviços do Serviço Nacional de Saúde,FALSE
Aquisição de Dispositivos Médicos - Cateteres,Ao abrigo de acordo-quadro (art.º 259.º),Aquisição de bens móveis,"33100000-1, Equipamento médico","Unidade Local de Saúde do Litoral Alentejano, E. P. E. (510445152)","PMH PRODUTOS MEDIC. HOSPITAL, SA (502376899)","5.790,00 €",20-07-2018,19-07-2018,160 dias,"Portugal, Setúbal, Santiago do Cacém",Artigo 259.º do Código dos Contratos Públicos,,,,,,2622225,CP 2017/26 - Acordo Quadro para Fornecimento de Cateteres   às Instituições e Serviços do Serviço Nacional de Saúde,FALSE
"Aquisição de Dispositivos Médicos - Cateteres para a ULSLA, EPE",Ao abrigo de acordo-quadro (art.º 259.º),Aquisição de bens móveis,"33100000-1, Equipamento médico","Unidade Local de Saúde do Litoral Alentejano, E. P. E. (510445152)","Vygon, Lda (503232785)","2.242,00 €",20-07-2018,19-07-2018,160 dias,"Portugal, Setúbal, Santiago do Cacém",Artigo 259.º do Código dos Contratos Públicos,,,,,,2622225,CP 2017/26 - Acordo Quadro para Fornecimento de Cateteres   às Instituições e Serviços do Serviço Nacional de Saúde,FALSE
"Aquisição de Dispositivos Médicos - Cateteres para a ULSLA, EPE",Ao abrigo de acordo-quadro (art.º 259.º),Aquisição de bens móveis,"33100000-1, Equipamento médico","Unidade Local de Saúde do Litoral Alentejano, E. P. E. (510445152)","B BRAUN MEDICAL, LDA. (501506543)","20.981,40 €",20-07-2018,19-07-2018,160 dias,"Portugal, Setúbal, Santiago do Cacém",Artigo 259.º do Código dos Contratos Públicos,,,,,,2622225,CP 2017/26 - Acordo Quadro para Fornecimento de Cateteres   às Instituições e Serviços do Serviço Nacional de Saúde,FALSE
Aquisição de Dispositivos Médicos - Seringas e Agulhas,Ao abrigo de acordo-quadro (art.º 259.º),Aquisição de bens móveis,"33600000-6, Produtos farmacêuticos","Unidade Local de Saúde do Litoral Alentejano, E. P. E. (510445152)","BECTON DICKINSON PORTUGAL UNIPESSOAL, LDA (514239743)","4.607,50 €",20-07-2018,19-07-2018,160 dias,"Portugal, Setúbal, Santiago do Cacém",Artigo 259.º do Código dos Contratos Públicos,,,,,,1341769,"ACORDO QUADRO PARA FORNECIMENTO DE SERINGAS, AGULHAS E CONTENTORES ÀS INSTITUIÇÕES E SERVIÇOS DO SERVIÇO NACIONAL DE SAÚDE PROGRAMA DE CONCURSO",FALSE
"Aquisição de Dispositivos Médicos - Seringas e Agulhas para a ULSLA, EPE",Ao abrigo de acordo-quadro (art.º 259.º),Aquisição de bens móveis,"33600000-6, Produtos farmacêuticos","Unidade Local de Saúde do Litoral Alentejano, E. P. E. (510445152)","LINEAMEDICA-DISPOSITIVOS MEDICOS-CIRUGICOS, SA (505148676)","321,60 €",19-07-2018,19-07-2018,160 dias,"Portugal, Setúbal, Santiago do Cacém",Artigo 259.º do Código dos Contratos Públicos,,,,,,1341769,"ACORDO QUADRO PARA FORNECIMENTO DE SERINGAS, AGULHAS E CONTENTORES ÀS INSTITUIÇÕES E SERVIÇOS DO SERVIÇO NACIONAL DE SAÚDE PROGRAMA DE CONCURSO",FALSE
"Aquisição de Dispositivos Médicos - Seringas e Agulhas para a ULSLA, EPE",Ao abrigo de acordo-quadro (art.º 259.º),Aquisição de bens móveis,"33600000-6, Produtos farmacêuticos","Unidade Local de Saúde do Litoral Alentejano, E. P. E. (510445152)","Quilaban, Lda (500399670)","8,55 €",19-07-2018,19-07-2018,160 dias,"Portugal, Setúbal, Santiago do Cacém",Artigo 259.º do Código dos Contratos Públicos,,,,,,1341769,"ACORDO QUADRO PARA FORNECIMENTO DE SERINGAS, AGULHAS E CONTENTORES ÀS INSTITUIÇÕES E SERVIÇOS DO SERVIÇO NACIONAL DE SAÚDE PROGRAMA DE CONCURSO",FALSE
"Aquisição de Dispositivos Médicos - Seringas e Agulhas para a ULSLA, EPE",Ao abrigo de acordo-quadro (art.º 259.º),Aquisição de bens móveis,"33600000-6, Produtos farmacêuticos","Unidade Local de Saúde do Litoral Alentejano, E. P. E. (510445152)",OVERPHARMA PROD MEDICOS E FARMACEUTICOS LDA (505792362),"24,33 €",19-07-2018,19-07-2018,160 dias,"Portugal, Setúbal, Santiago do Cacém",Artigo 259.º do Código dos Contratos Públicos,,,,,,1341769,"ACORDO QUADRO PARA FORNECIMENTO DE SERINGAS, AGULHAS E CONTENTORES ÀS INSTITUIÇÕES E SERVIÇOS DO SERVIÇO NACIONAL DE SAÚDE PROGRAMA DE CONCURSO",FALSE
Aquisição de Dispositivos Médicos - Seringas e Agulhas,Ao abrigo de acordo-quadro (art.º 259.º),Aquisição de bens móveis,"33600000-6, Produtos farmacêuticos","Unidade Local de Saúde do Litoral Alentejano, E. P. E. (510445152)","Docworld, Lda (508592909)","1.472,10 €",19-07-2018,19-07-2018,160 dias,"Portugal, Setúbal, Santiago do Cacém",Artigo 259.º do Código dos Contratos Públicos,,,,,,1341769,"ACORDO QUADRO PARA FORNECIMENTO DE SERINGAS, AGULHAS E CONTENTORES ÀS INSTITUIÇÕES E SERVIÇOS DO SERVIÇO NACIONAL DE SAÚDE PROGRAMA DE CONCURSO",FALSE
Aquisição de Próteses Totais do Joelho tipo Attune Cimentadas,Ajuste Direto Regime Geral,Aquisição de bens móveis,"33141750-2, Articulações artificiais",Unidade Local de Saúde do Litoral Alentejano EPE (510445152),Johnson & Johnson Lda (500153370),"31.500,00 €",18-07-2018,28-09-2017,90 dias,"Portugal, Setúbal, Santiago do Cacém","Artigo 26.º, n.º 1, alínea a) do Código dos Contratos Públicos",,,,,,Não aplicável.,Não aplicável.,FALSE
Aquisição de Serviços de Consultoria para Desenvolvimento de Planos para Disaster Recovery  & Business Continuity para a ULSLA EPE,Consulta Prévia,Aquisição de serviços,"72000000-5, Serviços de TI: consultoria, desenvolvimento de software, Internet e apoio","Unidade Local de Saúde do Litoral Alentejano, E. P. E. (510445152)",Projecttime II (506110117),"41.922,00 €",18-07-2018,03-07-2018,90 dias,"Portugal, Setúbal, Santiago do Cacém","Artigo 20.º, n.º 1, alínea c) do Código dos Contratos Públicos",,,,,,Não aplicável.,Não aplicável.,FALSE
"Aquisição de Sistema de Monitorização de Frio para a ULSLA, EPE",Consulta Prévia,Aquisição de bens móveis,"38900000-4, Instrumentos diversos de avaliação ou ensaio","Unidade Local de Saúde do Litoral Alentejano, E. P. E. (510445152)",bluestream (513196781),"40.888,00 €",17-07-2018,02-07-2018,30 dias,"Portugal, Setúbal, Santiago do Cacém","Artigo 20.º, n.º 1, alínea c) do Código dos Contratos Públicos",,,,,,Não aplicável.,Não aplicável.,FALSE
Aquisição de Dispositivos Médicos - Dispositivos de Evacuação e Banhos,Ao abrigo de acordo-quadro (art.º 259.º),Aquisição de bens móveis,"33600000-6, Produtos farmacêuticos","Unidade Local de Saúde do Litoral Alentejano, E. P. E. (510445152)",EZEQUIEL PANÃO JORGE; Lda (501412727),"420,00 €",16-07-2018,16-07-2018,165 dias,"Portugal, Setúbal, Santiago do Cacém",Artigo 259.º do Código dos Contratos Públicos,,,,,,2349400,Acordo quadro para o fornecimento de Dispositivos para evacuação e para banho.,FALSE
"Aquisição de Dispositivos Médicos - Dispositivos de Evacuação e Banhos para a Unidade Local de Saúde do Litoral Alentejano, EPE",Ao abrigo de acordo-quadro (art.º 259.º),Aquisição de bens móveis,"33600000-6, Produtos farmacêuticos","Unidade Local de Saúde do Litoral Alentejano, E. P. E. (510445152)",Bastos Viegas S.A. (500042772),"160,00 €",16-07-2018,16-07-2018,165 dias,"Portugal, Setúbal, Santiago do Cacém",Artigo 259.º do Código dos Contratos Públicos,,,,,,2349400,Acordo quadro para o fornecimento de Dispositivos para evacuação e para banho.,FALSE
"Aquisição de Dispositivos Médicos - Luvas para a Unidade Local de Saúde do Litoral Alentejano, EPE",Ao abrigo de acordo-quadro (art.º 259.º),Aquisição de bens móveis,"33141420-0, Luvas para cirurgia","Unidade Local de Saúde do Litoral Alentejano, E. P. E. (510445152)",Bastos Viegas S.A. (500042772),"23.690,00 €",13-07-2018,13-07-2018,180 dias,"Portugal, Setúbal, Santiago do Cacém",Artigo 259.º do Código dos Contratos Públicos,,,,,,2587226,CP 2017/23-Acordo quadro para fornecimento de Luvas para uso Hospitalar   às Instituições e Serviços do Serviço Nacional de Saúde,FALSE
"Aquisição de Dispositivos Médicos - Luvas para a Unidade Local de Saúde do Litoral Alentejano, EPE",Ao abrigo de acordo-quadro (art.º 259.º),Aquisição de bens móveis,"33141420-0, Luvas para cirurgia","Unidade Local de Saúde do Litoral Alentejano, E. P. E. (510445152)",EZEQUIEL PANÃO JORGE; Lda (501412727),"138,00 €",13-07-2018,13-07-2018,180 dias,"Portugal, Setúbal, Santiago do Cacém",Artigo 259.º do Código dos Contratos Públicos,,,,,,2587226,CP 2017/23-Acordo quadro para fornecimento de Luvas para uso Hospitalar   às Instituições e Serviços do Serviço Nacional de Saúde,FALSE
"Aquisição de Dispositivos Médicos - Luvas para a Unidade Local de Saúde do Litoral Alentejano, EPE",Ao abrigo de acordo-quadro (art.º 259.º),Aquisição de bens móveis,"33141420-0, Luvas para cirurgia","Unidade Local de Saúde do Litoral Alentejano, E. P. E. (510445152)","HR  HOSPITALAR,Unipessoal, LDA (501895558)","372,00 €",13-07-2018,13-07-2018,180 dias,"Portugal, Setúbal, Santiago do Cacém",Artigo 259.º do Código dos Contratos Públicos,,,,,,2587226,CP 2017/23-Acordo quadro para fornecimento de Luvas para uso Hospitalar   às Instituições e Serviços do Serviço Nacional de Saúde,FALSE
"Contratação de Serviços de Gestão e Tratamento de Resíduos Hospitalares na Unidade Local de Saúde do Litoral Alentejano, EPE",Concurso público,Aquisição de serviços,"90524000-6, Serviços relacionados com resíduos médicos","Unidade Local de Saúde do Litoral Alentejano, E. P. E. (510445152)","Ambimed Gestão Ambiental,Lda (503593427)","112.087,40 €",12-07-2018,01-07-2018,365 dias,"Portugal, Setúbal, Santiago do Cacém","Artigo 20.º, n.º 1, alínea a) do Código dos Contratos Públicos",,,,,,Não aplicável.,Não aplicável.,FALSE
Aquisição de Material Hoteleiro para a ULSLA. EPE,Consulta Prévia,Aquisição de bens móveis,"33760000-5, Papel higiénico, lenços, toalhas de mão e guardanapos","Unidade Local de Saúde do Litoral Alentejano, E. P. E. (510445152)","FALGI-EQUIP.PROD.LIMPEZA, LDA (504629565)","9.189,59 €",12-07-2018,06-07-2018,150 dias,"Portugal, Setúbal, Santiago do Cacém","Artigo 20.º, n.º 1, alínea c) do Código dos Contratos Públicos",,,,,,Não aplicável.,Não aplicável.,FALSE
Aquisição de Material Hoteleiro para a ULSLA. EPE,Consulta Prévia,Aquisição de bens móveis,"33760000-5, Papel higiénico, lenços, toalhas de mão e guardanapos","Unidade Local de Saúde do Litoral Alentejano, E. P. E. (510445152)","CSH, COMERCIO SERVIÇO HIGIENE, LDA. (504346091)","12.798,40 €",12-07-2018,06-07-2018,150 dias,"Portugal, Setúbal, Santiago do Cacém","Artigo 20.º, n.º 1, alínea c) do Código dos Contratos Públicos",,,,,,Não aplicável.,Não aplicável.,FALSE
Aquisição de Material Hoteleiro para a ULSLA. EPE,Consulta Prévia,Aquisição de bens móveis,"33760000-5, Papel higiénico, lenços, toalhas de mão e guardanapos","Unidade Local de Saúde do Litoral Alentejano, E. P. E. (510445152)","ARTUR&GUERREIRO - Comerc. de Prod. Hoteleiros, Lda (503897787)","6.820,47 €",12-07-2018,06-07-2018,150 dias,"Portugal, Setúbal, Santiago do Cacém","Artigo 20.º, n.º 1, alínea c) do Código dos Contratos Públicos",,,,,,Não aplicável.,Não aplicável.,FALSE
