Objeto do Contrato,Tipo de Procedimento,Tipo(s) de Contrato,CPVs,Entidade(s) Adjudicante(s),Entidade(s) Adjudicatária(s),Preço Contratual,Data de Publicação,Data de Celebração do Contrato,Prazo de Execução,Local de Execução,Fundamentação,Data de Fecho do Contrato,Preço Total Efetivo,Causas das Alterações ao Prazo,Causas das Alterações ao Preço,Estado,N.º registo do Acordo Quadro,Descrição do Acordo Quadro,Procedimento Centralizado
Aquisição de reagentes imunologia - AjD 80003517,Ajuste Direto Regime Geral,Aquisição de bens móveis,"33696500-0, Reagentes de laboratório",Centro Hospitalar do Oeste (510412009),"Abbott Laboratórios, Lda (500006148)","6.638,70 €",23-02-2017,16-01-2017,1 dias,"Portugal, Leiria, Caldas da Rainha","Artigo 20.º, n.º 1, alínea a) do Código dos Contratos Públicos",16-01-2017,"6.638,70 €",,,,Não aplicável.,Não aplicável.,FALSE
Aquisição reagentes de imunologia - AjD 80004617,Ajuste Direto Regime Geral,Aquisição de bens móveis,"33696500-0, Reagentes de laboratório",Centro Hospitalar do Oeste  (510412009),"Abbott Laboratórios, Lda (500006148)","8.032,50 €",23-02-2017,24-01-2017,1 dias,"Portugal, Leiria, Caldas da Rainha","Artigo 20.º, n.º 1, alínea a) do Código dos Contratos Públicos",24-01-2017,"8.032,50 €",,,,Não aplicável.,Não aplicável.,FALSE
Aquisição de reagentes bioquimica - AjD 80003217,Ajuste Direto Regime Geral,Aquisição de bens móveis,"33140000-3, Material médico de consumo",Centro Hospitalar do Oeste (510412009),"Abbott Laboratórios, Lda (500006148)","6.111,55 €",23-02-2017,16-01-2017,1 dias,"Portugal, Leiria, Caldas da Rainha","Artigo 20.º, n.º 1, alínea a) do Código dos Contratos Públicos",16-01-2017,"6.111,55 €",,,,Não aplicável.,Não aplicável.,FALSE
