Objeto do Contrato,Tipo de Procedimento,Tipo(s) de Contrato,CPVs,Entidade(s) Adjudicante(s),Entidade(s) Adjudicatária(s),Preço Contratual,Data de Publicação,Data de Celebração do Contrato,Prazo de Execução,Local de Execução,Fundamentação,Data de Fecho do Contrato,Preço Total Efetivo,Causas das Alterações ao Prazo,Causas das Alterações ao Preço,Estado,N.º registo do Acordo Quadro,Descrição do Acordo Quadro,Procedimento Centralizado
Aquisição de Serviços à Faculdade de Medicina do Porto (FMUP) - contratação de médicos cubanos,Ajuste Direto Regime Geral,Aquisição de serviços,"79600000-0, Serviços de recrutamento","Administração Central do Sistema de Saúde, I. P. (508188423)",Faculdade de Medicina da Universidade do Porto (501413197),"58.910,00 €",04-09-2014,15-05-2014,20 dias,"Portugal, Lisboa, Lisboa","Artigo 20.º, n.º 1, alínea a) do Código dos Contratos Públicos",10-09-2014,"58.910,00 €",,,,Não aplicável.,Não aplicável.,FALSE
"Aquisição de serviços de assessoria económico-financeira no âmbito da implementação do Decreto-Lei n.º 138/2013, de 9 de outubro",Ajuste Direto Regime Geral,Aquisição de serviços,"73000000-2, Serviços de investigação e desenvolvimento e serviços de consultoria conexos","Administração Central do Sistema de Saúde, I. P. (508188423)","BPI, S.A. (501214534)","15.500,00 €",01-09-2014,01-08-2014,30 dias,"Portugal, Lisboa, Lisboa","Artigo 20.º, n.º 1, alínea a) do Código dos Contratos Públicos",30-09-2014,"15.500,00 €",,,,Não aplicável.,Não aplicável.,FALSE
Aquisição de serviços informáticos - II fase EEA Grants,Ajuste Direto Regime Geral,Aquisição de serviços,"72000000-5, Serviços de TI: consultoria, desenvolvimento de software, Internet e apoio","Administração Central do Sistema de Saúde, I. P. (508188423)","MasterLink-Sistemas de Informação, Lda. (504143603)","25.305,00 €",01-09-2014,07-07-2014,180 dias,"Portugal, Lisboa, Lisboa","Artigo 20.º, n.º 1, alínea a) do Código dos Contratos Públicos",24-09-2015,"25.305,00 €",,,,Não aplicável.,Não aplicável.,FALSE
