Objeto do Contrato,Tipo de Procedimento,Tipo(s) de Contrato,CPVs,Entidade(s) Adjudicante(s),Entidade(s) Adjudicatária(s),Preço Contratual,Data de Publicação,Data de Celebração do Contrato,Prazo de Execução,Local de Execução,Fundamentação,Data de Fecho do Contrato,Preço Total Efetivo,Causas das Alterações ao Prazo,Causas das Alterações ao Preço,Estado,N.º registo do Acordo Quadro,Descrição do Acordo Quadro,Procedimento Centralizado
PRESTAÇÃO SERVIÇOS HIGIENE E LIMPEZA,Concurso público,Aquisição de serviços,"90910000-9, Serviços de limpeza","Hospital Distrital de Santarém, E. P. E. (506361462)",AMBIENTE & JARDIM II- MULTISERVICES SA (510314910),"89.000,00 €",03-08-2016,30-07-2016,153 dias,"Portugal, Santarém, Santarém","Artigo 20.º, n.º 1, alínea b) do Código dos Contratos Públicos",,,,,,Não aplicável.,Não aplicável.,FALSE
PRESTAÇÃO SERVIÇOS TELERRADIOLOGIA,Concurso público,Aquisição de serviços,"85150000-5, Serviços de imagiologia médica","Hospital Distrital de Santarém, EPE (506361462)",ITM- INSTITUTO DE TELEMEDICINA LDA (506705641),"97.970,00 €",02-08-2016,12-07-2016,172 dias,"Portugal, Santarém, Santarém","Artigo 20.º, n.º 1, alínea b) do Código dos Contratos Públicos",,,,,,Não aplicável.,Não aplicável.,FALSE
"Prestação Serviços GESTÃO INTERNA RESIDUOS  do Hospital de Santarém, no período de Agosto a Dezembro",Ajuste Direto Regime Geral,Aquisição de serviços,"90500000-2, Serviços relativos a resíduos e lixos","Hospital Distrital de Santarém, EPE (506361462)",AMBIMED GESTÃO AMBIENTAL LDA (503593427),"20.775,00 €",02-08-2016,18-07-2016,153 dias,"Portugal, Santarém, Santarém","Artigo 20.º, n.º 1, alínea a) do Código dos Contratos Públicos",,,,,,Não aplicável.,Não aplicável.,FALSE
