Objeto do Contrato,Tipo de Procedimento,Tipo(s) de Contrato,CPVs,Entidade(s) Adjudicante(s),Entidade(s) Adjudicatária(s),Preço Contratual,Data de Publicação,Data de Celebração do Contrato,Prazo de Execução,Local de Execução,Fundamentação,Data de Fecho do Contrato,Preço Total Efetivo,Causas das Alterações ao Prazo,Causas das Alterações ao Preço,Estado,N.º registo do Acordo Quadro,Descrição do Acordo Quadro,Procedimento Centralizado
"Aquisição de serviços de seguros, mediante os quais são transferidos para uma seguradora os riscos de acidentes de trabalho, acidentes pessoais das equipas de emergência, de estagiários, eventos de risco e evacuação aérea e da frota automóvel.",Ajuste Direto Regime Geral,Aquisição de serviços,"66510000-8, Serviços de seguros","Instituto Nacional de Emergência Médica, IP (501356126)","VILLAS-BOAS ACP - Corretores Associados de Seguros, Lda. (500477540)","708.844,89 €",11-07-2011,31-03-2011,275 dias,Portugal,"Artigo 27.º, n.º 1, alínea a) do Código dos Contratos Públicos",,,,,,Não aplicável.,Não aplicável.,
"Cloreto sódio 9% para irrigação, morfina 1% e furosimida.",Ao abrigo de acordo-quadro (art.º 258.º),Aquisição de bens móveis,"33690000-3, Medicamentos vários","Instituto Nacional de Emergência Médica, IP (501356126)",OVERPHARMA (505792362),"1.302,50 €",11-07-2011,28-02-2011,30 dias,"Portugal, Lisboa, Lisboa","Artigo 26.º, n.º 1, alínea e) do Código dos Contratos Públicos",,,,,,Não definido.,Não definido.,
120 Frascos de desinfectante etanol+propanol.,Ao abrigo de acordo-quadro (art.º 258.º),Aquisição de bens móveis,"24455000-8, Desinfectantes","Instituto Nacional de Emergência Médica, IP (501356126)","AGA- ÁLCOOL E GÉNEROS ALIM, SA (500727457)","222,00 €",11-07-2011,27-02-2011,30 dias,"Portugal, Lisboa, Lisboa","Artigo 26.º, n.º 1, alínea e) do Código dos Contratos Públicos",,,,,,Não definido.,Não definido.,
"50 Ampolas Dopamina, sol. P/prefusão 40mg/ml fr.5ml (ampol).",Ao abrigo de acordo-quadro (art.º 258.º),Aquisição de bens móveis,"33690000-3, Medicamentos vários","Instituto Nacional de Emergência Médica, IP (501356126)","LABORATÓRIO MEDINFAR, SA (500384045)","62,00 €",11-07-2011,01-03-2011,30 dias,"Portugal, Lisboa, Lisboa","Artigo 26.º, n.º 1, alínea e) do Código dos Contratos Públicos",,,,,,Não definido.,Não definido.,
Prestação de serviço de comunicações de interligações e outros serviços conexos de comunicações.,Ajuste Direto Regime Geral,Aquisição de serviços,"64210000-1, Serviços telefónicos e de transmissão de dados","Instituto Nacional de Emergência Médica, IP (501356126)",PT PRIME - Soluções Empresariais de Telecomunicações e de Sistemas (502840757),"27.757,60 €",08-07-2011,31-05-2011,30 dias,Portugal,"Artigo 24.º, n.º 1, alínea c) do Código dos Contratos Públicos",,,,,,Não aplicável.,Não aplicável.,
Aquisição de detergente desinfectante,Ao abrigo de acordo-quadro (art.º 258.º),Aquisição de bens móveis,"24455000-8, Desinfectantes","Instituto Nacional de Emergência Médica, IP (501356126)","AIR LIQUIDE MEDICINAL, SA (501576436)","864,62 €",08-07-2011,28-02-2011,30 dias,"Portugal, Lisboa, Lisboa","Artigo 26.º, n.º 1, alínea e) do Código dos Contratos Públicos",,,,,,Não definido.,Não definido.,
Aquisição de Medicamento - Dobutamina,Ao abrigo de acordo-quadro (art.º 258.º),Aquisição de bens móveis,"33690000-3, Medicamentos vários","Instituto Nacional de Emergência Médica, IP (501356126)","FERRAZ, LYNCE, SA (500113270)","158,00 €",08-07-2011,25-02-2011,30 dias,"Portugal, Lisboa, Lisboa","Artigo 26.º, n.º 1, alínea e) do Código dos Contratos Públicos",,,,,,Não definido.,Não definido.,
"Aquisição de Medicamento - Glucose 5% Sol.Inj. 50 mg/ml, Saco 100ml",Ao abrigo de acordo-quadro (art.º 258.º),Aquisição de bens móveis,"33690000-3, Medicamentos vários","Instituto Nacional de Emergência Médica, IP (501356126)","GRIFOLS PORTUGAL, LDA. (502041285)","173,40 €",08-07-2011,01-03-2011,30 dias,"Portugal, Lisboa, Lisboa","Artigo 26.º, n.º 1, alínea e) do Código dos Contratos Públicos",,,,,,Não definido.,Não definido.,
Aquisição de paracetamol sol. inject.,Ao abrigo de acordo-quadro (art.º 258.º),Aquisição de bens móveis,"33690000-3, Medicamentos vários","Instituto Nacional de Emergência Médica, IP (501356126)","BRISTOL-MYERS, SA (500048193)","427,23 €",08-07-2011,25-02-2011,30 dias,"Portugal, Lisboa, Lisboa","Artigo 26.º, n.º 1, alínea e) do Código dos Contratos Públicos",,,,,,Não definido.,Não definido.,
GLUCAGOM PÓ E SOLVENTE P/SOL.INJ. 1 mg,Ao abrigo de acordo-quadro (art.º 258.º),Aquisição de bens móveis,"33690000-3, Medicamentos vários","Instituto Nacional de Emergência Médica, IP (501356126)","NOVO NORDISK.COM.PD.FARMAC,Lª (501485210)","409,50 €",08-07-2011,25-02-2011,30 dias,"Portugal, Lisboa, Lisboa","Artigo 26.º, n.º 1, alínea e) do Código dos Contratos Públicos",,,,,,Não definido.,Não definido.,
"Naloxona 0,4mg/1ml , sol.inj",Ao abrigo de acordo-quadro (art.º 258.º),Aquisição de bens móveis,"33690000-3, Medicamentos vários","Instituto Nacional de Emergência Médica, IP (501356126)","HIKMA FARMACÊUTICA, SA (502266791)","750,00 €",08-07-2011,02-03-2011,30 dias,"Portugal, Lisboa, Lisboa","Artigo 26.º, n.º 1, alínea e) do Código dos Contratos Públicos",,,,,,Não definido.,Não definido.,
"Aquisição de brometo de vecuronio, sol. inj",Ao abrigo de acordo-quadro (art.º 258.º),Aquisição de bens móveis,"33690000-3, Medicamentos vários","Instituto Nacional de Emergência Médica, IP (501356126)","SCHERING-PLOUGH FARMA, LDA. (500700907)","670,00 €",08-07-2011,25-02-2011,30 dias,"Portugal, Lisboa, Lisboa","Artigo 26.º, n.º 1, alínea e) do Código dos Contratos Públicos",,,,,,Não definido.,Não definido.,
SERVIÇO DE DESINFESTAÇÃO - DEL.FARO,Ajuste Direto Regime Geral,Aquisição de serviços,"98390000-3, Outros serviços","Instituto Nacional de Emergência Médica, IP (501356126)","TRULY NOLEN PORTUGAL, LDA. (504840479)","200,00 €",06-07-2011,16-06-2011,30 dias,"Portugal, Lisboa, Lisboa","Artigo 20.º, n.º 1, alínea a) do Código dos Contratos Públicos",,,,,,Não aplicável.,Não aplicável.,
SERVIÇO DE DESINFESTAÇÃO - DEL.NORTE.,Ajuste Direto Regime Geral,Aquisição de serviços,"98390000-3, Outros serviços","Instituto Nacional de Emergência Médica, IP (501356126)","TRULY NOLEN PORTUGAL, LDA. (504840479)","770,00 €",06-07-2011,21-06-2011,30 dias,"Portugal, Lisboa, Lisboa","Artigo 20.º, n.º 1, alínea a) do Código dos Contratos Públicos",,,,,,Não aplicável.,Não aplicável.,
Midazolam 5mg/ml solução injectável,Ao abrigo de acordo-quadro (art.º 258.º),Aquisição de bens móveis,"33690000-3, Medicamentos vários","Instituto Nacional de Emergência Médica, IP (501356126)","HIKMA FARMACÊUTICA, SA (502266791)","95,00 €",06-07-2011,25-02-2011,30 dias,"Portugal, Lisboa, Lisboa","Artigo 26.º, n.º 1, alínea e) do Código dos Contratos Públicos",,,,,,Não definido.,Não definido.,
Aquisição de Lancetas de uso estéril (p/amostra sangue),Ao abrigo de acordo-quadro (art.º 258.º),Aquisição de serviços,"33141900-9, Lancetas para sangria","Instituto Nacional de Emergência Médica, IP (501356126)","IBERLAB & IMUNOREAGE, LDA. (503406694)","585,00 €",06-07-2011,07-03-2011,30 dias,"Portugal, Lisboa, Lisboa","Artigo 26.º, n.º 1, alínea e) do Código dos Contratos Públicos",,,,,,Não definido.,Não definido.,
"1500 SACOS CLORETO DE SODIO 0,9% SOL.INJ.9mg/ml, 500ml e 100 SACOS CLORETO DE SODIO 0,9% SOL.INJ. 9mg/ml, 100ml.",Ajuste Direto Regime Geral,Aquisição de bens móveis,"33690000-3, Medicamentos vários","Instituto Nacional de Emergência Médica, IP (501356126)",OVERPHARMA (505792362),"2.324,60 €",06-07-2011,03-03-2011,30 dias,"Portugal, Lisboa, Lisboa","Artigo 26.º, n.º 1, alínea e) do Código dos Contratos Públicos",,,,,,Não aplicável.,Não aplicável.,
Reparação de 2 seringas perfusoras Alaris IVAC P200 s/n 2001-16760 e 2001-16766.,Ajuste Direto Regime Geral,Aquisição de serviços,"50421000-2, Serviços de reparação e manutenção de equipamento médico","Instituto Nacional de Emergência Médica, IP (501356126)",CLINIFAR- PROD CLIN E FARM. SA (503281115),"581,00 €",06-07-2011,16-05-2011,60 dias,"Portugal, Lisboa, Lisboa","Artigo 20.º, n.º 1, alínea a) do Código dos Contratos Públicos",,,,,,Não aplicável.,Não aplicável.,
Reparação de ventilador Weinmann s/n 7339,Ajuste Direto Regime Geral,Aquisição de serviços,"50421000-2, Serviços de reparação e manutenção de equipamento médico","Instituto Nacional de Emergência Médica, IP (501356126)","FUTURVIDA, LDA. (504260510)","1.453,20 €",06-07-2011,12-04-2011,30 dias,"Portugal, Lisboa, Lisboa","Artigo 24.º, n.º 1, alínea e) do Código dos Contratos Públicos",,,,,,Não aplicável.,Não aplicável.,
UPGRADE DO SOFTWARE DE RECEPÇÃO E TRANSMISSÃO DOS DADOS DAE E DME.,Ajuste Direto Regime Geral,Aquisição de serviços,"72212000-4, Serviços de programação de software de aplicação","Instituto Nacional de Emergência Médica, IP (501356126)","MEDTRONIC, LDA. (504223933)","32.300,80 €",06-07-2011,28-06-2011,30 dias,"Portugal, Lisboa, Lisboa","Artigo 24.º, n.º 1, alínea e) do Código dos Contratos Públicos",,,,,,Não aplicável.,Não aplicável.,
"Reparação de 3 monitores Nonin s/n 500238989, 500683384, 500239001.",Ajuste Direto Regime Geral,Aquisição de serviços,"50421000-2, Serviços de reparação e manutenção de equipamento médico","Instituto Nacional de Emergência Médica, IP (501356126)","SPACE, LDA. (507662407)","2.216,80 €",06-07-2011,24-03-2011,30 dias,"Portugal, Lisboa, Lisboa","Artigo 20.º, n.º 1, alínea a) do Código dos Contratos Públicos",,,,,,Não aplicável.,Não aplicável.,
"Reparação de 3 aspiradores Weinmann s/n 18498, 2026, 16295",Ajuste Direto Regime Geral,Aquisição de serviços,"50421000-2, Serviços de reparação e manutenção de equipamento médico","Instituto Nacional de Emergência Médica, IP (501356126)","FUTURVIDA, LDA. (504260510)","477,87 €",06-07-2011,29-06-2011,30 dias,"Portugal, Lisboa, Lisboa","Artigo 24.º, n.º 1, alínea e) do Código dos Contratos Públicos",,,,,,Não aplicável.,Não aplicável.,
Aquisição de motociclos ao abrigo da ANCP,Ao abrigo de acordo-quadro (art.º 258.º),Aquisição de bens móveis,"34410000-4, Motociclos","Instituto Nacional de Emergência Médica, IP (501356126)","YAMAHA MOTOR PORTUGAL, SA (502283130)","46.941,48 €",05-07-2011,09-05-2011,20 dias,"Portugal, Lisboa, Lisboa","Artigo 27.º, n.º 1, alínea h) do Código dos Contratos Públicos",,,,,,Não definido.,Não definido.,
"Necessidade de se proceder à reparação de 1 LP 12 sn, 30290032, 30290031",Ajuste Direto Regime Geral,Aquisição de serviços,"50000000-5, Serviços de reparação e manutenção","Instituto Nacional de Emergência Médica, IP (501356126)","MEDTRONIC, LDA. (504223933)","4.209,02 €",05-07-2011,18-03-2011,30 dias,"Portugal, Lisboa, Lisboa","Artigo 24.º, n.º 1, alínea e) do Código dos Contratos Públicos",,,,,,Não aplicável.,Não aplicável.,
Despesa com consumos EDP Corporate no período de 06-12-2010 a 05-01-2011,Ajuste Direto Regime Geral,Aquisição de serviços,"09310000-5, Electricidade","Instituto Nacional de Emergência Médica, IP (501356126)","EDP COMERCIAL, SA (503504564)","145,27 €",05-07-2011,28-03-2011,30 dias,"Portugal, Lisboa, Lisboa","Artigo 24.º, n.º 1, alínea e) do Código dos Contratos Públicos",,,,,,Não aplicável.,Não aplicável.,
"Fornecimento de 60 ampolas de diclofenac, 840 comprimidos de Dinitrato de Isossorbido, 160 comprimidos de Bromazepam",Ajuste Direto Regime Geral,Aquisição de bens móveis,"33690000-3, Medicamentos vários","Instituto Nacional de Emergência Médica, IP (501356126)","LABORATÓRIOS VITÓRIA, S.A. (500162220)","36,31 €",05-07-2011,06-04-2011,30 dias,"Portugal, Lisboa, Lisboa","Artigo 20.º, n.º 1, alínea a) do Código dos Contratos Públicos",,,,,,Não aplicável.,Não aplicável.,
Aquisição de luvas de exame látex n/esteril,Ajuste Direto Regime Geral,Aquisição de bens móveis,"33141420-0, Luvas para cirurgia","Instituto Nacional de Emergência Médica, IP (501356126)","PERGUT PORTUGAL, LDA. (501799729)","600,00 €",04-07-2011,01-03-2011,30 dias,"Portugal, Lisboa, Lisboa","Artigo 26.º, n.º 1, alínea e) do Código dos Contratos Públicos",,,,,,Não aplicável.,Não aplicável.,
Aquisição de Electrodos Multifunções para LP12 e LP500,Ajuste Direto Regime Geral,Aquisição de bens móveis,"31711140-6, Eléctrodos","Instituto Nacional de Emergência Médica, IP (501356126)","MEDICINÁLIA CORMÉDICA, LDA. (500684324)","5.250,00 €",04-07-2011,25-05-2011,30 dias,"Portugal, Lisboa, Lisboa","Artigo 20.º, n.º 1, alínea a) do Código dos Contratos Públicos",,,,,,Não aplicável.,Não aplicável.,
Aquisição de máscara inalação O2 c/ tubo de conexão - adulto,Ajuste Direto Regime Geral,Aquisição de bens móveis,"33157110-9, Máscara de oxigénio","Instituto Nacional de Emergência Médica, IP (501356126)",INTERSURGICAL (503480045),"1.850,00 €",04-07-2011,25-05-2011,30 dias,"Portugal, Lisboa, Lisboa","Artigo 20.º, n.º 1, alínea a) do Código dos Contratos Públicos",,,,,,Não aplicável.,Não aplicável.,
Aquisição de Enoxaparina (sol. inj. 100mg/mlamp,Ajuste Direto Regime Geral,Aquisição de bens móveis,"33622100-7, Medicamentos usados na terapêutica cardíaca","Instituto Nacional de Emergência Médica, IP (501356126)","SANOFI-AVENTIS, SA (500134960)","328,80 €",04-07-2011,07-06-2011,90 dias,"Portugal, Lisboa, Lisboa","Artigo 20.º, n.º 1, alínea a) do Código dos Contratos Públicos",,,,,,Não aplicável.,Não aplicável.,
