freguesia,acronym,validVotesPercentage,votes,dicofre
Fornos do Pinhal,PPD/PSD.CDS-PP,82.44,169,171211
Fornos do Pinhal,PS,15.61,32,171211
Fornos do Pinhal,MPT,0.49,1,171211
Fornos do Pinhal,PCP-PEV,0.49,1,171211
Fornos do Pinhal,PDA,0.49,1,171211
Fornos do Pinhal,PTP,0.49,1,171211
Fornos do Pinhal,B.E.,0,0,171211
Fornos do Pinhal,L,0,0,171211
Fornos do Pinhal,MAS,0,0,171211
Fornos do Pinhal,PAN,0,0,171211
Fornos do Pinhal,PCTP/MRPP,0,0,171211
Fornos do Pinhal,PND,0,0,171211
Fornos do Pinhal,PNR,0,0,171211
Fornos do Pinhal,POUS,0,0,171211
Fornos do Pinhal,PPM,0,0,171211
Fornos do Pinhal,PPV,0,0,171211
