Objeto do Contrato,Tipo de Procedimento,Tipo(s) de Contrato,CPVs,Entidade(s) Adjudicante(s),Entidade(s) Adjudicatária(s),Preço Contratual,Data de Publicação,Data de Celebração do Contrato,Prazo de Execução,Local de Execução,Fundamentação,Data de Fecho do Contrato,Preço Total Efetivo,Causas das Alterações ao Prazo,Causas das Alterações ao Preço,Estado,N.º registo do Acordo Quadro,Descrição do Acordo Quadro,Procedimento Centralizado
Reagentes para Hematologia para Portimão e Lagos,Concurso público,Aquisição de bens móveis,"33696500-0, Reagentes de laboratório","Centro Hospitalar Universitário do Algarve, E.P.E. (510745997)",Beckman Coulter Portugal (509035167),"84.351,90 €",11-12-2018,28-03-2018,304 dias,"Portugal, Faro, Faro","Artigo 20.º, n.º 1, alínea a) do Código dos Contratos Públicos",,,,,,Não aplicável.,Não aplicável.,FALSE
31/3476/2018-Eltrombopag 25 mg,Ao abrigo de acordo-quadro (art.º 258.º),Aquisição de bens móveis,"33600000-6, Produtos farmacêuticos","Centro Hospitalar Universitário do Algarve, E. P. E. (510745997)",novartis (500063524),"60.682,25 €",11-12-2018,19-10-2018,60 dias,"Portugal, Faro, Faro","Artigo 26.º, n.º 1, alínea e) do Código dos Contratos Públicos",,,,,,2489595,CP 2016/18 - Acordo quadro para fornecimento de Medicamentos do Grupo 4: Sangue às Instituições e Serviços do Serviço Nacional de Saúde,FALSE
31/3475/2018-Atazanavir 200 mg,Ao abrigo de acordo-quadro (art.º 258.º),Aquisição de bens móveis,"33600000-6, Produtos farmacêuticos","Centro Hospitalar Universitário do Algarve, E. P. E. (510745997)",bristol (500048193),"11.926,13 €",11-12-2018,05-12-2018,30 dias,"Portugal, Faro, Faro","Artigo 26.º, n.º 1, alínea e) do Código dos Contratos Públicos",,,,,,2183729,Medicamentos antirretrovíricos para o tratamento da infeção por VIH,FALSE
31/3464/2018-Lactulose 10 mg/15 ml,Ao abrigo de acordo-quadro (art.º 258.º),Aquisição de bens móveis,"33600000-6, Produtos farmacêuticos","Centro Hospitalar Universitário do Algarve, E. P. E. (510745997)",ferraz lynce (500113270),"6.163,90 €",11-12-2018,17-10-2018,60 dias,"Portugal, Faro, Faro","Artigo 26.º, n.º 1, alínea e) do Código dos Contratos Públicos",,,,,,2222779,Medicamentos do aparelho digestivo,FALSE
31/3445/2018-Dabrafenib 75 mg,Ao abrigo de acordo-quadro (art.º 258.º),Aquisição de bens móveis,"33600000-6, Produtos farmacêuticos","Centro Hospitalar Universitário do Algarve, E. P. E. (510745997)",Novartis (500063524),"11.044,01 €",11-12-2018,17-10-2018,60 dias,"Portugal, Faro, Faro","Artigo 26.º, n.º 1, alínea e) do Código dos Contratos Públicos",,,,,,2545980,CP 2017/61 - Acordo quadro para fornecimento de Medicamentos Diversos   às Instituições e Serviços do Serviço Nacional de Saúde,FALSE
31/3416/2018-Trametinib 2 mg,Ao abrigo de acordo-quadro (art.º 258.º),Aquisição de bens móveis,"33600000-6, Produtos farmacêuticos","Centro Hospitalar Universitário do Algarve, E. P. E. (510745997)",Novartis (500063524),"13.941,24 €",11-12-2018,19-10-2018,60 dias,"Portugal, Faro, Faro","Artigo 26.º, n.º 1, alínea e) do Código dos Contratos Públicos",,,,,,2969238,"CP 2017/6 - Acordo Quadro para fornecimento de Medicamentos do Foro Oncológico e Imunomoduladores, às Instituições e Serviços do Serviço Nacional de Saúde",FALSE
31/3412/2018-Tizanidina 2 mg,Ao abrigo de acordo-quadro (art.º 258.º),Aquisição de bens móveis,"33600000-6, Produtos farmacêuticos","Centro Hospitalar Universitário do Algarve, E. P. E. (510745997)",teva (507045491),"33,30 €",11-12-2018,19-10-2018,60 dias,"Portugal, Faro, Faro","Artigo 26.º, n.º 1, alínea e) do Código dos Contratos Públicos",,,,,,2211341,Medicamentos anestésicos e relaxantes musculares,FALSE
31/3411/2018-Iopromida 769 mg/ml,Ao abrigo de acordo-quadro (art.º 258.º),Aquisição de bens móveis,"33600000-6, Produtos farmacêuticos","Centro Hospitalar Universitário do Algarve, E. P. E. (510745997)",bayer (500043256),"23.100,00 €",11-12-2018,30-11-2018,30 dias,"Portugal, Faro, Faro","Artigo 26.º, n.º 1, alínea e) do Código dos Contratos Públicos",,,,,,1473614,CP 2015/56 - Acordo quadro para fornecimento de medicamentos usados como meios de diagnóstico em Imagiologia às Instituições e Serviços do Serviço Nacional de Saúde,FALSE
31/3351/2018-Tiaprida 100 mg,Ao abrigo de acordo-quadro (art.º 258.º),Aquisição de bens móveis,"33600000-6, Produtos farmacêuticos","Centro Hospitalar Universitário do Algarve, E. P. E. (510745997)",sanofi (500134960),"413,40 €",11-12-2018,19-10-2018,60 dias,"Portugal, Faro, Faro","Artigo 26.º, n.º 1, alínea e) do Código dos Contratos Públicos",,,,,,2356543,CP 2016/19 - Medicamentos Antipsicóticos,FALSE
31/3053/2018-Morfina 30 mg,Ao abrigo de acordo-quadro (art.º 258.º),Aquisição de bens móveis,"33600000-6, Produtos farmacêuticos","Centro Hospitalar Universitário do Algarve, E.P.E. (510745997)",Mundipharma (506760014),"105,04 €",11-12-2018,05-09-2018,120 dias,"Portugal, Faro, Faro","Artigo 26.º, n.º 1, alínea e) do Código dos Contratos Públicos",,,,,,1974985,"Medicamentos Analgésicos, Antipiréticos e Antidepressivos",FALSE
31/3052/2018-Multivitaminas hidrossóluveis + acido fólico,Ao abrigo de acordo-quadro (art.º 258.º),Aquisição de bens móveis,"33600000-6, Produtos farmacêuticos","Centro Hospitalar Universitário do Algarve, E.P.E. (510745997)",fresenius kabi (504293753),"1.592,00 €",11-12-2018,11-09-2018,120 dias,"Portugal, Faro, Faro","Artigo 26.º, n.º 1, alínea e) do Código dos Contratos Públicos",,,,,,3359042,Medicamentos para Nutrição Parentérica,FALSE
31/3034/2018-Emtricitabina 200 +Rilpivirina 25+Tenofovir 245,Ao abrigo de acordo-quadro (art.º 258.º),Aquisição de bens móveis,"33600000-6, Produtos farmacêuticos","Centro Hospitalar Universitário do Algarve, E. P. E. (510745997)",gilead (503604704),"11.800,02 €",11-12-2018,11-09-2018,120 dias,"Portugal, Faro, Faro","Artigo 26.º, n.º 1, alínea e) do Código dos Contratos Públicos",,,,,,2545980,CP 2017/61 - Acordo quadro para fornecimento de Medicamentos Diversos   às Instituições e Serviços do Serviço Nacional de Saúde,FALSE
31/2996/2018-Nimodipina 30 mg,Ao abrigo de acordo-quadro (art.º 258.º),Aquisição de bens móveis,"33600000-6, Produtos farmacêuticos","Centro Hospitalar Universitário do Algarve, E. P. E. (510745997)",Lab. Almiro (501169580),"149,90 €",11-12-2018,23-08-2018,120 dias,"Portugal, Faro, Faro","Artigo 26.º, n.º 1, alínea e) do Código dos Contratos Públicos",,,,,,2335591,CP 2016/01 - Acordo Quadro para fornecimento de Medicamentos do Aparelho Cardiovascular   às Instituições e Serviços do Serviço Nacional de Saúde,FALSE
31/2995/2018-Pamidronato de sódio 30 mg,Ao abrigo de acordo-quadro (art.º 258.º),Aquisição de bens móveis,"33600000-6, Produtos farmacêuticos","Centro Hospitalar Universitário do Algarve, E. P. E. (510745997)",pfizer (500162166),"67,20 €",11-12-2018,29-08-2018,120 dias,"Portugal, Faro, Faro","Artigo 26.º, n.º 1, alínea e) do Código dos Contratos Públicos",,,,,,1410779,CP 2015/47 - Acordo quadro para fornecimento de medicamentos do aparelho locomotor às instituições e serviços do serviço nacional de saúde,FALSE
31/2994/2018-Agalsidade alfa 3.5 mg,Ao abrigo de acordo-quadro (art.º 258.º),Aquisição de bens móveis,"33600000-6, Produtos farmacêuticos","Centro Hospitalar Universitário do Algarve, E. P. E. (510745997)",shire (509264662),"43.260,00 €",11-12-2018,11-09-2018,120 dias,"Portugal, Faro, Faro","Artigo 26.º, n.º 1, alínea e) do Código dos Contratos Públicos",,,,,,2658382,CP 2017/58 - Acordo Quadro para fornecimento de Medicamentos para Doenças Lisossomais de Sobrecarga às Instituições e Serviços do Serviço Nacional de Saúde,FALSE
31/2993/2018-Maraviroc 300 mg,Ao abrigo de acordo-quadro (art.º 258.º),Aquisição de bens móveis,"33600000-6, Produtos farmacêuticos","Centro Hospitalar Universitário do Algarve, E. P. E. (510745997)",viivhiv (509117961),"3.053,38 €",11-12-2018,29-08-2018,120 dias,"Portugal, Faro, Faro","Artigo 26.º, n.º 1, alínea e) do Código dos Contratos Públicos",,,,,,2183729,Medicamentos antirretrovíricos para o tratamento da infeção por VIH,FALSE
31/2992/2018-Clindamicina 20 mg,Ao abrigo de acordo-quadro (art.º 258.º),Aquisição de bens móveis,"33600000-6, Produtos farmacêuticos","Centro Hospitalar Universitário do Algarve, E. P. E. (510745997)",Pfizer (500162166),"73,70 €",11-12-2018,29-08-2018,120 dias,"Portugal, Faro, Faro","Artigo 26.º, n.º 1, alínea e) do Código dos Contratos Públicos",,,,,,3016206,"CP 2017/48 - Acordo Quadro para fornecimento de Medicamentos do aparelho geniturinário, às Instituições e Serviços do Serviço Nacional de Saúde",FALSE
31/2991/2018-Acido acetilsalicilico 500 mg,Ao abrigo de acordo-quadro (art.º 258.º),Aquisição de bens móveis,"33600000-6, Produtos farmacêuticos","Centro Hospitalar Universitário do Algarve, E. P. E. (510745997)",sanofi (500134960),"50,40 €",11-12-2018,29-08-2018,120 dias,"Portugal, Faro, Faro","Artigo 26.º, n.º 1, alínea e) do Código dos Contratos Públicos",,,,,,1974985,"Medicamentos Analgésicos, Antipiréticos e Antidepressivos",FALSE
31/2989/2018-Flucloxacilina 2000 mg,Ao abrigo de acordo-quadro (art.º 258.º),Aquisição de bens móveis,"33600000-6, Produtos farmacêuticos","Centro Hospitalar Universitário do Algarve, E. P. E. (510745997)",generis (508107997),"3.900,00 €",11-12-2018,29-08-2018,120 dias,"Portugal, Faro, Faro","Artigo 26.º, n.º 1, alínea e) do Código dos Contratos Públicos",,,,,,2775691,CP 2017/5 - Acordo Quadro para fornecimento de Medicamentos anti-infeciosos: exceto antivíricos e antifúngicos,FALSE
31/2969/2018- Sulpirida 50 mg,Ao abrigo de acordo-quadro (art.º 258.º),Aquisição de bens móveis,"33600000-6, Produtos farmacêuticos","Centro Hospitalar Universitário do Algarve, E. P. E. (510745997)",sanofi (500134960),"49,81 €",11-12-2018,24-08-2018,120 dias,"Portugal, Faro, Faro","Artigo 26.º, n.º 1, alínea e) do Código dos Contratos Públicos",,,,,,2356543,CP 2016/19 - Medicamentos Antipsicóticos,FALSE
Quiosque Multimedia,Concurso público,Aquisição de bens móveis,"30200000-1, Equipamento e material informático","Centro Hospitalar Universitário do Algarve, E.P.E. (510745997)",ATTENDSYS SOLUÇÕES GLOBAIS DE ATENDIMENTO (510306802),"111.790,00 €",10-12-2018,10-12-2018,45 dias,"Portugal, Faro, Portimão<BR/>Portugal, Faro, Lagos<BR/>Portugal, Faro, Faro<BR/>Portugal","Artigo 20.º, n.º 1, alínea b) do Código dos Contratos Públicos",,,,,,Não aplicável.,Não aplicável.,FALSE
31/2946/2018-Colistimetato de sódio,Ao abrigo de acordo-quadro (art.º 258.º),Aquisição de bens móveis,"33600000-6, Produtos farmacêuticos","Centro Hospitalar Universitário do Algarve, E.P.E. (510745997)",teva (507045491),"4.463,69 €",10-12-2018,23-08-2018,120 dias,"Portugal, Faro, Faro","Artigo 26.º, n.º 1, alínea e) do Código dos Contratos Públicos",,,,,,2556987,"CP 2017/65 - Acordo Quadro para fornecimento de Medicamentos de Várias áreas Terapêuticas, às Instituições e Serviços do Serviço Nacional de Saúde",FALSE
31/2944/2018-Picossulfato de sodio 7.5 mg,Ao abrigo de acordo-quadro (art.º 258.º),Aquisição de bens móveis,"33600000-6, Produtos farmacêuticos","Centro Hospitalar Universitário do Algarve, E. P. E. (510745997)",sanofi (500134960),"279,00 €",10-12-2018,24-08-2018,120 dias,"Portugal, Faro, Faro","Artigo 26.º, n.º 1, alínea e) do Código dos Contratos Públicos",,,,,,2222779,Medicamentos do aparelho digestivo,FALSE
31/2795/2018-Icodextrina 75 mg,Ao abrigo de acordo-quadro (art.º 258.º),Aquisição de bens móveis,"33600000-6, Produtos farmacêuticos","Centro Hospitalar Universitário do Algarve, E. P. E. (510745997)",baxter (503347345),"31.200,00 €",10-12-2018,25-07-2018,120 dias,"Portugal, Faro, Faro","Artigo 26.º, n.º 1, alínea e) do Código dos Contratos Públicos",,,,,,3035649,"CP 2017/35 - Acordo Quadro para fornecimento de bens e prestação de serviços de Diálise Peritoneal, às Instituições e Serviços do Serviço Nacional de Saúde",FALSE
31/2794/2018-Capecitabina 500 mg,Ao abrigo de acordo-quadro (art.º 258.º),Aquisição de bens móveis,"33600000-6, Produtos farmacêuticos","Centro Hospitalar Universitário do Algarve, E. P. E. (510745997)",Accord (508622263),"2.901,60 €",10-12-2018,25-07-2018,120 dias,"Portugal, Faro, Faro","Artigo 26.º, n.º 1, alínea e) do Código dos Contratos Públicos",,,,,,2969238,"CP 2017/6 - Acordo Quadro para fornecimento de Medicamentos do Foro Oncológico e Imunomoduladores, às Instituições e Serviços do Serviço Nacional de Saúde",FALSE
31/2793/2018-Cinacalcet 30 mg,Ao abrigo de acordo-quadro (art.º 258.º),Aquisição de bens móveis,"33600000-6, Produtos farmacêuticos","Centro Hospitalar Universitário do Algarve, E. P. E. (510745997)",amgen (502942959),"9.818,90 €",10-12-2018,02-08-2018,90 dias,"Portugal, Faro, Faro","Artigo 26.º, n.º 1, alínea e) do Código dos Contratos Públicos",,,,,,1410779,CP 2015/47 - Acordo quadro para fornecimento de medicamentos do aparelho locomotor às instituições e serviços do serviço nacional de saúde,FALSE
31/2792/2018-Eltrombopag 25 mg,Ao abrigo de acordo-quadro (art.º 258.º),Aquisição de bens móveis,"33600000-6, Produtos farmacêuticos","Centro Hospitalar Universitário do Algarve, E. P. E. (510745997)",NOVARTIS (500063524),"41.001,52 €",10-12-2018,04-09-2018,90 dias,"Portugal, Faro, Faro","Artigo 26.º, n.º 1, alínea e) do Código dos Contratos Públicos",,,,,,2489595,CP 2016/18 - Acordo quadro para fornecimento de Medicamentos do Grupo 4: Sangue às Instituições e Serviços do Serviço Nacional de Saúde,FALSE
31/2791/2018-Fibrinogénio humano 1000 mg,Ao abrigo de acordo-quadro (art.º 258.º),Aquisição de bens móveis,"33600000-6, Produtos farmacêuticos","Centro Hospitalar Universitário do Algarve, E. P. E. (510745997)",csl (503047201),"3.200,00 €",10-12-2018,22-08-2018,90 dias,"Portugal, Faro, Faro","Artigo 26.º, n.º 1, alínea e) do Código dos Contratos Públicos",,,,,,2800702,CP 2017/9 - Acordo quadro para fornecimento de Derivados do Plasma Humano às Instituições e Serviços do Serviço Nacional de Saúde,FALSE
31/2761/2018-Elbasvir 50mg +grazoprevir 100 mg,Ao abrigo de acordo-quadro (art.º 258.º),Aquisição de bens móveis,"33600000-6, Produtos farmacêuticos","Centro Hospitalar Universitário do Algarve, E.P.E. (510745997)",msd (500191360),"154.115,64 €",10-12-2018,17-07-2018,180 dias,"Portugal, Faro, Faro","Artigo 26.º, n.º 1, alínea e) do Código dos Contratos Públicos",,,,,,3023927,CP 2017/67 - Medicamentos para a Hepatite C crónica,FALSE
31/2760/2018-Medicamentos Hepatite C,Ao abrigo de acordo-quadro (art.º 258.º),Aquisição de bens móveis,"33600000-6, Produtos farmacêuticos","Centro Hospitalar Universitário do Algarve, E. P. E. (510745997)",gilead (503604704),"600.300,00 €",10-12-2018,30-07-2018,180 dias,"Portugal, Faro, Faro","Artigo 26.º, n.º 1, alínea e) do Código dos Contratos Públicos",,,,,,3023927,CP 2017/67 - Medicamentos para a Hepatite C crónica,FALSE
31/2756/2018-Petidina 100 mg,Ao abrigo de acordo-quadro (art.º 258.º),Aquisição de bens móveis,"33600000-6, Produtos farmacêuticos","Centro Hospitalar Universitário do Algarve, E. P. E. (510745997)",Lab. Almiro (501169580),"3.809,40 €",10-12-2018,31-08-2018,90 dias,"Portugal, Faro, Faro","Artigo 26.º, n.º 1, alínea e) do Código dos Contratos Públicos",,,,,,1974985,"Medicamentos Analgésicos, Antipiréticos e Antidepressivos",FALSE
21/557/2018 - Vários Medicamentos sem CHNM,Concurso público,Aquisição de bens móveis,"33690000-3, Medicamentos vários","Centro Hospitalar Universitário do Algarve, E.P.E. (510745997)","BAYER PORTUGAL, Lda. (500043256), BAXTER MEDICO FARMACEUTICA LDA (503347345), AIR LIQUIDE MEDICINAL SA (501576436), CLINIFAR - PROD.CLINICOS E FARMAC., (503281115), LABESFAL-LABORATORIOS ALMIRO, SA (501169580), VYGON (PORTUGAL),LDA. (503232785), JOHNSON & JOHNSON PROD.PROF. (500153370), PAUL HARTMAN LDA (502271728), PROCLINICA-Equipamentos e Produtos Clínicos, Lda (500222665), LABORATORIO EDOL-S.A. (507072642), B. BRAUN MEDICAL, LDA. (501506543), lab.medinfar (500384045), AVIQUIMICA IMPORTAÇÕES E MANUFACTURAS LDA (500039720)","71.034,24 €",07-12-2018,14-02-2018,329 dias,"Portugal, Faro, Faro","Artigo 20.º, n.º 1, alínea b) do Código dos Contratos Públicos",,,,,,Não aplicável.,Não aplicável.,FALSE
Proc. 68/4075/2018- Fornecimento e instalação de suportes-Sist. Transporte Pneumatico Analises,Ajuste Direto Regime Geral,Aquisição de serviços,"50700000-2, Serviços de reparação e manutenção de equipamento em edifícios","Centro Hospitalar Universitário do Algarve, E. P. E. (510745997)",JJL INSTALAÇÕES ELÉTRICAS LDA (506310132),"698,26 €",07-12-2018,06-12-2018,20 dias,"Portugal, Faro, Portimão","Artigo 24.º, n.º 1, alínea e), subalínea ii) do Código dos Contratos Públicos",,,,,,Não aplicável.,Não aplicável.,FALSE
31/2729/2018-Fentanilo 600 mg,Ao abrigo de acordo-quadro (art.º 258.º),Aquisição de bens móveis,"33600000-6, Produtos farmacêuticos","Centro Hospitalar Universitário do Algarve, E. P. E. (510745997)",teva (507045491),"442,40 €",07-12-2018,23-07-2018,180 dias,"Portugal, Faro, Faro","Artigo 26.º, n.º 1, alínea e) do Código dos Contratos Públicos",,,,,,1974985,"Medicamentos Analgésicos, Antipiréticos e Antidepressivos",FALSE
31/2727/2018-Dolutegravir 50 mg,Ao abrigo de acordo-quadro (art.º 258.º),Aquisição de bens móveis,"33600000-6, Produtos farmacêuticos","Centro Hospitalar Universitário do Algarve, E. P. E. (510745997)",viivhiv (509117961),"153.120,35 €",07-12-2018,26-07-2018,180 dias,"Portugal, Faro, Faro","Artigo 26.º, n.º 1, alínea e) do Código dos Contratos Públicos",,,,,,2545980,CP 2017/61 - Acordo quadro para fornecimento de Medicamentos Diversos   às Instituições e Serviços do Serviço Nacional de Saúde,FALSE
31/2709/2018-Enalapril 20 mg,Ao abrigo de acordo-quadro (art.º 258.º),Aquisição de bens móveis,"33600000-6, Produtos farmacêuticos","Centro Hospitalar Universitário do Algarve, E. P. E. (510745997)",ratiopharm (502414910),"76,50 €",07-12-2018,23-07-2018,180 dias,"Portugal, Faro, Faro","Artigo 26.º, n.º 1, alínea e) do Código dos Contratos Públicos",,,,,,2335591,CP 2016/01 - Acordo Quadro para fornecimento de Medicamentos do Aparelho Cardiovascular   às Instituições e Serviços do Serviço Nacional de Saúde,FALSE
31/2708-Aciclovir  400 mg,Ao abrigo de acordo-quadro (art.º 258.º),Aquisição de bens móveis,"33600000-6, Produtos farmacêuticos","Centro Hospitalar Universitário do Algarve, E. P. E. (510745997)",lab.medinfar (500384045),"265,50 €",07-12-2018,27-07-2018,180 dias,"Portugal, Faro, Faro","Artigo 26.º, n.º 1, alínea e) do Código dos Contratos Públicos",,,,,,1422736,CP 2015/41 - ACORDO QUADRO PARA FORNECIMENTO DE MEDICAMENTOS ANTI-INFECIOSOS: ANTIVÍRICOS E ANTIFÚNGICOS ÀS INSTITUIÇÕES E SERVIÇOS DO SERVIÇO NACIONAL DE SAÚDE,FALSE
31/2707/2018-Haloperidol decanoato 100 mg,Ao abrigo de acordo-quadro (art.º 258.º),Aquisição de bens móveis,"33600000-6, Produtos farmacêuticos","Centro Hospitalar Universitário do Algarve, E. P. E. (510745997)",janssen cilag (500189412),"3.750,00 €",07-12-2018,23-08-2018,180 dias,"Portugal, Faro, Faro","Artigo 26.º, n.º 1, alínea e) do Código dos Contratos Públicos",,,,,,2356543,CP 2016/19 - Medicamentos Antipsicóticos,FALSE
21/556/2018 - Meios de Diagnóstico Rápido,Concurso público,Aquisição de bens móveis,"33690000-3, Medicamentos vários","Centro Hospitalar Universitário do Algarve, E.P.E. (510745997)","ALERE,LDA. (502518863), Know-How, Lda (509884296), ABBOTT LABORATORIOS LDA (500006148), Quilaban, S. A. (500399670)","23.107,33 €",07-12-2018,07-02-2018,327 dias,"Portugal, Faro, Faro","Artigo 20.º, n.º 1, alínea b) do Código dos Contratos Públicos",,,,,,Não aplicável.,Não aplicável.,FALSE
31/2705/2018-Agalsidade beta 35 mg,Ao abrigo de acordo-quadro (art.º 258.º),Aquisição de bens móveis,"33600000-6, Produtos farmacêuticos","Centro Hospitalar Universitário do Algarve, E. P. E. (510745997)",sanofi (500134960),"53.184,00 €",07-12-2018,26-07-2018,180 dias,"Portugal, Faro, Faro","Artigo 26.º, n.º 1, alínea e) do Código dos Contratos Públicos",,,,,,2658382,CP 2017/58 - Acordo Quadro para fornecimento de Medicamentos para Doenças Lisossomais de Sobrecarga às Instituições e Serviços do Serviço Nacional de Saúde,FALSE
21/533/2018 - Nutrição Entérica e Leites Infantis,Concurso público,Aquisição de bens móveis,"33690000-3, Medicamentos vários","Centro Hospitalar Universitário do Algarve, E. P. E. (510745997)","Nutricia Advanced Medical Nutrition Unipessoal, Lda (507558286), PROFARIN DISTRIBUIDORA DE PROD. FARM. INDUSTRIAIS (500223238), NESTLE PORTUGAL SA (500201307), FRESENIUS KABI PHARMA PORTUGAL,LDA (504293753)","73.354,11 €",07-12-2018,06-03-2018,300 dias,"Portugal, Faro, Faro","Artigo 20.º, n.º 1, alínea b) do Código dos Contratos Públicos",,,,,,Não aplicável.,Não aplicável.,FALSE
31/2619/2018-Sulfato de Magnesio 2000 mg,Ao abrigo de acordo-quadro (art.º 258.º),Aquisição de bens móveis,"33600000-6, Produtos farmacêuticos","Centro Hospitalar Universitário do Algarve, E. P. E. (510745997)",Lab. Almiro (501169580),"7.074,00 €",07-12-2018,27-07-2018,180 dias,"Portugal, Faro, Faro","Artigo 26.º, n.º 1, alínea e) do Código dos Contratos Públicos",,,,,,2528675,CP 2017/3 - Acordo Quadro para fornecimento de corretivos da volémia e outras soluções estéreis,FALSE
31/2618/2018-Clonazepam 0.5 mg,Ao abrigo de acordo-quadro (art.º 258.º),Aquisição de bens móveis,"33600000-6, Produtos farmacêuticos","Centro Hospitalar Universitário do Algarve, E. P. E. (510745997)",roche farmaceutica (500233810),"224,40 €",07-12-2018,23-07-2018,180 dias,"Portugal, Faro, Faro","Artigo 26.º, n.º 1, alínea e) do Código dos Contratos Públicos",,,,,,2528670,"CP 2017/2 - Acordo Quadro para fornecimento de Medicamentos do Sistema Nervoso Cerebrospinal, exceto: anestésicos, relaxantes musculares, analgésicos, antipiréticos, antidepressivos e antipsicóticos  às Instituições e Serviços do Serviço Nacional de Saúde",FALSE
31/2617/2018-Enoxaparina sodica 20mg,Ao abrigo de acordo-quadro (art.º 258.º),Aquisição de bens móveis,"33600000-6, Produtos farmacêuticos","Centro Hospitalar Universitário do Algarve, E. P. E. (510745997)",sanofi (500134960),"9.920,00 €",07-12-2018,20-07-2018,180 dias,"Portugal, Faro, Faro","Artigo 26.º, n.º 1, alínea e) do Código dos Contratos Públicos",,,,,,2489595,CP 2016/18 - Acordo quadro para fornecimento de Medicamentos do Grupo 4: Sangue às Instituições e Serviços do Serviço Nacional de Saúde,FALSE
31/2616/2018-Tigeciclina 50 mg,Ao abrigo de acordo-quadro (art.º 258.º),Aquisição de bens móveis,"33600000-6, Produtos farmacêuticos","Centro Hospitalar Universitário do Algarve, E. P. E. (510745997)",pfizer (500162166),"27.710,40 €",07-12-2018,20-07-2018,180 dias,"Portugal, Faro, Faro","Artigo 26.º, n.º 1, alínea e) do Código dos Contratos Públicos",,,,,,2775691,CP 2017/5 - Acordo Quadro para fornecimento de Medicamentos anti-infeciosos: exceto antivíricos e antifúngicos,FALSE
31/2615/2018-Atazanavir 200 mg,Ao abrigo de acordo-quadro (art.º 258.º),Aquisição de bens móveis,"33600000-6, Produtos farmacêuticos","Centro Hospitalar Universitário do Algarve, E. P. E. (510745997)",bristol (500048193),"18.069,90 €",07-12-2018,23-07-2018,180 dias,"Portugal, Faro, Faro","Artigo 26.º, n.º 1, alínea e) do Código dos Contratos Públicos",,,,,,2183729,Medicamentos antirretrovíricos para o tratamento da infeção por VIH,FALSE
31/2086/2018-Gelatina 78 mg+glicerol,Ao abrigo de acordo-quadro (art.º 258.º),Aquisição de bens móveis,"33600000-6, Produtos farmacêuticos","Centro Hospitalar Universitário do Algarve, E. P. E. (510745997)",mylan (502248793),"2.542,77 €",07-12-2018,18-06-2018,180 dias,"Portugal, Faro, Faro","Artigo 26.º, n.º 1, alínea e) do Código dos Contratos Públicos",,,,,,2222779,Medicamentos do aparelho digestivo,FALSE
92-4036-2018 Aquisição de material clínico,Ajuste Direto Regime Geral,Aquisição de bens móveis,"33140000-3, Material médico de consumo","Centro Hospitalar Universitário do Algarve, E. P. E. (510745997)","B. Braun Medical, Lda. (501506543)","164,40 €",07-12-2018,04-12-2018,27 dias,"Portugal, Faro, Portimão","Artigo 24.º, n.º 1, alínea c) do Código dos Contratos Públicos",,,,,,Não aplicável.,Não aplicável.,FALSE
31/2068- Amiodarona 200 mg,Ao abrigo de acordo-quadro (art.º 258.º),Aquisição de bens móveis,"33600000-6, Produtos farmacêuticos","Centro Hospitalar Universitário do Algarve, E. P. E. (510745997)",generis (508107997),"324,00 €",07-12-2018,16-05-2018,180 dias,"Portugal, Faro, Faro","Artigo 26.º, n.º 1, alínea e) do Código dos Contratos Públicos",,,,,,2335591,CP 2016/01 - Acordo Quadro para fornecimento de Medicamentos do Aparelho Cardiovascular   às Instituições e Serviços do Serviço Nacional de Saúde,FALSE
92-3946-2018 Aquisição de material clínico diverso,Ajuste Direto Regime Geral,Aquisição de bens móveis,"33140000-3, Material médico de consumo","Centro Hospitalar Universitário do Algarve, E. P. E. (510745997)","VYGON (PORTUGAL),LDA. (503232785)","1.595,50 €",07-12-2018,04-12-2018,27 dias,"Portugal, Faro, Portimão","Artigo 24.º, n.º 1, alínea c) do Código dos Contratos Públicos",,,,,,Não aplicável.,Não aplicável.,FALSE
31/2067-2018-Aprepitant 80 mg,Ao abrigo de acordo-quadro (art.º 258.º),Aquisição de bens móveis,"33600000-6, Produtos farmacêuticos","Centro Hospitalar Universitário do Algarve, E. P. E. (510745997)",msd (500191360),"8.208,00 €",07-12-2018,01-06-2018,180 dias,"Portugal, Faro, Faro","Artigo 26.º, n.º 1, alínea e) do Código dos Contratos Públicos",,,,,,2528670,"CP 2017/2 - Acordo Quadro para fornecimento de Medicamentos do Sistema Nervoso Cerebrospinal, exceto: anestésicos, relaxantes musculares, analgésicos, antipiréticos, antidepressivos e antipsicóticos  às Instituições e Serviços do Serviço Nacional de Saúde",FALSE
92-3947-2018 Aquisição de fio de sutura,Ajuste Direto Regime Geral,Aquisição de bens móveis,"33140000-3, Material médico de consumo","Centro Hospitalar Universitário do Algarve, E. P. E. (510745997)",JOHNSON & JOHNSON PROD.PROF. (500153370),"355,68 €",07-12-2018,04-12-2018,27 dias,"Portugal, Faro, Portimão","Artigo 24.º, n.º 1, alínea c) do Código dos Contratos Públicos",,,,,,Não aplicável.,Não aplicável.,FALSE
31/2066-2018-Insulina  glulisina 100,Ao abrigo de acordo-quadro (art.º 258.º),Aquisição de bens móveis,"33600000-6, Produtos farmacêuticos","Centro Hospitalar Universitário do Algarve, E. P. E. (510745997)",sanofi (500134960),"78,38 €",07-12-2018,24-05-2018,180 dias,"Portugal, Faro, Faro","Artigo 26.º, n.º 1, alínea e) do Código dos Contratos Públicos",,,,,,1415640,CP 2015/7 - ACORDO QUADRO PARA FORNECIMENTO DE HORMONAS E OUTROS MEDICAMENTOS USADOS NO TRATAMENTO DAS DOENÇAS ENDÓCRINAS ÀS INSTITUIÇÕES E SERVIÇOS DO SERVIÇO NACIONAL DE SAÚDE,FALSE
92-3941-2018 AQUISIÇÃO DE MATERIAL CLÍNICO DIVERSO,Ajuste Direto Regime Geral,Aquisição de bens móveis,"33140000-3, Material médico de consumo","Centro Hospitalar Universitário do Algarve, E. P. E. (510745997)","B. Braun Medical, Lda. (501506543)","9.189,44 €",07-12-2018,05-12-2018,27 dias,"Portugal, Faro, Portimão","Artigo 24.º, n.º 1, alínea c) do Código dos Contratos Públicos",,,,,,Não aplicável.,Não aplicável.,FALSE
92-4037-2018 Aquisição de Material Clínico,Ajuste Direto Regime Geral,Aquisição de bens móveis,"33140000-3, Material médico de consumo","Centro Hospitalar Universitário do Algarve, E.P.E. (510745997)","FRESENIUS MEDICAL CARE, S.A.. (503070220)","8.140,00 €",07-12-2018,04-12-2018,27 dias,"Portugal, Faro","Artigo 24.º, n.º 1, alínea c) do Código dos Contratos Públicos",,,,,,Não aplicável.,Não aplicável.,FALSE
92-4034-2018 AQUISIÇÃO DE MATERIAL CLÍNICO,Ajuste Direto Regime Geral,Aquisição de bens móveis,"33140000-3, Material médico de consumo","Centro Hospitalar Universitário do Algarve, E.P.E. (510745997)","VYGON (PORTUGAL),LDA. (503232785)","1.497,00 €",07-12-2018,04-12-2018,27 dias,"Portugal, Faro, Faro","Artigo 24.º, n.º 1, alínea c) do Código dos Contratos Públicos",,,,,,Não aplicável.,Não aplicável.,FALSE
92/4015/2018 AQUISIÇÃO DE MATERIAL DE HEMODIÁLISE,Ajuste Direto Regime Geral,Aquisição de bens móveis,"33140000-3, Material médico de consumo","Centro Hospitalar Universitário do Algarve, E. P. E. (510745997)","FRESENIUS MEDICAL CARE, S.A.. (503070220)","7.680,00 €",07-12-2018,04-12-2018,27 dias,"Portugal, Faro, Faro","Artigo 24.º, n.º 1, alínea c) do Código dos Contratos Públicos",,,,,,Não aplicável.,Não aplicável.,FALSE
31/2065/2018-Omalizumab 75 mg,Ao abrigo de acordo-quadro (art.º 258.º),Aquisição de bens móveis,"33600000-6, Produtos farmacêuticos","Centro Hospitalar Universitário do Algarve, E. P. E. (510745997)",novartis (500063524),"15.463,00 €",06-12-2018,22-05-2018,180 dias,"Portugal, Faro, Faro","Artigo 26.º, n.º 1, alínea e) do Código dos Contratos Públicos",,,,,,1638654,CP 2015/12 - Acordo quadro para fornecimento de Medicamentos do Aparelho Respiratório às Instituições e Serviços do Serviço Nacional de Saúde,FALSE
31/2064/2018-Atazanavir 200 mg,Ao abrigo de acordo-quadro (art.º 258.º),Aquisição de bens móveis,"33600000-6, Produtos farmacêuticos","Centro Hospitalar Universitário do Algarve, E. P. E. (510745997)",bristol (500048193),"16.985,71 €",06-12-2018,16-05-2018,180 dias,"Portugal, Faro, Faro","Artigo 26.º, n.º 1, alínea e) do Código dos Contratos Públicos",,,,,,2183729,Medicamentos antirretrovíricos para o tratamento da infeção por VIH,FALSE
31/2063/2018-Tenecteplase e alteplase,Ao abrigo de acordo-quadro (art.º 258.º),Aquisição de bens móveis,"33600000-6, Produtos farmacêuticos","Centro Hospitalar Universitário do Algarve, E. P. E. (510745997)",unilfarma (500293023),"88.808,00 €",06-12-2018,15-05-2018,180 dias,"Portugal, Faro, Faro","Artigo 26.º, n.º 1, alínea e) do Código dos Contratos Públicos",,,,,,2489595,CP 2016/18 - Acordo quadro para fornecimento de Medicamentos do Grupo 4: Sangue às Instituições e Serviços do Serviço Nacional de Saúde,FALSE
31/2062/2018-Aminofilina 225 mg,Ao abrigo de acordo-quadro (art.º 258.º),Aquisição de bens móveis,"33600000-6, Produtos farmacêuticos","Centro Hospitalar Universitário do Algarve, E. P. E. (510745997)",mylan (502248793),"297,00 €",06-12-2018,16-05-2018,180 dias,"Portugal, Faro, Faro","Artigo 26.º, n.º 1, alínea e) do Código dos Contratos Públicos",,,,,,1638654,CP 2015/12 - Acordo quadro para fornecimento de Medicamentos do Aparelho Respiratório às Instituições e Serviços do Serviço Nacional de Saúde,FALSE
31/2061/2018-Brinzolamida 10 mg,Ao abrigo de acordo-quadro (art.º 258.º),Aquisição de bens móveis,"33600000-6, Produtos farmacêuticos","Centro Hospitalar Universitário do Algarve, E. P. E. (510745997)",novartis (500063524),"61,10 €",06-12-2018,16-05-2018,180 dias,"Portugal, Faro, Faro","Artigo 26.º, n.º 1, alínea e) do Código dos Contratos Públicos",,,,,,2124520,CP 2016/55 - Medicamentos Diversos,FALSE
31/2060/2018-Colistimetato de sódio,Ao abrigo de acordo-quadro (art.º 258.º),Aquisição de bens móveis,"33600000-6, Produtos farmacêuticos","Centro Hospitalar Universitário do Algarve, E. P. E. (510745997)",teva (507045491),"6.137,58 €",06-12-2018,01-06-2018,180 dias,"Portugal, Faro, Faro","Artigo 26.º, n.º 1, alínea e) do Código dos Contratos Públicos",,,,,,2556987,"CP 2017/65 - Acordo Quadro para fornecimento de Medicamentos de Várias áreas Terapêuticas, às Instituições e Serviços do Serviço Nacional de Saúde",FALSE
31/2059/2018-Tetracaina 7.5 mg,Ao abrigo de acordo-quadro (art.º 258.º),Aquisição de bens móveis,"33600000-6, Produtos farmacêuticos","Centro Hospitalar Universitário do Algarve, E. P. E. (510745997)",b.braun (501506543),"15.000,00 €",06-12-2018,16-05-2018,180 dias,"Portugal, Faro, Faro","Artigo 26.º, n.º 1, alínea e) do Código dos Contratos Públicos",,,,,,2850371,"CP 2017/51 - Acordo Quadro para fornecimento de Medicamentos usados nas afeções cutâneas, às Instituições e Serviços do Serviço Nacional de Saúde",FALSE
31/2057/2018-Mirtazapina 15 mg,Ao abrigo de acordo-quadro (art.º 258.º),Aquisição de bens móveis,"33600000-6, Produtos farmacêuticos","Centro Hospitalar Universitário do Algarve, E. P. E. (510745997)",generis (508107997),"159,49 €",06-12-2018,16-05-2018,180 dias,"Portugal, Faro, Faro","Artigo 26.º, n.º 1, alínea e) do Código dos Contratos Públicos",,,,,,1974985,"Medicamentos Analgésicos, Antipiréticos e Antidepressivos",FALSE
31/2047/2018-Fibrinogénio humano 1000 mg,Ao abrigo de acordo-quadro (art.º 258.º),Aquisição de bens móveis,"33600000-6, Produtos farmacêuticos","Centro Hospitalar Universitário do Algarve, E. P. E. (510745997)",csl (503047201),"3.200,00 €",06-12-2018,02-05-2018,180 dias,"Portugal, Faro, Faro","Artigo 26.º, n.º 1, alínea e) do Código dos Contratos Públicos",,,,,,2800702,CP 2017/9 - Acordo quadro para fornecimento de Derivados do Plasma Humano às Instituições e Serviços do Serviço Nacional de Saúde,FALSE
31/2188/2018-Glucose 500 mg,Ao abrigo de acordo-quadro (art.º 258.º),Aquisição de bens móveis,"33600000-6, Produtos farmacêuticos","Centro Hospitalar Universitário do Algarve, E. P. E. (510745997)",almiro (501169580),"1.172,88 €",06-12-2018,01-06-2018,180 dias,"Portugal, Faro, Faro","Artigo 26.º, n.º 1, alínea e) do Código dos Contratos Públicos",,,,,,2528675,CP 2017/3 - Acordo Quadro para fornecimento de corretivos da volémia e outras soluções estéreis,FALSE
31/2187/2018-Benzidamina 1.5 mg,Ao abrigo de acordo-quadro (art.º 258.º),Aquisição de bens móveis,"33600000-6, Produtos farmacêuticos","Centro Hospitalar Universitário do Algarve, E. P. E. (510745997)",angelini (500583650),"6.642,00 €",06-12-2018,25-05-2018,180 dias,"Portugal, Faro, Faro","Artigo 26.º, n.º 1, alínea e) do Código dos Contratos Públicos",,,,,,2222779,Medicamentos do aparelho digestivo,FALSE
31/2186/2018-Rosuvastatina 20 mg,Ao abrigo de acordo-quadro (art.º 258.º),Aquisição de bens móveis,"33600000-6, Produtos farmacêuticos","Centro Hospitalar Universitário do Algarve, E. P. E. (510745997)",astrazeneca (502942240),"3.646,50 €",06-12-2018,01-06-2018,180 dias,"Portugal, Faro, Faro","Artigo 26.º, n.º 1, alínea e) do Código dos Contratos Públicos",,,,,,2335591,CP 2016/01 - Acordo Quadro para fornecimento de Medicamentos do Aparelho Cardiovascular   às Instituições e Serviços do Serviço Nacional de Saúde,FALSE
31/2185/2018-Simeticone 42 mg,Ao abrigo de acordo-quadro (art.º 258.º),Aquisição de bens móveis,"33600000-6, Produtos farmacêuticos","Centro Hospitalar Universitário do Algarve, E. P. E. (510745997)",om pharma (500207410),"308,00 €",06-12-2018,28-05-2018,180 dias,"Portugal, Faro, Faro","Artigo 26.º, n.º 1, alínea e) do Código dos Contratos Públicos",,,,,,2222779,Medicamentos do aparelho digestivo,FALSE
31/2178/2018-Ranibizumab 10 mg,Ao abrigo de acordo-quadro (art.º 258.º),Aquisição de bens móveis,"33600000-6, Produtos farmacêuticos","Centro Hospitalar Universitário do Algarve, E. P. E. (510745997)",novartis (500063524),"32.488,00 €",06-12-2018,19-06-2018,180 dias,"Portugal, Faro, Faro","Artigo 26.º, n.º 1, alínea e) do Código dos Contratos Públicos",,,,,,2545980,CP 2017/61 - Acordo quadro para fornecimento de Medicamentos Diversos   às Instituições e Serviços do Serviço Nacional de Saúde,FALSE
21/524/2018 - Antiséticos e Desinfetantes,Concurso público,Aquisição de bens móveis,"33680000-0, Artigos de farmácia","Centro Hospitalar Universitário do Algarve, E.P.E. (510745997)","OVERPHARMA, LDA (505792362), Franklab Portugal, Lda (506058654), PROCLINICA-Equipamentos e Produtos Clínicos, Lda (500222665), B BRAUN MEDICAL, LDA. (501506543), VWR International - Material de Laboratório, Lda. (503842770), ESTERIPLAS (502020776)","26.090,36 €",06-12-2018,21-02-2018,315 dias,"Portugal, Faro, Faro","Artigo 20.º, n.º 1, alínea b) do Código dos Contratos Públicos",,,,,,Não aplicável.,Não aplicável.,FALSE
31/2179/2018-Deferasirox,Ao abrigo de acordo-quadro (art.º 258.º),Aquisição de bens móveis,"33600000-6, Produtos farmacêuticos","Centro Hospitalar Universitário do Algarve, E. P. E. (510745997)",novartis (500063524),"1.933,79 €",06-12-2018,04-06-2018,180 dias,"Portugal, Faro, Faro","Artigo 26.º, n.º 1, alínea e) do Código dos Contratos Públicos",,,,,,2775699,"CP 2017/50 - Medicação antialérgica, vitaminas e sais minerais, medicamentos usados no tratamento de intoxicações e grupo 20.9",FALSE
21/399/2018 - Antiséticos e Desinfetantes,Concurso público,Aquisição de bens móveis,"33680000-0, Artigos de farmácia","Centro Hospitalar Universitário do Algarve, E. P. E. (510745997)","LAB EDOL-PROD FARMACEUTICOS,SA (507072642), OVERPHARMA, LDA (505792362)","9.766,00 €",06-12-2018,07-05-2018,207 dias,"Portugal, Faro, Faro","Artigo 20.º, n.º 1, alínea b) do Código dos Contratos Públicos",,,,,,Não aplicável.,Não aplicável.,FALSE
31/2177/2018-Tigeciclina 50 mg,Ao abrigo de acordo-quadro (art.º 258.º),Aquisição de bens móveis,"33600000-6, Produtos farmacêuticos","Centro Hospitalar Universitário do Algarve, E. P. E. (510745997)",pfizer (500162166),"6.927,60 €",06-12-2018,11-05-2018,180 dias,"Portugal, Faro, Faro","Artigo 26.º, n.º 1, alínea e) do Código dos Contratos Públicos",,,,,,2775691,CP 2017/5 - Acordo Quadro para fornecimento de Medicamentos anti-infeciosos: exceto antivíricos e antifúngicos,FALSE
31/2168/2018-Medicamentos diversos,Ao abrigo de acordo-quadro (art.º 258.º),Aquisição de bens móveis,"33600000-6, Produtos farmacêuticos","Centro Hospitalar Universitário do Algarve, E. P. E. (510745997)",gilead (503604704),"888.123,92 €",06-12-2018,06-07-2018,180 dias,"Portugal, Faro, Faro","Artigo 26.º, n.º 1, alínea e) do Código dos Contratos Públicos",,,,,,2545980,CP 2017/61 - Acordo quadro para fornecimento de Medicamentos Diversos   às Instituições e Serviços do Serviço Nacional de Saúde,FALSE
21/355/2018 - Material de Penso com Efeito Terapêutico,Concurso público,Aquisição de bens móveis,"33680000-0, Artigos de farmácia","Centro Hospitalar Universitário do Algarve, E. P. E. (510745997)","CLINIFAR - PROD.CLINICOS E FARMAC., (503281115), OVERPHARMA-PRODUTOS MÉDICOS E FARMACÉUTICOS,LDA (505792362), SMITH & NEPHEW, LDA. (503552461), Kvtech Portugal - Produtos Médicos Unipessoal, Lda (508671531), Anstacio Saldanha, Lda. (505804441)","56.821,20 €",06-12-2018,12-04-2018,270 dias,"Portugal, Faro, Faro","Artigo 20.º, n.º 1, alínea b) do Código dos Contratos Públicos",,,,,,Não aplicável.,Não aplicável.,FALSE
31/2117/2018-Haloperidol 5 mg,Ao abrigo de acordo-quadro (art.º 258.º),Aquisição de bens móveis,"33600000-6, Produtos farmacêuticos","Centro Hospitalar Universitário do Algarve, E. P. E. (510745997)",ratiopharm (502414910),"3.200,00 €",06-12-2018,25-05-2018,180 dias,"Portugal, Faro, Faro","Artigo 26.º, n.º 1, alínea e) do Código dos Contratos Públicos",,,,,,2356543,CP 2016/19 - Medicamentos Antipsicóticos,FALSE
31/2116/2018-Senosido A+Senosido B,Ao abrigo de acordo-quadro (art.º 258.º),Aquisição de bens móveis,"33600000-6, Produtos farmacêuticos","Centro Hospitalar Universitário do Algarve, E. P. E. (510745997)",glaxo (500276994),"1.085,00 €",06-12-2018,11-05-2018,180 dias,"Portugal, Faro, Faro","Artigo 26.º, n.º 1, alínea e) do Código dos Contratos Públicos",,,,,,2222779,Medicamentos do aparelho digestivo,FALSE
31/2115/2018-Emtricitabina+rilpivirina+tenofovir alafenamida,Ao abrigo de acordo-quadro (art.º 258.º),Aquisição de bens móveis,"33600000-6, Produtos farmacêuticos","Centro Hospitalar Universitário do Algarve, E. P. E. (510745997)",gilead (503604704),"6.112,08 €",06-12-2018,04-06-2018,180 dias,"Portugal, Faro, Faro","Artigo 26.º, n.º 1, alínea e) do Código dos Contratos Públicos",,,,,,2545980,CP 2017/61 - Acordo quadro para fornecimento de Medicamentos Diversos   às Instituições e Serviços do Serviço Nacional de Saúde,FALSE
31/2114/2018-Piridoxina,Ao abrigo de acordo-quadro (art.º 258.º),Aquisição de bens móveis,"33600000-6, Produtos farmacêuticos","Centro Hospitalar Universitário do Algarve, E. P. E. (510745997)",lab. almiro (501169580),"4.904,80 €",06-12-2018,04-06-2018,180 dias,"Portugal, Faro, Faro","Artigo 26.º, n.º 1, alínea e) do Código dos Contratos Públicos",,,,,,2775699,"CP 2017/50 - Medicação antialérgica, vitaminas e sais minerais, medicamentos usados no tratamento de intoxicações e grupo 20.9",FALSE
31/2112/2018-Aprepitant 125 mg,Ao abrigo de acordo-quadro (art.º 258.º),Aquisição de bens móveis,"33600000-6, Produtos farmacêuticos","Centro Hospitalar Universitário do Algarve, E. P. E. (510745997)",merck (500191360),"5.344,00 €",06-12-2018,01-06-2018,180 dias,"Portugal, Faro, Faro","Artigo 26.º, n.º 1, alínea e) do Código dos Contratos Públicos",,,,,,2528670,"CP 2017/2 - Acordo Quadro para fornecimento de Medicamentos do Sistema Nervoso Cerebrospinal, exceto: anestésicos, relaxantes musculares, analgésicos, antipiréticos, antidepressivos e antipsicóticos  às Instituições e Serviços do Serviço Nacional de Saúde",FALSE
31/2111/2018-Betametasona,Ao abrigo de acordo-quadro (art.º 258.º),Aquisição de bens móveis,"33600000-6, Produtos farmacêuticos","Centro Hospitalar Universitário do Algarve, E. P. E. (510745997)",merck (500191360),"1.556,40 €",06-12-2018,11-05-2018,180 dias,"Portugal, Faro, Faro","Artigo 26.º, n.º 1, alínea e) do Código dos Contratos Públicos",,,,,,1415640,CP 2015/7 - ACORDO QUADRO PARA FORNECIMENTO DE HORMONAS E OUTROS MEDICAMENTOS USADOS NO TRATAMENTO DAS DOENÇAS ENDÓCRINAS ÀS INSTITUIÇÕES E SERVIÇOS DO SERVIÇO NACIONAL DE SAÚDE,FALSE
31/2110/2018-Darunavir 800 mg,Ao abrigo de acordo-quadro (art.º 258.º),Aquisição de bens móveis,"33600000-6, Produtos farmacêuticos","Centro Hospitalar Universitário do Algarve, E. P. E. (510745997)",janssen (500189412),"58.832,43 €",06-12-2018,25-05-2018,180 dias,"Portugal, Faro, Faro","Artigo 26.º, n.º 1, alínea e) do Código dos Contratos Públicos",,,,,,2183729,Medicamentos antirretrovíricos para o tratamento da infeção por VIH,FALSE
21/328/2018 - Reagentes para Hemoculturas e Microbacteriologia Sistema Automático,Concurso público,Aquisição de bens móveis,"33696500-0, Reagentes de laboratório","Centro Hospitalar Universitário do Algarve, E. P. E. (510745997)",Biomerieux Portugal (501524177),"43.040,00 €",06-12-2018,02-02-2018,349 dias,"Portugal, Faro, Faro","Artigo 20.º, n.º 1, alínea b) do Código dos Contratos Públicos",,,,,,Não aplicável.,Não aplicável.,FALSE
21/321/2018 - Reagentes Microbiologia Identificação e Antibiograma,Concurso público,Aquisição de bens móveis,"33696500-0, Reagentes de laboratório","Centro Hospitalar Universitário do Algarve, E.P.E. (510745997)",Biomerieux Portugal (501524177),"32.340,00 €",06-12-2018,26-01-2018,353 dias,"Portugal, Faro, Faro","Artigo 20.º, n.º 1, alínea b) do Código dos Contratos Públicos",,,,,,Não aplicável.,Não aplicável.,FALSE
"21/305/2018 - Medicamento """"Pemetrexedo 500mg""""",Concurso público,Aquisição de bens móveis,"33690000-3, Medicamentos vários","Centro Hospitalar Universitário do Algarve, E.P.E. (510745997)","Teva Pharma - Produtos Farmacêuticos, Lda. (507045491)","26.356,40 €",06-12-2018,05-02-2018,336 dias,"Portugal, Faro, Faro","Artigo 20.º, n.º 1, alínea b) do Código dos Contratos Públicos",,,,,,Não aplicável.,Não aplicável.,FALSE
"21/299/2018 - Medicamento """"Emtricitabina+Tenofovir""""",Concurso público,Aquisição de bens móveis,"33690000-3, Medicamentos vários","Centro Hospitalar Universitário do Algarve, E. P. E. (510745997)","GILEAD SCIENCES, LDA (503604704)","477.688,86 €",06-12-2018,07-02-2018,348 dias,"Portugal, Faro, Faro","Artigo 20.º, n.º 1, alínea b) do Código dos Contratos Públicos",,,,,,Não aplicável.,Não aplicável.,FALSE
Equipamento Medico ORL - 68/3581/18,Ajuste Direto Regime Geral,Aquisição de bens móveis,"33100000-1, Equipamento médico","Centro Hospitalar Universitário do Algarve, E. P. E. (510745997)",OLYMPUS IBERIA SAU (980474710),"10.013,00 €",05-12-2018,23-11-2018,25 dias,"Portugal, Faro, Portimão","Artigo 24.º, n.º 1, alínea e), subalínea iii) do Código dos Contratos Públicos",,,,,,Não aplicável.,Não aplicável.,FALSE
deposito agua quente sanitaria ( 77/3827/18),Ajuste Direto Regime Geral,Aquisição de bens móveis,"42965110-2, Sistema de depósito","Centro Hospitalar Universitário do Algarve, E. P. E. (510745997)","TECNIQUEIMA - Caldeiras Equip. Técnicos, Lda (503706604)","7.750,00 €",05-12-2018,23-11-2018,30 dias,"Portugal, Faro, Lagos","Artigo 20.º, n.º 1, alínea d) do Código dos Contratos Públicos",,,,,,Não aplicável.,Não aplicável.,FALSE
"31/2305/2018-Droperidol 2,5 mg",Ao abrigo de acordo-quadro (art.º 258.º),Aquisição de bens móveis,"33600000-6, Produtos farmacêuticos","Centro Hospitalar Universitário do Algarve, E.P.E. (510745997)",overpharma (505792362),"2.520,00 €",05-12-2018,01-06-2018,180 dias,"Portugal, Faro, Faro","Artigo 26.º, n.º 1, alínea e) do Código dos Contratos Públicos",,,,,,2356543,CP 2016/19 - Medicamentos Antipsicóticos,FALSE
31/2304/2018-Cinacalcet 30 mg,Ao abrigo de acordo-quadro (art.º 258.º),Aquisição de bens móveis,"33600000-6, Produtos farmacêuticos","Centro Hospitalar Universitário do Algarve, E. P. E. (510745997)",amgen (502942959),"4.909,45 €",05-12-2018,01-06-2018,180 dias,"Portugal, Faro, Faro","Artigo 26.º, n.º 1, alínea e) do Código dos Contratos Públicos",,,,,,1410779,CP 2015/47 - Acordo quadro para fornecimento de medicamentos do aparelho locomotor às instituições e serviços do serviço nacional de saúde,FALSE
31/2303/2018-Carboximaltose ferrica,Ao abrigo de acordo-quadro (art.º 258.º),Aquisição de bens móveis,"33600000-6, Produtos farmacêuticos","Centro Hospitalar Universitário do Algarve, E. P. E. (510745997)",om pharma (500207410),"80.620,68 €",05-12-2018,07-06-2018,180 dias,"Portugal, Faro, Faro","Artigo 26.º, n.º 1, alínea e) do Código dos Contratos Públicos",,,,,,2489595,CP 2016/18 - Acordo quadro para fornecimento de Medicamentos do Grupo 4: Sangue às Instituições e Serviços do Serviço Nacional de Saúde,FALSE
31/2302/2018-Acido acetilsalicilico 1000 mg,Ao abrigo de acordo-quadro (art.º 258.º),Aquisição de bens móveis,"33600000-6, Produtos farmacêuticos","Centro Hospitalar Universitário do Algarve, E. P. E. (510745997)",labesfal (501169580),"644,80 €",05-12-2018,01-06-2018,180 dias,"Portugal, Faro, Faro","Artigo 26.º, n.º 1, alínea e) do Código dos Contratos Públicos",,,,,,1974985,"Medicamentos Analgésicos, Antipiréticos e Antidepressivos",FALSE
31/2297/2018-Fenobarbital 100 mg,Ao abrigo de acordo-quadro (art.º 258.º),Aquisição de bens móveis,"33600000-6, Produtos farmacêuticos","Centro Hospitalar Universitário do Algarve, E. P. E. (510745997)",labesfal (501169580),"1.077,00 €",05-12-2018,25-05-2018,180 dias,"Portugal, Faro, Faro","Artigo 26.º, n.º 1, alínea e) do Código dos Contratos Públicos",,,,,,2528670,"CP 2017/2 - Acordo Quadro para fornecimento de Medicamentos do Sistema Nervoso Cerebrospinal, exceto: anestésicos, relaxantes musculares, analgésicos, antipiréticos, antidepressivos e antipsicóticos  às Instituições e Serviços do Serviço Nacional de Saúde",FALSE
31/2289/2018-Risperidona 50 mg,Ao abrigo de acordo-quadro (art.º 258.º),Aquisição de bens móveis,"33600000-6, Produtos farmacêuticos","Centro Hospitalar Universitário do Algarve, E. P. E. (510745997)",janssen cilag (500189412),"5.030,00 €",05-12-2018,22-05-2018,180 dias,"Portugal, Faro, Faro","Artigo 26.º, n.º 1, alínea e) do Código dos Contratos Públicos",,,,,,2356543,CP 2016/19 - Medicamentos Antipsicóticos,FALSE
"31/2266/2018-Calcitriol 0,25",Ao abrigo de acordo-quadro (art.º 258.º),Aquisição de bens móveis,"33600000-6, Produtos farmacêuticos","Centro Hospitalar Universitário do Algarve, E. P. E. (510745997)",roche farmaceutica (500233810),"1.431,84 €",05-12-2018,28-05-2018,180 dias,"Portugal, Faro, Faro","Artigo 26.º, n.º 1, alínea e) do Código dos Contratos Públicos",,,,,,1410779,CP 2015/47 - Acordo quadro para fornecimento de medicamentos do aparelho locomotor às instituições e serviços do serviço nacional de saúde,FALSE
31/2261/2018-Ropivacaina 200 mg,Ao abrigo de acordo-quadro (art.º 258.º),Aquisição de bens móveis,"33600000-6, Produtos farmacêuticos","Centro Hospitalar Universitário do Algarve, E. P. E. (510745997)",fresenius (504293753),"2.000,00 €",05-12-2018,23-05-2018,180 dias,"Portugal, Faro, Faro","Artigo 26.º, n.º 1, alínea e) do Código dos Contratos Públicos",,,,,,2211341,Medicamentos anestésicos e relaxantes musculares,FALSE
31/2260/2018-Dabigatrano etexilato 75 mg,Ao abrigo de acordo-quadro (art.º 258.º),Aquisição de bens móveis,"33600000-6, Produtos farmacêuticos","Centro Hospitalar Universitário do Algarve, E. P. E. (510745997)",unilfarma (500293023),"56,40 €",05-12-2018,22-05-2018,180 dias,"Portugal, Faro, Faro","Artigo 26.º, n.º 1, alínea e) do Código dos Contratos Públicos",,,,,,2489595,CP 2016/18 - Acordo quadro para fornecimento de Medicamentos do Grupo 4: Sangue às Instituições e Serviços do Serviço Nacional de Saúde,FALSE
31/2258/2018-Quetiapina 400 mg,Ao abrigo de acordo-quadro (art.º 258.º),Aquisição de bens móveis,"33600000-6, Produtos farmacêuticos","Centro Hospitalar Universitário do Algarve, E. P. E. (510745997)",generis (508107997),"390,00 €",05-12-2018,22-05-2018,180 dias,"Portugal, Faro, Faro","Artigo 26.º, n.º 1, alínea e) do Código dos Contratos Públicos",,,,,,2356543,CP 2016/19 - Medicamentos Antipsicóticos,FALSE
31/2257/2018-Efedrina 50 mg,Ao abrigo de acordo-quadro (art.º 258.º),Aquisição de bens móveis,"33600000-6, Produtos farmacêuticos","Centro Hospitalar Universitário do Algarve, E. P. E. (510745997)",labesfal (501169580),"5.069,00 €",05-12-2018,22-05-2018,180 dias,"Portugal, Faro, Faro","Artigo 26.º, n.º 1, alínea e) do Código dos Contratos Públicos",,,,,,1638654,CP 2015/12 - Acordo quadro para fornecimento de Medicamentos do Aparelho Respiratório às Instituições e Serviços do Serviço Nacional de Saúde,FALSE
31/2256/2018-Fosaprepitant 150 mg,Ao abrigo de acordo-quadro (art.º 258.º),Aquisição de bens móveis,"33600000-6, Produtos farmacêuticos","Centro Hospitalar Universitário do Algarve, E. P. E. (510745997)",merck sharp (500191360),"6.211,15 €",05-12-2018,23-05-2018,180 dias,"Portugal, Faro, Faro","Artigo 26.º, n.º 1, alínea e) do Código dos Contratos Públicos",,,,,,2528670,"CP 2017/2 - Acordo Quadro para fornecimento de Medicamentos do Sistema Nervoso Cerebrospinal, exceto: anestésicos, relaxantes musculares, analgésicos, antipiréticos, antidepressivos e antipsicóticos  às Instituições e Serviços do Serviço Nacional de Saúde",FALSE
31/2255/2018-Insulina glargina 100,Ao abrigo de acordo-quadro (art.º 258.º),Aquisição de bens móveis,"33600000-6, Produtos farmacêuticos","Centro Hospitalar Universitário do Algarve, E. P. E. (510745997)",sanofi (500134960),"4.492,93 €",05-12-2018,23-05-2018,180 dias,"Portugal, Faro, Faro","Artigo 26.º, n.º 1, alínea e) do Código dos Contratos Públicos",,,,,,1415640,CP 2015/7 - ACORDO QUADRO PARA FORNECIMENTO DE HORMONAS E OUTROS MEDICAMENTOS USADOS NO TRATAMENTO DAS DOENÇAS ENDÓCRINAS ÀS INSTITUIÇÕES E SERVIÇOS DO SERVIÇO NACIONAL DE SAÚDE,FALSE
Mepivacaina 54 mg,Ao abrigo de acordo-quadro (art.º 258.º),Aquisição de bens móveis,"33600000-6, Produtos farmacêuticos","Centro Hospitalar Universitário do Algarve, E. P. E. (510745997)",inibsa (500139571),"536,00 €",05-12-2018,20-09-2018,90 dias,"Portugal, Faro, Faro","Artigo 26.º, n.º 1, alínea e) do Código dos Contratos Públicos",,,,,,2211341,Medicamentos anestésicos e relaxantes musculares,FALSE
31/1541/2018-Tizanidina 2 mg,Ao abrigo de acordo-quadro (art.º 258.º),Aquisição de bens móveis,"33600000-6, Produtos farmacêuticos","Centro Hospitalar Universitário do Algarve, E. P. E. (510745997)",teva (507045491),"81,40 €",04-12-2018,13-03-2018,300 dias,"Portugal, Faro, Faro","Artigo 26.º, n.º 1, alínea e) do Código dos Contratos Públicos",,,,,,2211341,Medicamentos anestésicos e relaxantes musculares,FALSE
31/1518/2018-nevirapina 10 mg,Ao abrigo de acordo-quadro (art.º 258.º),Aquisição de bens móveis,"33600000-6, Produtos farmacêuticos","Centro Hospitalar Universitário do Algarve, E. P. E. (510745997)",Unifarma (500293023),"81,48 €",04-12-2018,13-03-2018,300 dias,"Portugal, Faro, Faro","Artigo 26.º, n.º 1, alínea e) do Código dos Contratos Públicos",,,,,,2183729,Medicamentos antirretrovíricos para o tratamento da infeção por VIH,FALSE
"31/1487/2018-fentanilo 200,400 e 600",Ao abrigo de acordo-quadro (art.º 258.º),Aquisição de bens móveis,"33600000-6, Produtos farmacêuticos","Centro Hospitalar Universitário do Algarve, E. P. E. (510745997)",ferrer (500069190),"2.795,55 €",04-12-2018,14-03-2018,300 dias,"Portugal, Faro, Faro","Artigo 26.º, n.º 1, alínea e) do Código dos Contratos Públicos",,,,,,1974985,"Medicamentos Analgésicos, Antipiréticos e Antidepressivos",FALSE
Butilescopolamina 20 mg,Ao abrigo de acordo-quadro (art.º 258.º),Aquisição de bens móveis,"33600000-6, Produtos farmacêuticos","Centro Hospitalar Universitário do Algarve, E. P. E. (510745997)",sanofi (500134960),"3.146,41 €",04-12-2018,14-03-2018,300 dias,"Portugal, Faro, Faro","Artigo 26.º, n.º 1, alínea e) do Código dos Contratos Públicos",,,,,,2222779,Medicamentos do aparelho digestivo,FALSE
Proc.88/3481/2018- Execução de Caixa de Retenção de Hidrocarbonetos-Heliporto da Unid.Portimão,Consulta Prévia,Empreitadas de obras públicas,"45453000-7, Obras de revisão e recuperação","Centro Hospitalar Universitário do Algarve, E. P. E. (510745997)","Rui & Candeias, Lda. (505173212)","11.838,52 €",04-12-2018,20-11-2018,12 dias,"Portugal, Faro, Portimão","Artigo 20.º, n.º 1, alínea c) do Código dos Contratos Públicos",,,,,,Não aplicável.,Não aplicável.,FALSE
Aquisição de Kit rede Pré-Formada c/ tampão,Consulta Prévia,Aquisição de bens móveis,"33140000-3, Material médico de consumo","Centro Hospitalar Universitário do Algarve, E. P. E. (510745997)","MEDTRONIC PORTUGAL, LDA (504223933)","220,00 €",04-12-2018,03-12-2018,28 dias,"Portugal, Faro, Lagos<BR/>Portugal, Faro, Portimão<BR/>Portugal, Faro, Faro","Artigo 20.º, n.º 1, alínea c) do Código dos Contratos Públicos",,,,,,Não aplicável.,Não aplicável.,FALSE
Imunoglobulina humana,Ao abrigo de acordo-quadro (art.º 258.º),Aquisição de bens móveis,"33600000-6, Produtos farmacêuticos","Centro Hospitalar Universitário do Algarve, E. P. E. (510745997)",kedrion (508472830),"360.000,00 €",04-12-2018,03-04-2018,300 dias,"Portugal, Faro, Faro","Artigo 26.º, n.º 1, alínea e) do Código dos Contratos Públicos",,,,,,2800702,CP 2017/9 - Acordo quadro para fornecimento de Derivados do Plasma Humano às Instituições e Serviços do Serviço Nacional de Saúde,FALSE
Aquisição de Kit Cirurgia Colon,Ajuste Direto Regime Geral,Aquisição de bens móveis,"33140000-3, Material médico de consumo","Centro Hospitalar Universitário do Algarve, E. P. E. (510745997)","Johnson & Johnson, Lda  (500153370)","25.200,00 €",04-12-2018,29-11-2018,32 dias,"Portugal, Faro, Faro<BR/>Portugal, Faro, Lagos<BR/>Portugal, Faro, Portimão","Artigo 24.º, n.º 1, alínea e), subalínea ii) do Código dos Contratos Públicos",,,,,,Não aplicável.,Não aplicável.,FALSE
Alfacalcidol,Ao abrigo de acordo-quadro (art.º 258.º),Aquisição de bens móveis,"33600000-6, Produtos farmacêuticos","Centro Hospitalar Universitário do Algarve, E.P.E. (510745997)",leo (503932680),"41,68 €",04-12-2018,20-03-2018,300 dias,"Portugal, Faro, Faro","Artigo 26.º, n.º 1, alínea e) do Código dos Contratos Públicos",,,,,,1410779,CP 2015/47 - Acordo quadro para fornecimento de medicamentos do aparelho locomotor às instituições e serviços do serviço nacional de saúde,FALSE
Insulina,Ao abrigo de acordo-quadro (art.º 258.º),Aquisição de bens móveis,"33600000-6, Produtos farmacêuticos","Centro Hospitalar Universitário do Algarve, E.P.E. (510745997)",novo nordisk (501485210),"1.707,00 €",04-12-2018,27-03-2018,300 dias,"Portugal, Faro, Faro","Artigo 26.º, n.º 1, alínea e) do Código dos Contratos Públicos",,,,,,1415640,CP 2015/7 - ACORDO QUADRO PARA FORNECIMENTO DE HORMONAS E OUTROS MEDICAMENTOS USADOS NO TRATAMENTO DAS DOENÇAS ENDÓCRINAS ÀS INSTITUIÇÕES E SERVIÇOS DO SERVIÇO NACIONAL DE SAÚDE,FALSE
Megestrol 160 mg,Ao abrigo de acordo-quadro (art.º 258.º),Aquisição de bens móveis,"33600000-6, Produtos farmacêuticos","Centro Hospitalar Universitário do Algarve, E.P.E. (510745997)",generis (508107997),"2.790,00 €",04-12-2018,20-03-2018,300 dias,"Portugal, Faro, Faro","Artigo 26.º, n.º 1, alínea e) do Código dos Contratos Públicos",,,,,,1771819,CP 2015/6 - Acordo quadro para o fornecimento de Medicamentos do Foro Oncológico,FALSE
31/1443/2018-Zidovudina 10  mg,Ao abrigo de acordo-quadro (art.º 258.º),Aquisição de bens móveis,"33600000-6, Produtos farmacêuticos","Centro Hospitalar Universitário do Algarve, E.P.E. (510745997)",viivhiv (509117961),"360,00 €",04-12-2018,15-05-2018,360 dias,"Portugal, Faro, Faro","Artigo 26.º, n.º 1, alínea e) do Código dos Contratos Públicos",,,,,,2183729,Medicamentos antirretrovíricos para o tratamento da infeção por VIH,FALSE
Aquisição de Triptorrelina,Ao abrigo de acordo-quadro (art.º 258.º),Aquisição de bens móveis,"33600000-6, Produtos farmacêuticos","Centro Hospitalar Universitário do Algarve, E.P.E. (510745997)",Ipsen (502609800),"1.117,92 €",04-12-2018,22-02-2018,360 dias,"Portugal, Faro, Faro","Artigo 26.º, n.º 1, alínea e) do Código dos Contratos Públicos",,,,,,1771819,CP 2015/6 - Acordo quadro para o fornecimento de Medicamentos do Foro Oncológico,FALSE
Darunavir 800 mg,Ao abrigo de acordo-quadro (art.º 258.º),Aquisição de bens móveis,"33600000-6, Produtos farmacêuticos","Centro Hospitalar Universitário do Algarve, E. P. E. (510745997)",Janssen cilag (500189412),"26.421,75 €",04-12-2018,13-03-2018,360 dias,"Portugal, Faro, Faro","Artigo 26.º, n.º 1, alínea e) do Código dos Contratos Públicos",,,,,,2183729,Medicamentos antirretrovíricos para o tratamento da infeção por VIH,FALSE
Aquisição de AGRAFADOR INTRALUMINAL CURVO 28MM a 29MM,Consulta Prévia,Aquisição de bens móveis,"33140000-3, Material médico de consumo","Centro Hospitalar Universitário do Algarve, E. P. E. (510745997)","MEDTRONIC PORTUGAL, LDA (504223933)","3.420,00 €",03-12-2018,29-11-2018,32 dias,"Portugal, Faro, Lagos<BR/>Portugal, Faro, Portimão<BR/>Portugal, Faro, Faro","Artigo 20.º, n.º 1, alínea c) do Código dos Contratos Públicos",,,,,,Não aplicável.,Não aplicável.,FALSE
Prestação de Serviços Médicos de Nefrologia,Ajuste Direto Regime Geral,Aquisição de serviços,"85121220-1, Serviços especializados de nefrologia ou do sistema nervoso","Centro Hospitalar Universitário do Algarve, E. P. E. (510745997)","Ekenvar, Lda (514981776)","5.616,00 €",03-12-2018,29-11-2018,31 dias,"Portugal, Faro, Faro","Artigo 24.º, n.º 1, alínea e), subalínea ii) do Código dos Contratos Públicos",,,,,,Não aplicável.,Não aplicável.,FALSE
92/3930/2018 AQUISIÇÃO DE MATERIAL CLÍNICO,Ajuste Direto Regime Geral,Aquisição de bens móveis,"33140000-3, Material médico de consumo","Centro Hospitalar Universitário do Algarve, E. P. E. (510745997)","MEDTRONIC PORTUGAL, LDA. (504223933)","1.193,96 €",03-12-2018,28-11-2018,33 dias,"Portugal, Faro","Artigo 24.º, n.º 1, alínea c) do Código dos Contratos Públicos",,,,,,Não aplicável.,Não aplicável.,FALSE
92/3824/2018 Aquisição de Esponjas Hemostáticas,Ajuste Direto Regime Geral,Aquisição de bens móveis,"33140000-3, Material médico de consumo","Centro Hospitalar Universitário do Algarve, E. P. E. (510745997)","MEDTRONIC PORTUGAL, LDA. (504223933)","1.030,00 €",03-12-2018,16-11-2018,45 dias,"Portugal, Faro, Portimão","Artigo 24.º, n.º 1, alínea c) do Código dos Contratos Públicos",,,,,,Não aplicável.,Não aplicável.,FALSE
