Objeto do Contrato,Tipo de Procedimento,Tipo(s) de Contrato,CPVs,Entidade(s) Adjudicante(s),Entidade(s) Adjudicatária(s),Preço Contratual,Data de Publicação,Data de Celebração do Contrato,Prazo de Execução,Local de Execução,Fundamentação,Data de Fecho do Contrato,Preço Total Efetivo,Causas das Alterações ao Prazo,Causas das Alterações ao Preço,Estado,N.º registo do Acordo Quadro,Descrição do Acordo Quadro,Procedimento Centralizado
Aquisição de serviços de instalação do sistema SINAVE e apoio ao arranque de um piloto,Ajuste Direto Regime Geral,Aquisição de serviços,"72000000-5, Serviços de TI: consultoria, desenvolvimento de software, Internet e apoio","Serviço Partilhados do Ministério da Saúde, E. P. E. (509540716)","Deloitte Consultores, SA (502310090)","9.900,00 €",29-04-2013,04-04-2013,90 dias,Portugal,"Artigo 20.º, n.º 1, alínea a) do Código dos Contratos Públicos","","",,,,Não aplicável.,Não aplicável.,
"Prestação de serviços de colaboração no processo de avaliação SIADAP para a SPMS, EPE",Ajuste Direto Regime Geral,Aquisição de serviços,"79000000-4, Serviços a empresas: direito, comercialização, consultoria, recrutamento, impressão e segurança","Serviço Partilhados do Ministério da Saúde, E. P. E. (509540716)","GN Consulting, Unipessoal, Lda. (508880149)","10.000,00 €",24-04-2013,28-03-2013,720 dias,Portugal,"Artigo 20.º, n.º 1, alínea a) do Código dos Contratos Públicos",31-03-2015,"10.000,00 €",,,,Não aplicável.,Não aplicável.,
Empreitada de obras para instalação de Quadro de Baixa Tensão e de Grupo Gerador,Ajuste Direto Regime Geral,Empreitadas de obras públicas,"50000000-5, Serviços de reparação e manutenção","Serviço Partilhados do Ministério da Saúde, E. P. E. (509540716)","MAXIGLOBAL, EQUIPAMENTOS E SERVIÇOS DE INFORMÁTICA, S.A. (504320882)","97.529,05 €",23-04-2013,03-04-2013,90 dias,Portugal,"Artigo 19.º, alínea a) do Código dos Contratos Públicos","","",,,,Não aplicável.,Não aplicável.,
Contrato de prestação de serviços de assessoria juridica de acompanhamento do procedimento de diálogo concorrencial,Ajuste Direto Regime Geral,Aquisição de serviços,"79000000-4, Serviços a empresas: direito, comercialização, consultoria, recrutamento, impressão e segurança","Serviço Partilhados do Ministério da Saúde, E. P. E. (509540716)",Sérvulo & Associados (504344285),"52.500,00 €",22-04-2013,01-04-2013,270 dias,Portugal,"Artigo 27.º, n.º 1, alínea b) do Código dos Contratos Públicos",31-12-2013,"52.500,00 €",,,,Não aplicável.,Não aplicável.,
