Objeto do Contrato,Tipo de Procedimento,Tipo(s) de Contrato,CPVs,Entidade(s) Adjudicante(s),Entidade(s) Adjudicatária(s),Preço Contratual,Data de Publicação,Data de Celebração do Contrato,Prazo de Execução,Local de Execução,Fundamentação,Data de Fecho do Contrato,Preço Total Efetivo,Causas das Alterações ao Prazo,Causas das Alterações ao Preço,Estado,N.º registo do Acordo Quadro,Descrição do Acordo Quadro,Procedimento Centralizado
TUBO SANGUE PLASMA,Ao abrigo de acordo-quadro (art.º 259.º),Aquisição de bens móveis,"33140000-3, Material médico de consumo","Centro Hospitalar de Leiria, E. P. E. (509822932)","NORMAX-FABRICA VIDROS CIENTIFICOS, LDA (500203130)","74,00 €",30-05-2016,30-05-2016,10 dias,"Portugal, Leiria, Leiria","Artigo 20.º, n.º 1, alínea b) do Código dos Contratos Públicos",30-05-2016,"74,00 €",,,,448705,"CONCURSO PÚBLICO PARA A CELEBRAÇÃO DE CONTRATOS PÚBLICOS DE APROVISIONAMENTO PARA A ÁREA DA SAÚDE, COM VISTA AO FORNECIMENTO DE SERINGAS, AGULHAS, CONTENTORES E SISTEMAS FECHADOS DE COLHEITA,  ÀS INSTITUIÇÕES E SERVIÇOS DO SERVIÇO NACIONAL DE SAÚDE",FALSE
Medicamentos do Foro Oncológico,Ao abrigo de acordo-quadro (art.º 259.º),Aquisição de bens móveis,"33600000-6, Produtos farmacêuticos","Centro Hospitalar de Leiria, E. P. E. (509822932)","ROCHE FARMACEUTICA QUIMICA, LDA (500233810)","98.792,16 €",30-05-2016,01-01-2015,360 dias,"Portugal, Leiria, Leiria",Artigo 259.º do Código dos Contratos Públicos,31-12-2015,"98.792,16 €",,,,345900,CONCURSO PÚBLICO PARA A CELEBRAÇÃO DE CONTRATOS PÚBLICOS DE APROVISIONAMENTO PARA AQUISIÇÃO MEDICAMENTOS DO FORO ONCOLÓGICO,FALSE
MATERIAL EMPACOTAMENTO PROTEÇÃO E ESTAERILIZAÇÃO,Concurso público,Aquisição de bens móveis,"33140000-3, Material médico de consumo","Centro Hospitalar de Leiria, E. P. E. (509822932)","ANASTACIO SALDANHA UNIPESSOAL, LDA. (505804441)","11.380,00 €",30-05-2016,16-06-2015,365 dias,"Portugal, Leiria, Leiria","Artigo 20.º, n.º 1, alínea b) do Código dos Contratos Públicos","","",,,,Não aplicável.,Não aplicável.,FALSE
"0310E16-PRESTAÇÃO DE SERVIÇOS DE MANUTENÇÃO E ASSIST. DAS INSTALAÇÕES E EQUIP. ELÉCTRICOS NO CHLP, EPE",Ajuste Direto Regime Geral,Aquisição de serviços,"50000000-5, Serviços de reparação e manutenção","Centro Hospitalar de Leiria, E. P. E. (509822932)","UPK, SA (513567399)","27.064,00 €",30-05-2016,23-05-2016,61 dias,"Portugal, Leiria, Leiria","Artigo 20.º, n.º 1, alínea a) do Código dos Contratos Públicos",31-05-2016,"27.064,00 €",,,,Não aplicável.,Não aplicável.,FALSE
0318E16-SERVIÇOS DE MANUTENÇÃO PARA SERVIDORES DO HSA,Ajuste Direto Regime Geral,Aquisição de serviços,"50000000-5, Serviços de reparação e manutenção","Centro Hospitalar de Leiria, E. P. E. (509822932)","Informantém - Informática e Manutenção, S.A. (503670693)","6.401,45 €",30-05-2016,24-05-2016,123 dias,"Portugal, Leiria, Leiria","Artigo 20.º, n.º 1, alínea a) do Código dos Contratos Públicos",31-05-2016,"6.401,45 €",,,,Não aplicável.,Não aplicável.,FALSE
Medicamentos do Aparelho Digestivo,Ao abrigo de acordo-quadro (art.º 259.º),Aquisição de bens móveis,"33600000-6, Produtos farmacêuticos","Centro Hospitalar de Leiria, E. P. E. (509822932)",SIDEFARMA-SOC.IND.EXPANSAO FARMACEUTICA (500717419),"505,00 €",30-05-2016,01-01-2015,360 dias,"Portugal, Leiria, Leiria",Artigo 259.º do Código dos Contratos Públicos,31-12-2015,"505,00 €",,,,520788,CONCURSO PUBLICO PARA A CELEBRAÇÃO DE CONTRATOS PUBLICOS DE APROVISIONAMENTO PARA A AREA DA SAUDE  COM VISTA AO FORNECIMENTO DE MEDICAMENTOS PARA O APARELHO DIGESTIVO  AS INSITUIÇÕES DO SERVIÇO NACIONAL DE SAÚDE,FALSE
Medicamentos do Aparelho Digestivo,Ao abrigo de acordo-quadro (art.º 259.º),Aquisição de bens móveis,"33600000-6, Produtos farmacêuticos","Centro Hospitalar de Leiria, E. P. E. (509822932)","RATIOPHARM-COM.IND.PROD.FARMACEUT., LDA (502414910)","118,80 €",30-05-2016,01-01-2015,360 dias,"Portugal, Leiria, Leiria",Artigo 259.º do Código dos Contratos Públicos,31-12-2015,"118,80 €",,,,520788,CONCURSO PUBLICO PARA A CELEBRAÇÃO DE CONTRATOS PUBLICOS DE APROVISIONAMENTO PARA A AREA DA SAUDE  COM VISTA AO FORNECIMENTO DE MEDICAMENTOS PARA O APARELHO DIGESTIVO  AS INSITUIÇÕES DO SERVIÇO NACIONAL DE SAÚDE,FALSE
Medicamentos do Aparelho Digestivo,Ao abrigo de acordo-quadro (art.º 259.º),Aquisição de bens móveis,"33600000-6, Produtos farmacêuticos","Centro Hospitalar de Leiria, E. P. E. (509822932)","LABORATORIO MEDINFAR, SA (500384045)","1.619,40 €",30-05-2016,01-01-2015,360 dias,"Portugal, Leiria, Leiria",Artigo 259.º do Código dos Contratos Públicos,31-12-2015,"1.619,40 €",,,,520788,CONCURSO PUBLICO PARA A CELEBRAÇÃO DE CONTRATOS PUBLICOS DE APROVISIONAMENTO PARA A AREA DA SAUDE  COM VISTA AO FORNECIMENTO DE MEDICAMENTOS PARA O APARELHO DIGESTIVO  AS INSITUIÇÕES DO SERVIÇO NACIONAL DE SAÚDE,FALSE
Medicamentos do Aparelho Digestivo,Ao abrigo de acordo-quadro (art.º 259.º),Aquisição de bens móveis,"33600000-6, Produtos farmacêuticos","Centro Hospitalar de Leiria, E. P. E. (509822932)","LABESFAL-LABORATORIOS ALMIRO, SA (501169580)","582,08 €",30-05-2016,01-01-2015,360 dias,"Portugal, Leiria, Leiria",Artigo 259.º do Código dos Contratos Públicos,31-12-2015,"582,08 €",,,,520788,CONCURSO PUBLICO PARA A CELEBRAÇÃO DE CONTRATOS PUBLICOS DE APROVISIONAMENTO PARA A AREA DA SAUDE  COM VISTA AO FORNECIMENTO DE MEDICAMENTOS PARA O APARELHO DIGESTIVO  AS INSITUIÇÕES DO SERVIÇO NACIONAL DE SAÚDE,FALSE
Medicamentos do Aparelho Digestivo,Ao abrigo de acordo-quadro (art.º 259.º),Aquisição de bens móveis,"33600000-6, Produtos farmacêuticos","Centro Hospitalar de Leiria, E. P. E. (509822932)","BAYER PORTUGAL, SA (500043256)","88,08 €",30-05-2016,01-01-2015,360 dias,"Portugal, Leiria, Leiria",Artigo 259.º do Código dos Contratos Públicos,31-12-2015,"88,08 €",,,,520788,CONCURSO PUBLICO PARA A CELEBRAÇÃO DE CONTRATOS PUBLICOS DE APROVISIONAMENTO PARA A AREA DA SAUDE  COM VISTA AO FORNECIMENTO DE MEDICAMENTOS PARA O APARELHO DIGESTIVO  AS INSITUIÇÕES DO SERVIÇO NACIONAL DE SAÚDE,FALSE
Medicamentos do foro oncológico,Ao abrigo de acordo-quadro (art.º 259.º),Aquisição de bens móveis,"33600000-6, Produtos farmacêuticos","Centro Hospitalar de Leiria, E. P. E. (509822932)","TEVA PHARMA-PRODUTOS FARMACEUTICOS, LDA (507045491)","3.003,28 €",30-05-2016,01-01-2015,360 dias,"Portugal, Leiria, Leiria",Artigo 259.º do Código dos Contratos Públicos,31-12-2015,"3.003,28 €",,,,345900,CONCURSO PÚBLICO PARA A CELEBRAÇÃO DE CONTRATOS PÚBLICOS DE APROVISIONAMENTO PARA AQUISIÇÃO MEDICAMENTOS DO FORO ONCOLÓGICO,FALSE
Medicamentos do foro oncológico,Ao abrigo de acordo-quadro (art.º 259.º),Aquisição de bens móveis,"33600000-6, Produtos farmacêuticos","Centro Hospitalar de Leiria, E. P. E. (509822932)","SANOFI-PRODUTOS FARMACEUTICOS,LDA (500134960)","50,16 €",30-05-2016,01-01-2015,360 dias,"Portugal, Leiria, Leiria",Artigo 259.º do Código dos Contratos Públicos,31-12-2015,"50,16 €",,,,345900,CONCURSO PÚBLICO PARA A CELEBRAÇÃO DE CONTRATOS PÚBLICOS DE APROVISIONAMENTO PARA AQUISIÇÃO MEDICAMENTOS DO FORO ONCOLÓGICO,FALSE
Medicamentos do foro oncológico,Ao abrigo de acordo-quadro (art.º 259.º),Aquisição de bens móveis,"33600000-6, Produtos farmacêuticos","Centro Hospitalar de Leiria, E. P. E. (509822932)","IPSEN PORTUGAL-PRODUT.FARMACEUTICOS, SA (502609800)","2.730,00 €",30-05-2016,01-01-2015,360 dias,"Portugal, Leiria, Leiria",Artigo 259.º do Código dos Contratos Públicos,31-12-2015,"2.730,00 €",,,,345900,CONCURSO PÚBLICO PARA A CELEBRAÇÃO DE CONTRATOS PÚBLICOS DE APROVISIONAMENTO PARA AQUISIÇÃO MEDICAMENTOS DO FORO ONCOLÓGICO,FALSE
Medicamentos do foro oncológico,Ao abrigo de acordo-quadro (art.º 259.º),Aquisição de bens móveis,"33600000-6, Produtos farmacêuticos","Centro Hospitalar de Leiria, E. P. E. (509822932)","HOSPIRA PORTUGAL, LDA (502918098)","5.718,05 €",30-05-2016,01-01-2015,360 dias,"Portugal, Leiria, Leiria",Artigo 259.º do Código dos Contratos Públicos,31-12-2015,"5.718,05 €",,,,345900,CONCURSO PÚBLICO PARA A CELEBRAÇÃO DE CONTRATOS PÚBLICOS DE APROVISIONAMENTO PARA AQUISIÇÃO MEDICAMENTOS DO FORO ONCOLÓGICO,FALSE
Medicamentos do foro oncológico,Ao abrigo de acordo-quadro (art.º 259.º),Aquisição de bens móveis,"33600000-6, Produtos farmacêuticos","Centro Hospitalar de Leiria, E. P. E. (509822932)","GLAXOSMITHKLINE-PROD.FARMACEUTICOS, LDA (500139962)","5.758,87 €",30-05-2016,01-01-2015,360 dias,"Portugal, Leiria, Leiria",Artigo 259.º do Código dos Contratos Públicos,31-12-2015,"5.758,87 €",,,,345900,CONCURSO PÚBLICO PARA A CELEBRAÇÃO DE CONTRATOS PÚBLICOS DE APROVISIONAMENTO PARA AQUISIÇÃO MEDICAMENTOS DO FORO ONCOLÓGICO,FALSE
Medicamentos do foro oncológico,Ao abrigo de acordo-quadro (art.º 259.º),Aquisição de bens móveis,"33600000-6, Produtos farmacêuticos","Centro Hospitalar de Leiria, E. P. E. (509822932)","FRESENIUS KABI PHARMA PORTUGAL, LDA (504293753)","6.859,36 €",30-05-2016,01-01-2015,360 dias,"Portugal, Leiria, Leiria",Artigo 259.º do Código dos Contratos Públicos,31-12-2015,"6.859,36 €",,,,345900,CONCURSO PÚBLICO PARA A CELEBRAÇÃO DE CONTRATOS PÚBLICOS DE APROVISIONAMENTO PARA AQUISIÇÃO MEDICAMENTOS DO FORO ONCOLÓGICO,FALSE
Medicamentos do foro oncológico,Ao abrigo de acordo-quadro (art.º 259.º),Aquisição de bens móveis,"33600000-6, Produtos farmacêuticos","Centro Hospitalar de Leiria, E. P. E. (509822932)","AUROVITAS UNIPESSOAL, LDA. (513053239)","232,80 €",30-05-2016,01-01-2015,360 dias,"Portugal, Leiria, Leiria",Artigo 259.º do Código dos Contratos Públicos,31-12-2015,"232,80 €",,,,345900,CONCURSO PÚBLICO PARA A CELEBRAÇÃO DE CONTRATOS PÚBLICOS DE APROVISIONAMENTO PARA AQUISIÇÃO MEDICAMENTOS DO FORO ONCOLÓGICO,FALSE
Medicamentos Antivírico e Antifúngico,Ao abrigo de acordo-quadro (art.º 259.º),Aquisição de bens móveis,"33600000-6, Produtos farmacêuticos","Centro Hospitalar de Leiria, E. P. E. (509822932)","ROCHE FARMACEUTICA QUIMICA, LDA (500233810)","2.113,44 €",30-05-2016,05-01-2016,120 dias,"Portugal, Leiria, Leiria",Artigo 259.º do Código dos Contratos Públicos,23-05-2016,"2.113,44 €",,,,1422736,CP 2015/41 - ACORDO QUADRO PARA FORNECIMENTO DE MEDICAMENTOS ANTI-INFECIOSOS: ANTIVÍRICOS E ANTIFÚNGICOS ÀS INSTITUIÇÕES E SERVIÇOS DO SERVIÇO NACIONAL DE SAÚDE,FALSE
Medicamentos Antivírico e Antifúngico,Ao abrigo de acordo-quadro (art.º 259.º),Aquisição de bens móveis,"33600000-6, Produtos farmacêuticos","Centro Hospitalar de Leiria, E. P. E. (509822932)","FRESENIUS KABI PHARMA PORTUGAL, LDA (504293753)","628,74 €",30-05-2016,05-01-2016,120 dias,"Portugal, Leiria, Leiria",Artigo 259.º do Código dos Contratos Públicos,23-05-2016,"628,74 €",,,,1422736,CP 2015/41 - ACORDO QUADRO PARA FORNECIMENTO DE MEDICAMENTOS ANTI-INFECIOSOS: ANTIVÍRICOS E ANTIFÚNGICOS ÀS INSTITUIÇÕES E SERVIÇOS DO SERVIÇO NACIONAL DE SAÚDE,FALSE
Medicamentos Antivírico e Antifúngico,Ao abrigo de acordo-quadro (art.º 259.º),Aquisição de bens móveis,"33600000-6, Produtos farmacêuticos","Centro Hospitalar de Leiria, E. P. E. (509822932)","BRISTOL MYERS SQUIBB-FARM.PORTUGUESA, SA (500048193)","364,00 €",30-05-2016,05-01-2016,120 dias,"Portugal, Leiria, Leiria",Artigo 259.º do Código dos Contratos Públicos,23-05-2016,"364,00 €",,,,1422736,CP 2015/41 - ACORDO QUADRO PARA FORNECIMENTO DE MEDICAMENTOS ANTI-INFECIOSOS: ANTIVÍRICOS E ANTIFÚNGICOS ÀS INSTITUIÇÕES E SERVIÇOS DO SERVIÇO NACIONAL DE SAÚDE,FALSE
ribavirina,Ao abrigo de acordo-quadro (art.º 259.º),Aquisição de bens móveis,"33600000-6, Produtos farmacêuticos","Centro Hospitalar de Leiria, E. P. E. (509822932)","ROCHE FARMACEUTICA QUIMICA, LDA (500233810)","435,12 €",27-05-2016,14-01-2015,365 dias,"Portugal, Leiria, Leiria",Artigo 259.º do Código dos Contratos Públicos,31-12-2015,"435,12 €",,,,1422736,CP 2015/41 - ACORDO QUADRO PARA FORNECIMENTO DE MEDICAMENTOS ANTI-INFECIOSOS: ANTIVÍRICOS E ANTIFÚNGICOS ÀS INSTITUIÇÕES E SERVIÇOS DO SERVIÇO NACIONAL DE SAÚDE,FALSE
Aciclovir,Ao abrigo de acordo-quadro (art.º 259.º),Aquisição de bens móveis,"33600000-6, Produtos farmacêuticos","Centro Hospitalar de Leiria, E. P. E. (509822932)","LABESFAL-LABORATORIOS ALMIRO, SA (501169580)","290,20 €",27-05-2016,14-01-2015,365 dias,"Portugal, Leiria, Leiria",Artigo 259.º do Código dos Contratos Públicos,31-12-2015,"290,20 €",,,,1422736,CP 2015/41 - ACORDO QUADRO PARA FORNECIMENTO DE MEDICAMENTOS ANTI-INFECIOSOS: ANTIVÍRICOS E ANTIFÚNGICOS ÀS INSTITUIÇÕES E SERVIÇOS DO SERVIÇO NACIONAL DE SAÚDE,FALSE
Fluconazol,Ao abrigo de acordo-quadro (art.º 259.º),Aquisição de bens móveis,"33600000-6, Produtos farmacêuticos","Centro Hospitalar de Leiria, E. P. E. (509822932)","FRESENIUS KABI PHARMA PORTUGAL, LDA (504293753)","179,64 €",27-05-2016,14-01-2015,365 dias,"Portugal, Leiria, Leiria",Artigo 259.º do Código dos Contratos Públicos,31-12-2015,"179,64 €",,,,1422736,CP 2015/41 - ACORDO QUADRO PARA FORNECIMENTO DE MEDICAMENTOS ANTI-INFECIOSOS: ANTIVÍRICOS E ANTIFÚNGICOS ÀS INSTITUIÇÕES E SERVIÇOS DO SERVIÇO NACIONAL DE SAÚDE,FALSE
nistatina,Ao abrigo de acordo-quadro (art.º 259.º),Aquisição de bens móveis,"33600000-6, Produtos farmacêuticos","Centro Hospitalar de Leiria, E. P. E. (509822932)","BRISTOL MYERS SQUIBB-FARM.PORTUGUESA, SA (500048193)","330,20 €",27-05-2016,14-01-2015,365 dias,"Portugal, Leiria, Leiria",Artigo 259.º do Código dos Contratos Públicos,31-12-2015,"330,20 €",,,,1422736,CP 2015/41 - ACORDO QUADRO PARA FORNECIMENTO DE MEDICAMENTOS ANTI-INFECIOSOS: ANTIVÍRICOS E ANTIFÚNGICOS ÀS INSTITUIÇÕES E SERVIÇOS DO SERVIÇO NACIONAL DE SAÚDE,FALSE
Reagentes para imunoalergologia,Ajuste Direto Regime Geral,Aquisição de bens móveis,"33696500-0, Reagentes de laboratório","Centro Hospitalar de Leiria, E. P. E. (509822932)","THERMO FISHER DIAGNOSTICS, SOC. UNIPESSOAL, LDA. (506916243)","17.001,71 €",25-05-2016,31-12-2015,365 dias,"Portugal, Leiria, Leiria","Artigo 26.º, n.º 1, alínea a) do Código dos Contratos Públicos",31-12-2015,"17.001,71 €",,,,Não aplicável.,Não aplicável.,FALSE
Equipamentos de Urologia,Concurso público,Aquisição de bens móveis,"33100000-1, Equipamento médico","Centro Hospitalar de Leiria, E. P. E. (509822932)",Olympus Iberia SAU  (980474710),"61.210,45 €",25-05-2016,18-11-2015,60 dias,"Portugal, Leiria, Leiria","Artigo 20.º, n.º 1, alínea b) do Código dos Contratos Públicos",18-11-2015,"61.210,45 €",,,,Não aplicável.,Não aplicável.,FALSE
Reagentes para quimioluminescência,Ajuste Direto Regime Geral,Aquisição de bens móveis,"33696500-0, Reagentes de laboratório","Centro Hospitalar de Leiria, E. P. E. (509822932)","DIASORIN IBERIA, SA - SUC. PORTUGAL (980379563)","11.453,50 €",25-05-2016,01-01-2015,365 dias,"Portugal, Leiria, Leiria","Artigo 26.º, n.º 1, alínea a) do Código dos Contratos Públicos",31-12-2015,"11.453,50 €",,,,Não aplicável.,Não aplicável.,FALSE
Reagentes para Electroforeses,Ajuste Direto Regime Geral,Aquisição de bens móveis,"33696500-0, Reagentes de laboratório","Centro Hospitalar de Leiria, E. P. E. (509822932)","THERMO FISHER DIAGNOSTICS, SOC. UNIPESSOAL, LDA. (506916243)","6.357,26 €",25-05-2016,01-01-2015,365 dias,"Portugal, Leiria, Leiria","Artigo 26.º, n.º 1, alínea a) do Código dos Contratos Públicos",31-12-2015,"6.357,26 €",,,,Não aplicável.,Não aplicável.,FALSE
Reagentes para imunoserologia manual e automática,Ajuste Direto Regime Geral,Aquisição de bens móveis,"33696500-0, Reagentes de laboratório","Centro Hospitalar de Leiria, E. P. E. (509822932)","WERFEN PORTUGAL, LDA (501086110)","1.995,90 €",25-05-2016,01-01-2015,365 dias,"Portugal, Leiria, Leiria","Artigo 26.º, n.º 1, alínea a) do Código dos Contratos Públicos",31-12-2015,"1.995,90 €",,,,Não aplicável.,Não aplicável.,FALSE
Reagentes para imunoserologia manual e automática,Ajuste Direto Regime Geral,Aquisição de bens móveis,"33696500-0, Reagentes de laboratório","Centro Hospitalar de Leiria, E. P. E. (509822932)","MENARINI DIAGNOSTICOS, LDA (502610069)","6.439,00 €",25-05-2016,01-01-2015,365 dias,"Portugal, Leiria, Leiria","Artigo 26.º, n.º 1, alínea a) do Código dos Contratos Públicos",31-12-2015,"6.439,00 €",,,,Não aplicável.,Não aplicável.,FALSE
Reagentes para imunoserologia manual e automática,Ajuste Direto Regime Geral,Aquisição de bens móveis,"33696500-0, Reagentes de laboratório","Centro Hospitalar de Leiria, E. P. E. (509822932)","ISODER-ISOTOPOS E DERIVADOS, SA (502241594)","17.904,26 €",25-05-2016,01-01-2015,365 dias,"Portugal, Leiria, Leiria","Artigo 26.º, n.º 1, alínea a) do Código dos Contratos Públicos",31-12-2015,"17.904,26 €",,,,Não aplicável.,Não aplicável.,FALSE
Reagentes para imunoserologia manual e automática,Ajuste Direto Regime Geral,Aquisição de bens móveis,"33696500-0, Reagentes de laboratório","Centro Hospitalar de Leiria, E. P. E. (509822932)","GRIFOLS PORTUGAL-PROD.FARM.HOSPIT., LDA (502041285)","12.680,00 €",25-05-2016,01-01-2015,365 dias,"Portugal, Leiria, Leiria","Artigo 26.º, n.º 1, alínea a) do Código dos Contratos Públicos",31-12-2015,"12.680,00 €",,,,Não aplicável.,Não aplicável.,FALSE
Reagentes para imunoserologia manual e automática,Ajuste Direto Regime Geral,Aquisição de bens móveis,"33696500-0, Reagentes de laboratório","Centro Hospitalar de Leiria, E. P. E. (509822932)","BIOMERIEUX PORTUGAL-APAR.REAG.LAB., LDA (501524177)","498,40 €",25-05-2016,01-01-2015,365 dias,"Portugal, Leiria, Leiria","Artigo 26.º, n.º 1, alínea a) do Código dos Contratos Públicos",31-12-2015,"498,40 €",,,,Não aplicável.,Não aplicável.,FALSE
Reagentes para Imunoserologia manual e automática,Ajuste Direto Regime Geral,Aquisição de bens móveis,"33696500-0, Reagentes de laboratório","Centro Hospitalar de Leiria, E. P. E. (509822932)","BDPL CIENTIFICA-REAGENTES INSTRUMENTOS,LDA. (504527584)","1.440,07 €",25-05-2016,01-01-2015,365 dias,"Portugal, Leiria, Leiria","Artigo 26.º, n.º 1, alínea a) do Código dos Contratos Públicos",31-12-2015,"1.440,07 €",,,,Não aplicável.,Não aplicável.,FALSE
Reagentes para imunoserologia manual e automática,Ajuste Direto Regime Geral,Aquisição de bens móveis,"33696500-0, Reagentes de laboratório","Centro Hospitalar de Leiria, E. P. E. (509822932)","BAPTISTA MARQUES DIAG. E REAGENTES, LDA (501439110)","2.631,29 €",25-05-2016,01-01-2015,365 dias,"Portugal, Leiria, Leiria","Artigo 26.º, n.º 1, alínea a) do Código dos Contratos Públicos",31-12-2015,"2.631,29 €",,,,Não aplicável.,Não aplicável.,FALSE
Reagentes para imunoserologia manual e automática,Ajuste Direto Regime Geral,Aquisição de bens móveis,"33696500-0, Reagentes de laboratório","Centro Hospitalar de Leiria, E. P. E. (509822932)","ARIUM-SIST.DIAGNOSTICO,LDA. (502501880)","1.875,00 €",25-05-2016,01-01-2015,365 dias,"Portugal, Leiria, Leiria","Artigo 26.º, n.º 1, alínea a) do Código dos Contratos Públicos",31-12-2015,"1.875,00 €",,,,Não aplicável.,Não aplicável.,FALSE
Reagentes para imunoserologia manual e automática,Ajuste Direto Regime Geral,Aquisição de bens móveis,"33696500-0, Reagentes de laboratório","Centro Hospitalar de Leiria, E. P. E. (509822932)","ALERE, LDA (502518863)","514,00 €",25-05-2016,01-01-2015,365 dias,"Portugal, Leiria, Leiria","Artigo 26.º, n.º 1, alínea b) do Código dos Contratos Públicos",31-12-2015,"514,00 €",,,,Não aplicável.,Não aplicável.,FALSE
Reagentes de Bioquímica,Ajuste Direto Regime Geral,Aquisição de bens móveis,"33696500-0, Reagentes de laboratório","Centro Hospitalar de Leiria, E. P. E. (509822932)","WERFEN PORTUGAL, LDA (501086110)","303,60 €",25-05-2016,01-01-2015,365 dias,"Portugal, Leiria, Leiria","Artigo 26.º, n.º 1, alínea a) do Código dos Contratos Públicos",31-12-2015,"303,60 €",,,,Não aplicável.,Não aplicável.,FALSE
Reagentes para Bioquímica,Ajuste Direto Regime Geral,Aquisição de bens móveis,"33696500-0, Reagentes de laboratório","Centro Hospitalar de Leiria, E. P. E. (509822932)","BECKMAN COULTER PORTUGAL UNIPESSOAL,LDA. (509035167)","11.630,44 €",25-05-2016,01-01-2015,365 dias,"Portugal, Leiria, Leiria","Artigo 26.º, n.º 1, alínea a) do Código dos Contratos Públicos",31-12-2015,"11.630,44 €",,,,Não aplicável.,Não aplicável.,FALSE
Reagentes para Quimioluminescência e Citometria,Ajuste Direto Regime Geral,Aquisição de bens móveis,"33696500-0, Reagentes de laboratório","Centro Hospitalar de Leiria, E. P. E. (509822932)","ROCHE SISTEMAS DIAGNOSTICOS, LDA (504282921)","15.070,00 €",25-05-2016,01-01-2015,365 dias,"Portugal, Leiria, Leiria","Artigo 26.º, n.º 1, alínea a) do Código dos Contratos Públicos",31-12-2015,"15.070,00 €",,,,Não aplicável.,Não aplicável.,FALSE
Reagentes para Quimioluminescência e Citometria,Ajuste Direto Regime Geral,Aquisição de bens móveis,"33696500-0, Reagentes de laboratório","Centro Hospitalar de Leiria, E. P. E. (509822932)","FARDIOTOP, PRODUTOS E SERVICOS FARMACEUTCOS, LDA. (508033128)","2.490,00 €",25-05-2016,01-01-2015,365 dias,"Portugal, Leiria, Leiria","Artigo 26.º, n.º 1, alínea a) do Código dos Contratos Públicos",31-12-2015,"2.490,00 €",,,,Não aplicável.,Não aplicável.,FALSE
Reagentes de quimioluminescência e citometria,Ajuste Direto Regime Geral,Aquisição de bens móveis,"33696500-0, Reagentes de laboratório","Centro Hospitalar de Leiria, E. P. E. (509822932)","DIASORIN IBERIA, SA - SUC. PORTUGAL (980379563)","3.612,00 €",25-05-2016,01-01-2015,365 dias,"Portugal, Leiria, Leiria","Artigo 26.º, n.º 1, alínea a) do Código dos Contratos Públicos",31-12-2015,"3.612,00 €",,,,Não aplicável.,Não aplicável.,FALSE
Reagentes de quimioluminescência e citometria,Ajuste Direto Regime Geral,Aquisição de bens móveis,"33696500-0, Reagentes de laboratório","Centro Hospitalar de Leiria, E. P. E. (509822932)","BECKMAN COULTER PORTUGAL UNIPESSOAL,LDA. (509035167)","1.080,00 €",25-05-2016,01-01-2015,365 dias,"Portugal, Leiria, Leiria","Artigo 26.º, n.º 1, alínea a) do Código dos Contratos Públicos",31-12-2015,"1.080,00 €",,,,Não aplicável.,Não aplicável.,FALSE
Reagentes para a Unidade Laboratorial de Pombal,Ajuste Direto Regime Geral,Aquisição de bens móveis,"33696500-0, Reagentes de laboratório","Centro Hospitalar de Leiria, E. P. E. (509822932)","WERFEN PORTUGAL, LDA (501086110)","11.194,50 €",24-05-2016,01-01-2015,365 dias,"Portugal, Leiria, Leiria","Artigo 26.º, n.º 1, alínea a) do Código dos Contratos Públicos",31-12-2015,"11.194,50 €",,,,Não aplicável.,Não aplicável.,FALSE
Reagentes para Hematologia,Ajuste Direto Regime Geral,Aquisição de bens móveis,"33696500-0, Reagentes de laboratório","Centro Hospitalar de Leiria, E. P. E. (509822932)","BECKMAN COULTER PORTUGAL UNIPESSOAL,LDA. (509035167)","14.756,15 €",24-05-2016,01-01-2015,365 dias,"Portugal, Leiria, Leiria","Artigo 26.º, n.º 1, alínea a) do Código dos Contratos Públicos",31-12-2015,"14.756,15 €",,,,Não aplicável.,Não aplicável.,FALSE
BATERIAS PARA UPS,Ajuste Direto Regime Geral,Aquisição de bens móveis,"31440000-2, Baterias","Centro Hospitalar de Leiria, E. P. E. (509822932)",LEIRISTÁVEL (503573906),"8.429,01 €",24-05-2016,23-05-2016,60 dias,"Portugal, Leiria, Leiria","Artigo 20.º, n.º 1, alínea a) do Código dos Contratos Públicos",24-05-2016,"8.429,01 €",,,,Não aplicável.,Não aplicável.,FALSE
BATERIAS PARA UPS,Ajuste Direto Regime Geral,Aquisição de bens móveis,"31440000-2, Baterias","Centro Hospitalar de Leiria, E. P. E. (509822932)",LEIRISTÁVEL (503573906),"0,00 €",24-05-2016,23-05-2016,60 dias,"Portugal, Leiria, Leiria","Artigo 20.º, n.º 1, alínea a) do Código dos Contratos Públicos","","",,,,Não aplicável.,Não aplicável.,FALSE
0369E15- EMOLUMENTOS TRIBUNAL DE CONTAS,Ajuste Direto Regime Geral,Aquisição de serviços,"75230000-7, Serviços relacionados com a justiça","Centro Hospitalar de Leiria, E. P. E. (509822932)",TRIBUNAL CONTAS (600018709),"6.098,58 €",24-05-2016,09-10-2015,1 dias,"Portugal, Leiria, Leiria","Artigo 20.º, n.º 1, alínea a) do Código dos Contratos Públicos",14-10-2015,"6.098,58 €",,,,Não aplicável.,Não aplicável.,FALSE
0344E15- PRESTAÇÃO SERVIÇOS MÉDICOS PNEUMOLOGIA . JUL. A DEZ.,Ajuste Direto Regime Geral,Aquisição de serviços,"85100000-0, Serviços de saúde","Centro Hospitalar de Leiria, E. P. E. (509822932)","MEDIPEOPLE- SOLUÇÕES SAUDE E EDUCAÇÃO, LDA (508543436)","17.550,00 €",24-05-2016,25-06-2015,180 dias,"Portugal, Leiria, Leiria","Artigo 20.º, n.º 1, alínea a) do Código dos Contratos Públicos",31-12-2015,"17.550,00 €",,,,Não aplicável.,Não aplicável.,FALSE
Substituição da Rede Core,Ajuste Direto Regime Geral,Aquisição de bens móveis,"30200000-1, Equipamento e material informático","Centro Hospitalar de Leiria, E. P. E. (509822932)","Syscrum, Lda (509656510)","55.896,48 €",23-05-2016,22-06-2015,60 dias,"Portugal, Leiria, Leiria","Artigo 20.º, n.º 1, alínea a) do Código dos Contratos Públicos",22-06-2015,"55.896,48 €",,,,Não aplicável.,Não aplicável.,FALSE
Aquisição de camas e mesas de cabeceira,Concurso público,Aquisição de bens móveis,"33192120-9, Camas de hospital","Centro Hospitalar de Leiria, E. P. E. (509822932)",IMO - Indústrias Metalúrgicas SA (500136939),"185.791,36 €",23-05-2016,09-03-2015,60 dias,"Portugal, Leiria, Leiria","Artigo 20.º, n.º 1, alínea b) do Código dos Contratos Públicos",09-03-2015,"185.791,36 €",,,,Não aplicável.,Não aplicável.,FALSE
Medicamento Exclusivo aflibercept - Bayer,Ajuste Direto Regime Geral,Aquisição de bens móveis,"33600000-6, Produtos farmacêuticos","Centro Hospitalar de Leiria, E. P. E. (509822932)","BAYER PORTUGAL, SA (500043256)","89.887,10 €",23-05-2016,24-09-2015,60 dias,"Portugal, Leiria, Leiria","Artigo 24.º, n.º 1, alínea e) do Código dos Contratos Públicos",27-11-2015,"89.887,10 €",,,,Não aplicável.,Não aplicável.,FALSE
Dexametasona 700 mcg implante intravítreo,Ajuste Direto Regime Geral,Aquisição de bens móveis,"33600000-6, Produtos farmacêuticos","Centro Hospitalar de Leiria, E. P. E. (509822932)","PROFARIN-DIST.PROD.FARMACEUTICOS, LDA (500223238)","24.700,00 €",23-05-2016,24-09-2015,60 dias,"Portugal, Leiria, Leiria","Artigo 24.º, n.º 1, alínea e) do Código dos Contratos Públicos",31-12-2015,"24.700,00 €",,,,Não aplicável.,Não aplicável.,FALSE
0419E15- INDEMNIZAÇÃO,Ajuste Direto Regime Geral,Aquisição de serviços,"85100000-0, Serviços de saúde","Centro Hospitalar de Leiria, E. P. E. (509822932)",MARCO AURÉLIO RAMOS FRANCISCO (224292242),"7.119,60 €",23-05-2016,04-12-2015,1 dias,"Portugal, Leiria, Leiria","Artigo 20.º, n.º 1, alínea a) do Código dos Contratos Públicos",04-12-2015,"7.119,60 €",,,,Não aplicável.,Não aplicável.,FALSE
0424E15- PRESTAÇÃO SERVIÇOS MÉDICOS MEDICINA INTERNA,Ajuste Direto Regime Geral,Aquisição de serviços,"85100000-0, Serviços de saúde","Centro Hospitalar de Leiria, E. P. E. (509822932)",INSIDEPURPLE (510275940),"93.320,75 €",23-05-2016,04-12-2015,120 dias,"Portugal, Leiria, Leiria","Artigo 24.º, n.º 1, alínea c) do Código dos Contratos Públicos",31-12-2015,"93.320,75 €",,,,Não aplicável.,Não aplicável.,FALSE
0025E15- SEGURO ACIDENTES TRABALHO CONTRATADOS - REGUL. ANO,Ajuste Direto Regime Geral,Aquisição de serviços,"66510000-8, Serviços de seguros","Centro Hospitalar de Leiria, E. P. E. (509822932)",ZURICH INSURANCE PLC (980420636),"4.344,62 €",23-05-2016,21-03-2016,365 dias,"Portugal, Leiria, Leiria","Artigo 20.º, n.º 1, alínea a) do Código dos Contratos Públicos",31-12-2015,"4.344,62 €",,,,Não aplicável.,Não aplicável.,FALSE
0025E15- SEGURO ACIDENTES TRABALHO CONTRATADOS - REGUL. 1.º SEM.,Ajuste Direto Regime Geral,Aquisição de serviços,"66510000-8, Serviços de seguros","Centro Hospitalar de Leiria, E. P. E. (509822932)",ZURICH INSURANCE PLC (980420636),"5.275,83 €",23-05-2016,18-09-2015,180 dias,"Portugal, Leiria, Leiria","Artigo 20.º, n.º 1, alínea a) do Código dos Contratos Públicos",30-06-2015,"5.275,83 €",,,,Não aplicável.,Não aplicável.,FALSE
0025E15- SEGURO ACIDENTES TRABALHO CONTRATADOS - 4.º TRIM.,Ajuste Direto Regime Geral,Aquisição de serviços,"66510000-8, Serviços de seguros","Centro Hospitalar de Leiria, E. P. E. (509822932)",ZURICH INSURANCE PLC (980420636),"7.704,53 €",23-05-2016,18-09-2015,90 dias,"Portugal, Leiria, Leiria","Artigo 20.º, n.º 1, alínea a) do Código dos Contratos Públicos",31-12-2015,"7.704,53 €",,,,Não aplicável.,Não aplicável.,FALSE
0025E15- SEGURO ACIDENTES TRABALHO CONTRATADOS - 3.º TRIM.,Ajuste Direto Regime Geral,Aquisição de serviços,"66510000-8, Serviços de seguros","Centro Hospitalar de Leiria, E. P. E. (509822932)",ZURICH INSURANCE PLC (980420636),"7.704,53 €",23-05-2016,07-07-2015,90 dias,"Portugal, Leiria, Leiria","Artigo 20.º, n.º 1, alínea a) do Código dos Contratos Públicos",30-09-2015,"7.704,53 €",,,,Não aplicável.,Não aplicável.,FALSE
0025E15- SEGURO ACIDENTES TRABALHO CONTRATADOS - 2.º TRIM.,Ajuste Direto Regime Geral,Aquisição de serviços,"66510000-8, Serviços de seguros","Centro Hospitalar de Leiria, E. P. E. (509822932)",ZURICH INSURANCE PLC (980420636),"7.704,53 €",23-05-2016,31-03-2015,90 dias,"Portugal, Leiria, Leiria","Artigo 20.º, n.º 1, alínea a) do Código dos Contratos Públicos",30-06-2015,"7.704,53 €",,,,Não aplicável.,Não aplicável.,FALSE
0025E15- SEGURO ACIDENTES TRABALHO CONTRATADOS - 1.º SEM.,Ajuste Direto Regime Geral,Aquisição de serviços,"66510000-8, Serviços de seguros","Centro Hospitalar de Leiria, E. P. E. (509822932)",ZURICH INSURANCE PLC (980420636),"7.681,97 €",23-05-2016,22-01-2015,90 dias,"Portugal, Leiria, Leiria","Artigo 20.º, n.º 1, alínea a) do Código dos Contratos Públicos",31-12-2015,"7.681,97 €",,,,Não aplicável.,Não aplicável.,FALSE
