Objeto do Contrato,Tipo de Procedimento,Tipo(s) de Contrato,CPVs,Entidade(s) Adjudicante(s),Entidade(s) Adjudicatária(s),Preço Contratual,Data de Publicação,Data de Celebração do Contrato,Prazo de Execução,Local de Execução,Fundamentação,Data de Fecho do Contrato,Preço Total Efetivo,Causas das Alterações ao Prazo,Causas das Alterações ao Preço,Estado,N.º registo do Acordo Quadro,Descrição do Acordo Quadro,Procedimento Centralizado
AD1227-2017 DUAS GAMAS SONDA,Ajuste Direto Regime Geral,Aquisição de bens móveis,"33100000-1, Equipamento médico","Instituto Português de Oncologia de Lisboa Francisco Gentil, E. P. E. (506361616)","CATETER PRODUTOS MÉDICOS HOSPITALARES, LDA (502914319)","28.480,00 €",11-10-2017,03-10-2017,30 dias,"Portugal, Lisboa, Lisboa","Artigo 20.º, n.º 1, alínea a) do Código dos Contratos Públicos",,,,,,Não aplicável.,Não aplicável.,FALSE
"AD2521-2017BLINATUMOMAB 38,5 MG INJ",Ajuste Direto Regime Geral,Aquisição de bens móveis,"33600000-6, Produtos farmacêuticos","Instituto Português de Oncologia de Lisboa FG, E.P.E. (506361616)","AMGEN BIO-FARMACEUTICA, LDA (502942959)","79.447,20 €",10-10-2017,25-09-2017,98 dias,"Portugal, Lisboa, Lisboa","Artigo 24.º, n.º 1, alínea e) do Código dos Contratos Públicos",,,,,,Não aplicável.,Não aplicável.,FALSE
AD2587-2017-PEMETREXEDO 500 E 1000 MG INJ,Ajuste Direto Regime Geral,Aquisição de bens móveis,"33600000-6, Produtos farmacêuticos","Instituto Português de Oncologia de Lisboa Francisco Gentil, E. P. E. (506361616)","TEVA PHARMA -PRODUTOS FARMACEUTICOS, LDA (507045491)","105.425,60 €",10-10-2017,25-09-2017,98 dias,"Portugal, Lisboa, Lisboa","Artigo 20.º, n.º 1, alínea a) do Código dos Contratos Públicos",,,,,,Não aplicável.,Não aplicável.,FALSE
AD2301-2017DARATUMUMAB 20 MG/INJ 20 ML,Ajuste Direto Regime Geral,Aquisição de bens móveis,"33600000-6, Produtos farmacêuticos","Instituto Português de Oncologia de Lisboa FG, E.P.E. (506361616)",JANSSEN-CILAG FARMACEUTICA LDA (500189412),"61.531,60 €",10-10-2017,25-09-2017,98 dias,"Portugal, Lisboa, Lisboa","Artigo 24.º, n.º 1, alínea e) do Código dos Contratos Públicos",,,,,,Não aplicável.,Não aplicável.,FALSE
AD2809-2017-KITS DE PERITONECTOMIA E DE PERFUSÃO DE MEMBROS,Ajuste Direto Regime Geral,Aquisição de bens móveis,"33141620-2, Kits médicos","Instituto Português de Oncologia de Lisboa FG, E.P.E. (506361616)","MERCÉ V. ELECTROMEDECINA, S.L. (B-96056023)","9.800,00 €",09-10-2017,06-10-2017,30 dias,"Portugal, Lisboa, Lisboa","Artigo 24.º, n.º 1, alínea e) do Código dos Contratos Públicos",,,,,,Não aplicável.,Não aplicável.,FALSE
AD2809-2017KITS PERITONECTOMIA E PERFUSÃO DE MEMBROS,Ajuste Direto Regime Geral,Aquisição de bens móveis,"33141624-0, Kits para perfusão","Instituto Português de Oncologia de Lisboa FG, E.P.E. (506361616)",MERCÉ V. ELECTROMEDICINA S.L. (B96056023),"9.800,00 €",06-10-2017,06-10-2017,30 dias,"Portugal, Lisboa, Lisboa","Artigo 24.º, n.º 1, alínea e) do Código dos Contratos Públicos",,,,,,Não aplicável.,Não aplicável.,FALSE
AD126-2017 DETERGENTES,Ajuste Direto Regime Geral,Aquisição de bens móveis,"39831200-8, Detergentes","Instituto Português de Oncologia de Lisboa Francisco Gentil, E. P. E. (506361616)",OLYMPUS IBERIA S.A.U. SUCURSAL EM PORTUGAL (980474710),"13.782,00 €",06-10-2017,19-04-2017,255 dias,"Portugal, Lisboa, Lisboa","Artigo 20.º, n.º 1, alínea a) do Código dos Contratos Públicos",,,,,,Não aplicável.,Não aplicável.,FALSE
AD689-2017CONTRATO DE ASSISTENCIA TÉCNICA,Ajuste Direto Regime Geral,Aquisição de serviços,"50400000-9, Serviços de reparação e manutenção de equipamento médico e de precisão","Instituto Português de Oncologia de Lisboa Francisco Gentil, E. P. E. (506361616)",PHILIPS PORTUGESA S.A. (500216843),"236.659,82 €",06-10-2017,28-08-2017,365 dias,"Portugal, Lisboa, Lisboa","Artigo 24.º, n.º 1, alínea e) do Código dos Contratos Públicos",,,,,,Não aplicável.,Não aplicável.,FALSE
"AQUISIÇÃO DE SERVIÇOS DE DIAGNÓSTICO E DEFINIÇÃO DE REQUISITOS DO REGISTO ONCOLÓGICO NACIONAL AO INSTITUTO PORTUGUÊS DE ONCOLOGIA DE LISBOA FRANCISCO GENTIL, EPE",Ajuste Direto Regime Geral,Aquisição de serviços,"72200000-7, Serviços de consultoria e de programação de software","Instituto Português de Oncologia de Lisboa FG, E.P.E. (506361616)","ITSECTOR-SISTEMAS DE INFORMAÇÃO, SA, (507291727)","34.900,00 €",04-10-2017,22-09-2017,90 dias,"Portugal, Lisboa, Lisboa","Artigo 24.º, n.º 1, alínea d) do Código dos Contratos Públicos",,,,,,Não aplicável.,Não aplicável.,FALSE
CRIAÇÃO DE WEBSITE E REABRANDING DA IMAGEM DO IPOLFG,Ajuste Direto Regime Geral,Aquisição de serviços,"72400000-4, Serviços de Internet","Instituto Português de Oncologia de Lisboa Francisco Gentil, E. P. E. (506361616)","MDC - Digital Culture, Lda (509624979)","22.500,00 €",04-10-2017,06-07-2017,90 dias,"Portugal, Lisboa, Lisboa","Artigo 20.º, n.º 1, alínea a) do Código dos Contratos Públicos",,,,,,Não aplicável.,Não aplicável.,FALSE
AD959-2017AQUISIÇÃO DE REAGENTES PARA DIVERSAS AREAS LABORATORIAIS,Ajuste Direto Regime Geral,Aquisição de bens móveis,"33696500-0, Reagentes de laboratório","Instituto Português de Oncologia de Lisboa Francisco Gentil, E. P. E. (506361616)","VWR INTERNATIONAL MATERIAL DE LABORATÓRIO, LDA (503842770)","39.390,20 €",04-10-2017,24-08-2017,148 dias,"Portugal, Lisboa, Lisboa","Artigo 20.º, n.º 1, alínea a) do Código dos Contratos Públicos",,,,,,Não aplicável.,Não aplicável.,FALSE
AD959-2017AQUISIÇÃO DE REAGENTES PARA DIVERSAS AREAS LABORATORIAIS,Ajuste Direto Regime Geral,Aquisição de bens móveis,"33696500-0, Reagentes de laboratório","Instituto Português de Oncologia de Lisboa Francisco Gentil, E. P. E. (506361616)","JOSÉ MANUEL GOMES DOS SANTOS, LDA (501399224)","23.721,10 €",04-10-2017,22-08-2017,131 dias,"Portugal, Lisboa, Lisboa","Artigo 20.º, n.º 1, alínea a) do Código dos Contratos Públicos",,,,,,Não aplicável.,Não aplicável.,FALSE
AD1812-2017FORNECIMENTO DE REAGENTES EXCLUSIVOS PARA OS LAB. DE PATABIOLOGIA MOLECULAR E VIROLOGIA,Ajuste Direto Regime Geral,Aquisição de bens móveis,"33696500-0, Reagentes de laboratório","Instituto Português de Oncologia de Lisboa Francisco Gentil, E. P. E. (506361616)","ALFAGENE- NOVA TECNOLOGIAS DAS CÊNCIAS DA VIDA, LDA (503387398)","221.560,87 €",04-10-2017,10-08-2017,142 dias,"Portugal, Lisboa, Lisboa","Artigo 24.º, n.º 1, alínea e) do Código dos Contratos Públicos",,,,,,Não aplicável.,Não aplicável.,FALSE
AD2558-2017FORNECIMENTO DE MEDICAMENTO EXCLUSIVO,Ajuste Direto Regime Geral,Aquisição de bens móveis,"33600000-6, Produtos farmacêuticos","Instituto Português de Oncologia de Lisboa FG, E.P.E. (506361616)",MERCK SHARP & DOHME LDA (500191360),"22.925,00 €",04-10-2017,22-09-2017,100 dias,"Portugal, Lisboa, Lisboa","Artigo 24.º, n.º 1, alínea e) do Código dos Contratos Públicos",,,,,,Não aplicável.,Não aplicável.,FALSE
AD1324-2017 MEDICAMENTOS DE NUTRIÇÃO,Ajuste Direto Regime Geral,Aquisição de bens móveis,"33600000-6, Produtos farmacêuticos","Instituto Português de Oncologia de Lisboa Francisco Gentil, E. P. E. (506361616)",FRESENIUS KABI PHARMA PORTUGAL (504293753),"32.275,10 €",02-10-2017,12-09-2017,110 dias,"Portugal, Lisboa, Lisboa","Artigo 20.º, n.º 1, alínea a) do Código dos Contratos Públicos",,,,,,Não aplicável.,Não aplicável.,FALSE
