Objeto do Contrato,Tipo de Procedimento,Tipo(s) de Contrato,CPVs,Entidade(s) Adjudicante(s),Entidade(s) Adjudicatária(s),Preço Contratual,Data de Publicação,Data de Celebração do Contrato,Prazo de Execução,Local de Execução,Fundamentação,Data de Fecho do Contrato,Preço Total Efetivo,Causas das Alterações ao Prazo,Causas das Alterações ao Preço,Estado,N.º registo do Acordo Quadro,Descrição do Acordo Quadro,Procedimento Centralizado
Prestação de serviço de fornecimento de consumíveis de higiene na Região Norte,Ajuste Direto Regime Geral,Aquisição de serviços,"90000000-7, Serviços relativos a águas residuais, resíduos, limpeza e ambiente","Instituto Nacional de Emergência Médica, I. P. (501356126)","SERVISAN - Produtos de Higiene, S.A. (500246530)","0,00 €",11-03-2016,11-03-2016,122 dias,"Portugal, Porto, Vila Nova de Gaia<BR/>Portugal, Porto, Porto","Artigo 27.º, n.º 1, alínea h) do Código dos Contratos Públicos","","",,"",,2012182,Prestação de serviço de fornecimento de consumíveis de higiene na Região Norte,FALSE
Aquisição de Combustível Rodoviário em Postos Públicos para Portugal Continental Lote 2,Ajuste Direto Regime Geral,Aquisição de serviços,"76000000-3, Serviços relacionados com as indústrias do gás e do petróleo","Instituto Nacional de Emergência Médica, I. P. (501356126)","PETRÓLEOS DE PORTUGAL - Petrogal , S.A. (500697370)","0,00 €",09-03-2016,01-03-2016,31 dias,"Portugal, Portugal Continental","Artigo 27.º, n.º 1, alínea h) do Código dos Contratos Públicos","","",,"",,2008129,Aquisição de Combustível Rodoviário em Postos Públicos para Portugal Continental Lote 2,FALSE
Aquisição de Gas Natural para o CHPL Ano 2015-(UMC-SG),Concurso público,Aquisição de bens móveis,"09123000-7, Gás natural","Unidade Local de Saúde de Castelo Branco, E. P. E. (509309844), Centro Hospitalar Cova da Beira, E. P. E. (506361659), SUCH - Serviço de Utilização Comum dos Hospitais (500900469), Administração Regional de Saúde do Centro, I. P. (503122165), Centro Hospitalar de Lisboa Central, E. P. E. (508080142), Centro Hospitalar Psiquiátrico de Lisboa (508338476), Instituto Nacional de Saúde Dr. Ricardo Jorge, I. P. (501427511), Centro Hospitalar do Baixo Vouga, E. P. E (CHBV, E. P. E.) (510123210), Centro Hospitalar do Médio Ave, E. P. E. (508093937), Instituto Português de Oncologia de Coimbra Francisco Gentil, E. P. E. (506361438), Centro Hospitalar Vila Nova de Gaia - Espinho, E. P. E. (508142156), Hospital Santa Maria Maior, E. P. E. (506361381), Hospital Dr. Francisco Zagalo (501510150), Hospital de Magalhães Lemos, E. P. E. (502828790), Centro Hospitalar de Leiria, E. P. E. (509822932), Instituto Português de Oncologia de Lisboa Francisco Gentil, E. P. E. (506361616), Centro Hospitalar Porto, E. P. E. (508331471), Centro Hospitalar de Lisboa Ocidental, E. P. E. (507618319), Centro Hospitalar Lisboa Norte, E. P. E. (508481287), Hospital Garcia de Orta, E. P. E. (506361470), Secretaria-Geral do Ministério da Saúde (600080684), Centro Hospitalar do Algarve, E. P. E. (510745997), Centro Hospitalar de Entre o Douro e Vouga, E.P.E. (508878462), Serviço de Intervenção nos Comportamentos Aditivos e nas Dependências (600084884), Centro Hospitalar do Alto Ave, E. P. E. (508080827), Hospital Arcebispo João Crisóstomo (501626123), Instituto Português de Oncologia do Porto Francisco Gentil, E. P. E. (506362299), Centro Hospitalar Tondela-Viseu, E. P. E. (509822940), Unidade Local de Saúde do Nordeste, E. P. E (509932584), Administração Regional de Saúde do Norte, I. P. (503135593), Administração Regional de Saúde de Lisboa e Vale do Tejo, I. P. (503148776), Instituto Nacional de Emergência Médica, I. P. (501356126), Centro Hospitalar do Tâmega e Sousa, E. P. E. (508318262), Hospital de José Luciano de Castro (501613021), Hospital Distrital de Santarém, E. P. E. (506361462), Centro Hospitalar Póvoa de Varzim - Vila do Conde, E. P. E. (508741823), Centro Hospitalar de Setúbal, E. P. E. (507606787), Direcção-Geral da Saúde (600037100), Unidade Local de Saúde do Alto Minho, E. P. E. (508786193), Instituto de Oftalmologia Dr. Gama Pinto (600000052), Instituto Português do Sangue e da Transplantação, I. P. (502423943), Centro Hospitalar e Universitário de Coimbra, E. P. E. (510103448), Centro Hospitalar de Trás-os-Montes e Alto Douro, E. P. E. (508100496), Unidade Local de Saúde da Guarda, E. P. E. (508752000), Centro Hospitalar do Oeste (510412009), Centro Hospitalar de São João, E. P. E. (509821197), Centro Hospitalar Barreiro Montijo, E. P. E. (509186998), Hospital do Espírito Santo de Évora, E. P. E. (508085888), Centro Hospitalar do Médio Tejo, E. P. E. (506361608)","EDP Comercial, S.A (503504564)","579.733,88 €",07-03-2016,30-01-2015,365 dias,"Portugal, Lisboa, Lisboa",Artigo 259.º do Código dos Contratos Públicos,31-12-2015,"525.715,02 €",,Valor corresponde ao Faturado (inferior ao estimado),,Não aplicável.,Não aplicável.,TRUE
"Prestação de serviços de higiene e limpeza consumíveis de casa de banho para todo o Território Nacional, ao abrigo do Lote 24 do Acordo Quadro.",Ajuste Direto Regime Geral,Aquisição de serviços,"90000000-7, Serviços relativos a águas residuais, resíduos, limpeza e ambiente","Instituto Nacional de Emergência Médica, I. P. (501356126)","INTERLIMPE - Facility Services, S.A. (502611057)","0,00 €",07-03-2016,01-03-2016,306 dias,"Portugal, Coimbra, Coimbra<BR/>Portugal, Faro, Loulé<BR/>Portugal, Porto, Vila Nova de Gaia<BR/>Portugal, Porto, Porto<BR/>Portugal, Lisboa, Lisboa",Artigo 258.º do Código dos Contratos Públicos,"","",,"",,2001617,"Prestação de serviços de higiene e limpeza consumíveis de casa de banho para todo o Território Nacional, ao abrigo do Lote 24 do Acordo Quadro.  ",FALSE
Fornecimento de gás natural,Ajuste Direto Regime Geral,Aquisição de serviços,"76000000-3, Serviços relacionados com as indústrias do gás e do petróleo","Instituto Nacional de Emergência Médica, I. P. (501356126)","EDP COMERCIAL, S.A. (503504564)","813,00 €",04-03-2016,04-03-2016,62 dias,"Portugal, Lisboa, Lisboa","Artigo 24.º, n.º 1, alínea c) do Código dos Contratos Públicos","","",,"",,Não aplicável.,Não aplicável.,FALSE
Aquisição de serviços de higiene e limpeza a nível nacional,Ajuste Direto Regime Geral,Aquisição de serviços,"90000000-7, Serviços relativos a águas residuais, resíduos, limpeza e ambiente","Instituto Nacional de Emergência Médica, I. P. (501356126)","INTERLIMPE - Facility Services, S.A. (502611057)","39.246,18 €",02-03-2016,15-02-2016,60 dias,"Portugal, Porto, Porto<BR/>Portugal, Lisboa, Lisboa<BR/>Portugal, Porto, Vila Nova de Gaia<BR/>Portugal, Coimbra, Coimbra","Artigo 24.º, n.º 1, alínea c) do Código dos Contratos Públicos","","",,"",,Não aplicável.,Não aplicável.,FALSE
Caixas de transporte de dispositivos médicos,Ajuste Direto Regime Geral,Aquisição de bens móveis,"34900000-6, Equipamento e peças sobressalentes diversas para transportes","Instituto Nacional de Emergência Médica, I. P. (501356126)","Manutan Unipessoal, Lda (504779079)","7.083,75 €",02-03-2016,23-12-2015,1 dias,"Portugal, Lisboa, Lisboa","Artigo 20.º, n.º 1, alínea a) do Código dos Contratos Públicos","","",,"",,Não aplicável.,Não aplicável.,FALSE
