Objeto do Contrato,Tipo de Procedimento,Tipo(s) de Contrato,CPVs,Entidade(s) Adjudicante(s),Entidade(s) Adjudicatária(s),Preço Contratual,Data de Publicação,Data de Celebração do Contrato,Prazo de Execução,Local de Execução,Fundamentação,Data de Fecho do Contrato,Preço Total Efetivo,Causas das Alterações ao Prazo,Causas das Alterações ao Preço,Estado,N.º registo do Acordo Quadro,Descrição do Acordo Quadro,Procedimento Centralizado
Processo n.º 14800932. ACES Pinhal Litoral. Empreitada para criação de infraestrutura elétrica da sala informática e sala dos bastidores,Ajuste Direto Regime Geral,Empreitadas de obras públicas,"45310000-3, Obras de instalação eléctrica","Administração Regional de Saúde do Centro, IP (503122165)","Lâmpada de Cores - Instalações Elétricas e Obras Públicas, Lda (509231608)","7.432,00 €",20-03-2015,18-02-2015,15 dias,"Portugal, Leiria, Leiria","Artigo 19.º, alínea a) do Código dos Contratos Públicos",,,,,,Não aplicável.,Não aplicável.,FALSE
Processo n.º 14700989. ACES PIN - Centro de Saúde de Penela. Aquisição e Mntagem de UPS Monofásica de 8kVA.,Ajuste Direto Regime Geral,Aquisição de bens móveis,"31000000-6, Maquinaria, aparelhagem, equipamento e consumíveis eléctricos; iluminação","ADMINISTRAÇÃO REGIONAL DE SAÚDE DO CENTRO, I. P. (503122165)",Lâmpada de Cores (509231608),"2.660,00 €",18-03-2015,04-03-2015,15 dias,"Portugal, Coimbra, Penela","Artigo 20.º, n.º 1, alínea a) do Código dos Contratos Públicos",,,,,,Não aplicável.,Não aplicável.,FALSE
