Objeto do Contrato,Tipo de Procedimento,Tipo(s) de Contrato,CPVs,Entidade(s) Adjudicante(s),Entidade(s) Adjudicatária(s),Preço Contratual,Data de Publicação,Data de Celebração do Contrato,Prazo de Execução,Local de Execução,Fundamentação,Data de Fecho do Contrato,Preço Total Efetivo,Causas das Alterações ao Prazo,Causas das Alterações ao Preço,Estado,N.º registo do Acordo Quadro,Descrição do Acordo Quadro,Procedimento Centralizado
Aquisição de acessórios de carga para equipamentos de esterilização,Ajuste Direto Regime Geral,Aquisição de bens móveis,"33191110-9, Autoclaves","Instituto Nacional de Saúde Doutor Ricardo Jorge, I. P. (501427511)",A.J.Costa Irmãos (500002576),"18.980,00 €",01-12-2015,03-11-2015,60 dias,"Portugal, Lisboa, Lisboa","Artigo 24.º, n.º 1, alínea e) do Código dos Contratos Públicos",,,,,,Não aplicável.,Não aplicável.,FALSE
Aquisição de material de consumo de filtração/extração,Concurso público,Aquisição de bens móveis,"33100000-1, Equipamento médico","Instituto Nacional de Saúde Doutor Ricardo Jorge, I. P. (501427511)","Type Solution, SA (508400317)","1.076,25 €",27-11-2015,25-09-2015,167 dias,"Portugal, Lisboa, Lisboa","Artigo 20.º, n.º 1, alínea b) do Código dos Contratos Públicos",,,,,,Não aplicável.,Não aplicável.,FALSE
Aquisição de material de consumo de filtração/extração,Concurso público,Aquisição de bens móveis,"33100000-1, Equipamento médico","Instituto Nacional de Saúde Doutor Ricardo Jorge, I. P. (501427511)","Frilabo II, Lda (507958861)","5.368,65 €",27-11-2015,25-09-2015,167 dias,"Portugal, Lisboa, Lisboa","Artigo 20.º, n.º 1, alínea b) do Código dos Contratos Públicos",,,,,,Não aplicável.,Não aplicável.,FALSE
Aquisição de material de consumo de filtração/extração,Concurso público,Aquisição de bens móveis,"33100000-1, Equipamento médico","Instituto Nacional de Saúde Doutor Ricardo Jorge, I. P. (501427511)",Sarstedt (503019461),"584,00 €",27-11-2015,25-09-2015,167 dias,"Portugal, Lisboa, Lisboa","Artigo 20.º, n.º 1, alínea b) do Código dos Contratos Públicos",,,,,,Não aplicável.,Não aplicável.,FALSE
Aquisição de material de consumo de filtração/extração,Concurso público,Aquisição de bens móveis,"33100000-1, Equipamento médico","Instituto Nacional de Saúde Doutor Ricardo Jorge, I. P. (501427511)",PVL - Produtos para Laboratório Lda (501411852),"560,00 €",27-11-2015,25-09-2015,167 dias,"Portugal, Lisboa, Lisboa","Artigo 20.º, n.º 1, alínea b) do Código dos Contratos Públicos",,,,,,Não aplicável.,Não aplicável.,FALSE
Aquisição de material de consumo de filtração/extração,Concurso público,Aquisição de bens móveis,"33100000-1, Equipamento médico","Instituto Nacional de Saúde Doutor Ricardo Jorge, I. P. (501427511)",VWR International (503842770),"534,97 €",27-11-2015,25-09-2015,167 dias,"Portugal, Lisboa, Lisboa","Artigo 20.º, n.º 1, alínea b) do Código dos Contratos Públicos",,,,,,Não aplicável.,Não aplicável.,FALSE
Aquisição de material de consumo de filtração/extração,Concurso público,Aquisição de bens móveis,"33100000-1, Equipamento médico","Instituto Nacional de Saúde Doutor Ricardo Jorge, I. P. (501427511)",Normax (500203130),"2.365,42 €",27-11-2015,25-09-2015,167 dias,"Portugal, Lisboa, Lisboa","Artigo 20.º, n.º 1, alínea b) do Código dos Contratos Públicos",,,,,,Não aplicável.,Não aplicável.,FALSE
Aquisição de material de consumo de filtração/extração,Concurso público,Aquisição de bens móveis,"33100000-1, Equipamento médico","Instituto Nacional de Saúde Doutor Ricardo Jorge, I. P. (501427511)",Anastácio Saldanha (505804441),"29,00 €",27-11-2015,25-09-2015,167 dias,"Portugal, Lisboa, Lisboa","Artigo 20.º, n.º 1, alínea b) do Código dos Contratos Públicos",,,,,,Não aplicável.,Não aplicável.,FALSE
Aquisição de acessórios de equipamentos para consumo nos laboratórios do INSA,Concurso público,Aquisição de bens móveis,"31230000-7, Peças para aparelhos de controlo ou distribuição de electricidade","Instituto Nacional de Saúde Doutor Ricardo Jorge, I. P. (501427511)","VWR Internacional, Lda (503842770)","2.201,77 €",27-11-2015,26-11-2015,90 dias,"Portugal, Lisboa, Lisboa<BR/>Portugal, Porto, Porto<BR/>Portugal, Setúbal, Setúbal","Artigo 20.º, n.º 1, alínea b) do Código dos Contratos Públicos",,,,,,Não aplicável.,Não aplicável.,FALSE
Aquisição de material de consumo de filtração/extração,Concurso público,Aquisição de bens móveis,"33100000-1, Equipamento médico","Instituto Nacional de Saúde Doutor Ricardo Jorge, I. P. (501427511)",Ambicontrol (502715464),"240,00 €",27-11-2015,25-09-2015,167 dias,"Portugal, Lisboa, Lisboa","Artigo 20.º, n.º 1, alínea b) do Código dos Contratos Públicos",,,,,,Não aplicável.,Não aplicável.,FALSE
Aquisição de acessórios de equipamentos para consumo nos laboratórios do INSA,Concurso público,Aquisição de bens móveis,"31230000-7, Peças para aparelhos de controlo ou distribuição de electricidade","Instituto Nacional de Saúde Doutor Ricardo Jorge, I. P. (501427511)","Tecnilab Portugal, Lda (500758158)","705,76 €",27-11-2015,26-11-2015,90 dias,"Portugal, Lisboa, Lisboa<BR/>Portugal, Setúbal, Setúbal<BR/>Portugal, Porto, Porto","Artigo 20.º, n.º 1, alínea b) do Código dos Contratos Públicos",,,,,,Não aplicável.,Não aplicável.,FALSE
Aquisição de acessórios de equipamentos para consumo nos laboratórios do INSA,Concurso público,Aquisição de bens móveis,"31230000-7, Peças para aparelhos de controlo ou distribuição de electricidade","Instituto Nacional de Saúde Doutor Ricardo Jorge, I. P. (501427511)","ILC - Instrumentos de Laboratório e Cientifico, Lda (500948208)","643,00 €",27-11-2015,26-11-2015,90 dias,"Portugal, Lisboa, Lisboa<BR/>Portugal, Setúbal, Setúbal<BR/>Portugal, Porto, Porto","Artigo 20.º, n.º 1, alínea b) do Código dos Contratos Públicos",,,,,,Não aplicável.,Não aplicável.,FALSE
Aquisição de acessórios de equipamentos para consumo nos laboratórios do INSA,Concurso público,Aquisição de bens móveis,"31230000-7, Peças para aparelhos de controlo ou distribuição de electricidade","Instituto Nacional de Saúde Doutor Ricardo Jorge, I. P. (501427511)","IZASA II Scientific, Lda (513252088)","522,32 €",27-11-2015,26-11-2015,90 dias,"Portugal, Setúbal, Setúbal<BR/>Portugal, Porto, Porto<BR/>Portugal, Lisboa, Lisboa","Artigo 20.º, n.º 1, alínea b) do Código dos Contratos Públicos",,,,,,Não aplicável.,Não aplicável.,FALSE
Aquisição de acessórios de equipamentos para consumo nos laboratórios do INSA,Concurso público,Aquisição de bens móveis,"31230000-7, Peças para aparelhos de controlo ou distribuição de electricidade","Instituto Nacional de Saúde Doutor Ricardo Jorge, I. P. (501427511)","Ambifood, Lda (505400057)","145,00 €",27-11-2015,26-11-2015,90 dias,"Portugal, Porto, Porto<BR/>Portugal, Lisboa, Lisboa<BR/>Portugal, Setúbal, Setúbal","Artigo 20.º, n.º 1, alínea b) do Código dos Contratos Públicos",,,,,,Não aplicável.,Não aplicável.,FALSE
Aquisição de acessórios de equipamentos para consumo nos laboratórios do INSA,Concurso público,Aquisição de bens móveis,"31230000-7, Peças para aparelhos de controlo ou distribuição de electricidade","Instituto Nacional de Saúde Doutor Ricardo Jorge, I. P. (501427511)","Ambergo - Estudos e Equipamentos de Controlo Ambiental, Lda (503741353)","2.970,00 €",27-11-2015,26-11-2015,90 dias,"Portugal, Porto, Porto<BR/>Portugal, Setúbal, Setúbal<BR/>Portugal, Lisboa, Lisboa","Artigo 20.º, n.º 1, alínea b) do Código dos Contratos Públicos",,,,,,Não aplicável.,Não aplicável.,FALSE
Aquisição de acessórios de equipamentos para consumo nos laboratórios do INSA,Concurso público,Aquisição de bens móveis,"31230000-7, Peças para aparelhos de controlo ou distribuição de electricidade","Instituto Nacional de Saúde Doutor Ricardo Jorge, I. P. (501427511)","SOLITICA - Soluções Analíticas, Lda (510824641)","295,00 €",27-11-2015,26-11-2015,90 dias,"Portugal, Lisboa, Lisboa<BR/>Portugal, Porto, Porto<BR/>Portugal, Setúbal, Setúbal","Artigo 20.º, n.º 1, alínea b) do Código dos Contratos Públicos",,,,,,Não aplicável.,Não aplicável.,FALSE
Aquisição de acessórios de equipamentos para consumo nos laboratórios do INSA,Concurso público,Aquisição de bens móveis,"31230000-7, Peças para aparelhos de controlo ou distribuição de electricidade","Instituto Nacional de Saúde Doutor Ricardo Jorge, I. P. (501427511)","UNICAM - Sistemas Analíticos, Lda (502614625)","6.461,50 €",27-11-2015,26-11-2015,90 dias,"Portugal, Setúbal, Setúbal<BR/>Portugal, Porto, Porto<BR/>Portugal, Lisboa, Lisboa","Artigo 20.º, n.º 1, alínea b) do Código dos Contratos Públicos",,,,,,Não aplicável.,Não aplicável.,FALSE
Aquisição de acessórios de equipamentos para consumo nos laboratórios do INSA,Concurso público,Aquisição de bens móveis,"31230000-7, Peças para aparelhos de controlo ou distribuição de electricidade","Instituto Nacional de Saúde Doutor Ricardo Jorge, I. P. (501427511)","Via Athena - Gestão de Laboratórios, Lda (502272570)","1.362,00 €",27-11-2015,26-11-2015,90 dias,"Portugal, Porto, Porto<BR/>Portugal, Lisboa, Lisboa<BR/>Portugal, Setúbal, Setúbal","Artigo 20.º, n.º 1, alínea b) do Código dos Contratos Públicos",,,,,,Não aplicável.,Não aplicável.,FALSE
Aquisição de produtos de cultura de tecidos e de padrões,Concurso público,Aquisição de bens móveis,"33696500-0, Reagentes de laboratório","Instituto Nacional de Saúde Dr. Ricardo Jorge, I. P. (501427511)",CSP Saúde (508440246),"600,00 €",27-11-2015,21-05-2015,328 dias,"Portugal, Lisboa, Lisboa","Artigo 20.º, n.º 1, alínea b) do Código dos Contratos Públicos",,,,,,Não aplicável.,Não aplicável.,FALSE
Aquisição de produtos de cultura de tecidos e de padrões,Concurso público,Aquisição de bens móveis,"33696500-0, Reagentes de laboratório","Instituto Nacional de Saúde Dr. Ricardo Jorge, I. P. (501427511)",Laborspirit (507485149),"90,00 €",27-11-2015,21-05-2015,328 dias,"Portugal, Lisboa, Lisboa","Artigo 20.º, n.º 1, alínea b) do Código dos Contratos Públicos",,,,,,Não aplicável.,Não aplicável.,FALSE
Aquisição de produtos de cultura de tecidos e de padrões,Concurso público,Aquisição de bens móveis,"33696500-0, Reagentes de laboratório","Instituto Nacional de Saúde Dr. Ricardo Jorge, I. P. (501427511)",Zmway Lda (508085349),"2.083,57 €",27-11-2015,21-05-2015,328 dias,"Portugal, Lisboa, Lisboa","Artigo 20.º, n.º 1, alínea b) do Código dos Contratos Públicos",,,,,,Não aplicável.,Não aplicável.,FALSE
Aquisição de produtos de cultura de tecidos e de padrões,Concurso público,Aquisição de bens móveis,"33696500-0, Reagentes de laboratório","Instituto Nacional de Saúde Dr. Ricardo Jorge, I. P. (501427511)",VWR International (503842770),"993,70 €",27-11-2015,21-05-2015,328 dias,"Portugal, Lisboa, Lisboa","Artigo 20.º, n.º 1, alínea b) do Código dos Contratos Públicos",,,,,,Não aplicável.,Não aplicável.,FALSE
Aquisição de produtos de cultura de tecidos e de padrões,Concurso público,Aquisição de bens móveis,"33696500-0, Reagentes de laboratório","Instituto Nacional de Saúde Dr. Ricardo Jorge, I. P. (501427511)",Normax (500203130),"150,00 €",27-11-2015,21-05-2015,328 dias,"Portugal, Lisboa, Lisboa","Artigo 20.º, n.º 1, alínea b) do Código dos Contratos Públicos",,,,,,Não aplicável.,Não aplicável.,FALSE
Aquisição de produtos de cultura de tecidos e de padrões,Concurso público,Aquisição de bens móveis,"33696500-0, Reagentes de laboratório","Instituto Nacional de Saúde Dr. Ricardo Jorge, I. P. (501427511)",Soquímica (500274231),"470,40 €",27-11-2015,21-05-2015,328 dias,"Portugal, Lisboa, Lisboa","Artigo 20.º, n.º 1, alínea b) do Código dos Contratos Públicos",,,,,,Não aplicável.,Não aplicável.,FALSE
Aquisição de produtos de cultura de tecidos e de padrões,Concurso público,Aquisição de bens móveis,"33696500-0, Reagentes de laboratório","Instituto Nacional de Saúde Dr. Ricardo Jorge, I. P. (501427511)",Sigma Aldrich Química Lda (980148820),"1.171,50 €",27-11-2015,21-05-2015,328 dias,"Portugal, Lisboa, Lisboa","Artigo 20.º, n.º 1, alínea b) do Código dos Contratos Públicos",,,,,,Não aplicável.,Não aplicável.,FALSE
Aquisição de produtos de cultura de tecidos e de padrões,Concurso público,Aquisição de bens móveis,"33696500-0, Reagentes de laboratório","Instituto Nacional de Saúde Dr. Ricardo Jorge, I. P. (501427511)",Alfagene (503387398),"119.934,05 €",27-11-2015,21-05-2015,328 dias,"Portugal, Lisboa, Lisboa","Artigo 20.º, n.º 1, alínea b) do Código dos Contratos Públicos",,,,,,Não aplicável.,Não aplicável.,FALSE
Aquisição de reagentes de biologia molecular para o sequenciador de nova geração,Concurso público,Aquisição de bens móveis,"33696500-0, Reagentes de laboratório","Instituto Nacional de Saúde Dr. Ricardo Jorge, I. P. (501427511)",Soquímica (500274231),"17.310,00 €",27-11-2015,26-06-2015,254 dias,"Portugal, Lisboa, Lisboa","Artigo 20.º, n.º 1, alínea b) do Código dos Contratos Públicos",,,,,,Não aplicável.,Não aplicável.,FALSE
Aquisição de reagentes de biologia molecular para o sequenciador de nova geraçação,Concurso público,Aquisição de bens móveis,"33696500-0, Reagentes de laboratório","Instituto Nacional de Saúde Dr. Ricardo Jorge, I. P. (501427511)",ILC - Instrumentos de Laboiratório e Científicos Lda (500948208),"99.110,00 €",27-11-2015,26-06-2015,254 dias,"Portugal, Lisboa, Lisboa","Artigo 20.º, n.º 1, alínea b) do Código dos Contratos Públicos",,,,,,Não aplicável.,Não aplicável.,FALSE
Aquisição de reagentes para a área das doenças crónicaas e genéticas,Concurso público,Aquisição de bens móveis,"33696500-0, Reagentes de laboratório","Instituto Nacional de Saúde Dr. Ricardo Jorge, I. P. (501427511)",Baptista Marques (501439110),"1.791,00 €",27-11-2015,22-05-2015,281 dias,"Portugal, Lisboa, Lisboa","Artigo 20.º, n.º 1, alínea b) do Código dos Contratos Públicos",,,,,,Não aplicável.,Não aplicável.,FALSE
Aquisição de reagentes para a área das doenças crónicaas e genéticas,Concurso público,Aquisição de bens móveis,"33696500-0, Reagentes de laboratório","Instituto Nacional de Saúde Dr. Ricardo Jorge, I. P. (501427511)",Bio-Rad Laboratories (501301321),"5.955,95 €",27-11-2015,22-05-2015,281 dias,"Portugal, Lisboa, Lisboa","Artigo 20.º, n.º 1, alínea b) do Código dos Contratos Públicos",,,,,,Não aplicável.,Não aplicável.,FALSE
Aquisição de reagentes para a área das doenças crónicaas e genéticas,Concurso público,Aquisição de bens móveis,"33696500-0, Reagentes de laboratório","Instituto Nacional de Saúde Dr. Ricardo Jorge, I. P. (501427511)",Phadia Sociedade Unipessoal Lda (506916243),"7.050,43 €",27-11-2015,22-05-2015,281 dias,"Portugal, Lisboa, Lisboa","Artigo 20.º, n.º 1, alínea b) do Código dos Contratos Públicos",,,,,,Não aplicável.,Não aplicável.,FALSE
Aquisição de reagentes para a área das doenças crónicaas e genéticas,Concurso público,Aquisição de bens móveis,"33696500-0, Reagentes de laboratório","Instituto Nacional de Saúde Dr. Ricardo Jorge, I. P. (501427511)",Stago Portugal (509952976),"2.966,94 €",27-11-2015,22-05-2015,281 dias,"Portugal, Lisboa, Lisboa","Artigo 20.º, n.º 1, alínea b) do Código dos Contratos Públicos",,,,,,Não aplicável.,Não aplicável.,FALSE
Aquisição de reagentes para a área das doenças crónicaas e genéticas,Concurso público,Aquisição de bens móveis,"33696500-0, Reagentes de laboratório","Instituto Nacional de Saúde Dr. Ricardo Jorge, I. P. (501427511)",Roche Sistemas Diagnóstico Lda (504282921),"2.800,00 €",27-11-2015,22-05-2015,281 dias,"Portugal, Lisboa, Lisboa","Artigo 20.º, n.º 1, alínea b) do Código dos Contratos Públicos",,,,,,Não aplicável.,Não aplicável.,FALSE
Aquisição de reagentes para a área das doenças crónicaas e genéticas,Concurso público,Aquisição de bens móveis,"33696500-0, Reagentes de laboratório","Instituto Nacional de Saúde Dr. Ricardo Jorge, I. P. (501427511)",Irlandox (502515619),"10.440,80 €",27-11-2015,22-05-2015,281 dias,"Portugal, Lisboa, Lisboa","Artigo 20.º, n.º 1, alínea b) do Código dos Contratos Públicos",,,,,,Não aplicável.,Não aplicável.,FALSE
Aquisição de reagentes para a área das doenças crónicas e genéticas,Concurso público,Aquisição de bens móveis,"33696500-0, Reagentes de laboratório","Instituto Nacional de Saúde Dr. Ricardo Jorge, I. P. (501427511)",Enzifarma (503636975),"25.313,81 €",27-11-2015,22-05-2015,281 dias,"Portugal, Lisboa, Lisboa","Artigo 20.º, n.º 1, alínea b) do Código dos Contratos Públicos",,,,,,Não aplicável.,Não aplicável.,FALSE
Aquisição de reagentes para biologia molecular para sequenciadores automáticos,Concurso público,Aquisição de bens móveis,"33696500-0, Reagentes de laboratório","Instituto Nacional de Saúde Dr. Ricardo Jorge, I. P. (501427511)",Alfagene (503387398),"56.638,60 €",27-11-2015,24-04-2015,283 dias,"Portugal, Lisboa, Lisboa","Artigo 20.º, n.º 1, alínea b) do Código dos Contratos Públicos",,,,,,Não aplicável.,Não aplicável.,FALSE
Aquisição de reagentes,Concurso público,Aquisição de bens móveis,"33696500-0, Reagentes de laboratório","Instituto Nacional de Saúde Dr. Ricardo Jorge, I. P. (501427511)",CSP Saúde (508440246),"1.700,18 €",26-11-2015,21-05-2015,332 dias,"Portugal, Lisboa, Lisboa","Artigo 20.º, n.º 1, alínea b) do Código dos Contratos Públicos",,,,,,Não aplicável.,Não aplicável.,FALSE
Aquisição de reagentes,Concurso público,Aquisição de bens móveis,"33696500-0, Reagentes de laboratório","Instituto Nacional de Saúde Dr. Ricardo Jorge, I. P. (501427511)",Tebu-Bio Lda (267133197),"4.457,60 €",26-11-2015,21-05-2015,332 dias,"Portugal, Lisboa, Lisboa","Artigo 20.º, n.º 1, alínea b) do Código dos Contratos Públicos",,,,,,Não aplicável.,Não aplicável.,FALSE
Aquisição de reagentes,Concurso público,Aquisição de bens móveis,"33696500-0, Reagentes de laboratório","Instituto Nacional de Saúde Dr. Ricardo Jorge, I. P. (501427511)",Iberlab e Imunoreage (503406694),"1.242,59 €",26-11-2015,21-05-2015,332 dias,"Portugal, Lisboa, Lisboa","Artigo 20.º, n.º 1, alínea b) do Código dos Contratos Públicos",,,,,,Não aplicável.,Não aplicável.,FALSE
Aquisição de reagentes,Concurso público,Aquisição de bens móveis,"33696500-0, Reagentes de laboratório","Instituto Nacional de Saúde Dr. Ricardo Jorge, I. P. (501427511)",Fisher Scientific Lda (506429210),"10.672,43 €",26-11-2015,02-06-2015,332 dias,"Portugal, Lisboa, Lisboa","Artigo 20.º, n.º 1, alínea b) do Código dos Contratos Públicos",,,,,,Não aplicável.,Não aplicável.,FALSE
Aquisição de Álcool,Ajuste Direto Regime Geral,Aquisição de bens móveis,"33000000-0, Equipamento médico, medicamentos e produtos para cuidados pessoais","Instituto Nacional de Saúde Doutor Ricardo Jorge, I. P. (501427511)",Proclínica - Equipamentos e Produtos Clínicos Lda (500222665),"3.032,96 €",26-11-2015,04-09-2015,129 dias,"Portugal, Lisboa, Lisboa","Artigo 20.º, n.º 1, alínea a) do Código dos Contratos Públicos",,,,,,Não aplicável.,Não aplicável.,FALSE
Aquisição de material de vidro e porcelana,Ajuste Direto Regime Geral,Aquisição de bens móveis,"33000000-0, Equipamento médico, medicamentos e produtos para cuidados pessoais","Instituto Nacional de Saúde Doutor Ricardo Jorge, I. P. (501427511)",Normax (500203130),"2.999,78 €",26-11-2015,10-07-2015,231 dias,"Portugal, Lisboa, Lisboa","Artigo 20.º, n.º 1, alínea a) do Código dos Contratos Públicos",,,,,,Não aplicável.,Não aplicável.,FALSE
Aquisição de material de vidro e porcelana,Ajuste Direto Regime Geral,Aquisição de bens móveis,"33000000-0, Equipamento médico, medicamentos e produtos para cuidados pessoais","Instituto Nacional de Saúde Doutor Ricardo Jorge, I. P. (501427511)",VWR International (503842770),"993,20 €",26-11-2015,10-07-2015,231 dias,"Portugal, Lisboa, Lisboa","Artigo 20.º, n.º 1, alínea a) do Código dos Contratos Públicos",,,,,,Não aplicável.,Não aplicável.,FALSE
Aquisição de reagentes,Ajuste Direto Regime Geral,Aquisição de bens móveis,"33696000-5, Reagentes e meios de contraste",Instituto Nacional de Saúde Dr.Ricardo Jorge(INSA) (501427511),Quilaban (500399670),"19.724,02 €",26-11-2015,19-05-2015,255 dias,"Portugal, Lisboa, Lisboa","Artigo 20.º, n.º 1, alínea a) do Código dos Contratos Públicos",,,,,,Não aplicável.,Não aplicável.,FALSE
Aquisição de reagentes,Ajuste Direto Regime Geral,Aquisição de bens móveis,"33696000-5, Reagentes e meios de contraste",Instituto Nacional de Saúde Dr.Ricardo Jorge(INSA) (501427511),Isoder - Isótopos Derivados Lda (502241594),"3.000,00 €",26-11-2015,11-05-2015,255 dias,"Portugal, Lisboa, Lisboa","Artigo 20.º, n.º 1, alínea a) do Código dos Contratos Públicos",,,,,,Não aplicável.,Não aplicável.,FALSE
Aquisição de produtos farmacêuticos,Ajuste Direto Regime Geral,Aquisição de bens móveis,"33600000-6, Produtos farmacêuticos",Instituto Nacional de Saúde Dr.Ricardo Jorge(INSA) (501427511),Overpharma - produtos médicos e farmacêuticos Lda (505792362),"1.158,86 €",26-11-2015,28-07-2015,237 dias,"Portugal, Lisboa, Lisboa","Artigo 20.º, n.º 1, alínea a) do Código dos Contratos Públicos",,,,,,Não aplicável.,Não aplicável.,FALSE
Aquisição de material de penso,Ajuste Direto Regime Geral,Aquisição de bens móveis,"33140000-3, Material médico de consumo","Instituto Nacional de Saúde Doutor Ricardo Jorge, I. P. (501427511)",Ezequiel Panão Jorge Lda (501412727),"945,50 €",26-11-2015,22-04-2015,237 dias,"Portugal, Lisboa, Lisboa","Artigo 20.º, n.º 1, alínea a) do Código dos Contratos Públicos",,,,,,Não aplicável.,Não aplicável.,FALSE
Aquisição de material de penso,Ajuste Direto Regime Geral,Aquisição de bens móveis,"33140000-3, Material médico de consumo","Instituto Nacional de Saúde Doutor Ricardo Jorge, I. P. (501427511)",Anast´cio Saldanha (179425870),"651,13 €",26-11-2015,22-04-2015,237 dias,"Portugal, Lisboa, Lisboa","Artigo 20.º, n.º 1, alínea a) do Código dos Contratos Públicos",,,,,,Não aplicável.,Não aplicável.,FALSE
Aquisição de material de consumo clínico,Ajuste Direto Regime Geral,Aquisição de bens móveis,"33140000-3, Material médico de consumo","Instituto Nacional de Saúde Doutor Ricardo Jorge, I. P. (501427511)",Sarstedt (503019461),"15,00 €",26-11-2015,02-10-2015,184 dias,"Portugal, Lisboa, Lisboa","Artigo 20.º, n.º 1, alínea a) do Código dos Contratos Públicos",,,,,,Não aplicável.,Não aplicável.,FALSE
Aquisição de reagentes,Ajuste Direto Regime Geral,Aquisição de bens móveis,"33696000-5, Reagentes e meios de contraste","Instituto Nacional de Saúde Doutor Ricardo Jorge, I. P. (501427511)",Bio-Rad Laboratories Lda (501301321),"1.960,00 €",25-11-2015,23-10-2015,81 dias,"Portugal, Lisboa, Lisboa","Artigo 20.º, n.º 1, alínea a) do Código dos Contratos Públicos",,,,,,Não aplicável.,Não aplicável.,FALSE
Aquisição de reagentes dos desertos do concurso 42 para os diferentes departamentos do INSA,Ajuste Direto Regime Geral,Aquisição de bens móveis,"33140000-3, Material médico de consumo","Instituto Nacional de Saúde Doutor Ricardo Jorge, I. P. (501427511)","Bio-Rad  Laboratories, Lda (501301321)","1.005,58 €",25-11-2015,23-11-2015,90 dias,"Portugal, Setúbal, Setúbal<BR/>Portugal, Lisboa, Lisboa<BR/>Portugal, Porto, Porto","Artigo 20.º, n.º 1, alínea a) do Código dos Contratos Públicos",,,,,,Não aplicável.,Não aplicável.,FALSE
Aquisição de reagentes dos desertos do concurso 42 para os diferentes departamentos do INSA,Ajuste Direto Regime Geral,Aquisição de bens móveis,"33140000-3, Material médico de consumo","Instituto Nacional de Saúde Doutor Ricardo Jorge, I. P. (501427511)","PVL - Produtos para Laboratório, Lda (501411852)","75,90 €",25-11-2015,23-11-2015,90 dias,"Portugal, Porto, Porto<BR/>Portugal, Lisboa, Lisboa<BR/>Portugal, Setúbal, Setúbal","Artigo 20.º, n.º 1, alínea a) do Código dos Contratos Públicos",,,,,,Não aplicável.,Não aplicável.,FALSE
Aquisição de reagentes dos desertos do concurso 42 para os diferentes departamentos do INSA,Ajuste Direto Regime Geral,Aquisição de bens móveis,"33140000-3, Material médico de consumo","Instituto Nacional de Saúde Doutor Ricardo Jorge, I. P. (501427511)","ILC - Instrumentos de Laboratório e Cientifico, Lda (500948208)","770,00 €",25-11-2015,23-11-2015,90 dias,"Portugal, Setúbal, Setúbal<BR/>Portugal, Porto, Porto<BR/>Portugal, Lisboa, Lisboa","Artigo 20.º, n.º 1, alínea a) do Código dos Contratos Públicos",,,,,,Não aplicável.,Não aplicável.,FALSE
Aquisição de reagentes anticorpos para o INSA,Ajuste Direto Regime Geral,Aquisição de bens móveis,"33696500-0, Reagentes de laboratório",Instituto Nacional de Saúde Dr.Ricardo Jorge(INSA) (501427511),"Bioportugal - Químico Farmacêutica, Lda (502380543)","1.590,00 €",25-11-2015,13-11-2015,90 dias,"Portugal, Lisboa, Lisboa","Artigo 20.º, n.º 1, alínea a) do Código dos Contratos Públicos",,,,,,Não aplicável.,Não aplicável.,FALSE
