Objeto do Contrato,Tipo de Procedimento,Tipo(s) de Contrato,CPVs,Entidade(s) Adjudicante(s),Entidade(s) Adjudicatária(s),Preço Contratual,Data de Publicação,Data de Celebração do Contrato,Prazo de Execução,Local de Execução,Fundamentação,Data de Fecho do Contrato,Preço Total Efetivo,Causas das Alterações ao Prazo,Causas das Alterações ao Preço,Estado,N.º registo do Acordo Quadro,Descrição do Acordo Quadro,Procedimento Centralizado
OXIGENIO 100% MEDICINAL (EM CILINDRO),Ajuste Direto Regime Geral,Aquisição de bens móveis,"24111900-4, Oxigénio","Administração Regional de Saúde de Lisboa e Vale do Tejo, I.P. (503148776)","Gasin II - Gases Industriais, Unipessoal Lda. (510183751)","30.620,95 €",21-07-2014,17-06-2014,5 dias,"Portugal, Leiria<BR/>Portugal, Lisboa<BR/>Portugal, Setúbal<BR/>Portugal, Santarém","Artigo 26.º, n.º 1, alínea e) do Código dos Contratos Públicos","","",,,,Não aplicável.,Não aplicável.,FALSE
OXIGENIO 100% MEDICINAL (EM CILINDRO),Ajuste Direto Regime Geral,Aquisição de bens móveis,"24111900-4, Oxigénio","Administração Regional de Saúde de Lisboa e Vale do Tejo, I.P. (503148776)","Acaíl, Gás S.A. (503789151)","2.057,00 €",21-07-2014,17-06-2014,5 dias,"Portugal, Leiria<BR/>Portugal, Santarém<BR/>Portugal, Setúbal<BR/>Portugal, Lisboa","Artigo 26.º, n.º 1, alínea e) do Código dos Contratos Públicos","","",,,,Não aplicável.,Não aplicável.,FALSE
APLICADORES DE BOLAS DE FIBRA 10CM E APLICADORES DE BOLAS DE FIBRA XL 11CM,Ajuste Direto Regime Geral,Aquisição de bens móveis,"33140000-3, Material médico de consumo","Administração Regional de Saúde de Lisboa e Vale do Tejo, I. P. (503148776)","Montellano, Lda. (500196494)","10.228,10 €",21-07-2014,26-06-2014,188 dias,"Portugal, Lisboa, Lisboa","Artigo 24.º, n.º 1, alínea b) do Código dos Contratos Públicos","","",,,,Não aplicável.,Não aplicável.,FALSE
DETERGENTE EZIMÁTICO LIQUIDO,Ajuste Direto Regime Geral,Aquisição de bens móveis,"33140000-3, Material médico de consumo","Administração Regional de Saúde de Lisboa e Vale do Tejo, I. P. (503148776)",Air Liquide Medicinal S.A. (501576436),"8.346,48 €",21-07-2014,26-06-2014,5 dias,"Portugal, Lisboa, Lisboa","Artigo 26.º, n.º 1, alínea e) do Código dos Contratos Públicos","","",,,,Não aplicável.,Não aplicável.,FALSE
"DICLOROISOCIANURATO DE SODIO (TROCLOSENO)PAST 2,5G",Ajuste Direto Regime Geral,Aquisição de bens móveis,"33600000-6, Produtos farmacêuticos","Administração Regional de Saúde de Lisboa e Vale do Tejo, I. P. (503148776)","Johnson & Johnson, Lda. (500153370)","240,00 €",21-07-2014,08-07-2014,2 dias,"Portugal, Lisboa, Lisboa","Artigo 20.º, n.º 1, alínea a) do Código dos Contratos Públicos","","",,,,Não aplicável.,Não aplicável.,FALSE
"DIAZEPAM 5MG/2,5ML SOL RETAL",Ajuste Direto Regime Geral,Aquisição de bens móveis,"33690000-3, Medicamentos vários","Administração Regional de Saúde de Lisboa e Vale do Tejo, I. P. (503148776)","AUROVITAS, UNIPESSOAL, LDA (513053239)","122,70 €",21-07-2014,08-07-2014,2 dias,"Portugal, Lisboa, Lisboa","Artigo 26.º, n.º 1, alínea e) do Código dos Contratos Públicos","","",,,,Não aplicável.,Não aplicável.,FALSE
SELANTE DE FISSURA EM FRASCO E SELANTE DE FISSURA EM SERINGA,Ajuste Direto Regime Geral,Aquisição de bens móveis,"33140000-3, Material médico de consumo","Administração Regional de Saúde de Lisboa e Vale do Tejo, I. P. (503148776)","Montellano, Lda. (500196494)","15.800,00 €",21-07-2014,26-06-2014,188 dias,"Portugal, Lisboa, Lisboa","Artigo 24.º, n.º 1, alínea b) do Código dos Contratos Públicos","","",,,,Não aplicável.,Não aplicável.,FALSE
COPOS DE POLIMERO COM PESO MOLECULAR (LOTE 06 DO CP 14K00010),Ajuste Direto Regime Geral,Aquisição de bens móveis,"33140000-3, Material médico de consumo","Administração Regional de Saúde de Lisboa e Vale do Tejo, I. P. (503148776)","COMPAÑIA DENTAL DE VENTA DIRECTA, S.A. - SUCURSAL EM PORTUGAL (980187036)","55,90 €",21-07-2014,23-06-2014,5 dias,"Portugal, Lisboa, Lisboa","Artigo 24.º, n.º 1, alínea b) do Código dos Contratos Públicos","","",,,,Não aplicável.,Não aplicável.,FALSE
BROMO TOTAL EM PÓ PARA ANALISES DE CAMPO,Ajuste Direto Regime Geral,Aquisição de bens móveis,"33696000-5, Reagentes e meios de contraste","Administração Regional de Saúde de Lisboa e Vale do Tejo, I. P. (503148776)","Hanna Instruments (Portugal) - Instrumentos de Controle, Lda. (502540141)","22,00 €",21-07-2014,17-07-2014,15 dias,"Portugal, Lisboa, Lisboa","Artigo 24.º, n.º 1, alínea e) do Código dos Contratos Públicos","","",,,,Não aplicável.,Não aplicável.,FALSE
Obras de Reparação de roturas de água nas tubagens de abastecimento de água do edifício da USF S. Domingos / UCSP Santarém / UCC de Santarém,Ajuste Direto Regime Geral,Empreitadas de obras públicas,"45113000-2, Obras no local","Administração Regional de Saúde de Lisboa e Vale do Tejo, I. P. (503148776)","Secal - Engenharia e Construções, S.A. (501982248)","1.941,34 €",18-07-2014,18-07-2014,3 dias,"Portugal, Santarém, Santarém","Artigo 19.º, alínea a) do Código dos Contratos Públicos","","",,,,Não aplicável.,Não aplicável.,FALSE
Aquisição de Fluoreto Sódio 50MG/ML Susp Dental Tubo,Ajuste Direto Regime Geral,Aquisição de bens móveis,"33600000-6, Produtos farmacêuticos","Administração Regional de Saúde de Lisboa e Vale do Tejo, I. P. (503148776)","Dilofar - Distribuição, Transportes e Logística, Lda. (500563004)","2.574,00 €",16-07-2014,15-07-2014,20 dias,"Portugal, Lisboa","Artigo 24.º, n.º 1, alínea e) do Código dos Contratos Públicos","","",,,,Não aplicável.,Não aplicável.,FALSE
Aquisição de serviços de fornecimento de refeições confecionadas e prestação de serviços associados,Ao abrigo de acordo-quadro (art.º 259.º),Aquisição de serviços,"55520000-1, Serviços de fornecimento de refeições (catering)","Administração Regional de Saúde de Lisboa e Vale do Tejo, I. P. (503148776)","Gertal - Companhia Geral de Restaurantes e Alimentação, S.A. (500126623)","78.115,28 €",16-07-2014,30-06-2014,184 dias,"Portugal, Lisboa, Lisboa",Artigo 259.º do Código dos Contratos Públicos,"","",,,,119741,Concurso limitado por prévia qualificação para a celebração de acordo quadro para o fornecimento de refeições confeccionadas.,FALSE
ALUGUER E MANUTENÇÃO DE MÓDULOS PRÉ-FABRICADOS PARA A USF CARNIDE,Ajuste Direto Regime Geral,Aquisição de bens móveis,"44619000-2, Outros contentores","Administração Regional de Saúde de Lisboa e Vale do Tejo, I. P. (503148776)",Algeco - Construções Pré - Fabricadas S.A. (502721871),"932,79 €",16-07-2014,01-07-2014,30 dias,"Portugal, Lisboa, Lisboa","Artigo 24.º, n.º 1, alínea e) do Código dos Contratos Públicos","","",,,,Não aplicável.,Não aplicável.,FALSE
Serviços de vigilância e segurança para os ACES e Sede. Período de 01/07/2014 a 30/09/2014,Ajuste Direto Regime Geral,Aquisição de serviços,"79710000-4, Serviços de segurança","Administração Regional de Saúde de Lisboa e Vale do Tejo, I. P. (503148776)","Prestibel - Empresa de Segurança, S.A. (501326456)","1.606.890,42 €",16-07-2014,30-06-2014,92 dias,"Portugal, Santarém<BR/>Portugal, Leiria<BR/>Portugal, Setúbal<BR/>Portugal, Lisboa","Artigo 24.º, n.º 1, alínea c) do Código dos Contratos Públicos","","",,,,Não aplicável.,Não aplicável.,FALSE
"AQUISIÇÃO DE PLACAS DE BOTÕES PARA O ELEVADOR N.º 2 SITO NO EDIFICIO N.º 75 - SEDE DA ARSLVT, IP",Ajuste Direto Regime Geral,Aquisição de bens móveis,"42419510-4, Peças para elevadores","Administração Regional de Saúde de Lisboa e Vale do Tejo, I. P. (503148776)",Grupnor - Grupo Portugues de Elevadores do Norte Lda. (500959579),"110,00 €",15-07-2014,15-07-2014,5 dias,"Portugal, Lisboa, Lisboa","Artigo 24.º, n.º 1, alínea e) do Código dos Contratos Públicos","","",,,,Não aplicável.,Não aplicável.,FALSE
Aquisição de diverso Mobiliário de Escritório,Ao abrigo de acordo-quadro (art.º 259.º),Aquisição de bens móveis,"39141100-3, Estantes","Instituto Nacional de Saúde Dr. Ricardo Jorge, I. P. (501427511), Administração Regional de Saúde do Alentejo, I.P. (503148768), Secretaria-Geral do Ministério da Saúde - SNCP (600080684), Instituto Nacional de Emergência Médica, I. P. (501356126), Administração Regional de Saúde do Centro, I. P. (503122165), Administração Regional de Saúde de Lisboa e Vale do Tejo, I. P. (503148776), Administração Regional de Saúde do Norte, I. P. (503135593)","Julcar, S.A. (501140263)","1.722,90 €",14-07-2014,14-05-2014,226 dias,"Portugal, Braga<BR/>Portugal, Porto<BR/>Portugal, Vila Real<BR/>Portugal, Aveiro",Artigo 259.º do Código dos Contratos Públicos,02-10-2014,"1.722,90 €",,,,600257,Concurso limitado por prévia qualificação para a celebração de Acordo Quadro para o fornecimento de bens de  mobiliário.,TRUE
Aquisição de diverso Mobiliário de Escritório,Ao abrigo de acordo-quadro (art.º 259.º),Aquisição de bens móveis,"39156000-0, Mobiliário para salas de espera e de recepções","Instituto Nacional de Saúde Dr. Ricardo Jorge, I. P. (501427511), Administração Regional de Saúde do Alentejo, I.P. (503148768), Secretaria-Geral do Ministério da Saúde - SNCP (600080684), Instituto Nacional de Emergência Médica, I. P. (501356126), Administração Regional de Saúde do Centro, I. P. (503122165), Administração Regional de Saúde de Lisboa e Vale do Tejo, I. P. (503148776), Administração Regional de Saúde do Norte, I. P. (503135593)","JUlcar, S.A. (501140263)","4.023,54 €",14-07-2014,14-05-2014,226 dias,"Portugal, Porto<BR/>Portugal, Aveiro<BR/>Portugal, Vila Real<BR/>Portugal, Braga",Artigo 259.º do Código dos Contratos Públicos,02-10-2014,"4.023,54 €",,,,600257,Concurso limitado por prévia qualificação para a celebração de Acordo Quadro para o fornecimento de bens de  mobiliário.,TRUE
Aquisição de diverso Mobiliário de Escritório,Ao abrigo de acordo-quadro (art.º 259.º),Aquisição de bens móveis,"39130000-2, Mobiliário de escritório","Instituto Nacional de Saúde Dr. Ricardo Jorge, I. P. (501427511), Administração Regional de Saúde do Alentejo, I.P. (503148768), Secretaria-Geral do Ministério da Saúde - SNCP (600080684), Instituto Nacional de Emergência Médica, I. P. (501356126), Administração Regional de Saúde do Centro, I. P. (503122165), Administração Regional de Saúde de Lisboa e Vale do Tejo, I. P. (503148776), Administração Regional de Saúde do Norte, I. P. (503135593)","Julcar, S.A. (501140263)","136.771,30 €",14-07-2014,14-05-2014,226 dias,"Portugal, Braga<BR/>Portugal, Porto<BR/>Portugal, Aveiro<BR/>Portugal, Vila Real",Artigo 259.º do Código dos Contratos Públicos,02-10-2014,"136.771,30 €",,,,600257,Concurso limitado por prévia qualificação para a celebração de Acordo Quadro para o fornecimento de bens de  mobiliário.,TRUE
"Aquisição de serviços de vigilância e segurança para os serviços da dependência da ARSLVT, IP (DICAD) para o periodo de 01/07/2014 a 30/09/2014",Ajuste Direto Regime Geral,Aquisição de serviços,"79710000-4, Serviços de segurança","Administração Regional de Saúde de Lisboa e Vale do Tejo, I. P. (503148776)","Prestibel, SA (501326456)","149.083,17 €",14-07-2014,30-06-2014,92 dias,"Portugal, Lisboa<BR/>Portugal, Santarém<BR/>Portugal, Setúbal","Artigo 24.º, n.º 1, alínea c) do Código dos Contratos Públicos","","",,,,Não aplicável.,Não aplicável.,FALSE
