freguesia,acronym,validVotesPercentage,votes,dicofre
São Jorge,PPD/PSD.CDS-PP,49.37,276,310904
São Jorge,PS,18.78,105,310904
São Jorge,MPT,6.44,36,310904
São Jorge,PCP-PEV,5.01,28,310904
São Jorge,PTP,5.01,28,310904
São Jorge,B.E.,3.04,17,310904
São Jorge,PCTP/MRPP,2.68,15,310904
São Jorge,L,2.15,12,310904
São Jorge,PAN,2.15,12,310904
São Jorge,PND,2.15,12,310904
São Jorge,PPM,1.25,7,310904
São Jorge,MAS,0.72,4,310904
São Jorge,PNR,0.54,3,310904
São Jorge,POUS,0.36,2,310904
São Jorge,PPV,0.36,2,310904
São Jorge,PDA,0,0,310904
