Objeto do Contrato,Tipo de Procedimento,Tipo(s) de Contrato,CPVs,Entidade(s) Adjudicante(s),Entidade(s) Adjudicatária(s),Preço Contratual,Data de Publicação,Data de Celebração do Contrato,Prazo de Execução,Local de Execução,Fundamentação,Data de Fecho do Contrato,Preço Total Efetivo,Causas das Alterações ao Prazo,Causas das Alterações ao Preço,Estado,N.º registo do Acordo Quadro,Descrição do Acordo Quadro,Procedimento Centralizado
Aquisição de Diverso Material Descartável para Equipamentos de Diagnóstico Roche,Ajuste Direto Regime Geral,Aquisição de bens móveis,"33140000-3, Material médico de consumo","Unidade Local de Saúde do Norte Alentejano, E. P. E. (508094461)",ROCHE SISTEMA DE DIAGNOSTICOS (504282921),"8.107,89 €",31-10-2013,20-06-2013,180 dias,"Portugal, Portalegre, Portalegre","Artigo 24.º, n.º 1, alínea e) do Código dos Contratos Públicos",31-12-2013,"8.107,89 €","",,,Não aplicável.,Não aplicável.,
"Aquisição de Sistema de Controlo de Dispositivos Médicos para a ULSNA, EPE.",Ajuste Direto Regime Geral,Aquisição de bens móveis,"48000000-8, Pacotes de software e sistemas de informação","Unidade Local de Saúde do Norte Alentejano, E. P. E. (508094461)","BIEQ Consultores de Engenharia e Gestão Industrial, Lda (504105337)","9.890,00 €",29-10-2013,16-10-2013,30 dias,"Portugal, Portalegre, Portalegre","Artigo 20.º, n.º 1, alínea a) do Código dos Contratos Públicos",16-10-2013,"9.890,00 €","",,,Não aplicável.,Não aplicável.,
"Aquisição de Duas Torres de Laparoscópia para a ULSNA, EPE.",Concurso público,Aquisição de bens móveis,"33100000-1, Equipamento médico","Unidade Local de Saúde do Norte Alentejano, E.P.E. (508094461)","Stryker Portugal Produtos Médicos, Lda (504594214)","60.420,00 €",29-10-2013,11-10-2013,15 dias,"Portugal, Portalegre, Portalegre","Artigo 20.º, n.º 1, alínea b) do Código dos Contratos Públicos",31-12-2013,"60.420,00 €","",,,Não aplicável.,Não aplicável.,
Aquisição de Vinhetas e Receituário Médico,Ajuste Direto Regime Geral,Aquisição de bens móveis,"22000000-0, Material impresso e afins","Unidade Local de Saúde do Norte Alentejano, E. P. E. (508094461)",INCM (500792887),"150,00 €",29-10-2013,23-10-2013,5 dias,"Portugal, Portalegre, Portalegre","Artigo 24.º, n.º 1, alínea e) do Código dos Contratos Públicos",31-12-2013,"150,00 €","",,,Não aplicável.,Não aplicável.,
"Aquisição de Equipamento de Ofalmologia para a ULSNA, EPE.",Ajuste Direto Regime Geral,Aquisição de bens móveis,"33100000-1, Equipamento médico","Unidade Local de Saúde do Norte Alentejano, E. P. E. (508094461)","Oftaltec, Lda (503197149)","11.606,40 €",29-10-2013,07-10-2013,30 dias,"Portugal, Portalegre, Portalegre","Artigo 20.º, n.º 1, alínea a) do Código dos Contratos Públicos",07-11-2013,"11.606,40 €","",,,Não aplicável.,Não aplicável.,
" Prestação de Serviços Médicos, na Especialidade de Ortopedia, na ULSNA, EPE (de 1 de Julho a 30 de Setembro de 2013)",Ajuste Direto Regime Geral,Aquisição de serviços,"85100000-0, Serviços de saúde","Unidade Local de Saúde do Norte Alentejano, E. P. E. (508094461)","Bargão dos Santos, Serviços Médicos, Lda (507203895)","15.750,00 €",28-10-2013,15-10-2013,92 dias,"Portugal, Portalegre, Elvas","Artigo 24.º, n.º 1, alínea c) do Código dos Contratos Públicos",15-10-2013,"15.750,00 €","",,,Não aplicável.,Não aplicável.,
FORNECIMENTO DE 5.000 KGS DE GÁS PROPANO A GRANEL PARA O HOSPITAL DE SANTA LUZIA DE ELVAS,Ajuste Direto Regime Geral,Aquisição de serviços,"76000000-3, Serviços relacionados com as indústrias do gás e do petróleo","Unidade Local de Saúde do Norte Alentejano, E.P.E. (508094461)",BP (500194670),"6.296,80 €",24-10-2013,20-03-2013,365 dias,"Portugal, Portalegre, Elvas","Artigo 20.º, n.º 1, alínea a) do Código dos Contratos Públicos",31-12-2013,"6.296,80 €","",,,Não aplicável.,Não aplicável.,
"Prestação de Serviços de Reparações no Centro de Saúde de Portalegre da ULSNA, EPE.",Ajuste Direto Regime Geral,Empreitadas de obras públicas,"50000000-5, Serviços de reparação e manutenção","Unidade Local de Saúde do Norte Alentejano, E.P.E. (508094461)",António Trindade Damásio (124632521),"10.405,40 €",22-10-2013,10-10-2013,45 dias,"Portugal, Portalegre, Portalegre","Artigo 19.º, alínea a) do Código dos Contratos Públicos","","10.405,40 €","Prestação de Serviços de Reparações no Centro de Saúde de Portalegre da ULSNA, EPE.",,,Não aplicável.,Não aplicável.,
"Aquisição de Exames ao Exterior de Ressonância Magnética para a ULSNA, EPE",Ajuste Direto Regime Geral,Aquisição de serviços,"85150000-5, Serviços de imagiologia médica","Unidade Local de Saúde do Norte Alentejano, E.P.E. (508094461)",NRD Núcleo de Rádio-Diagnóstico (501495029),"28.310,07 €",22-10-2013,16-10-2013,76 dias,"Portugal, Portalegre, Portalegre","Artigo 20.º, n.º 1, alínea a) do Código dos Contratos Públicos",16-10-2013,"28.310,07 €","",,,Não aplicável.,Não aplicável.,
Aquisição de Reagentes para laboratório para a área de microbiologia,Ajuste Direto Regime Geral,Aquisição de bens móveis,"33000000-0, Equipamento médico, medicamentos e produtos para cuidados pessoais","Unidade Local de Saúde do Norte Alentejano, E.P.E. (508094461)",Biomerieux (501524177),"3.707,43 €",22-10-2013,16-10-2013,90 dias,"Portugal, Portalegre, Elvas<BR/>Portugal, Portalegre, Portalegre","Artigo 24.º, n.º 1, alínea e) do Código dos Contratos Públicos",31-12-2013,"3.707,43 €","",,,Não aplicável.,Não aplicável.,
" Prestação de Serviços Médicos, na Especialidade de Obstetricia e Ginecologia, na ULSNA, EPE (de 1 de Julho a 31 de Dezembro de 2012)",Ajuste Direto Regime Geral,Aquisição de serviços,"85100000-0, Serviços de saúde","Unidade Local de Saúde do Norte Alentejano, E.P.E. (508094461)","Policlinica Rainha Santa Isabel, Lda (503076031)","46.803,24 €",21-10-2013,21-11-2012,184 dias,"Portugal, Portalegre, Portalegre","Artigo 24.º, n.º 1, alínea c) do Código dos Contratos Públicos",31-12-2012,"46.803,24 €","",,,Não aplicável.,Não aplicável.,
" Prestação de Serviços Médicos, na Especialidade de Obstetrícia e Ginecologia, na ULSNA, EPE (de 1 de Janeiro a 31 de Março de 2013)",Ajuste Direto Regime Geral,Aquisição de serviços,"85100000-0, Serviços de saúde","Unidade Local de Saúde do Norte Alentejano, E.P.E. (508094461)","Enrique Matallana Unipessoal, Lda (507839587)","13.149,60 €",21-10-2013,30-01-2013,90 dias,"Portugal, Portalegre, Elvas","Artigo 24.º, n.º 1, alínea c) do Código dos Contratos Públicos",31-03-2013,"13.149,60 €","",,,Não aplicável.,Não aplicável.,
"Prestação de Serviços Médicoa, na Especialidade de Cirúrgia Plástica, na ULSNA, EPE ( de 1 de Janeiro a 31 de Dezembro de 2013)",Ajuste Direto Regime Geral,Aquisição de serviços,"85100000-0, Serviços de saúde","Unidade Local de Saúde do Norte Alentejano, E.P.E. (508094461)","Paralelos e Latitudes, Lda (508784093)","40.704,46 €",21-10-2013,16-08-2013,365 dias,"Portugal, Portalegre, Portalegre","Artigo 24.º, n.º 1, alínea c) do Código dos Contratos Públicos",31-12-2013,"40.704,46 €","",,,Não aplicável.,Não aplicável.,
"Prestação de Serviços de Manutenção dos Equipamentos da Marca GE instalados no HDJMG e HSL Elvas, no âmbito do contrato de manutenção “Harmony Essencial”",Ajuste Direto Regime Geral,Aquisição de serviços,"50000000-5, Serviços de reparação e manutenção","Unidade Local de Saúde do Norte Alentejano, E.P.E. (508094461)","GENERAL ELECTRIC PORTUGUESA, S.A (500357129)","90.000,00 €",21-10-2013,08-10-2013,365 dias,"Portugal, Portalegre, Portalegre","Artigo 24.º, n.º 1, alínea e) do Código dos Contratos Públicos",31-12-2013,"90.000,00 €","",,,Não aplicável.,Não aplicável.,
"Prestação de Serviços Médicos, na Especialidade de Radiologia, na ULSNA, EPE ( de 1 de Julho a 31 de Dezembro de 2013)",Ajuste Direto Regime Geral,Aquisição de serviços,"85100000-0, Serviços de saúde","Unidade Local de Saúde do Norte Alentejano, E.P.E. (508094461)","Instituto de Radiologia Médica, S.L. (B06228696)","19.800,00 €",21-10-2013,09-05-2013,184 dias,"Portugal, Portalegre, Portalegre","Artigo 24.º, n.º 1, alínea c) do Código dos Contratos Públicos",31-12-2013,"19.800,00 €","",,,Não aplicável.,Não aplicável.,
"Prestação de Serviços Médicos, na Especialidade de Ortopedia, na ULSNA, EPE, (de Abril a Junho de 2013)",Ajuste Direto Regime Geral,Aquisição de serviços,"85100000-0, Serviços de saúde","Unidade Local de Saúde do Norte Alentejano, E.P.E. (508094461)","Convergefrontier - Serviços Médicos Unipessoal, Lda. (510378730)","21.600,00 €",21-10-2013,02-05-2013,91 dias,"Portugal, Portalegre, Portalegre","Artigo 24.º, n.º 1, alínea c) do Código dos Contratos Públicos",30-06-2013,"21.600,00 €","",,,Não aplicável.,Não aplicável.,
"Prestação de Serviços Médicos na Especialidade de Oftalmologia, na ULSNA, EPE (de Abril a Junho de 2013)",Ajuste Direto Regime Geral,Aquisição de serviços,"85100000-0, Serviços de saúde","Unidade Local de Saúde do Norte Alentejano, E.P.E. (508094461)","Clinica de Oftalmologia Médica e Cirúrgica Dr. Spencer, Unipessoal, Lda. (504073370)","55.377,36 €",21-10-2013,03-05-2013,91 dias,"Portugal, Portalegre, Portalegre","Artigo 24.º, n.º 1, alínea c) do Código dos Contratos Públicos",30-06-2013,"55.377,36 €","",,,Não aplicável.,Não aplicável.,
