Objeto do Contrato,Tipo de Procedimento,Tipo(s) de Contrato,CPVs,Entidade(s) Adjudicante(s),Entidade(s) Adjudicatária(s),Preço Contratual,Data de Publicação,Data de Celebração do Contrato,Prazo de Execução,Local de Execução,Fundamentação,Data de Fecho do Contrato,Preço Total Efetivo,Causas das Alterações ao Prazo,Causas das Alterações ao Preço,Estado,N.º registo do Acordo Quadro,Descrição do Acordo Quadro,Procedimento Centralizado
Aquisição de serviços de tradução ICD10/CM/PCS,Ajuste Direto Regime Geral,Aquisição de serviços,"79530000-8, Serviços de tradução","Administração Central do Sistema de Saúde, I. P. (508188423)",Miguel José  Cabral de Pinto (217263089),"7.750,00 €",09-08-2018,09-08-2018,30 dias,"Portugal, Lisboa, Lisboa","Artigo 20.º, n.º 1, alínea d) do Código dos Contratos Públicos",31-12-2018,"7.750,00 €",,,,Não aplicável.,Não aplicável.,FALSE
Aquisição de Serviços para a Incineração da reserva Estratégica de Oseltamivir.,Ajuste Direto Regime Geral,Aquisição de serviços,"90513300-9, Serviços de incineração de resíduos","Administração Central do Sistema de Saúde, I. P. (508188423)","AMBIMED, GESTAO AMBIENTAL, LDA (503593427)","6.682,00 €",09-08-2018,09-08-2018,30 dias,"Portugal, Lisboa, Lisboa","Artigo 20.º, n.º 1, alínea d) do Código dos Contratos Públicos",07-09-2018,"6.682,00 €",,,,Não aplicável.,Não aplicável.,FALSE
Aquisição de serviços de consultadoria para apoio contabilístico à ACSS área SNC-AP,Consulta Prévia,Aquisição de serviços,"79210000-9, Serviços de contabilidade e auditoria","Administração Central do Sistema de Saúde, I. P. (508188423)",GESBANHA - Gestão e Contabilidade. SA (501768254),"73.500,00 €",01-08-2018,19-07-2018,174 dias,"Portugal, Lisboa, Lisboa","Artigo 20.º, n.º 1, alínea c) do Código dos Contratos Públicos",31-12-2018,"73.500,00 €",,,,Não aplicável.,Não aplicável.,FALSE
