Objeto do Contrato,Tipo de Procedimento,Tipo(s) de Contrato,CPVs,Entidade(s) Adjudicante(s),Entidade(s) Adjudicatária(s),Preço Contratual,Data de Publicação,Data de Celebração do Contrato,Prazo de Execução,Local de Execução,Fundamentação,Data de Fecho do Contrato,Preço Total Efetivo,Causas das Alterações ao Prazo,Causas das Alterações ao Preço,Estado,N.º registo do Acordo Quadro,Descrição do Acordo Quadro,Procedimento Centralizado
Aquisição de emtricitabina 200 mg + tenofovir 245 mg comp.,Ajuste Direto Regime Geral,Aquisição de bens móveis,"33651400-2, Antivíricos de uso sistémico","Centro Hospitalar Universitário de Lisboa Norte, EPE (508481287)",teva (507045491),"104.100,00 €",11-12-2018,11-12-2018,20 dias,"Portugal, Lisboa, Lisboa","Artigo 24.º, n.º 1, alínea c) do Código dos Contratos Públicos",,,,,,Não aplicável.,Não aplicável.,FALSE
181000400 - DIAZEPAM COMP 10 MG,Ao abrigo de acordo-quadro (art.º 259.º),Aquisição de bens móveis,"33690000-3, Medicamentos vários","Centro Hospitalar Universitário de Lisboa Norte, EPE (508481287)","LABESFAL - Laboratórios Almiro, S.A (501169580)","54,00 €",11-12-2018,14-02-2018,1 dias,"Portugal, Lisboa, Lisboa",Artigo 259.º do Código dos Contratos Públicos,,,,,,2528670,"CP 2017/2 - Acordo Quadro para fornecimento de Medicamentos do Sistema Nervoso Cerebrospinal, exceto: anestésicos, relaxantes musculares, analgésicos, antipiréticos, antidepressivos e antipsicóticos  às Instituições e Serviços do Serviço Nacional de Saúde",FALSE
181000398 - PACLITAXEL SOL INJ  - VÁRIAS DOSAGENS,Ao abrigo de acordo-quadro (art.º 259.º),Aquisição de bens móveis,"33690000-3, Medicamentos vários","Centro Hospitalar Universitário de Lisboa Norte, EPE (508481287)","ACCORD HEALTHCARE, UNIPESSOAL, LDA (508622263)","8.191,80 €",11-12-2018,14-02-2018,1 dias,"Portugal, Lisboa, Lisboa",Artigo 259.º do Código dos Contratos Públicos,,,,,,1771819,CP 2015/6 - Acordo quadro para o fornecimento de Medicamentos do Foro Oncológico,FALSE
Consulta Prévia n.º 184000008,Ao abrigo de acordo-quadro (art.º 259.º),Aquisição de bens móveis,"33700000-7, Produtos para cuidados pessoais","Centro Hospitalar Universitário de Lisboa Norte, E. P. E. (508481287)",Ezequiel Panão Jorge (501412727),"132,00 €",11-12-2018,11-12-2018,20 dias,"Portugal, Lisboa, Lisboa",Artigo 259.º do Código dos Contratos Públicos,,,,,,2349400,Acordo quadro para o fornecimento de Dispositivos para evacuação e para banho.,FALSE
181000397 - CITARABINA SOL INJ - VÁRIAS DOSAGENS,Ao abrigo de acordo-quadro (art.º 259.º),Aquisição de bens móveis,"33690000-3, Medicamentos vários","Centro Hospitalar Universitário de Lisboa Norte, E. P. E. (508481287)","FRESENIUS- KABI PHARMA PORTUGAL, LD (504293753)","2.005,80 €",11-12-2018,19-02-2018,1 dias,"Portugal, Lisboa, Lisboa",Artigo 259.º do Código dos Contratos Públicos,,,,,,1771819,CP 2015/6 - Acordo quadro para o fornecimento de Medicamentos do Foro Oncológico,FALSE
CP n.º 184A000006 - Aquisição de desinfetantes e detergentes de lavagem manual durante o ano de 2018,Concurso público,Aquisição de bens móveis,"24455000-8, Desinfectantes","Centro Hospitalar Lisboa Norte, E. P. E. (508481287)","AIR LIQUIDE MEDICINAL,S.A. (501576436)","25.773,24 €",11-12-2018,07-12-2018,213 dias,"Portugal, Lisboa, Lisboa","Artigo 20.º, n.º 1, alínea b) do Código dos Contratos Públicos",,,,,,Não aplicável.,Não aplicável.,FALSE
CP n.º 184A000006 - Aquisição de desinfetantes e detergentes de lavagem manual durante o ano de 2018,Concurso público,Aquisição de bens móveis,"24455000-8, Desinfectantes","Centro Hospitalar Lisboa Norte, E. P. E. (508481287)","FRANKLAB PORTUGAL, LDA (506058654)","9.769,76 €",11-12-2018,11-12-2018,213 dias,"Portugal, Lisboa, Lisboa","Artigo 20.º, n.º 1, alínea b) do Código dos Contratos Públicos",,,,,,Não aplicável.,Não aplicável.,FALSE
181000396 - METILPREDNISOLONA SOL INJ EXT 1 G,Ao abrigo de acordo-quadro (art.º 259.º),Aquisição de bens móveis,"33690000-3, Medicamentos vários","Centro Hospitalar Universitário de Lisboa Norte, E. P. E. (508481287)",HIKMA FARMACEUTICA PORTUGAL S.A (502266791),"3.712,50 €",11-12-2018,14-02-2018,1 dias,"Portugal, Lisboa, Lisboa",Artigo 259.º do Código dos Contratos Públicos,,,,,,1415640,CP 2015/7 - ACORDO QUADRO PARA FORNECIMENTO DE HORMONAS E OUTROS MEDICAMENTOS USADOS NO TRATAMENTO DAS DOENÇAS ENDÓCRINAS ÀS INSTITUIÇÕES E SERVIÇOS DO SERVIÇO NACIONAL DE SAÚDE,FALSE
181000395 - PARICALCITOL 2 MCG CAPS,Ao abrigo de acordo-quadro (art.º 259.º),Aquisição de bens móveis,"33690000-3, Medicamentos vários","Centro Hospitalar Universitário de Lisboa Norte, E. P. E. (508481287)",ABBVIE LDA (510229050),"3.837,56 €",11-12-2018,15-02-2018,2 dias,"Portugal, Lisboa, Lisboa",Artigo 259.º do Código dos Contratos Públicos,,,,,,1410779,CP 2015/47 - Acordo quadro para fornecimento de medicamentos do aparelho locomotor às instituições e serviços do serviço nacional de saúde,FALSE
181000394 - IBUPROFENO COMP 200 MG,Ao abrigo de acordo-quadro (art.º 259.º),Aquisição de bens móveis,"33600000-6, Produtos farmacêuticos","Centro Hospitalar Lisboa Norte, E. P. E. (508481287)",TECNIMEDE SOCIEDADE TECNICO-MEDICINAL S.A (500626413),"472,50 €",11-12-2018,22-02-2018,1 dias,"Portugal, Lisboa, Lisboa",Artigo 259.º do Código dos Contratos Públicos,,,,,,1410779,CP 2015/47 - Acordo quadro para fornecimento de medicamentos do aparelho locomotor às instituições e serviços do serviço nacional de saúde,FALSE
181000393,Ao abrigo de acordo-quadro (art.º 259.º),Aquisição de bens móveis,"33690000-3, Medicamentos vários","Centro Hospitalar Universitário de Lisboa Norte, E. P. E. (508481287)",PROCLINICA EQUIPAMENTOS E PRODUTOS CLINICOS LDA. (500222665),"1.380,00 €",11-12-2018,14-02-2018,1 dias,"Portugal, Lisboa, Lisboa",Artigo 259.º do Código dos Contratos Públicos,,,,,,1406003,CP 2015/8,FALSE
181000392,Ao abrigo de acordo-quadro (art.º 259.º),Aquisição de bens móveis,"33690000-3, Medicamentos vários","Centro Hospitalar Universitário de Lisboa Norte, E. P. E. (508481287)",FRESENIUS KABI PHARMA PORTUGAL LDA. (504293753),"1.390,50 €",11-12-2018,12-02-2018,1 dias,"Portugal, Lisboa, Lisboa",Artigo 259.º do Código dos Contratos Públicos,,,,,,2775691,CP 2017/5 - Acordo Quadro para fornecimento de Medicamentos anti-infeciosos: exceto antivíricos e antifúngicos,FALSE
181000399 - Epirrubicina Sol Inj 10 mg e 50 mg,Ao abrigo de acordo-quadro (art.º 259.º),Aquisição de bens móveis,"33690000-3, Medicamentos vários","Centro Hospitalar Universitário de Lisboa Norte, E. P. E. (508481287)",TEVA PHARMA PRODUTOS FARMACEUTICOS LDA. (507045491),"255,00 €",11-12-2018,09-02-2018,1 dias,"Portugal, Lisboa, Lisboa",Artigo 259.º do Código dos Contratos Públicos,,,,,,1771819,CP 2015/6 - Acordo quadro para o fornecimento de Medicamentos do Foro Oncológico,FALSE
181000391 - ALOPURINOL COMP 100 MG,Ao abrigo de acordo-quadro (art.º 259.º),Aquisição de bens móveis,"33690000-3, Medicamentos vários","Centro Hospitalar Universitário de Lisboa Norte, E. P. E. (508481287)",BIAL PORTELA & CA SA (500220913),"101,09 €",11-12-2018,06-02-2018,3 dias,"Portugal, Lisboa, Lisboa",Artigo 259.º do Código dos Contratos Públicos,,,,,,1410779,CP 2015/47 - Acordo quadro para fornecimento de medicamentos do aparelho locomotor às instituições e serviços do serviço nacional de saúde,FALSE
181000390 - Aquisição de EFAVIRENZE CAPS 200 MG,Ao abrigo de acordo-quadro (art.º 259.º),Aquisição de bens móveis,"33690000-3, Medicamentos vários","Centro Hospitalar Universitário de Lisboa Norte, EPE (508481287)",MERCK SHARP & DOHME LDA. (500191360),"638,57 €",10-12-2018,02-02-2018,2 dias,"Portugal, Lisboa, Lisboa",Artigo 259.º do Código dos Contratos Públicos,,,,,,2545980,CP 2017/61 - Acordo quadro para fornecimento de Medicamentos Diversos   às Instituições e Serviços do Serviço Nacional de Saúde,FALSE
181000388 - Preservativo Masculino,Ao abrigo de acordo-quadro (art.º 259.º),Aquisição de bens móveis,"33690000-3, Medicamentos vários","Centro Hospitalar Universitário de Lisboa Norte, E. P. E. (508481287)",EZEQUIEL PANÃO JORGE LDA. (501412727),"86,98 €",10-12-2018,19-02-2018,1 dias,"Portugal, Lisboa, Lisboa",Artigo 259.º do Código dos Contratos Públicos,,,,,,1459323,CP 2015/20,FALSE
181000387 - GLICLAZIDA LM COMP 30MG,Ao abrigo de acordo-quadro (art.º 259.º),Aquisição de bens móveis,"33690000-3, Medicamentos vários","Centro Hospitalar Universitário de Lisboa Norte, E. P. E. (508481287)",SANDOZ FARMACEUTICA LDA. (506985261),"56,16 €",10-12-2018,07-02-2018,1 dias,"Portugal, Lisboa, Lisboa",Artigo 259.º do Código dos Contratos Públicos,,,,,,1415640,CP 2015/7 - ACORDO QUADRO PARA FORNECIMENTO DE HORMONAS E OUTROS MEDICAMENTOS USADOS NO TRATAMENTO DAS DOENÇAS ENDÓCRINAS ÀS INSTITUIÇÕES E SERVIÇOS DO SERVIÇO NACIONAL DE SAÚDE,FALSE
181000386 - HIDROPOLIMEROS ESPESSOS C/REBORDO PENSO,Ao abrigo de acordo-quadro (art.º 259.º),Aquisição de bens móveis,"33690000-3, Medicamentos vários","Centro Hospitalar Universitário de Lisboa Norte, E. P. E. (508481287)",CLINIFAR  (503281115),"429,00 €",10-12-2018,16-02-2018,1 dias,"Portugal, Lisboa, Lisboa",Artigo 259.º do Código dos Contratos Públicos,,,,,,1315192,Acordo Quadro para fornecimento de material de penso de efeito terapêutico às Instituições e Serviços do Serviço Nacional de Saúde,FALSE
181000385 - COMPLEXO B COMP,Ao abrigo de acordo-quadro (art.º 259.º),Aquisição de bens móveis,"33690000-3, Medicamentos vários","Centro Hospitalar Universitário de Lisboa Norte, E. P. E. (508481287)",MYLAN LDA (502248793),"735,00 €",10-12-2018,07-02-2018,1 dias,"Portugal, Lisboa, Lisboa",Artigo 259.º do Código dos Contratos Públicos,,,,,,1338581,"Acordo quadro para fornecimento de Medicação antialérgica, medicamentos usados no tratamento de intoxicações, vitaminas e sais minerais e grupo 20.9 - outros produtos às instituições e serviços do serviço nacional de saúde",FALSE
181000384 - CONCENTRADO FIBRINOGÉNIO HUMANO 1 GR ( HAEMOCOMPLETTAN ),Ao abrigo de acordo-quadro (art.º 259.º),Aquisição de bens móveis,"33690000-3, Medicamentos vários","Centro Hospitalar Universitário de Lisboa Norte, E. P. E. (508481287)",CSL BEHRING UNIPESSOAL LDA. (503047201),"109.600,00 €",10-12-2018,15-02-2018,1 dias,"Portugal, Lisboa, Lisboa",Artigo 259.º do Código dos Contratos Públicos,,,,,,2800702,CP 2017/9 - Acordo quadro para fornecimento de Derivados do Plasma Humano às Instituições e Serviços do Serviço Nacional de Saúde,FALSE
181000383 - CLORETO DE POTASSIO SOL INJ 75 MG/ML AMP 10 ML,Ao abrigo de acordo-quadro (art.º 259.º),Aquisição de bens móveis,"33690000-3, Medicamentos vários","Centro Hospitalar Universitário de Lisboa Norte, E. P. E. (508481287)",OVERPHARMA PRODUTOS MEDICOS E FARMACEUTICOS LDA. (505792362),"13.500,00 €",10-12-2018,15-02-2018,2 dias,"Portugal, Lisboa, Lisboa",Artigo 259.º do Código dos Contratos Públicos,,,,,,2528675,CP 2017/3 - Acordo Quadro para fornecimento de corretivos da volémia e outras soluções estéreis,FALSE
181000381 - IRINOTECANO SOL INJ 20 MG/ML AMP,Ao abrigo de acordo-quadro (art.º 259.º),Aquisição de bens móveis,"33690000-3, Medicamentos vários","Centro Hospitalar Universitário de Lisboa Norte, E. P. E. (508481287)",FRESENIUS KABI PHARMA PORTUGAL LDA (504293753),"2.630,00 €",10-12-2018,14-02-2018,1 dias,"Portugal, Lisboa, Lisboa",Artigo 259.º do Código dos Contratos Públicos,,,,,,1771819,CP 2015/6 - Acordo quadro para o fornecimento de Medicamentos do Foro Oncológico,FALSE
"181000379 - PIPERACILINA + TAZOBACTAM SOL INJ IV 4,5   CONC 5 SPMS",Ao abrigo de acordo-quadro (art.º 259.º),Aquisição de bens móveis,"33690000-3, Medicamentos vários","Centro Hospitalar Universitário de Lisboa Norte, E. P. E. (508481287)",FRESENIUS KABI PHARMA PORTUGAL LDA. (504293753),"43.659,00 €",10-12-2018,15-02-2018,1 dias,"Portugal, Lisboa, Lisboa",Artigo 259.º do Código dos Contratos Públicos,,,,,,2775691,CP 2017/5 - Acordo Quadro para fornecimento de Medicamentos anti-infeciosos: exceto antivíricos e antifúngicos,FALSE
181000377 - ALBUMINA HUMANA SOL INJ 5% FRS 250 ML,Ao abrigo de acordo-quadro (art.º 259.º),Aquisição de bens móveis,"33690000-3, Medicamentos vários","Centro Hospitalar Universitário de Lisboa Norte, EPE (508481287)","CSL BEHRING, LDA. (503047201)","3.379,20 €",07-12-2018,14-02-2018,1 dias,"Portugal, Lisboa, Lisboa",Artigo 259.º do Código dos Contratos Públicos,,,,,,2800702,CP 2017/9 - Acordo quadro para fornecimento de Derivados do Plasma Humano às Instituições e Serviços do Serviço Nacional de Saúde,FALSE
181000376 - HIDROCOLÓIDES GEL BISN 15 G,Ao abrigo de acordo-quadro (art.º 259.º),Aquisição de bens móveis,"33690000-3, Medicamentos vários","Centro Hospitalar Universitário de Lisboa Norte, E. P. E. (508481287)","CLINIFAR - PROD.CLINICOS E FARMAC., (503281115)","568,80 €",07-12-2018,16-02-2018,1 dias,"Portugal, Lisboa, Lisboa",Artigo 259.º do Código dos Contratos Públicos,,,,,,1315192,Acordo Quadro para fornecimento de material de penso de efeito terapêutico às Instituições e Serviços do Serviço Nacional de Saúde,FALSE
181000375 - AMLODIPINA COMP 5 MG,Ao abrigo de acordo-quadro (art.º 259.º),Aquisição de bens móveis,"33690000-3, Medicamentos vários","Centro Hospitalar Universitário de Lisboa Norte, E. P. E. (508481287)","GENERIS - FARMACÊUTICA, S.A. (508107997)","189,00 €",07-12-2018,14-02-2018,1 dias,"Portugal, Lisboa, Lisboa",Artigo 259.º do Código dos Contratos Públicos,,,,,,2335591,CP 2016/01 - Acordo Quadro para fornecimento de Medicamentos do Aparelho Cardiovascular   às Instituições e Serviços do Serviço Nacional de Saúde,FALSE
Aquisição de seringa Luer lock 30 cc desc,Ao abrigo de acordo-quadro (art.º 259.º),Aquisição de bens móveis,"33140000-3, Material médico de consumo","Centro Hospitalar Universitário de Lisboa Norte, E. P. E. (508481287)","Pergut Portugal, Lda. (501799729)","320,00 €",07-12-2018,12-02-2018,1 dias,"Portugal, Lisboa, Lisboa",Artigo 259.º do Código dos Contratos Públicos,,,,,,1341769,"ACORDO QUADRO PARA FORNECIMENTO DE SERINGAS, AGULHAS E CONTENTORES ÀS INSTITUIÇÕES E SERVIÇOS DO SERVIÇO NACIONAL DE SAÚDE PROGRAMA DE CONCURSO",FALSE
181000374 - Furosemida 40 mg Comp,Ao abrigo de acordo-quadro (art.º 259.º),Aquisição de bens móveis,"33690000-3, Medicamentos vários","Centro Hospitalar Universitário de Lisboa Norte, EPE (508481287)","GENERIS - FARMACÊUTICA, S.A. (508107997)","214,20 €",07-12-2018,19-02-2018,1 dias,"Portugal, Lisboa, Lisboa",Artigo 259.º do Código dos Contratos Públicos,,,,,,2335591,CP 2016/01 - Acordo Quadro para fornecimento de Medicamentos do Aparelho Cardiovascular   às Instituições e Serviços do Serviço Nacional de Saúde,FALSE
181000373 - Aquisição de HIDROFIBRAS PENSO 10 X 10 CM,Ao abrigo de acordo-quadro (art.º 259.º),Aquisição de bens móveis,"33690000-3, Medicamentos vários","Centro Hospitalar Universitário de Lisboa Norte, E. P. E. (508481287)","BSN MEDICAL,S.A. (505385058)","987,00 €",07-12-2018,09-02-2018,2 dias,"Portugal, Lisboa, Lisboa",Artigo 259.º do Código dos Contratos Públicos,,,,,,1315192,Acordo Quadro para fornecimento de material de penso de efeito terapêutico às Instituições e Serviços do Serviço Nacional de Saúde,FALSE
181000371 - Bacitracina 50.000 UI % Pomada Bisnaga 20 g,Ao abrigo de acordo-quadro (art.º 259.º),Aquisição de bens móveis,"33690000-3, Medicamentos vários","Centro Hospitalar Universitário de Lisboa Norte, E. P. E. (508481287)","GENERIS - FARMACÊUTICA, S.A. (508107997)","225,00 €",07-12-2018,08-02-2018,1 dias,"Portugal, Lisboa, Lisboa",Artigo 259.º do Código dos Contratos Públicos,,,,,,1370278,CP 2015/51 - Acordo quadro para fornecimento de medicamentos usados nas afeções cutâneas às instituições e serviços do serviço nacional de saúde,FALSE
181000370,Ao abrigo de acordo-quadro (art.º 259.º),Aquisição de bens móveis,"33690000-3, Medicamentos vários","Centro Hospitalar Universitário de Lisboa Norte, E. P. E. (508481287)","GENERIS - FARMACÊUTICA, S.A. (508107997)","110,16 €",07-12-2018,14-02-2018,1 dias,"Portugal, Lisboa, Lisboa",Artigo 259.º do Código dos Contratos Públicos,,,,,,2335591,CP 2016/01 - Acordo Quadro para fornecimento de Medicamentos do Aparelho Cardiovascular   às Instituições e Serviços do Serviço Nacional de Saúde,FALSE
181000369 - ALBUMINA HUMANA SOL INJ 20% FRS 50 ML,Ao abrigo de acordo-quadro (art.º 259.º),Aquisição de bens móveis,"33690000-3, Medicamentos vários","Centro Hospitalar Universitário de Lisboa Norte, E. P. E. (508481287)","GRIFOLS PORTUGAL- PROD.FARM.HOSP., (502041285)","22.177,65 €",07-12-2018,27-02-2018,1 dias,"Portugal, Lisboa, Lisboa",Artigo 259.º do Código dos Contratos Públicos,,,,,,2800702,CP 2017/9 - Acordo quadro para fornecimento de Derivados do Plasma Humano às Instituições e Serviços do Serviço Nacional de Saúde,FALSE
"181000368 - Flumazenil Sol Inj 0,1 mg/ml Amp 5 ml",Ao abrigo de acordo-quadro (art.º 259.º),Aquisição de bens móveis,"33690000-3, Medicamentos vários","Centro Hospitalar Universitário de Lisboa Norte, E. P. E. (508481287)","ACCORD HEALTHCARE, UNIPESSOAL, LDA (508622263)","1.008,00 €",07-12-2018,19-02-2018,1 dias,"Portugal, Lisboa, Lisboa",Artigo 259.º do Código dos Contratos Públicos,,,,,,1338581,"Acordo quadro para fornecimento de Medicação antialérgica, medicamentos usados no tratamento de intoxicações, vitaminas e sais minerais e grupo 20.9 - outros produtos às instituições e serviços do serviço nacional de saúde",FALSE
"181000367 - Sunitinib Caps 12,5 mg",Ao abrigo de acordo-quadro (art.º 259.º),Aquisição de bens móveis,"33690000-3, Medicamentos vários","Centro Hospitalar Universitário de Lisboa Norte, E. P. E. (508481287)","PFIZER BIOFARMACEUTICA, LDA (513300376)","4.832,60 €",07-12-2018,08-02-2018,2 dias,"Portugal, Lisboa, Lisboa",Artigo 259.º do Código dos Contratos Públicos,,,,,,1771819,CP 2015/6 - Acordo quadro para o fornecimento de Medicamentos do Foro Oncológico,FALSE
181000366 - Raltegravir Comp 400 mg,Ao abrigo de acordo-quadro (art.º 259.º),Aquisição de bens móveis,"33690000-3, Medicamentos vários","Centro Hospitalar Universitário de Lisboa Norte, E. P. E. (508481287)","MERCK SHARP & DOHME, LDA (500191360)","322.211,04 €",07-12-2018,09-02-2018,2 dias,"Portugal, Lisboa, Lisboa",Artigo 259.º do Código dos Contratos Públicos,,,,,,2183729,Medicamentos antirretrovíricos para o tratamento da infeção por VIH,FALSE
181000364 - Aquisição de GABAPENTINA CAPS 100 MG,Ao abrigo de acordo-quadro (art.º 259.º),Aquisição de bens móveis,"33690000-3, Medicamentos vários","Centro Hospitalar Universitário de Lisboa Norte, E. P. E. (508481287)","GENERIS - FARMACÊUTICA, S.A. (508107997)","138,00 €",07-12-2018,15-02-2018,1 dias,"Portugal, Lisboa, Lisboa",Artigo 259.º do Código dos Contratos Públicos,,,,,,2528670,"CP 2017/2 - Acordo Quadro para fornecimento de Medicamentos do Sistema Nervoso Cerebrospinal, exceto: anestésicos, relaxantes musculares, analgésicos, antipiréticos, antidepressivos e antipsicóticos  às Instituições e Serviços do Serviço Nacional de Saúde",FALSE
"Elaboração e edição de livros sobre o tratamento inovador de Hepatite C no CHULN, EPE",Ajuste Direto Regime Geral,Aquisição de serviços,"79971100-2, Serviços de acabamento de livros","Centro Hospitalar Universitário de Lisboa Norte, E. P. E. (508481287)",José Fernando Macedo Esteves (202143724),"19.700,00 €",06-12-2018,06-12-2018,1 dias,"Portugal, Lisboa, Lisboa","Artigo 20.º, n.º 1, alínea d) do Código dos Contratos Públicos",,,,,,Não aplicável.,Não aplicável.,FALSE
181000363,Ao abrigo de acordo-quadro (art.º 259.º),Aquisição de bens móveis,"33690000-3, Medicamentos vários","Centro Hospitalar Universitário de Lisboa Norte, E. P. E. (508481287)",LAB. MEDINFAR- PROD.FARMACEUT.  SA (500384045),"96,00 €",06-12-2018,19-02-2018,3 dias,"Portugal, Lisboa, Lisboa",Artigo 259.º do Código dos Contratos Públicos,,,,,,2222779,Medicamentos do aparelho digestivo,FALSE
Aquisição de adesivo hipo seda artificial 10x5 cm,Ao abrigo de acordo-quadro (art.º 259.º),Aquisição de bens móveis,"33140000-3, Material médico de consumo","Centro Hospitalar Universitário de Lisboa Norte, E. P. E. (508481287)","Bastos Viegas, SA (500042772)","381,60 €",06-12-2018,17-02-2018,317 dias,"Portugal, Lisboa, Lisboa",Artigo 259.º do Código dos Contratos Públicos,,,,,,2183753,CP 2016/82 - Acordo quadro para fornecimento de Nastros e Fitas Cirúrgicas às Instituições e Serviços do Serviço Nacional de Saúde,FALSE
181000362,Ao abrigo de acordo-quadro (art.º 259.º),Aquisição de bens móveis,"33690000-3, Medicamentos vários","Centro Hospitalar Universitário de Lisboa Norte, E. P. E. (508481287)","GENERIS - FARMACÊUTICA, S.A. (508107997)","153,72 €",06-12-2018,14-02-2018,1 dias,"Portugal, Lisboa, Lisboa",Artigo 259.º do Código dos Contratos Públicos,,,,,,2356543,CP 2016/19 - Medicamentos Antipsicóticos,FALSE
Obra de reparação na lavagem da palamenta da cozinha do HSM,Ajuste Direto Regime Geral,Empreitadas de obras públicas,"45453100-8, Obras de recuperação","Centro Hospitalar Universitário de Lisboa Norte, E. P. E. (508481287)","Engiexponente, Lda. (514995335)","10.376,00 €",06-12-2018,06-12-2018,25 dias,"Portugal, Lisboa, Lisboa","Artigo 19.º, alínea d) do Código dos Contratos Públicos",,,,,,Não aplicável.,Não aplicável.,FALSE
181000359 - Aquisição de RISPERIDONA SOL ORAL 1 MG/ML FRS 30 ML,Ao abrigo de acordo-quadro (art.º 259.º),Aquisição de bens móveis,"33690000-3, Medicamentos vários","Centro Hospitalar Universitário de Lisboa Norte, E. P. E. (508481287)","GENERIS - FARMACÊUTICA, S.A. (508107997)","223,50 €",06-12-2018,15-02-2018,1 dias,"Portugal, Lisboa, Lisboa",Artigo 259.º do Código dos Contratos Públicos,,,,,,2356543,CP 2016/19 - Medicamentos Antipsicóticos,FALSE
Aquisição de TNT em propipropileno,Ao abrigo de acordo-quadro (art.º 259.º),Aquisição de bens móveis,"33198200-6, Saquetas e invólucros de papel para esterilização","Centro Hospitalar Universitário de Lisboa Norte, E. P. E. (508481287)","Dimor Lusitania, Lda. (500730741)","3.277,60 €",06-12-2018,02-02-2018,332 dias,"Portugal, Lisboa, Lisboa",Artigo 259.º do Código dos Contratos Públicos,,,,,,1974943,CP 2016/43 - Acordo quadro para fornecimento de Material para Empacotamento em Esterilização às Instituições e Serviços do Serviço Nacional de Saúde.,FALSE
Aquisição de TNT em prolipropileno,Ao abrigo de acordo-quadro (art.º 259.º),Aquisição de bens móveis,"33198200-6, Saquetas e invólucros de papel para esterilização","Centro Hospitalar Universitário de Lisboa Norte, E. P. E. (508481287)","Medline, Lda. (510533515)","13.720,00 €",06-12-2018,02-02-2018,332 dias,"Portugal, Lisboa, Lisboa",Artigo 259.º do Código dos Contratos Públicos,,,,,,1974943,CP 2016/43 - Acordo quadro para fornecimento de Material para Empacotamento em Esterilização às Instituições e Serviços do Serviço Nacional de Saúde.,FALSE
181000358 - Aquisição de MEROPENEM SOL INJ 500 MG,Ao abrigo de acordo-quadro (art.º 259.º),Aquisição de bens móveis,"33690000-3, Medicamentos vários","Centro Hospitalar Universitário de Lisboa Norte, E. P. E. (508481287)","GENERIS - FARMACÊUTICA, S.A. (508107997)","2.835,00 €",06-12-2018,14-02-2018,1 dias,"Portugal, Lisboa, Lisboa",Artigo 259.º do Código dos Contratos Públicos,,,,,,2775691,CP 2017/5 - Acordo Quadro para fornecimento de Medicamentos anti-infeciosos: exceto antivíricos e antifúngicos,FALSE
181000356,Ao abrigo de acordo-quadro (art.º 259.º),Aquisição de bens móveis,"33690000-3, Medicamentos vários","Centro Hospitalar Universitário de Lisboa Norte, E. P. E. (508481287)",LAB. MEDINFAR- PROD.FARMACEUT.  SA (500384045),"675,00 €",06-12-2018,19-02-2018,3 dias,"Portugal, Lisboa, Lisboa",Artigo 259.º do Código dos Contratos Públicos,,,,,,2335591,CP 2016/01 - Acordo Quadro para fornecimento de Medicamentos do Aparelho Cardiovascular   às Instituições e Serviços do Serviço Nacional de Saúde,FALSE
181000355 - Aquisição de QUETIAPINA COMP 100 MG,Ao abrigo de acordo-quadro (art.º 259.º),Aquisição de bens móveis,"33690000-3, Medicamentos vários","Centro Hospitalar Universitário de Lisboa Norte, E. P. E. (508481287)","OVERPHARMA, LDA (505792362)","163,80 €",06-12-2018,23-02-2018,2 dias,"Portugal, Lisboa, Lisboa",Artigo 259.º do Código dos Contratos Públicos,,,,,,2356543,CP 2016/19 - Medicamentos Antipsicóticos,FALSE
Consulta Prévia n.º 182000038,Ao abrigo de acordo-quadro (art.º 259.º),Aquisição de bens móveis,"33198200-6, Saquetas e invólucros de papel para esterilização","Centro Hospitalar Universitário de Lisboa Norte, E. P. E. (508481287)","Dimor Lusitânia, Lda. (500730741)","3.393,60 €",06-12-2018,02-02-2018,332 dias,"Portugal, Lisboa, Lisboa",Artigo 259.º do Código dos Contratos Públicos,,,,,,1974943,CP 2016/43 - Acordo quadro para fornecimento de Material para Empacotamento em Esterilização às Instituições e Serviços do Serviço Nacional de Saúde.,FALSE
181000354 - Aquisição de HIDROPOLIMEROS ESPESSOS SEM REB PENSO 20 X 20,Ao abrigo de acordo-quadro (art.º 259.º),Aquisição de bens móveis,"33690000-3, Medicamentos vários","Centro Hospitalar Universitário de Lisboa Norte, E. P. E. (508481287)","CLINIFAR - PROD.CLINICOS E FARMAC., (503281115)","256,41 €",06-12-2018,16-02-2018,1 dias,"Portugal, Lisboa, Lisboa",Artigo 259.º do Código dos Contratos Públicos,,,,,,1315192,Acordo Quadro para fornecimento de material de penso de efeito terapêutico às Instituições e Serviços do Serviço Nacional de Saúde,FALSE
Aquisição de três carros unidose para o serviço de Giencologia,Consulta Prévia,Aquisição de bens móveis,"33100000-1, Equipamento médico","Centro Hospitalar Universitário de Lisboa Norte, E. P. E. (508481287)","PARAMEDICA EQUIPAMENTOS MEDICOS, LDA (501393005)","11.985,00 €",06-12-2018,03-12-2018,30 dias,"Portugal, Lisboa, Lisboa","Artigo 20.º, n.º 1, alínea c) do Código dos Contratos Públicos",,,,,,Não aplicável.,Não aplicável.,FALSE
181000352 - Etoposido Sol Inj 20 mg/ml Amp 5 ml,Ao abrigo de acordo-quadro (art.º 259.º),Aquisição de bens móveis,"33690000-3, Medicamentos vários","Centro Hospitalar Universitário de Lisboa Norte, E. P. E. (508481287)","ACCORD HEALTHCARE, UNIPESSOAL, LDA (508622263)","630,00 €",06-12-2018,14-02-2018,1 dias,"Portugal, Lisboa, Lisboa",Artigo 259.º do Código dos Contratos Públicos,,,,,,1771819,CP 2015/6 - Acordo quadro para o fornecimento de Medicamentos do Foro Oncológico,FALSE
Aquisição de serviços de manutenção ao licenciamento SYMATEC,Consulta Prévia,Aquisição de serviços,"72212761-1, Serviços de desenvolvimento de software antivírus","Centro Hospitalar Universitário de Lisboa Norte, E. P. E. (508481287)","ORAMIX - Sistemas de Informação, SA (504448382)","20.128,00 €",06-12-2018,28-11-2018,365 dias,"Portugal, Lisboa, Lisboa","Artigo 20.º, n.º 1, alínea c) do Código dos Contratos Públicos",,,,,,Não aplicável.,Não aplicável.,FALSE
Aquisição de cabos e lâminas de bisturi para o ano de 2018,Ao abrigo de acordo-quadro (art.º 259.º),Aquisição de bens móveis,"33141411-4, Bisturis e lâminas","Centro Hospitalar Universitário de Lisboa Norte, E. P. E. (508481287)","Anstacio Saldanha, Lda. (505804441)","1.294,84 €",06-12-2018,06-02-2018,329 dias,"Portugal, Lisboa, Lisboa",Artigo 259.º do Código dos Contratos Públicos,,,,,,2102851,CP 2016/74 - Acordo quadro para fornecimento de Material disposable de bloco operatório - Parte I-B às Instituições e Serviços do Serviço Nacional de Saúde,FALSE
181000351,Ao abrigo de acordo-quadro (art.º 259.º),Aquisição de bens móveis,"33690000-3, Medicamentos vários","Centro Hospitalar Universitário de Lisboa Norte, E. P. E. (508481287)","TECNIMEDE, SOC TECNICO-MED, SA (500626413)","144,00 €",06-12-2018,22-02-2018,1 dias,"Portugal, Lisboa, Lisboa",Artigo 259.º do Código dos Contratos Públicos,,,,,,2528670,"CP 2017/2 - Acordo Quadro para fornecimento de Medicamentos do Sistema Nervoso Cerebrospinal, exceto: anestésicos, relaxantes musculares, analgésicos, antipiréticos, antidepressivos e antipsicóticos  às Instituições e Serviços do Serviço Nacional de Saúde",FALSE
181000350 - Aquisição de FUROSEMIDA SOL INJ 10 MG/ML AMP 2 ML,Ao abrigo de acordo-quadro (art.º 259.º),Aquisição de bens móveis,"33690000-3, Medicamentos vários","Centro Hospitalar Universitário de Lisboa Norte, E. P. E. (508481287)","OVERPHARMA, LDA (505792362)","5.298,79 €",06-12-2018,15-02-2018,2 dias,"Portugal, Lisboa, Lisboa",Artigo 259.º do Código dos Contratos Públicos,,,,,,2335591,CP 2016/01 - Acordo Quadro para fornecimento de Medicamentos do Aparelho Cardiovascular   às Instituições e Serviços do Serviço Nacional de Saúde,FALSE
Aquisição de cabo e laminas de bisturi,Ao abrigo de acordo-quadro (art.º 259.º),Aquisição de bens móveis,"33141411-4, Bisturis e lâminas","Centro Hospitalar Universitário de Lisboa Norte, E. P. E. (508481287)","HR Hospitalar, Lda. (501895558)","11,40 €",06-12-2018,06-02-2018,329 dias,"Portugal, Lisboa, Lisboa",Artigo 259.º do Código dos Contratos Públicos,,,,,,2102851,CP 2016/74 - Acordo quadro para fornecimento de Material disposable de bloco operatório - Parte I-B às Instituições e Serviços do Serviço Nacional de Saúde,FALSE
181000349 - Aquisição de folinato de calcio 15 MG,Ao abrigo de acordo-quadro (art.º 259.º),Aquisição de bens móveis,"33690000-3, Medicamentos vários","Centro Hospitalar Universitário de Lisboa Norte, E. P. E. (508481287)",LAB. MEDINFAR- PROD.FARMACEUT.  SA (500384045),"2.640,00 €",06-12-2018,12-02-2018,3 dias,"Portugal, Lisboa, Lisboa",Artigo 259.º do Código dos Contratos Públicos,,,,,,1338581,"Acordo quadro para fornecimento de Medicação antialérgica, medicamentos usados no tratamento de intoxicações, vitaminas e sais minerais e grupo 20.9 - outros produtos às instituições e serviços do serviço nacional de saúde",FALSE
Aquisição de curetas para o ano de 2018,Ao abrigo de acordo-quadro (art.º 259.º),Aquisição de bens móveis,"33140000-3, Material médico de consumo","Centro Hospitalar Universitário de Lisboa Norte, E. P. E. (508481287)","HR Hospitalar, Lda. (501895558)","5.610,00 €",06-12-2018,06-02-2018,336 dias,"Portugal, Lisboa, Lisboa",Artigo 259.º do Código dos Contratos Públicos,,,,,,2414255,CP 2017/36 - Acordo Quadro para fornecimento de material de dispositivos médicos diversos às Instituições e Serviços do Serviço Nacional de Saúde,FALSE
Aquisição de cureta desc. 7 mm,Ao abrigo de acordo-quadro (art.º 259.º),Aquisição de bens móveis,"33190000-8, Dispositivos e produtos médicos variados","Centro Hospitalar Universitário de Lisboa Norte, E. P. E. (508481287)","HR Hospitalar, Lda. (501895558)","330,00 €",06-12-2018,31-01-2018,1 dias,"Portugal, Lisboa, Lisboa",Artigo 259.º do Código dos Contratos Públicos,,,,,,2414255,CP 2017/36 - Acordo Quadro para fornecimento de material de dispositivos médicos diversos às Instituições e Serviços do Serviço Nacional de Saúde,FALSE
"Aquisição de lâmina bisturi, cabo c/ lâmina e protector de sapatos",Ao abrigo de acordo-quadro (art.º 259.º),Aquisição de bens móveis,"33140000-3, Material médico de consumo","Centro Hospitalar Universitário de Lisboa Norte, E. P. E. (508481287)","Anastacio Saldanha, Lda. (505804441)","9,80 €",05-12-2018,01-02-2018,334 dias,"Portugal, Lisboa, Lisboa",Artigo 259.º do Código dos Contratos Públicos,,,,,,2102851,CP 2016/74 - Acordo quadro para fornecimento de Material disposable de bloco operatório - Parte I-B às Instituições e Serviços do Serviço Nacional de Saúde,FALSE
"Aquisição de lâmina bisturi, cabo com lâmina e protector de sapatos",Ao abrigo de acordo-quadro (art.º 259.º),Aquisição de bens móveis,"33140000-3, Material médico de consumo","Centro Hospitalar Universitário de Lisboa Norte, E. P. E. (508481287)","Docworld, Lda. (508592909)","651,00 €",05-12-2018,01-02-2018,334 dias,"Portugal, Lisboa, Lisboa",Artigo 259.º do Código dos Contratos Públicos,,,,,,2102851,CP 2016/74 - Acordo quadro para fornecimento de Material disposable de bloco operatório - Parte I-B às Instituições e Serviços do Serviço Nacional de Saúde,FALSE
Empreitada para execução da obra de paliativos do Serviço de Cardiologia II - Internamento - Geral,Ajuste Direto Regime Geral,Empreitadas de obras públicas,"45215000-7, Obras de construção de edifícios relacionados com serviços de saúde ou sociais, crematórios e instalações sanitárias públicas","Centro Hospitalar Universitário de Lisboa Norte, E. P. E. (508481287)","Vitor Augusto - Engenharia, Reabilitação e Construção, Unipessoal, Lda (514528800)","12.368,45 €",05-12-2018,05-12-2018,7 dias,"Portugal, Lisboa, Lisboa","Artigo 19.º, alínea d) do Código dos Contratos Públicos",,,,,,Não aplicável.,Não aplicável.,FALSE
181000344 - DOCETAXEL SOL INJ,Ao abrigo de acordo-quadro (art.º 259.º),Aquisição de bens móveis,"33690000-3, Medicamentos vários","Centro Hospitalar Universitário de Lisboa Norte, E. P. E. (508481287)","GENERIS - FARMACÊUTICA, S.A. (508107997)","1.339,00 €",05-12-2018,02-02-2018,1 dias,"Portugal, Lisboa, Lisboa",Artigo 259.º do Código dos Contratos Públicos,,,,,,1771819,CP 2015/6 - Acordo quadro para o fornecimento de Medicamentos do Foro Oncológico,FALSE
181000347 - IDARRUBICINA SOL INJ 5 MG AMP     CONC 6 SPMS,Ao abrigo de acordo-quadro (art.º 259.º),Aquisição de bens móveis,"33690000-3, Medicamentos vários","Centro Hospitalar Universitário de Lisboa Norte, E. P. E. (508481287)","ACCORD HEALTHCARE, UNIPESSOAL, LDA (508622263)","760,00 €",05-12-2018,27-02-2018,1 dias,"Portugal, Lisboa, Lisboa",Artigo 259.º do Código dos Contratos Públicos,,,,,,1771819,CP 2015/6 - Acordo quadro para o fornecimento de Medicamentos do Foro Oncológico,FALSE
181000346 - HIDROPOLIMERO COMPOSTO C/PRATA E CARVÃO  CONC 10 SPMS,Ao abrigo de acordo-quadro (art.º 259.º),Aquisição de bens móveis,"33690000-3, Medicamentos vários","Centro Hospitalar Universitário de Lisboa Norte, E. P. E. (508481287)",MOLNLYCKE HEALTH CARE-COM.PROD.HOSP (511101066),"4.485,60 €",05-12-2018,27-02-2018,2 dias,"Portugal, Lisboa, Lisboa",Artigo 259.º do Código dos Contratos Públicos,,,,,,1315192,Acordo Quadro para fornecimento de material de penso de efeito terapêutico às Instituições e Serviços do Serviço Nacional de Saúde,FALSE
181000343 - ALGINATO DE CALCIO COM PRATA PENSO 11X11  CONC 10 SPMS,Ao abrigo de acordo-quadro (art.º 259.º),Aquisição de bens móveis,"33690000-3, Medicamentos vários","Centro Hospitalar Universitário de Lisboa Norte, EPE (508481287)",Queenlabs - Especialidades Farmaceuticas Lda. (503984485),"1.176,00 €",05-12-2018,09-02-2018,1 dias,"Portugal, Lisboa, Lisboa",Artigo 259.º do Código dos Contratos Públicos,,,,,,1315192,Acordo Quadro para fornecimento de material de penso de efeito terapêutico às Instituições e Serviços do Serviço Nacional de Saúde,FALSE
181000342,Ao abrigo de acordo-quadro (art.º 259.º),Aquisição de bens móveis,"33690000-3, Medicamentos vários","Centro Hospitalar Universitário de Lisboa Norte, E. P. E. (508481287)","Generis - Farmaceutica, S.A (508107997)","131,25 €",05-12-2018,27-02-2018,1 dias,"Portugal, Lisboa, Lisboa",Artigo 259.º do Código dos Contratos Públicos,,,,,,1422736,CP 2015/41 - ACORDO QUADRO PARA FORNECIMENTO DE MEDICAMENTOS ANTI-INFECIOSOS: ANTIVÍRICOS E ANTIFÚNGICOS ÀS INSTITUIÇÕES E SERVIÇOS DO SERVIÇO NACIONAL DE SAÚDE,FALSE
181000340 - PEMBROLIZUMAB 50 MG INJ    CONC 61 SPMS,Ao abrigo de acordo-quadro (art.º 259.º),Aquisição de bens móveis,"33690000-3, Medicamentos vários","Centro Hospitalar Universitário de Lisboa Norte, E. P. E. (508481287)","Merck Sharp & Dome, Lda. (500191360)","105.000,00 €",05-12-2018,31-01-2018,2 dias,"Portugal, Lisboa, Lisboa",Artigo 259.º do Código dos Contratos Públicos,,,,,,2545980,CP 2017/61 - Acordo quadro para fornecimento de Medicamentos Diversos   às Instituições e Serviços do Serviço Nacional de Saúde,FALSE
181000339 - SOL DIÁLISE PERITONEAL C/ AMINOÁCIDOS 1%,Ao abrigo de acordo-quadro (art.º 259.º),Aquisição de bens móveis,"33690000-3, Medicamentos vários","Centro Hospitalar Universitário de Lisboa Norte, E. P. E. (508481287)","BAXTER - MÉDICO FARMACEUTICA, LDA (503347345)","400,00 €",05-12-2018,19-02-2018,1 dias,"Portugal, Lisboa, Lisboa",Artigo 259.º do Código dos Contratos Públicos,,,,,,1481309,CP 2015/35 - Acordo quadro para fornecimento de bens e prestação de serviços de Diálise Peritoneal às Instituições e Serviços do Serviço Nacional de Saúde,FALSE
"181000338 - LORAZEPAM COMP 2,5 MG",Ao abrigo de acordo-quadro (art.º 259.º),Aquisição de bens móveis,"33690000-3, Medicamentos vários","Centro Hospitalar Universitário de Lisboa Norte, E. P. E. (508481287)","LABESFAL - LABORATÓRIOS ALMIRO, S.A (501169580)","138,00 €",05-12-2018,30-01-2018,1 dias,"Portugal, Lisboa, Lisboa",Artigo 259.º do Código dos Contratos Públicos,,,,,,2528670,"CP 2017/2 - Acordo Quadro para fornecimento de Medicamentos do Sistema Nervoso Cerebrospinal, exceto: anestésicos, relaxantes musculares, analgésicos, antipiréticos, antidepressivos e antipsicóticos  às Instituições e Serviços do Serviço Nacional de Saúde",FALSE
"Aquisição de lâmina bisturi, cabo com lâmina e protector de sapatos",Ao abrigo de acordo-quadro (art.º 259.º),Aquisição de bens móveis,"33140000-3, Material médico de consumo","Centro Hospitalar Universitário de Lisboa Norte, E. P. E. (508481287)","HR Hospitalar, Lda. (501895558)","231,00 €",05-12-2018,01-02-2018,334 dias,"Portugal, Lisboa, Lisboa",Artigo 259.º do Código dos Contratos Públicos,,,,,,2102851,CP 2016/74 - Acordo quadro para fornecimento de Material disposable de bloco operatório - Parte I-B às Instituições e Serviços do Serviço Nacional de Saúde,FALSE
181000337 - LIDOCAINA 1% SOL INJ 10 MG/ML FRS 20 ML,Ao abrigo de acordo-quadro (art.º 259.º),Aquisição de bens móveis,"33690000-3, Medicamentos vários","Centro Hospitalar Universitário de Lisboa Norte, E. P. E. (508481287)",LABESFAL - LABORATÓRIOS ALMIRO S.A (501169580),"2.178,00 €",05-12-2018,30-01-2018,1 dias,"Portugal, Lisboa, Lisboa",Artigo 259.º do Código dos Contratos Públicos,,,,,,2211341,Medicamentos anestésicos e relaxantes musculares,FALSE
Aquisição de adesivo hipo TNT 10x10 cm,Ao abrigo de acordo-quadro (art.º 259.º),Aquisição de bens móveis,"33190000-8, Dispositivos e produtos médicos variados","Centro Hospitalar Universitário de Lisboa Norte, E. P. E. (508481287)","Dimor Lusitânia, Lda. (500730741)","528,00 €",05-12-2018,30-01-2018,335 dias,"Portugal, Lisboa, Lisboa",Artigo 259.º do Código dos Contratos Públicos,,,,,,2183753,CP 2016/82 - Acordo quadro para fornecimento de Nastros e Fitas Cirúrgicas às Instituições e Serviços do Serviço Nacional de Saúde,FALSE
182C000002 - Aquisição de sondas gástricas e gastroduo ENFIT durante o ano 2018,Ajuste Direto Regime Geral,Aquisição de bens móveis,"33141641-5, Sondas","Centro Hospitalar Lisboa Norte, E. P. E. (508481287)",VYGON PORTUGAL (503232785),"3.061,20 €",05-12-2018,16-03-2018,290 dias,"Portugal, Lisboa, Lisboa","Artigo 20.º, n.º 1, alínea d) do Código dos Contratos Públicos",,,,,,Não aplicável.,Não aplicável.,FALSE
182C000002 - Aquisição de sondas gástricas e gastroduo ENFIT durante o ano 2018,Ajuste Direto Regime Geral,Aquisição de bens móveis,"33141641-5, Sondas","Centro Hospitalar Lisboa Norte, E. P. E. (508481287)",Mundinter (500199906),"28.363,50 €",05-12-2018,16-03-2018,290 dias,"Portugal, Lisboa, Lisboa","Artigo 24.º, n.º 1, alínea d) do Código dos Contratos Públicos",,,,,,Não aplicável.,Não aplicável.,FALSE
182G001731 - AQUISIÇÃO DE DISPOSITIVOS PARA ABLAÇÃO DE FA COM PVAC DURANTE O ANO 2018,Ajuste Direto Regime Geral,Aquisição de bens móveis,"33190000-8, Dispositivos e produtos médicos variados","CENTRO HOSPITALAR LISBOA NORTE, EPE (508481287)","MEDTRONIC PORTUGAL, LDA (504223933)","188.982,57 €",05-12-2018,26-02-2018,332 dias,"Portugal, Lisboa, Lisboa","Artigo 24.º, n.º 1, alínea e), subalínea ii) do Código dos Contratos Públicos",,,,,,Não aplicável.,Não aplicável.,FALSE
182G001710 - AQUISIÇÃO DE CONSUMÍVEIS PARA ECT DIAGNOSTICO DURANTE O ANO 2018,Ajuste Direto Regime Geral,Aquisição de bens móveis,"33190000-8, Dispositivos e produtos médicos variados","Centro Hospitalar Lisboa Norte, E. P. E. (508481287)","Boston - Scientific Portugal, Lda (504988964)","302.600,00 €",05-12-2018,06-03-2018,300 dias,"Portugal, Lisboa, Lisboa","Artigo 24.º, n.º 1, alínea e), subalínea ii) do Código dos Contratos Públicos",,,,,,Não aplicável.,Não aplicável.,FALSE
Aquisição de almofadas durante o ano 2018,Ajuste Direto Regime Geral,Aquisição de bens móveis,"39516110-6, Almofadas","Centro Hospitalar Lisboa Norte, E. P. E. (508481287)",MEILEX LDA (501759441),"3.480,80 €",04-12-2018,21-03-2018,285 dias,"Portugal, Lisboa, Lisboa","Artigo 20.º, n.º 1, alínea d) do Código dos Contratos Públicos",,,,,,Não aplicável.,Não aplicável.,FALSE
Ajuste Direto n.º 181G003896,Ajuste Direto Regime Geral,Aquisição de bens móveis,"33690000-3, Medicamentos vários","Centro Hospitalar Universitário de Lisboa Norte, E. P. E. (508481287)",MERCK SHARP & DOHME LDA (500191360),"240.000,00 €",04-12-2018,14-11-2018,47 dias,"Portugal, Lisboa, Lisboa","Artigo 24.º, n.º 1, alínea e), subalínea ii) do Código dos Contratos Públicos",,,,,,Não aplicável.,Não aplicável.,FALSE
Ajuste Direto n.º 181G004026,Ajuste Direto Regime Geral,Aquisição de bens móveis,"33690000-3, Medicamentos vários","Centro Hospitalar Universitário de Lisboa Norte, E. P. E. (508481287)",SANDOZ FARMACEUTICA LDA (506985261),"18.750,00 €",04-12-2018,07-11-2018,54 dias,"Portugal, Lisboa, Lisboa","Artigo 24.º, n.º 1, alínea e), subalínea ii) do Código dos Contratos Públicos",,,,,,Não aplicável.,Não aplicável.,FALSE
Ajuste Direto n.º 181G013565,Ajuste Direto Regime Geral,Aquisição de bens móveis,"33190000-8, Dispositivos e produtos médicos variados","Centro Hospitalar Universitário de Lisboa Norte, E. P. E. (508481287)","Boston - Scientific Portugal, Lda (504988964)","15.523,00 €",04-12-2018,20-11-2018,1 dias,"Portugal, Lisboa, Lisboa","Artigo 24.º, n.º 1, alínea e), subalínea ii) do Código dos Contratos Públicos",,,,,,Não aplicável.,Não aplicável.,FALSE
Aquisição de biberões de vidro e descartáveis -ano de 2018,Consulta Prévia,Aquisição de bens móveis,"33681000-7, Tetinas, protectores de mamilo e artigos similares para bebés","Centro Hospitalar Universitário de Lisboa Norte, E. P. E. (508481287)","Normax - Fabrica de Vidros Cientificos, Lda. (500203130)","3.556,98 €",04-12-2018,15-03-2018,291 dias,"Portugal, Lisboa, Lisboa","Artigo 20.º, n.º 1, alínea c) do Código dos Contratos Públicos",,,,,,Não aplicável.,Não aplicável.,FALSE
Aquisição de biberões de vidro e descartáveis durante o ano de 2018,Consulta Prévia,Aquisição de bens móveis,"33681000-7, Tetinas, protectores de mamilo e artigos similares para bebés","Centro Hospitalar Universitário de Lisboa Norte, E. P. E. (508481287)","H. R. - Hospitalar, Lda (501895558)","23.758,56 €",04-12-2018,15-03-2018,291 dias,"Portugal, Lisboa, Lisboa","Artigo 20.º, n.º 1, alínea c) do Código dos Contratos Públicos",,,,,,Não aplicável.,Não aplicável.,FALSE
Aquisição de impressos e envelopes para o ano de 2018,Consulta Prévia,Aquisição de bens móveis,"22900000-9, Material impresso diverso","Centro Hospitalar Universitário de Lisboa Norte, E. P. E. (508481287)","Oficinas Gráficas Ribeiro de Pêra, Lda. (500569495)","4.355,50 €",04-12-2018,04-12-2018,1 dias,"Portugal, Lisboa, Lisboa","Artigo 20.º, n.º 1, alínea c) do Código dos Contratos Públicos",,,,,,Não aplicável.,Não aplicável.,FALSE
Ajuste Direto n.º 182G013594,Ajuste Direto Regime Geral,Aquisição de bens móveis,"33190000-8, Dispositivos e produtos médicos variados","Centro Hospitalar Universitário de Lisboa Norte, E. P. E. (508481287)","MEDTRONIC PORTUGAL, LDA (504223933)","8.333,00 €",04-12-2018,20-11-2018,1 dias,"Portugal, Lisboa, Lisboa","Artigo 24.º, n.º 1, alínea e), subalínea ii) do Código dos Contratos Públicos",,,,,,Não aplicável.,Não aplicável.,FALSE
Ajuste Direto n.º 181G004198,Ajuste Direto Regime Geral,Aquisição de bens móveis,"33696000-5, Reagentes e meios de contraste","Centro Hospitalar Universitário de Lisboa Norte, E. P. E. (508481287)",ROCHE SISTEMAS DIAGNOSTICOS LDA (504282921),"5.000,00 €",04-12-2018,21-11-2018,2 dias,"Portugal, Lisboa, Lisboa","Artigo 24.º, n.º 1, alínea e), subalínea iii) do Código dos Contratos Públicos",,,,,,Não aplicável.,Não aplicável.,FALSE
Ajuste Direto n.º 181G004108,Ajuste Direto Regime Geral,Aquisição de bens móveis,"33696000-5, Reagentes e meios de contraste","Centro Hospitalar Universitário de Lisboa Norte, E. P. E. (508481287)",WERFEN PORTUGAL UNIPESSOAL LDA (501086110),"5.040,00 €",04-12-2018,21-11-2018,3 dias,"Portugal, Lisboa, Lisboa","Artigo 24.º, n.º 1, alínea e), subalínea ii) do Código dos Contratos Públicos",,,,,,Não aplicável.,Não aplicável.,FALSE
Ajuste Direto n.º 181G004106,Ajuste Direto Regime Geral,Aquisição de bens móveis,"33690000-3, Medicamentos vários","Centro Hospitalar Universitário de Lisboa Norte, E. P. E. (508481287)",WERFEN PORTUGAL UNIPESSOAL LDA (501086110),"5.200,00 €",04-12-2018,21-11-2018,3 dias,"Portugal, Lisboa, Lisboa","Artigo 24.º, n.º 1, alínea e), subalínea ii) do Código dos Contratos Públicos",,,,,,Não aplicável.,Não aplicável.,FALSE
Ajuste Direto n.º 181G003976,Ajuste Direto Regime Geral,Aquisição de bens móveis,"33690000-3, Medicamentos vários","Centro Hospitalar Universitário de Lisboa Norte, E. P. E. (508481287)",PROFARIN (500223238),"9.758,90 €",04-12-2018,21-11-2018,2 dias,"Portugal, Lisboa, Lisboa","Artigo 24.º, n.º 1, alínea e), subalínea iii) do Código dos Contratos Públicos",,,,,,Não aplicável.,Não aplicável.,FALSE
Ajuste Direto n.º 181G004044,Consulta Prévia,Aquisição de bens móveis,"33690000-3, Medicamentos vários","Centro Hospitalar Universitário de Lisboa Norte, E. P. E. (508481287)","Sanofi-Produtos Farmaceuticos,Lda (500134960)","54,00 €",04-12-2018,21-11-2018,1 dias,"Portugal, Lisboa, Lisboa",Artigo 27.º-A do Código dos Contratos Públicos,,,,,,Não aplicável.,Não aplicável.,FALSE
Aquisição de discos para computador,Consulta Prévia,Aquisição de bens móveis,"30233130-1, Unidades de memória em discos magnéticos","Centro Hospitalar Universitário de Lisboa Norte, E. P. E. (508481287)","SATURN NUMBERS, LDA (513576150)","9.712,50 €",04-12-2018,04-12-2018,27 dias,"Portugal, Lisboa, Lisboa","Artigo 20.º, n.º 1, alínea c) do Código dos Contratos Públicos",,,,,,Não aplicável.,Não aplicável.,FALSE
Ajuste Direto n.º 181G004004,Ajuste Direto Regime Geral,Aquisição de bens móveis,"33690000-3, Medicamentos vários","Centro Hospitalar Universitário de Lisboa Norte, E. P. E. (508481287)",THERMO FISHER DIAGNOSTICS (506916243),"8.643,00 €",04-12-2018,21-11-2018,2 dias,"Portugal, Lisboa, Lisboa","Artigo 24.º, n.º 1, alínea e), subalínea iii) do Código dos Contratos Públicos",,,,,,Não aplicável.,Não aplicável.,FALSE
Ajuste Direto n.º 181G003985,Ajuste Direto Regime Geral,Aquisição de bens móveis,"33690000-3, Medicamentos vários","Centro Hospitalar Universitário de Lisboa Norte, E. P. E. (508481287)",BECKMAN COULTER PORTUGAL UNIP LDA (509035167),"6.000,00 €",04-12-2018,21-11-2018,3 dias,"Portugal, Lisboa, Lisboa","Artigo 24.º, n.º 1, alínea e), subalínea ii) do Código dos Contratos Públicos",,,,,,Não aplicável.,Não aplicável.,FALSE
Ajuste Direto n.º 181G003929,Ajuste Direto Regime Geral,Aquisição de bens móveis,"33690000-3, Medicamentos vários","Centro Hospitalar Universitário de Lisboa Norte, E. P. E. (508481287)",PROFARIN (500223238),"7.807,12 €",04-12-2018,21-11-2018,2 dias,"Portugal, Lisboa, Lisboa","Artigo 24.º, n.º 1, alínea e), subalínea iii) do Código dos Contratos Públicos",,,,,,Não aplicável.,Não aplicável.,FALSE
Ajuste Direto n.º 181G003930,Ajuste Direto Regime Geral,Aquisição de bens móveis,"33690000-3, Medicamentos vários","Centro Hospitalar Universitário de Lisboa Norte, E. P. E. (508481287)","AMGEN BIOFARMACÊUTICA, LDA. (502942959)","40.304,16 €",04-12-2018,31-10-2018,61 dias,"Portugal, Lisboa, Lisboa","Artigo 24.º, n.º 1, alínea e), subalínea ii) do Código dos Contratos Públicos",,,,,,Não aplicável.,Não aplicável.,FALSE
Ajuste Direto n.º 181G003954,Ajuste Direto Regime Geral,Aquisição de bens móveis,"33696000-5, Reagentes e meios de contraste","Centro Hospitalar Universitário de Lisboa Norte, E. P. E. (508481287)",WERFEN PORTUGAL UNIPESSOAL LDA (501086110),"8.280,00 €",04-12-2018,21-11-2018,3 dias,"Portugal, Lisboa, Lisboa","Artigo 24.º, n.º 1, alínea e), subalínea iii) do Código dos Contratos Públicos",,,,,,Não aplicável.,Não aplicável.,FALSE
Aquisição de serviços de reparação de broncoscópio convencional,Ajuste Direto Regime Geral,Aquisição de serviços,"50420000-5, Serviços de reparação e manutenção de equipamento médico e cirúrgico","Centro Hospitalar Universitário de Lisboa Norte, EPE (508481287)","SISTEMAS INTEGRALES DE LA MEDICINA., S.A. (980488842)","6.716,90 €",04-12-2018,04-12-2018,27 dias,"Portugal, Lisboa, Lisboa","Artigo 24.º, n.º 1, alínea e), subalínea iii) do Código dos Contratos Públicos",,,,,,Não aplicável.,Não aplicável.,FALSE
"Ajuste Direto n,.º 181G004087",Ajuste Direto Regime Geral,Aquisição de bens móveis,"33690000-3, Medicamentos vários","Centro Hospitalar Universitário de Lisboa Norte, E. P. E. (508481287)","ALERE, LDA (502518863)","5.500,00 €",04-12-2018,21-11-2018,2 dias,"Portugal, Lisboa, Lisboa","Artigo 24.º, n.º 1, alínea e), subalínea iii) do Código dos Contratos Públicos",,,,,,Não aplicável.,Não aplicável.,FALSE
Aquisição de virus respiratório painel 2 teste identif.,Ajuste Direto Regime Geral,Aquisição de bens móveis,"33696000-5, Reagentes e meios de contraste","Centro Hospitalar Universitário de Lisboa Norte, EPE (508481287)",WERFEN PORTUGAL UNIPESSOAL LDA (501086110),"5.040,00 €",04-12-2018,04-12-2018,27 dias,"Portugal, Lisboa, Lisboa","Artigo 24.º, n.º 1, alínea e), subalínea ii) do Código dos Contratos Públicos",,,,,,Não aplicável.,Não aplicável.,FALSE
Ajuste Direto n.º 181G004088,Ajuste Direto Regime Geral,Aquisição de bens móveis,"33696000-5, Reagentes e meios de contraste","Centro Hospitalar Universitário de Lisboa Norte, E. P. E. (508481287)",WERFEN PORTUGAL UNIPESSOAL LDA (501086110),"7.200,00 €",04-12-2018,21-11-2018,3 dias,"Portugal, Lisboa, Lisboa","Artigo 24.º, n.º 1, alínea e), subalínea iii) do Código dos Contratos Públicos",,,,,,Não aplicável.,Não aplicável.,FALSE
Ajuste Direto n.º 181G003921,Ajuste Direto Regime Geral,Aquisição de bens móveis,"33690000-3, Medicamentos vários","Centro Hospitalar Universitário de Lisboa Norte, E. P. E. (508481287)","ROCHE FARMACEUTICA QUIMICA, LDA (500233810)","36.532,44 €",04-12-2018,30-10-2018,62 dias,"Portugal, Lisboa, Lisboa","Artigo 24.º, n.º 1, alínea e), subalínea iii) do Código dos Contratos Públicos",,,,,,Não aplicável.,Não aplicável.,FALSE
Ajuste Direto n.º 181G003739,Ajuste Direto Regime Geral,Aquisição de bens móveis,"33690000-3, Medicamentos vários","Centro Hospitalar Universitário de Lisboa Norte, E. P. E. (508481287)",UNILFARMA (500293023),"67.999,99 €",04-12-2018,05-11-2018,56 dias,"Portugal, Lisboa, Lisboa","Artigo 24.º, n.º 1, alínea e), subalínea iii) do Código dos Contratos Públicos",,,,,,Não aplicável.,Não aplicável.,FALSE
Regularização de material utilizado em Cirurgia de Ortopedia,Ajuste Direto Regime Geral,Aquisição de bens móveis,"33190000-8, Dispositivos e produtos médicos variados","Centro Hospitalar Universitário de Lisboa Norte, E. P. E. (508481287)","MCT POR, UNIPESSOAL, LDA (510020569)","8.920,00 €",04-12-2018,22-11-2018,1 dias,"Portugal, Lisboa, Lisboa","Artigo 24.º, n.º 1, alínea e), subalínea ii) do Código dos Contratos Públicos",,,,,,Não aplicável.,Não aplicável.,FALSE
Consulta prévia n.º 181G004075,Consulta Prévia,Aquisição de bens móveis,"33690000-3, Medicamentos vários","Centro Hospitalar Universitário de Lisboa Norte, E. P. E. (508481287)",INTERSURGICAL PORTUGAL (503480045),"350,00 €",04-12-2018,21-11-2018,2 dias,"Portugal, Lisboa, Lisboa",Artigo 27.º-A do Código dos Contratos Públicos,,,,,,Não aplicável.,Não aplicável.,FALSE
Aquisição de urinol descartável - AQ n.º 2016/86,Ao abrigo de acordo-quadro (art.º 259.º),Aquisição de bens móveis,"33700000-7, Produtos para cuidados pessoais","Centro Hospitalar Universitário de Lisboa Norte, E. P. E. (508481287)",Ezequiel Panão Jorge (501412727),"119,10 €",04-12-2018,18-06-2018,196 dias,"Portugal, Lisboa, Lisboa",Artigo 259.º do Código dos Contratos Públicos,,,,,,2349400,Acordo quadro para o fornecimento de Dispositivos para evacuação e para banho.,FALSE
Ajuste Direto n.º 181G003913,Ajuste Direto Regime Geral,Aquisição de bens móveis,"33696000-5, Reagentes e meios de contraste","Centro Hospitalar Universitário de Lisboa Norte, E. P. E. (508481287)",WERFEN PORTUGAL UNIPESSOAL LDA (501086110),"45.000,00 €",04-12-2018,31-10-2018,61 dias,"Portugal, Lisboa, Lisboa","Artigo 24.º, n.º 1, alínea e), subalínea ii) do Código dos Contratos Públicos",,,,,,Não aplicável.,Não aplicável.,FALSE
Aquisição de ABL 90 flex cassete teste 900 T,Ajuste Direto Regime Geral,Aquisição de bens móveis,"33690000-3, Medicamentos vários","Centro Hospitalar Universitário de Lisboa Norte, E. P. E. (508481287)",Radiometer Ibérica SL (980201667),"5.037,48 €",04-12-2018,04-12-2018,27 dias,"Portugal, Lisboa, Lisboa","Artigo 24.º, n.º 1, alínea e), subalínea ii) do Código dos Contratos Públicos",,,,,,Não aplicável.,Não aplicável.,FALSE
Ajuste Direto n.º 181G004201,Ajuste Direto Regime Geral,Aquisição de bens móveis,"33690000-3, Medicamentos vários","Centro Hospitalar Universitário de Lisboa Norte, E. P. E. (508481287)","FRESENIUS KABI PHARMA PORTUGAL,LDA (504293753)","6.912,00 €",04-12-2018,21-11-2018,1 dias,"Portugal, Lisboa, Lisboa","Artigo 24.º, n.º 1, alínea e), subalínea ii) do Código dos Contratos Públicos",,,,,,Não aplicável.,Não aplicável.,FALSE
Consulta Prévia n.º 181G004058,Consulta Prévia,Aquisição de bens móveis,"33690000-3, Medicamentos vários","Centro Hospitalar Universitário de Lisboa Norte, E. P. E. (508481287)","CLINIFAR -PROD. CLINICOX E FARMACIA S,A, (503281115)","86,11 €",04-12-2018,22-11-2018,1 dias,"Portugal, Lisboa, Lisboa",Artigo 27.º-A do Código dos Contratos Públicos,,,,,,Não aplicável.,Não aplicável.,FALSE
Ajuste Direto n.º 181G003912,Ajuste Direto Regime Geral,Aquisição de bens móveis,"33690000-3, Medicamentos vários","Centro Hospitalar Universitário de Lisboa Norte, E. P. E. (508481287)",WERFEN PORTUGAL LDA (501086110),"7.500,00 €",04-12-2018,22-11-2018,3 dias,"Portugal, Lisboa, Lisboa","Artigo 24.º, n.º 1, alínea e), subalínea ii) do Código dos Contratos Públicos",,,,,,Não aplicável.,Não aplicável.,FALSE
Ajuste Direto n.º 181G004096,Ajuste Direto Regime Geral,Aquisição de bens móveis,"33690000-3, Medicamentos vários","Centro Hospitalar Universitário de Lisboa Norte, E. P. E. (508481287)",Orphan Europe SARL. (FR79379088115),"39.600,00 €",04-12-2018,22-11-2018,1 dias,"Portugal, Lisboa, Lisboa","Artigo 24.º, n.º 1, alínea e), subalínea iii) do Código dos Contratos Públicos",,,,,,Não aplicável.,Não aplicável.,FALSE
Aquisição de valvula aortica s/ sutura 19 mm,Ajuste Direto Regime Geral,Aquisição de bens móveis,"33190000-8, Dispositivos e produtos médicos variados","Centro Hospitalar Universitário de Lisboa Norte, E. P. E. (508481287)",Edwards Lifesciences (508014832),"5.900,00 €",04-12-2018,04-12-2018,27 dias,"Portugal, Lisboa, Lisboa","Artigo 24.º, n.º 1, alínea e), subalínea ii) do Código dos Contratos Públicos",,,,,,Não aplicável.,Não aplicável.,FALSE
Ajuste Direto n.º 181G003991,Ajuste Direto Regime Geral,Aquisição de bens móveis,"33690000-3, Medicamentos vários","Centro Hospitalar Universitário de Lisboa Norte, E. P. E. (508481287)",AIR LIQUIDE MEDICINAL SA (501576436),"7.408,80 €",04-12-2018,22-11-2018,1 dias,"Portugal, Lisboa, Lisboa","Artigo 24.º, n.º 1, alínea e), subalínea ii) do Código dos Contratos Públicos",,,,,,Não aplicável.,Não aplicável.,FALSE
Ajuste Direto n.º 181G004113,Ajuste Direto Regime Geral,Aquisição de bens móveis,"33690000-3, Medicamentos vários","Centro Hospitalar Universitário de Lisboa Norte, E. P. E. (508481287)",ORIONFIN UNIPESSOAL LDA. (508907365),"6.287,90 €",04-12-2018,23-11-2018,2 dias,"Portugal, Lisboa, Lisboa","Artigo 24.º, n.º 1, alínea e), subalínea iii) do Código dos Contratos Públicos",,,,,,Não aplicável.,Não aplicável.,FALSE
Aquisição de efarirenze 600 mg + emtricitabina 200 mg +  tenofovir 245 mg comprimidos,Ajuste Direto Regime Geral,Aquisição de bens móveis,"33651400-2, Antivíricos de uso sistémico","Centro Hospitalar Universitário de Lisboa Norte, E. P. E. (508481287)","TEVA PHARMA - PRODUTOS FARMACEUTICOS,LDA (507045491)","67.860,00 €",04-12-2018,04-12-2018,27 dias,"Portugal, Lisboa, Lisboa","Artigo 24.º, n.º 1, alínea c) do Código dos Contratos Públicos",,,,,,Não aplicável.,Não aplicável.,FALSE
Ajuste Direto n.º 182G013522,Ajuste Direto Regime Geral,Aquisição de bens móveis,"33190000-8, Dispositivos e produtos médicos variados","Centro Hospitalar Universitário de Lisboa Norte, E. P. E. (508481287)",Edwards Lifesciences (508014832),"5.900,00 €",04-12-2018,20-11-2018,2 dias,"Portugal, Lisboa, Lisboa","Artigo 24.º, n.º 1, alínea e), subalínea ii) do Código dos Contratos Públicos",,,,,,Não aplicável.,Não aplicável.,FALSE
CP n.º 181A000018 - Aquisição de darunavir 800 mg - comprimidos,Concurso público,Aquisição de bens móveis,"33651400-2, Antivíricos de uso sistémico","Centro Hospitalar Universitário de Lisboa Norte, E. P. E. (508481287)","Sandoz Farmaceutica, Lda (506985261)","80.400,00 €",03-12-2018,30-11-2018,30 dias,"Portugal, Lisboa, Lisboa","Artigo 155.º, alínea a) do Código dos Contratos Públicos",,,,,,Não aplicável.,Não aplicável.,FALSE
