Objeto do Contrato,Tipo de Procedimento,Tipo(s) de Contrato,CPVs,Entidade(s) Adjudicante(s),Entidade(s) Adjudicatária(s),Preço Contratual,Data de Publicação,Data de Celebração do Contrato,Prazo de Execução,Local de Execução,Fundamentação,Data de Fecho do Contrato,Preço Total Efetivo,Causas das Alterações ao Prazo,Causas das Alterações ao Preço,Estado,N.º registo do Acordo Quadro,Descrição do Acordo Quadro,Procedimento Centralizado
20170097 - Aquisição de serviços de publicação de anúncios de procedimentos concursais,Ajuste Direto Regime Geral,Aquisição de serviços,"79824000-6, Serviços de impressão e distribuição","Instituto Nacional de Saúde Doutor Ricardo Jorge, I. P. (501427511)","Global Noticias - Media Group, S.A. (502535369)","1.500,00 €",27-04-2017,14-02-2017,320 dias,"Portugal, Lisboa, Lisboa","Artigo 20.º, n.º 1, alínea a) do Código dos Contratos Públicos",09-01-2018,"1.400,00 €",,O valor estimado foi superior às necessidades efetivas da prestação de serviços,,Não aplicável.,Não aplicável.,FALSE
20170191 - Aquisição de reagente,Ajuste Direto Regime Geral,Aquisição de bens móveis,"33696500-0, Reagentes de laboratório","Instituto Nacional de Saúde Doutor Ricardo Jorge, I. P. (501427511)",Teknokroma S.A. (A08541468),"2.919,64 €",27-04-2017,19-04-2017,90 dias,"Portugal, Porto, Porto","Artigo 24.º, n.º 1, alínea e) do Código dos Contratos Públicos",04-05-2017,"2.919,64 €",,"",,Não aplicável.,Não aplicável.,FALSE
20170191 - Aquisição de reagente,Ajuste Direto Regime Geral,Aquisição de bens móveis,"33696500-0, Reagentes de laboratório","Instituto Nacional de Saúde Doutor Ricardo Jorge, I. P. (501427511)",CAROTENATURE GMBH (CHE101151197),"424,99 €",27-04-2017,12-04-2017,90 dias,"Portugal, Lisboa, Lisboa","Artigo 24.º, n.º 1, alínea e) do Código dos Contratos Públicos",30-11-2017,"424,99 €",,"",,Não aplicável.,Não aplicável.,FALSE
