Objeto do Contrato,Tipo de Procedimento,Tipo(s) de Contrato,CPVs,Entidade(s) Adjudicante(s),Entidade(s) Adjudicatária(s),Preço Contratual,Data de Publicação,Data de Celebração do Contrato,Prazo de Execução,Local de Execução,Fundamentação,Data de Fecho do Contrato,Preço Total Efetivo,Causas das Alterações ao Prazo,Causas das Alterações ao Preço,Estado,N.º registo do Acordo Quadro,Descrição do Acordo Quadro,Procedimento Centralizado
20180620 - Aquisição de reagentes para diagnóstico de Sarampo,Ajuste Direto Regime Geral,Aquisição de bens móveis,"33696500-0, Reagentes de laboratório","Instituto Nacional de Saúde Doutor Ricardo Jorge, I. P. (501427511)","DIASORIN IBERIA, S.A (980379563)","1.939,66 €",07-01-2019,03-12-2018,90 dias,"Portugal, Lisboa, Lisboa","Artigo 24.º, n.º 1, alínea c) do Código dos Contratos Públicos","","",,"",,Não aplicável.,Não aplicável.,FALSE
CP 47-2018 Reagentes para biologia molecular,Concurso público,Aquisição de bens móveis,"33696500-0, Reagentes de laboratório",Instituto Nacional de Saúde Dr.Ricardo Jorge(INSA) (501427511),"AMBIFOOD, LDA. (505400057)","1.140,00 €",07-01-2019,15-10-2018,91 dias,Portugal,"Artigo 20.º, n.º 1, alínea b) do Código dos Contratos Públicos","","",,"",,Não aplicável.,Não aplicável.,FALSE
CP 47-2018 Reagentes para biologia molecular,Concurso público,Aquisição de bens móveis,"33696500-0, Reagentes de laboratório",Instituto Nacional de Saúde Dr.Ricardo Jorge(INSA) (501427511),"Biognóstica - Distribuição de Prod. e Equip. Técnicos, Lda. (504441256)","280,00 €",07-01-2019,15-10-2018,91 dias,Portugal,"Artigo 20.º, n.º 1, alínea b) do Código dos Contratos Públicos","","",,"",,Não aplicável.,Não aplicável.,FALSE
CP 47-2018 Reagentes para biologia molecular,Concurso público,Aquisição de bens móveis,"33696500-0, Reagentes de laboratório",Instituto Nacional de Saúde Dr.Ricardo Jorge(INSA) (501427511),"LABORSPIRIT, LDA. (507485149)","5.627,46 €",07-01-2019,15-10-2018,91 dias,Portugal,"Artigo 20.º, n.º 1, alínea b) do Código dos Contratos Públicos","","",,"",,Não aplicável.,Não aplicável.,FALSE
CP 47-2018 Reagentes para biologia molecular,Concurso público,Aquisição de bens móveis,"33696500-0, Reagentes de laboratório",Instituto Nacional de Saúde Dr.Ricardo Jorge(INSA) (501427511),"ARIUM - Sistemas de Diagnóstico, LDA. (502501880)","1.320,00 €",07-01-2019,15-10-2018,91 dias,Portugal,"Artigo 20.º, n.º 1, alínea b) do Código dos Contratos Públicos","","",,"",,Não aplicável.,Não aplicável.,FALSE
CP 47-2018 Reagentes para biologia molecular,Concurso público,Aquisição de bens móveis,"33696500-0, Reagentes de laboratório",Instituto Nacional de Saúde Dr.Ricardo Jorge(INSA) (501427511),"QUILABAN,LDA. (500399670)","205,92 €",07-01-2019,15-10-2018,91 dias,Portugal,"Artigo 20.º, n.º 1, alínea b) do Código dos Contratos Públicos","","",,"",,Não aplicável.,Não aplicável.,FALSE
CP 47-2018 Reagentes para biologia molecular,Concurso público,Aquisição de bens móveis,"33696500-0, Reagentes de laboratório",Instituto Nacional de Saúde Dr.Ricardo Jorge(INSA) (501427511),"SOQUIMICA, LDA. (500274231)","3.897,90 €",07-01-2019,15-10-2018,91 dias,Portugal,"Artigo 20.º, n.º 1, alínea b) do Código dos Contratos Públicos","","",,"",,Não aplicável.,Não aplicável.,FALSE
CP 47-2018 Reagentes para biologia molecular,Concurso público,Aquisição de bens móveis,"33696500-0, Reagentes de laboratório",Instituto Nacional de Saúde Dr.Ricardo Jorge(INSA) (501427511),"Biomérieux Portugal, Lda (501524177)","2.547,90 €",07-01-2019,15-10-2018,91 dias,Portugal,"Artigo 20.º, n.º 1, alínea b) do Código dos Contratos Públicos","","",,"",,Não aplicável.,Não aplicável.,FALSE
CP 47-2018 Reagentes para biologia molecular,Concurso público,Aquisição de bens móveis,"33696500-0, Reagentes de laboratório",Instituto Nacional de Saúde Dr.Ricardo Jorge(INSA) (501427511),"EUROIMMUN Portugal, Unipessoal Lda. (504022180)","500,00 €",07-01-2019,15-10-2018,91 dias,Portugal,"Artigo 20.º, n.º 1, alínea b) do Código dos Contratos Públicos","","",,"",,Não aplicável.,Não aplicável.,FALSE
CP 47-2018 Reagentes para biologia molecular,Concurso público,Aquisição de bens móveis,"33696500-0, Reagentes de laboratório",Instituto Nacional de Saúde Dr.Ricardo Jorge(INSA) (501427511),"VWR International, Lda (503842770)","857,00 €",07-01-2019,15-10-2018,91 dias,Portugal,"Artigo 20.º, n.º 1, alínea b) do Código dos Contratos Públicos","","",,"",,Não aplicável.,Não aplicável.,FALSE
CP 47-2018 Reagentes para biologia molecular,Concurso público,Aquisição de bens móveis,"33696500-0, Reagentes de laboratório",Instituto Nacional de Saúde Dr.Ricardo Jorge(INSA) (501427511),"Qlabo - Equipamentos de Laboratório e Serviços, LDA. (503829994)","11.640,42 €",07-01-2019,25-10-2018,91 dias,Portugal,"Artigo 20.º, n.º 1, alínea b) do Código dos Contratos Públicos","","",,"",,Não aplicável.,Não aplicável.,FALSE
CP 47-2018 Reagentes para biologia molecular,Concurso público,Aquisição de bens móveis,"33696500-0, Reagentes de laboratório",Instituto Nacional de Saúde Dr.Ricardo Jorge(INSA) (501427511),Alfagene (503387398),"100.629,99 €",07-01-2019,25-10-2018,91 dias,Portugal,"Artigo 20.º, n.º 1, alínea b) do Código dos Contratos Públicos","","",,"",,Não aplicável.,Não aplicável.,FALSE
CP 47-2018 Reagentes para biologia molecular,Concurso público,Aquisição de bens móveis,"33696500-0, Reagentes de laboratório",Instituto Nacional de Saúde Dr.Ricardo Jorge(INSA) (501427511),"Gomensoro Potencial Zero - Instrumentação Científica, lda. (506704017)","12.503,00 €",07-01-2019,15-10-2018,91 dias,Portugal,"Artigo 20.º, n.º 1, alínea b) do Código dos Contratos Públicos","","",,"",,Não aplicável.,Não aplicável.,FALSE
20180049 - Aquisição de gasóleo para aquecimento,Ajuste Direto Regime Geral,Aquisição de bens móveis,"09135100-5, Combustível para aquecimento","Instituto Nacional de Saúde Doutor Ricardo Jorge, I. P. (501427511)","REPSOL DIRECTO, LDA (504425242)","9.416,00 €",07-01-2019,02-02-2018,330 dias,"Portugal, Lisboa, Lisboa","Artigo 20.º, n.º 1, alínea d) do Código dos Contratos Públicos",09-08-2018,"9.415,32 €",,faturação de acordo com os preços em vigor,,Não aplicável.,Não aplicável.,FALSE
20180329 - 1 Computador de Secretária avançado,Ao abrigo de acordo-quadro (art.º 259.º),Aquisição de bens móveis,"30213300-8, Computadores de secretária (desktop computers)",Instituto Nacional de Saúde Dr.Ricardo Jorge(INSA) (501427511),"Paulo S. Conde, Lda (506324729)","1.033,00 €",03-01-2019,10-07-2018,90 dias,Portugal,Artigo 259.º do Código dos Contratos Públicos,29-10-2018,"1.033,00 €",,"",,1196657,Acordo Quadro para aquisição e aluguer operacional de equipamento informático,FALSE
