Objeto do Contrato,Tipo de Procedimento,Tipo(s) de Contrato,CPVs,Entidade(s) Adjudicante(s),Entidade(s) Adjudicatária(s),Preço Contratual,Data de Publicação,Data de Celebração do Contrato,Prazo de Execução,Local de Execução,Fundamentação,Data de Fecho do Contrato,Preço Total Efetivo,Causas das Alterações ao Prazo,Causas das Alterações ao Preço,Estado,N.º registo do Acordo Quadro,Descrição do Acordo Quadro,Procedimento Centralizado
Aquisição de Serviços de Verificação Técnica de Equipamentos Médicos [PC/00300011/2018],Consulta Prévia,Aquisição de serviços,"50433000-9, Serviços de calibragem","Centro Hospitalar do Baixo Vouga, E. P. E. (510123210)",SUCH (500900469),"17.968,50 €",03-07-2018,13-06-2018,60 dias,"Portugal, Aveiro, Estarreja<BR/>Portugal, Aveiro, Águeda<BR/>Portugal, Aveiro, Aveiro","Artigo 20.º, n.º 1, alínea c) do Código dos Contratos Públicos",,,,,,Não aplicável.,Não aplicável.,FALSE
Aquisição de Serviços de Ensaios de Equipamentos de Frio e Laboratório [PC/00300010/2018].,Consulta Prévia,Aquisição de serviços,"50433000-9, Serviços de calibragem","Centro Hospitalar do Baixo Vouga, E. P. E. (510123210)",ISQ - Instituto de Soldadura e Qualidade (500140022),"13.880,00 €",03-07-2018,13-06-2018,22 dias,"Portugal, Aveiro, Estarreja<BR/>Portugal, Aveiro, Águeda<BR/>Portugal, Aveiro, Aveiro","Artigo 20.º, n.º 1, alínea c) do Código dos Contratos Públicos",,,,,,Não aplicável.,Não aplicável.,FALSE
FORNECIMENTO DE EQUIPAMENTO DIVERSO AO ABRIGO DO CP2015/76 SPMS,Ao abrigo de acordo-quadro (art.º 259.º),Aquisição de bens móveis,"33100000-1, Equipamento médico","Centro Hospitalar do Baixo Vouga, E.P.E. (510123210)",Paul Hartmann (502271728),"910,00 €",03-07-2018,02-07-2018,2 dias,"Portugal, Aveiro, Aveiro",Artigo 259.º do Código dos Contratos Públicos,,,,,,1587913,Acordo Quadro para fornecimento de Equipamentos e Dispositivos Médicos de uso comum em internamento e ambulatório - Parte I às instituições e serviços do Serviço Nacional de Saúde.,FALSE
