Objeto do Contrato,Tipo de Procedimento,Tipo(s) de Contrato,CPVs,Entidade(s) Adjudicante(s),Entidade(s) Adjudicatária(s),Preço Contratual,Data de Publicação,Data de Celebração do Contrato,Prazo de Execução,Local de Execução,Fundamentação,Data de Fecho do Contrato,Preço Total Efetivo,Causas das Alterações ao Prazo,Causas das Alterações ao Preço,Estado,N.º registo do Acordo Quadro,Descrição do Acordo Quadro,Procedimento Centralizado
Prestação de serviços médicos em neurologia,Ajuste Direto Regime Geral,Aquisição de serviços,"85121000-3, Serviços de prática médica","Hospital do Espírito Santo de Évora, E. P. E. (508085888)",Maria Irene Martins Mendes (129386197),"18.252,00 €",15-05-2018,17-01-2018,365 dias,"Portugal, Évora","Artigo 20.º, n.º 1, alínea a) do Código dos Contratos Públicos",,,,,,Não aplicável.,Não aplicável.,FALSE
Prestação de serviços médicos de neurologia,Ajuste Direto Regime Geral,Aquisição de serviços,"85120000-6, Serviços de prática médica e serviços conexos","Hospital do Espírito Santo de Évora, E. P. E. (508085888)",Maria Irene Martins Mendes (129386197),"12.240,00 €",22-03-2017,15-03-2017,240 dias,"Portugal, Évora, Évora","Artigo 20.º, n.º 1, alínea a) do Código dos Contratos Públicos",,,,,,Não aplicável.,Não aplicável.,FALSE
"Prestação, de Serviços Médicos de Utrassonografia",Ajuste Direto Regime Geral,Aquisição de serviços,"85120000-6, Serviços de prática médica e serviços conexos","Hospital do Espírito Santo de Évora, E. P. E. (508085888)",Maria Irene Martins Mendes (129386197),"18.720,00 €",03-08-2016,20-01-2016,365 dias,"Portugal, Évora, Évora","Artigo 20.º, n.º 1, alínea a) do Código dos Contratos Públicos",,,,,,Não aplicável.,Não aplicável.,FALSE
Prestação serviços médicos de ultrasonografia,Ajuste Direto Regime Geral,Aquisição de serviços,"85121000-3, Serviços de prática médica","Hospital do Espírito Santo de Évora, E. P. E. (508085888)",Maria Irene Martins Mendes (129386197),"17.280,00 €",03-09-2015,18-02-2015,330 dias,"Portugal, Évora, Évora","Artigo 20.º, n.º 1, alínea a) do Código dos Contratos Públicos",,,,,,Não aplicável.,Não aplicável.,FALSE
Serviços Médicos Neurologia,Ajuste Direto Regime Geral,Aquisição de serviços,"85121200-5, Serviços de medicina especializada","Hospital do Espírito Santo de Évora, E. P. E. (508085888)",Maria Irene Mendes (129386197),"24.960,00 €",21-03-2014,04-02-2014,365 dias,"Portugal, Évora, Évora","Artigo 20.º, n.º 1, alínea a) do Código dos Contratos Públicos",,,,,,Não aplicável.,Não aplicável.,FALSE
