Objeto do Contrato,Tipo de Procedimento,Tipo(s) de Contrato,CPVs,Entidade(s) Adjudicante(s),Entidade(s) Adjudicatária(s),Preço Contratual,Data de Publicação,Data de Celebração do Contrato,Prazo de Execução,Local de Execução,Fundamentação,Data de Fecho do Contrato,Preço Total Efetivo,Causas das Alterações ao Prazo,Causas das Alterações ao Preço,Estado,N.º registo do Acordo Quadro,Descrição do Acordo Quadro,Procedimento Centralizado
Serviços de digitalização e processamento de documentos,Ajuste Direto Regime Geral,Aquisição de serviços,"72310000-1, Serviços de processamento de dados","Serviço Partilhados do Ministério da Saúde, E. P. E. (509540716)","Reditus Business Solutions, SA (501551557)","4.000,00 €",31-03-2014,27-02-2014,30 dias,"Portugal, Lisboa, Lisboa","Artigo 20.º, n.º 1, alínea a) do Código dos Contratos Públicos",28-02-2014,"4.000,00 €","","",,Não aplicável.,Não aplicável.,FALSE
Aquisição de preservativos para Programa de Troca de Seringas,Ao abrigo de acordo-quadro (art.º 259.º),Aquisição de bens móveis,"33710000-0, Perfumes, produtos de toucador e preservativos","Serviço Partilhados do Ministério da Saúde, E. P. E. (509540716)","Clinifar - Produtos Clínicos e Farmacêuticos, SA (503281115)","27.525,00 €",31-03-2014,31-03-2014,270 dias,Portugal,Artigo 259.º do Código dos Contratos Públicos,"","","","",,613817,"CONCURSO PÚBLICO PARA A CELEBRAÇÃO DE CONTRATOS PÚBLICOS DE APROVISIONAMENTO PARA A ÁREA DA SAÚDE, COM VISTA AO FORNECIMENTO DE CONTRACETIVOS ORAIS, PROFILATICOS E MECANICO, ÀS INSTITUIÇÕES E SERVIÇOS DO SERVIÇO NACIONAL DE SAÚDE",FALSE
Aquisição de seringas para Programa de Troca de Seringas,Ao abrigo de acordo-quadro (art.º 259.º),Aquisição de bens móveis,"33141310-6, Seringas","Serviço Partilhados do Ministério da Saúde, E. P. E. (509540716)","PERGUT PORTUGAL, LDA. (501799729)","136.440,32 €",31-03-2014,27-03-2014,270 dias,Portugal,Artigo 259.º do Código dos Contratos Públicos,"","","","",,448705,"CONCURSO PÚBLICO PARA A CELEBRAÇÃO DE CONTRATOS PÚBLICOS DE APROVISIONAMENTO PARA A ÁREA DA SAÚDE, COM VISTA AO FORNECIMENTO DE SERINGAS, AGULHAS, CONTENTORES E SISTEMAS FECHADOS DE COLHEITA,  ÀS INSTITUIÇÕES E SERVIÇOS DO SERVIÇO NACIONAL DE SAÚDE",FALSE
Aquisição de serviços de investigação em sistemas de informação de saúde para sistematização legislativa,Ajuste Direto Regime Geral,Aquisição de serviços,"73110000-6, Serviços de investigação","Serviço Partilhados do Ministério da Saúde, E. P. E. (509540716)",Instituto de Direito do Trabalho da Faculdade de Direito de Lisboa (504992392),"72.500,00 €",27-03-2014,23-12-2013,374 dias,"Portugal, Lisboa, Lisboa","Artigo 20.º, n.º 1, alínea a) do Código dos Contratos Públicos","","","","",,Não aplicável.,Não aplicável.,FALSE
"CONVITE PARA APRESENTAÇÃO DE PROPOSTA AO ABRIGO DO ACORDO QUADRO   n.º 20120117,DE SERVIÇOS DE CONSULTADORIA, DESENVOLVIMENTO E MANUTENÇÃO DE SOFTWARE E GESTÃO OPERACIONAL DOS SISTEMAS E BASES DE DADOS, CELEBRADO PELA SPMS, EPE Serviços de Desenvolvimento e Manutenção Aplicacional RNU  -  desenvolvimento e integração do Testamento Vital  ",Ao abrigo de acordo-quadro (art.º 259.º),Aquisição de serviços,"72500000-0, Serviços relacionados com a informática","Serviço Partilhados do Ministério da Saúde, E. P. E. (509540716)","Altranportugal, S.A. (504272179)","39.424,00 €",27-03-2014,28-02-2014,270 dias,"Portugal, Lisboa, Lisboa",Artigo 259.º do Código dos Contratos Públicos,28-02-2015,"39.424,00 €","","",,425776,CONCURSO PÚBLICO n.º 20120117 -,FALSE
Aquisição de serviços extra de manutenção aplicacional SIM@SNS - Sistema de Informação de Monitorização do Serviço Nacional de Saúde,Ajuste Direto Regime Geral,Aquisição de serviços,"50324100-3, Serviços de manutenção de sistemas","Serviço Partilhados do Ministério da Saúde, E. P. E. (509540716)","ALTRANPORTUGAL, S. A. (504272179)","8.880,00 €",27-03-2014,09-12-2013,54 dias,"Portugal, Porto, Porto","Artigo 20.º, n.º 1, alínea a) do Código dos Contratos Públicos",31-01-2014,"8.880,00 €","","",,Não aplicável.,Não aplicável.,FALSE
"AQUISIÇÃO DE SERVIÇOS DE UPGRADE FUNCIONAL E NOVAS FUNCIONALIDADES E MANUTENÇÃO DO SOFTWARE SMARTDOCS INSTALADO ACSS, PARA O ANO 2014",Ajuste Direto Regime Geral,Aquisição de serviços,"72300000-8, Serviços relacionados com dados","Serviço Partilhados do Ministério da Saúde, E. P. E. (509540716)","Fujitsu Technology Solutions, Lda (500646791)","104.585,82 €",27-03-2014,24-02-2014,330 dias,"Portugal, Lisboa, Lisboa","Artigo 24.º, n.º 1, alínea e) do Código dos Contratos Públicos",31-05-2015,"104.585,82 €","","",,Não aplicável.,Não aplicável.,FALSE
Aquisição de Serviços para Combate à Fraude e Desperdício,Ajuste Direto Regime Geral,Aquisição de serviços,"72000000-5, Serviços de TI: consultoria, desenvolvimento de software, Internet e apoio","Serviço Partilhados do Ministério da Saúde, E. P. E. (509540716)","Accenture - Consultores de Gestão, S.A. (502309440)","180.000,00 €",27-03-2014,30-12-2013,132 dias,"Portugal, Porto, Porto","Artigo 24.º, n.º 1, alínea e) do Código dos Contratos Públicos",28-02-2014,"66.050,00 €",Denúncia do contrato  nos termos da Cláusula Segunda do Contrato.,Denúncia do contrato  nos termos da Cláusula Segunda do Contrato.,,Não aplicável.,Não aplicável.,FALSE
Aquisição de robot storage,Ajuste Direto Regime Geral,Aquisição de bens móveis,"48800000-6, Sistemas de informação e servidores","Serviço Partilhados do Ministério da Saúde, E. P. E. (509540716)","Oramix - Sistemas de Informação, S. A. (504448382)","9.980,00 €",27-03-2014,16-12-2013,30 dias,"Portugal, Lisboa, Lisboa","Artigo 20.º, n.º 1, alínea a) do Código dos Contratos Públicos","","","","",,Não aplicável.,Não aplicável.,FALSE
"Aquisição de serviços de apoio administrativo na área das compras da CCS_SPMS, EPE",Ajuste Direto Regime Geral,Aquisição de serviços,"75122000-7, Serviços administrativos na área da saúde","Serviço Partilhados do Ministério da Saúde, E. P. E. (509540716)","Softventure - Consultoria e Tecnologia, S. A. (511252277)","65.029,24 €",26-03-2014,31-12-2013,900 dias,"Portugal, Lisboa, Lisboa","Artigo 20.º, n.º 1, alínea a) do Código dos Contratos Públicos",31-12-2015,"52.023,42 €",Revogação do contrato ao abrigo do artigo 331.º do CCP.,Revogação do contrato ao abrigo do artigo 331.º do CCP.,,Não aplicável.,Não aplicável.,FALSE
Aquisição de bastidores,Ajuste Direto Regime Geral,Aquisição de bens móveis,"48820000-2, Servidores","Serviço Partilhados do Ministério da Saúde, E. P. E. (509540716)","GONKSYS, S. A. (510874169)","26.249,06 €",26-03-2014,26-12-2013,30 dias,"Portugal, Porto, Porto","Artigo 20.º, n.º 1, alínea a) do Código dos Contratos Públicos","","","","",,Não aplicável.,Não aplicável.,FALSE
"""""Outsourcing"""" das infraestruturas de telecomunicações da Rede Informática da Saúde (RIS)",Ajuste Direto Regime Geral,Aquisição de serviços,"64227000-3, Serviços integrados de telecomunicações","Serviço Partilhados do Ministério da Saúde, E. P. E. (509540716)","OniTelecom - Infocomunicações, S. A. (504073206)","149.677,42 €",26-03-2014,31-12-2013,8 dias,Portugal,"Artigo 24.º, n.º 1, alínea e) do Código dos Contratos Públicos","","","","",,Não aplicável.,Não aplicável.,FALSE
