freguesia,acronym,validVotesPercentage,votes,dicofre
União das freguesias de Anjos e Vilar do Chão,PPD/PSD.CDS-PP,50.69,147,031123
União das freguesias de Anjos e Vilar do Chão,PS,32.07,93,031123
União das freguesias de Anjos e Vilar do Chão,PCP-PEV,6.21,18,031123
União das freguesias de Anjos e Vilar do Chão,MPT,4.14,12,031123
União das freguesias de Anjos e Vilar do Chão,B.E.,2.07,6,031123
União das freguesias de Anjos e Vilar do Chão,PCTP/MRPP,1.72,5,031123
União das freguesias de Anjos e Vilar do Chão,PND,0.69,2,031123
União das freguesias de Anjos e Vilar do Chão,PPM,0.69,2,031123
União das freguesias de Anjos e Vilar do Chão,L,0.34,1,031123
União das freguesias de Anjos e Vilar do Chão,MAS,0.34,1,031123
União das freguesias de Anjos e Vilar do Chão,PAN,0.34,1,031123
União das freguesias de Anjos e Vilar do Chão,PNR,0.34,1,031123
União das freguesias de Anjos e Vilar do Chão,PTP,0.34,1,031123
União das freguesias de Anjos e Vilar do Chão,PDA,0,0,031123
União das freguesias de Anjos e Vilar do Chão,POUS,0,0,031123
União das freguesias de Anjos e Vilar do Chão,PPV,0,0,031123
