freguesia,acronym,validVotesPercentage,votes,dicofre
Pedralva,PPD/PSD.CDS-PP,41.13,146,030334
Pedralva,PS,36.9,131,030334
Pedralva,PCP-PEV,6.48,23,030334
Pedralva,PND,3.1,11,030334
Pedralva,B.E.,2.54,9,030334
Pedralva,MPT,2.54,9,030334
Pedralva,PCTP/MRPP,1.97,7,030334
Pedralva,L,1.69,6,030334
Pedralva,PAN,1.13,4,030334
Pedralva,MAS,0.85,3,030334
Pedralva,PNR,0.56,2,030334
Pedralva,PTP,0.56,2,030334
Pedralva,POUS,0.28,1,030334
Pedralva,PPV,0.28,1,030334
Pedralva,PDA,0,0,030334
Pedralva,PPM,0,0,030334
