Objeto do Contrato,Tipo de Procedimento,Tipo(s) de Contrato,CPVs,Entidade(s) Adjudicante(s),Entidade(s) Adjudicatária(s),Preço Contratual,Data de Publicação,Data de Celebração do Contrato,Prazo de Execução,Local de Execução,Fundamentação,Data de Fecho do Contrato,Preço Total Efetivo,Causas das Alterações ao Prazo,Causas das Alterações ao Preço,Estado,N.º registo do Acordo Quadro,Descrição do Acordo Quadro,Procedimento Centralizado
49000417-Prestação Serviços de Enfermagem,Ajuste Direto Regime Geral,Aquisição de serviços,"79600000-0, Serviços de recrutamento",Hospital Dr. Francisco Zagalo (501510150),Helped Emergency Lda. (509388906),"37.400,00 €",19-05-2017,17-03-2017,335 dias,"Portugal, Aveiro, Ovar","Artigo 20.º, n.º 1, alínea a) do Código dos Contratos Públicos",31-07-2017,"22.336,12 €",contrato finalizado a 31/7/2017,valores pagos abaixo da previsão,,Não aplicável.,Não aplicável.,FALSE
Medicamentos,Ajuste Direto Regime Geral,Aquisição de bens móveis,"33600000-6, Produtos farmacêuticos",Hospital Dr. Francisco Zagalo (501510150),"B.Braun Medical, Lda (501506543)","199,00 €",18-05-2017,06-01-2017,12 dias,"Portugal, Aveiro, Ovar","Artigo 20.º, n.º 1, alínea a) do Código dos Contratos Públicos",18-01-2017,"199,00 €","","",,Não aplicável.,Não aplicável.,FALSE
Medicamentos,Ajuste Direto Regime Geral,Aquisição de bens móveis,"33600000-6, Produtos farmacêuticos",Hospital Dr. Francisco Zagalo (501510150),"UNILFARMA-UNIAO INTERN.LABOR.FARM., LDA (500293023)","67,63 €",18-05-2017,06-01-2017,12 dias,"Portugal, Aveiro, Ovar","Artigo 20.º, n.º 1, alínea a) do Código dos Contratos Públicos",18-01-2017,"67,63 €","","",,Não aplicável.,Não aplicável.,FALSE
Medicamentos,Ajuste Direto Regime Geral,Aquisição de bens móveis,"33600000-6, Produtos farmacêuticos",Hospital Dr. Francisco Zagalo (501510150),"LABORATORIOS PFIZER, S.A. (500162166)","161,79 €",18-05-2017,06-01-2017,12 dias,"Portugal, Aveiro, Ovar","Artigo 20.º, n.º 1, alínea a) do Código dos Contratos Públicos",18-01-2017,"161,79 €","","",,Não aplicável.,Não aplicável.,FALSE
CP 18000317 PRESTAÇÃO DE SERVIÇOS TEC. INFORMATICO E TECNICO SUP. GERAL,Concurso público,Aquisição de serviços,"79620000-6, Serviços de fornecimento de pessoal, inclusive temporário",Hospital Dr. Francisco Zagalo (501510150),"MultiTrab-Trabalho Temporario, Lda. (514004185)","48.917,16 €",18-05-2017,03-05-2017,275 dias,"Portugal, Aveiro, Ovar","Artigo 20.º, n.º 1, alínea b) do Código dos Contratos Públicos",31-12-2017,"41.318,34 €","",serviços abaixo de previsto,,Não aplicável.,Não aplicável.,FALSE
49003517-Contrato Manutenção preventiva equip. informatico Fortigate,Ajuste Direto Regime Geral,Outros Tipos (Concessão de exploração de bens do domínio público),"72540000-2, Serviços de actualização informática",Hospital Dr. Francisco Zagalo - Ovar (501510150),"ITEN Solutions - Sistemas de Informação, S.A. (510728189)","3.861,06 €",16-05-2017,09-03-2017,365 dias,"Portugal, Aveiro, Ovar","Artigo 20.º, n.º 1, alínea a) do Código dos Contratos Públicos",10-05-2017,"3.861,06 €","","",,Não aplicável.,Não aplicável.,FALSE
AD 42001517 Aquisição material ligamentoplastia,Ajuste Direto Regime Geral,Aquisição de bens móveis,"33183000-6, Material de assistência ortopédica",Hospital Dr. Francisco Zagalo (501510150),ARTUR SALGADO LDA. (503612600),"63,00 €",15-05-2017,03-02-2017,330 dias,"Portugal, Aveiro, Ovar","Artigo 20.º, n.º 1, alínea a) do Código dos Contratos Públicos",29-12-2017,"63,00 €","","",,Não aplicável.,Não aplicável.,FALSE
AD 42001517 Aquisição material ligamentoplastia,Ajuste Direto Regime Geral,Aquisição de bens móveis,"33183000-6, Material de assistência ortopédica",Hospital Dr. Francisco Zagalo (501510150),B BRAUN MEDICAL LDA (501506543),"222,00 €",15-05-2017,03-02-2017,330 dias,"Portugal, Aveiro, Ovar","Artigo 20.º, n.º 1, alínea a) do Código dos Contratos Públicos",29-12-2017,"188,70 €","",Previsão superior às necessidades,,Não aplicável.,Não aplicável.,FALSE
AD 52000717 Aquisição sacos/placas colostomia e urostomia,Ao abrigo de acordo-quadro (art.º 259.º),Aquisição de bens móveis,"33600000-6, Produtos farmacêuticos",Hospital Dr. Francisco Zagalo - Ovar (501510150),"MEDICINALIA CORMEDICA - COMER. PROD. MED. HOSP.,LD (500684324)","32,10 €",15-05-2017,26-04-2017,200 dias,"Portugal, Aveiro, Ovar",Artigo 259.º do Código dos Contratos Públicos,29-12-2017,"","",Montante total do lote não adquirido,,2349386,Acordo Quadro para o fornecimento de Cateteres às Instituições e Serviços do Serviço Nacional de Saúde,FALSE
AD 52000717 Aquisição sacos/placas colostomia e urostomia,Ao abrigo de acordo-quadro (art.º 259.º),Aquisição de bens móveis,"33600000-6, Produtos farmacêuticos",Hospital Dr. Francisco Zagalo - Ovar (501510150),"MEDICINALIA CORMEDICA - COMER. PROD. MED. HOSP.,LD (500684324)","44,10 €",15-05-2017,26-04-2017,200 dias,"Portugal, Aveiro, Ovar",Artigo 259.º do Código dos Contratos Públicos,29-12-2017,"29,40 €","",Previsão superior às necessidades,,2349386,Acordo Quadro para o fornecimento de Cateteres às Instituições e Serviços do Serviço Nacional de Saúde,FALSE
AD 52000717 Aquisição sacos/placas colostomia e urostomia,Ao abrigo de acordo-quadro (art.º 259.º),Aquisição de bens móveis,"33600000-6, Produtos farmacêuticos",Hospital Dr. Francisco Zagalo - Ovar (501510150),"MEDICINALIA CORMEDICA - COMER. PROD. MED. HOSP.,LD (500684324)","20,00 €",15-05-2017,26-04-2017,200 dias,"Portugal, Aveiro, Ovar",Artigo 259.º do Código dos Contratos Públicos,29-12-2017,"","",Montante do lote não adquirido,,2349386,Acordo Quadro para o fornecimento de Cateteres às Instituições e Serviços do Serviço Nacional de Saúde,FALSE
AD 52000717 Aquisição sacos/placas colostomia e urostomia,Ao abrigo de acordo-quadro (art.º 259.º),Aquisição de bens móveis,"33600000-6, Produtos farmacêuticos",Hospital Dr. Francisco Zagalo - Ovar (501510150),"MEDICINALIA CORMEDICA - COMER. PROD. MED. HOSP.,LD (500684324)","36,00 €",15-05-2017,26-04-2017,200 dias,"Portugal, Aveiro, Ovar",Artigo 259.º do Código dos Contratos Públicos,29-12-2017,"6,00 €","",Previsão superior às necessidades,,2349386,Acordo Quadro para o fornecimento de Cateteres às Instituições e Serviços do Serviço Nacional de Saúde,FALSE
