Objeto do Contrato,Tipo de Procedimento,Tipo(s) de Contrato,CPVs,Entidade(s) Adjudicante(s),Entidade(s) Adjudicatária(s),Preço Contratual,Data de Publicação,Data de Celebração do Contrato,Prazo de Execução,Local de Execução,Fundamentação,Data de Fecho do Contrato,Preço Total Efetivo,Causas das Alterações ao Prazo,Causas das Alterações ao Preço,Estado,N.º registo do Acordo Quadro,Descrição do Acordo Quadro,Procedimento Centralizado
Pensos especiais,Ao abrigo de acordo-quadro (art.º 259.º),Aquisição de bens móveis,"33000000-0, Equipamento médico, medicamentos e produtos para cuidados pessoais","Centro Hospitalar do Médio Tejo, E. P. E. (506361608)",B BRAUN MEDICAL LDA       (501506543),"5.565,00 €",30-05-2017,17-04-2017,365 dias,"Portugal, Santarém, Abrantes",Artigo 259.º do Código dos Contratos Públicos,,,,,,2183748,Pensos especiais,FALSE
Papel Marquesa,Ajuste Direto Regime Geral,Aquisição de bens móveis,"33000000-0, Equipamento médico, medicamentos e produtos para cuidados pessoais","Centro Hospitalar do Médio Tejo, E. P. E. (506361608)",SERVISAN Produtos de Higiene SA (500246530),"8.500,00 €",30-05-2017,13-03-2017,365 dias,"Portugal, Santarém, Abrantes","Artigo 20.º, n.º 1, alínea a) do Código dos Contratos Públicos",,,,,,Não aplicável.,Não aplicável.,FALSE
Sistema de Remoção CO2,Ajuste Direto Regime Geral,Aquisição de bens móveis,"33000000-0, Equipamento médico, medicamentos e produtos para cuidados pessoais","Centro Hospitalar do Médio Tejo, E.P.E. (CHMT) (506361608)",BAXTER MEDICO-FARMACEUTICA (503347345),"0,00 €",30-05-2017,01-03-2017,365 dias,"Portugal, Santarém, Abrantes","Artigo 20.º, n.º 1, alínea a) do Código dos Contratos Públicos",,,,,,Não aplicável.,Não aplicável.,FALSE
sacos drenagem de rampa,Ajuste Direto Regime Geral,Aquisição de bens móveis,"33100000-1, Equipamento médico","Centro Hospitalar do Médio Tejo, E. P. E. (506361608)",MEDICINALIA CORMEDICA-C.PROD.MEDICO HOSP.LDA. (500684324),"9.798,00 €",30-05-2017,30-03-2017,365 dias,"Portugal, Santarém, Tomar<BR/>Portugal, Santarém, Torres Novas<BR/>Portugal, Santarém, Abrantes","Artigo 20.º, n.º 1, alínea a) do Código dos Contratos Públicos",,,,,,Não aplicável.,Não aplicável.,FALSE
suturas mecanicas,Concurso público,Aquisição de bens móveis,"33100000-1, Equipamento médico","Centro Hospitalar do Médio Tejo, E. P. E. (506361608)","MEDTRONIC PORTUGAL, LDA. (504223933)","103.925,67 €",30-05-2017,23-03-2017,365 dias,"Portugal, Santarém, Tomar<BR/>Portugal, Santarém, Torres Novas<BR/>Portugal, Santarém, Abrantes","Artigo 20.º, n.º 2, alínea b), subalínea i) do Código dos Contratos Públicos",,,,,,Não aplicável.,Não aplicável.,FALSE
cardioversor desfibrilhador VR,Ajuste Direto Regime Geral,Aquisição de bens móveis,"33100000-1, Equipamento médico","Centro Hospitalar do Médio Tejo, E. P. E. (506361608)",ST. JUDE MEDICAL PORTUGAL (504180746),"7.000,00 €",30-05-2017,16-03-2017,10 dias,"Portugal, Santarém, Abrantes","Artigo 24.º, n.º 1, alínea c) do Código dos Contratos Públicos",,,,,,Não aplicável.,Não aplicável.,FALSE
cardioversor desfibrilhador VR,Ajuste Direto Regime Geral,Aquisição de bens móveis,"33100000-1, Equipamento médico","Centro Hospitalar do Médio Tejo, E.P.E. (CHMT) (506361608)",ST. JUDE MEDICAL PORTUGAL (504180746),"7.000,00 €",30-05-2017,12-04-2017,10 dias,"Portugal, Santarém, Abrantes","Artigo 24.º, n.º 1, alínea c) do Código dos Contratos Públicos",,,,,,Não aplicável.,Não aplicável.,FALSE
cardioversor desfibrilhador DR,Ajuste Direto Regime Geral,Aquisição de bens móveis,"33100000-1, Equipamento médico","Centro Hospitalar do Médio Tejo, E.P.E. (CHMT) (506361608)",ST. JUDE MEDICAL PORTUGAL (504180746),"11.500,00 €",30-05-2017,02-05-2017,365 dias,"Portugal, Santarém, Abrantes","Artigo 24.º, n.º 1, alínea c) do Código dos Contratos Públicos",,,,,,Não aplicável.,Não aplicável.,FALSE
cateteres Hemodiálise,Ajuste Direto Regime Geral,Aquisição de bens móveis,"33100000-1, Equipamento médico","Centro Hospitalar do Médio Tejo, E.P.E. (CHMT) (506361608)","medinfar - produtos farmaceuticos, sa (159386217)","18.580,00 €",30-05-2017,10-04-2017,365 dias,"Portugal, Santarém, Torres Novas","Artigo 20.º, n.º 1, alínea a) do Código dos Contratos Públicos",,,,,,Não aplicável.,Não aplicável.,FALSE
artigos laparoscopia,Ajuste Direto Regime Geral,Aquisição de bens móveis,"33100000-1, Equipamento médico","Centro Hospitalar do Médio Tejo, E.P.E. (CHMT) (506361608)","SFERAMED MEDICAL SUPPLIER, LDA (509762344)","5.292,00 €",30-05-2017,13-03-2017,365 dias,"Portugal, Santarém, Tomar","Artigo 20.º, n.º 1, alínea a) do Código dos Contratos Públicos",,,,,,Não aplicável.,Não aplicável.,FALSE
artigos laparoscopia,Ajuste Direto Regime Geral,Aquisição de bens móveis,"33100000-1, Equipamento médico","Centro Hospitalar do Médio Tejo, E.P.E. (CHMT) (506361608)",Moonsurge (506657035),"26.922,00 €",30-05-2017,03-04-2017,365 dias,"Portugal, Santarém, Tomar<BR/>Portugal, Santarém, Abrantes","Artigo 20.º, n.º 1, alínea a) do Código dos Contratos Públicos",,,,,,Não aplicável.,Não aplicável.,FALSE
artigos laparoscopia,Ajuste Direto Regime Geral,Aquisição de bens móveis,"33100000-1, Equipamento médico","Centro Hospitalar do Médio Tejo, E.P.E. (CHMT) (506361608)","MEDTRONIC PORTUGAL, LDA. (504223933)","20.000,00 €",30-05-2017,03-04-2017,365 dias,"Portugal, Santarém, Abrantes<BR/>Portugal, Santarém, Tomar","Artigo 20.º, n.º 1, alínea a) do Código dos Contratos Públicos",,,,,,Não aplicável.,Não aplicável.,FALSE
artigos gastro,Ajuste Direto Regime Geral,Aquisição de bens móveis,"33100000-1, Equipamento médico","Centro Hospitalar do Médio Tejo, E.P.E. (CHMT) (506361608)","OLYMPUS IBERIA, s.a.u. (980474710)","21.729,07 €",30-05-2017,03-05-2017,365 dias,"Portugal, Santarém, Abrantes","Artigo 20.º, n.º 1, alínea a) do Código dos Contratos Públicos",,,,,,Não aplicável.,Não aplicável.,FALSE
trouxas cirurgia geral,Ajuste Direto Regime Geral,Aquisição de bens móveis,"33100000-1, Equipamento médico","Centro Hospitalar do Médio Tejo, E.P.E. (CHMT) (506361608)","Bastos Viegas, S.A. (500042772)","10.886,40 €",30-05-2017,11-05-2017,365 dias,"Portugal, Santarém, Tomar<BR/>Portugal, Santarém, Abrantes<BR/>Portugal, Santarém, Torres Novas","Artigo 20.º, n.º 1, alínea a) do Código dos Contratos Públicos",,,,,,Não aplicável.,Não aplicável.,FALSE
Próteses revisão Joelho,Ajuste Direto Regime Geral,Aquisição de bens móveis,"33100000-1, Equipamento médico","Centro Hospitalar do Médio Tejo, E.P.E. (CHMT) (506361608)",JOHNSON & JOHNSON MEDICAL (500153370),"19.410,00 €",30-05-2017,02-05-2017,365 dias,"Portugal, Santarém, Abrantes","Artigo 24.º, n.º 1, alínea e) do Código dos Contratos Públicos",,,,,,Não aplicável.,Não aplicável.,FALSE
Fornecimento de combustíveis rodoviários - 2017 - 97001017,Ao abrigo de acordo-quadro (art.º 259.º),Aquisição de bens móveis,"09100000-0, Combustíveis","Centro Hospitalar do Médio Tejo, E. P. E. (506361608)","Petróleos de Portugal - Petrogal, SA. (500697370)","67.760,21 €",22-05-2017,07-03-2017,306 dias,"Portugal, Santarém, Abrantes",Artigo 259.º do Código dos Contratos Públicos,,,,,,400324,Acordo quadro de fornecimento de combustíveis rodoviários,FALSE
Serviços Médicos - Cuidados Paliativos - 37009217,Ajuste Direto Regime Geral,Aquisição de serviços,"85100000-0, Serviços de saúde","Centro Hospitalar do Médio Tejo, E. P. E. (506361608)","Rui Leonardo - Serviços Médicos, Lda (509796915)","19.592,52 €",22-05-2017,15-02-2017,365 dias,"Portugal, Santarém, Tomar","Artigo 20.º, n.º 1, alínea a) do Código dos Contratos Públicos",,,,,,Não aplicável.,Não aplicável.,FALSE
Serviços Médicos Cardiologia - 37003417,Ajuste Direto Regime Geral,Aquisição de serviços,"85100000-0, Serviços de saúde","Centro Hospitalar do Médio Tejo, E. P. E. (506361608)","Paulo Guerreiro Alves - Serviços Médicos Unipessoal, Lda (510094732)","56.100,00 €",22-05-2017,08-02-2017,365 dias,"Portugal, Santarém, Abrantes","Artigo 20.º, n.º 1, alínea a) do Código dos Contratos Públicos",,,,,,Não aplicável.,Não aplicável.,FALSE
Serviços Médicos Medicina Interna - 37018317,Ajuste Direto Regime Geral,Aquisição de serviços,"85100000-0, Serviços de saúde","Centro Hospitalar do Médio Tejo, E. P. E. (506361608)","Araújo & Pinto - Serviços de Saúde, Lda (508884446)","74.000,00 €",22-05-2017,30-03-2017,306 dias,"Portugal, Santarém, Abrantes","Artigo 20.º, n.º 1, alínea a) do Código dos Contratos Públicos",,,,,,Não aplicável.,Não aplicável.,FALSE
Serviços Médicos - Ortopedia - 37017517,Ajuste Direto Regime Geral,Aquisição de serviços,"85100000-0, Serviços de saúde","Centro Hospitalar do Médio Tejo, E. P. E. (506361608)",Isabel Cristina Gomes da Costa Simões (201595761),"27.000,00 €",22-05-2017,30-03-2017,365 dias,"Portugal, Santarém, Abrantes","Artigo 20.º, n.º 1, alínea a) do Código dos Contratos Públicos",,,,,,Não aplicável.,Não aplicável.,FALSE
Serviços Médicos - VMER - 37008317,Ajuste Direto Regime Geral,Aquisição de serviços,"85100000-0, Serviços de saúde","Centro Hospitalar do Médio Tejo, E. P. E. (506361608)","Lemos Gomes - Prestação de Serviços Médicos, medicina do Trabalho e formação (509975267)","32.100,00 €",22-05-2017,08-02-2017,365 dias,"Portugal, Santarém, Abrantes","Artigo 20.º, n.º 1, alínea a) do Código dos Contratos Públicos",,,,,,Não aplicável.,Não aplicável.,FALSE
Serviços Médicos Anestesiologia - 37012717,Ajuste Direto Regime Geral,Aquisição de serviços,"85100000-0, Serviços de saúde","Centro Hospitalar do Médio Tejo, E. P. E. (506361608)","SONOS, LDA (513534024)","24.000,00 €",22-05-2017,10-01-2017,365 dias,"Portugal, Santarém, Abrantes","Artigo 20.º, n.º 1, alínea a) do Código dos Contratos Públicos",,,,,,Não aplicável.,Não aplicável.,FALSE
Serviços Médicos VMER+Cirurgia - 37008617,Ajuste Direto Regime Geral,Aquisição de serviços,"85100000-0, Serviços de saúde","Centro Hospitalar do Médio Tejo, E. P. E. (506361608)","Insolitemotion, Lda (513725679)","72.000,00 €",22-05-2017,31-03-2017,365 dias,"Portugal, Santarém, Abrantes","Artigo 20.º, n.º 1, alínea a) do Código dos Contratos Públicos",,,,,,Não aplicável.,Não aplicável.,FALSE
Serviços Médicos Cirurgia Geral - 37018617,Ajuste Direto Regime Geral,Aquisição de serviços,"85100000-0, Serviços de saúde","Centro Hospitalar do Médio Tejo, E. P. E. (506361608)",Armando Augusto Rodrigues Correia (109368770),"75.000,00 €",22-05-2017,08-05-2017,365 dias,"Portugal, Santarém, Abrantes","Artigo 20.º, n.º 1, alínea a) do Código dos Contratos Públicos",,,,,,Não aplicável.,Não aplicável.,FALSE
Serviços de assessoria de imprensa - 37011117,Ajuste Direto Regime Geral,Aquisição de serviços,"73220000-0, Serviços de consultoria em matéria de desenvolvimento","Centro Hospitalar do Médio Tejo, E. P. E. (506361608)","Videoplus - Sociedade Produtora de Video, Lda (503999105)","22.634,10 €",22-05-2017,03-05-2017,365 dias,"Portugal, Santarém, Santarém","Artigo 20.º, n.º 1, alínea a) do Código dos Contratos Públicos",,,,,,Não aplicável.,Não aplicável.,FALSE
