freguesia,acronym,validVotesPercentage,votes,dicofre
Porto Salvo,PS,39.04,1818,111009
Porto Salvo,PPD/PSD,13.94,649,111009
Porto Salvo,B.E.,11.72,546,111009
Porto Salvo,PCP-PEV,8.42,392,111009
Porto Salvo,PAN,8.03,374,111009
Porto Salvo,CDS-PP,5.05,235,111009
Porto Salvo,A,3.07,143,111009
Porto Salvo,L,2.77,129,111009
Porto Salvo,PPM.PPV/CDC,2.45,114,111009
Porto Salvo,NC,1.42,66,111009
Porto Salvo,IL,1.27,59,111009
Porto Salvo,PCTP/MRPP,0.75,35,111009
Porto Salvo,PDR,0.56,26,111009
Porto Salvo,PURP,0.56,26,111009
Porto Salvo,PNR,0.49,23,111009
Porto Salvo,MAS,0.28,13,111009
Porto Salvo,PTP,0.19,9,111009
