Objeto do Contrato,Tipo de Procedimento,Tipo(s) de Contrato,CPVs,Entidade(s) Adjudicante(s),Entidade(s) Adjudicatária(s),Preço Contratual,Data de Publicação,Data de Celebração do Contrato,Prazo de Execução,Local de Execução,Fundamentação,Data de Fecho do Contrato,Preço Total Efetivo,Causas das Alterações ao Prazo,Causas das Alterações ao Preço,Estado,N.º registo do Acordo Quadro,Descrição do Acordo Quadro,Procedimento Centralizado
AQUISIÇÃO DE PRESTAÇÃO DE SERVIÇOS PARA FORNECIMENTO DE ALIMENTAÇÃO,Concurso público,Aquisição de serviços,"55322000-3, Serviços de confecção de refeições","Centro Hospitalar de Entre o Douro e Vouga, E.P.E. (508878462)","UNISELF, S.A. (501323325)","1.310.524,80 €",28-09-2015,13-08-2015,731 dias,"Portugal, Aveiro, Santa Maria da Feira","Artigo 20.º, n.º 1, alínea b) do Código dos Contratos Públicos","","",,,,Não aplicável.,Não aplicável.,FALSE
Aquisição de Cistoscópios para Urologia,Ajuste Direto Regime Geral,Aquisição de bens móveis,"33000000-0, Equipamento médico, medicamentos e produtos para cuidados pessoais","Centro Hospitalar de Entre o Douro e Vouga, E.P.E. (508878462)","Teprel - Equipamentos Médicos, S.A. (502262184)","35.000,00 €",24-09-2015,27-07-2015,90 dias,"Portugal, Aveiro, Santa Maria da Feira","Artigo 20.º, n.º 1, alínea a) do Código dos Contratos Públicos",25-11-2015,"35.000,00 €",,,,Não aplicável.,Não aplicável.,FALSE
