freguesia,acronym,validVotesPercentage,votes,dicofre
Ortiga,PS,42.37,100,141307
Ortiga,PPD/PSD.CDS-PP,28.81,68,141307
Ortiga,MPT,8.47,20,141307
Ortiga,PCP-PEV,8.05,19,141307
Ortiga,PPM,2.54,6,141307
Ortiga,B.E.,1.69,4,141307
Ortiga,L,1.69,4,141307
Ortiga,PCTP/MRPP,1.27,3,141307
Ortiga,PDA,1.27,3,141307
Ortiga,MAS,0.85,2,141307
Ortiga,PAN,0.85,2,141307
Ortiga,PND,0.85,2,141307
Ortiga,PTP,0.85,2,141307
Ortiga,PNR,0.42,1,141307
Ortiga,POUS,0,0,141307
Ortiga,PPV,0,0,141307
