Objeto do Contrato,Tipo de Procedimento,Tipo(s) de Contrato,CPVs,Entidade(s) Adjudicante(s),Entidade(s) Adjudicatária(s),Preço Contratual,Data de Publicação,Data de Celebração do Contrato,Prazo de Execução,Local de Execução,Fundamentação,Data de Fecho do Contrato,Preço Total Efetivo,Causas das Alterações ao Prazo,Causas das Alterações ao Preço,Estado,N.º registo do Acordo Quadro,Descrição do Acordo Quadro,Procedimento Centralizado
ESTUDOS DE IMUNOHISTOQUIMICA - 2017,Ajuste Direto Regime Geral,Aquisição de bens móveis,"33000000-0, Equipamento médico, medicamentos e produtos para cuidados pessoais","Instituto Português de Oncologia de Coimbra Francisco Gentil, E. P. E. (506361438)","ROCHE SIST.DIAG., SOC. UNIP. LDA (504282921)","137.090,00 €",31-01-2017,21-12-2016,365 dias,"Portugal, Coimbra, Coimbra","Artigo 26.º, n.º 1, alínea a) do Código dos Contratos Públicos",31-12-2017,"184.620,00 €",,fornecimento acima do valor previsto,,Não aplicável.,Não aplicável.,FALSE
SOFTWARE SIGEHP - SISCONT (SISBIT) (UMC-SPMS),Ajuste Direto Regime Geral,Aquisição de serviços,"72267000-4, Serviços de manutenção e reparação de software","Instituto Português de Oncologia de Coimbra Francisco Gentil, E. P. E. (506361438)","SISBIT, LDA. (502195576)","8.726,60 €",31-01-2017,27-01-2017,365 dias,"Portugal, Coimbra, Coimbra","Artigo 24.º, n.º 1, alínea e) do Código dos Contratos Públicos","","",,"",,Não aplicável.,Não aplicável.,FALSE
Anticorpos Anatomia Patológica - 2017,Ajuste Direto Regime Geral,Aquisição de bens móveis,"33000000-0, Equipamento médico, medicamentos e produtos para cuidados pessoais","Instituto Português de Oncologia de Coimbra Francisco Gentil, E. P. E. (506361438)","BIOPORTUGAL-QUIMICO FARMACEUTICA, LDª. (502380543)","2.457,00 €",31-01-2017,21-12-2016,365 dias,"Portugal, Coimbra, Coimbra","Artigo 20.º, n.º 1, alínea a) do Código dos Contratos Públicos",31-12-2017,"",,fornecimento ajustado ás necessidades reais,,Não aplicável.,Não aplicável.,FALSE
Anticorpos Anatomia Patológica - 2017,Ajuste Direto Regime Geral,Aquisição de bens móveis,"33000000-0, Equipamento médico, medicamentos e produtos para cuidados pessoais","Instituto Português de Oncologia de Coimbra Francisco Gentil, E. P. E. (506361438)","ZMWAY, LDA (508085349)","4.125,15 €",31-01-2017,21-12-2016,365 dias,"Portugal, Coimbra, Coimbra","Artigo 20.º, n.º 1, alínea a) do Código dos Contratos Públicos",21-04-2017,"951,30 €",,fornecimento abaixo do valor previsto,,Não aplicável.,Não aplicável.,FALSE
Anticorpos Anatomia Patológica - 2017,Ajuste Direto Regime Geral,Aquisição de bens móveis,"33000000-0, Equipamento médico, medicamentos e produtos para cuidados pessoais","Instituto Português de Oncologia de Coimbra Francisco Gentil, E. P. E. (506361438)","LEICA MICROSISTEMAS, LDA (500301921)","1.905,77 €",31-01-2017,21-12-2016,365 dias,"Portugal, Coimbra, Coimbra","Artigo 20.º, n.º 1, alínea a) do Código dos Contratos Públicos",31-12-2017,"",,fornecimento ajustado ás necessidades reais,,Não aplicável.,Não aplicável.,FALSE
Anticorpos Anatomia Patológica - 2017,Ajuste Direto Regime Geral,Aquisição de bens móveis,"33000000-0, Equipamento médico, medicamentos e produtos para cuidados pessoais","Instituto Português de Oncologia de Coimbra Francisco Gentil, E. P. E. (506361438)","GRUPO TAPER - EQUIP.PREC.CENTIFICA, LDA (506886336)","2.643,00 €",31-01-2017,21-12-2016,365 dias,"Portugal, Coimbra, Coimbra","Artigo 20.º, n.º 1, alínea a) do Código dos Contratos Públicos",28-12-2017,"1.262,00 €",,fornecimento abaixo do valor previsto,,Não aplicável.,Não aplicável.,FALSE
REAGENTES IMUNOHEMATOLOGIA - 2017,Ajuste Direto Regime Geral,Aquisição de bens móveis,"33696500-0, Reagentes de laboratório","Instituto Português de Oncologia de Coimbra Francisco Gentil, E. P. E. (506361438)","QUILABAN - QUIMICA LABORATORIAL ANALITICA, S.A. (500399670)","3.004,44 €",31-01-2017,12-12-2016,365 dias,"Portugal, Coimbra, Coimbra","Artigo 20.º, n.º 1, alínea a) do Código dos Contratos Públicos",29-11-2017,"3.068,18 €",,fornecimento acima do valor previsto,,Não aplicável.,Não aplicável.,FALSE
REAGENTES DE IMUNOHEMATOLOGIA - 2017,Ajuste Direto Regime Geral,Aquisição de bens móveis,"33696500-0, Reagentes de laboratório","Instituto Português de Oncologia de Coimbra Francisco Gentil, E. P. E. (506361438)","IMMUCOR (PORTUGAL) DIAG.MEDICOS, LDA (503007358)","10.400,81 €",31-01-2017,23-12-2016,365 dias,"Portugal, Coimbra, Coimbra","Artigo 20.º, n.º 1, alínea a) do Código dos Contratos Públicos",28-12-2017,"10.125,16 €",,fornecimento abaixo do valor previsto,,Não aplicável.,Não aplicável.,FALSE
REAGENTES DE IMUNOHEMATOLOGIA - 2017,Ajuste Direto Regime Geral,Aquisição de bens móveis,"33696500-0, Reagentes de laboratório","Instituto Português de Oncologia de Coimbra Francisco Gentil, E. P. E. (506361438)",BIO-RAD LABORATORIES LDA (501301321),"35.676,10 €",31-01-2017,21-12-2016,365 dias,"Portugal, Coimbra, Coimbra","Artigo 20.º, n.º 1, alínea a) do Código dos Contratos Públicos",31-12-2017,"34.362,58 €",,fornecimento abaixo do valor previsto,,Não aplicável.,Não aplicável.,FALSE
"MED. EXCLUSIVO ZAMBOM PROD. FARMACEUTICOS, LDA",Ajuste Direto Regime Geral,Aquisição de bens móveis,"33600000-6, Produtos farmacêuticos","Instituto Português de Oncologia de Coimbra Francisco Gentil, E. P. E. (506361438)","ZAMBON PROD. FARMACEUTICOS, LDA (502155930)","725,00 €",30-01-2017,29-12-2015,366 dias,"Portugal, Coimbra, Coimbra","Artigo 24.º, n.º 1, alínea e) do Código dos Contratos Públicos",15-12-2016,"522,00 €",,Diminuição das necessidades.,,Não aplicável.,Não aplicável.,FALSE
MARCADORES VIRAIS PARA SERVIÇO DE IMUNOHEMOTERAPIA - 2017,Ajuste Direto Regime Geral,Aquisição de bens móveis,"33696500-0, Reagentes de laboratório","Instituto Português de Oncologia de Coimbra Francisco Gentil, E. P. E. (506361438)",BIOMERIEUX (501524177),"16.832,90 €",30-01-2017,30-12-2016,365 dias,"Portugal, Coimbra, Coimbra","Artigo 20.º, n.º 1, alínea a) do Código dos Contratos Públicos",05-12-2017,"16.475,07 €",,fornecimento abaixo do valor previsto,,Não aplicável.,Não aplicável.,FALSE
MARCADORES VIRAIS PARA SERVIÇO DE IMUNOHEMOTERAPIA - 2017,Ajuste Direto Regime Geral,Aquisição de bens móveis,"33696500-0, Reagentes de laboratório","Instituto Português de Oncologia de Coimbra Francisco Gentil, E. P. E. (506361438)",BIO-RAD LABORATORIES LDA (501301321),"6.800,52 €",30-01-2017,12-12-2016,365 dias,"Portugal, Coimbra, Coimbra","Artigo 20.º, n.º 1, alínea a) do Código dos Contratos Públicos",28-12-2017,"6.827,35 €",,fornecimento acima do valor previsto,,Não aplicável.,Não aplicável.,FALSE
Fruta e Legumes Frescos e Congelados - 1º Trimestre 2017,Ajuste Direto Regime Geral,Aquisição de bens móveis,"15000000-8, Produtos alimentares, bebidas, tabaco e produtos afins","Instituto Português de Oncologia de Coimbra Francisco Gentil, E. P. E. (506361438)","INDUBEIRA - INDUSTRIA ALIMENTAR, S.A. (503501875)","1.648,24 €",27-01-2017,21-12-2016,90 dias,"Portugal, Coimbra, Coimbra","Artigo 20.º, n.º 1, alínea a) do Código dos Contratos Públicos",31-03-2017,"1.320,76 €",,fornecimento abaixo das quantidades previstas,,Não aplicável.,Não aplicável.,FALSE
Fruta e Legumes Frescos e Congelados - 1º Trimestre 2017,Ajuste Direto Regime Geral,Aquisição de bens móveis,"15000000-8, Produtos alimentares, bebidas, tabaco e produtos afins","Instituto Português de Oncologia de Coimbra Francisco Gentil, E. P. E. (506361438)","FRUTIBAIRRADA, COM.FRUTAS E LEGUMES LDA (504314750)","3.701,60 €",27-01-2017,21-12-2016,90 dias,"Portugal, Coimbra, Coimbra","Artigo 20.º, n.º 1, alínea a) do Código dos Contratos Públicos",31-03-2017,"3.524,17 €",,fornecimento abaixo das quantidades previstas,,Não aplicável.,Não aplicável.,FALSE
Não foi definido nas peças concursais,Ajuste Direto Regime Geral,Aquisição de bens móveis,"15000000-8, Produtos alimentares, bebidas, tabaco e produtos afins","Instituto Português de Oncologia de Coimbra Francisco Gentil, E. P. E. (506361438)",ADRIANO MANUEL VENTURA A. CARVALHO (172405890),"6.084,40 €",27-01-2017,21-12-2016,90 dias,"Portugal, Coimbra, Coimbra","Artigo 20.º, n.º 1, alínea a) do Código dos Contratos Públicos",31-03-2017,"6.000,77 €",,fornecimento abaixo das quantidades previstas,,Não aplicável.,Não aplicável.,FALSE
Fruta e Legumes Frescos e Congelados - 1º trimestre 2017,Ajuste Direto Regime Geral,Aquisição de bens móveis,"15000000-8, Produtos alimentares, bebidas, tabaco e produtos afins","Instituto Português de Oncologia de Coimbra Francisco Gentil, E. P. E. (506361438)",JOSE POETA PALRILHA (101717318),"2.840,80 €",27-01-2017,21-12-2016,90 dias,"Portugal, Coimbra, Coimbra","Artigo 20.º, n.º 1, alínea a) do Código dos Contratos Públicos",31-03-2017,"3.200,75 €",,fornecimento acima das quantidades previstas,,Não aplicável.,Não aplicável.,FALSE
Fruta e Legumes Frescos e Congelados - 1º Trimestre 2017,Ajuste Direto Regime Geral,Aquisição de bens móveis,"15000000-8, Produtos alimentares, bebidas, tabaco e produtos afins","Instituto Português de Oncologia de Coimbra Francisco Gentil, E. P. E. (506361438)",FRUTAS DO MONDEGO LDA (508537169),"5.503,56 €",27-01-2017,21-12-2016,90 dias,"Portugal, Coimbra, Coimbra","Artigo 20.º, n.º 1, alínea a) do Código dos Contratos Públicos",30-03-2017,"5.636,74 €",,fornecimento acima das quantidades previstas,,Não aplicável.,Não aplicável.,FALSE
Fruta e Legumes Frescos e Congelados - 1º Trimestre 2017,Ajuste Direto Regime Geral,Aquisição de bens móveis,"15000000-8, Produtos alimentares, bebidas, tabaco e produtos afins","Instituto Português de Oncologia de Coimbra Francisco Gentil, E. P. E. (506361438)",FERNANDO JORGE DE JESUS POVOA (209909951),"3.618,50 €",27-01-2017,21-12-2016,90 dias,"Portugal, Coimbra, Coimbra","Artigo 20.º, n.º 1, alínea a) do Código dos Contratos Públicos",31-03-2017,"3.731,16 €",,fornecimento acima das quantidades previstas,,Não aplicável.,Não aplicável.,FALSE
Fruta e Legumes Frescos e Congelados - 1º Trimestre 2017,Ajuste Direto Regime Geral,Aquisição de bens móveis,"15000000-8, Produtos alimentares, bebidas, tabaco e produtos afins","Instituto Português de Oncologia de Coimbra Francisco Gentil, E. P. E. (506361438)",MARIA ISABEL RIBEIRO GASPAR (146220935),"3.471,50 €",27-01-2017,21-12-2016,90 dias,"Portugal, Coimbra, Coimbra","Artigo 20.º, n.º 1, alínea a) do Código dos Contratos Públicos",31-03-2017,"2.518,97 €",,fornecimento abaixo das quantidades previstas,,Não aplicável.,Não aplicável.,FALSE
Fruta e Legumes Frescos e Congelados - 1º Trimestre 2017,Ajuste Direto Regime Geral,Aquisição de bens móveis,"15000000-8, Produtos alimentares, bebidas, tabaco e produtos afins","Instituto Português de Oncologia de Coimbra Francisco Gentil, E. P. E. (506361438)","DELTAGEL - PROD. ALIMENTARES,S.A. (505477882)","1.996,14 €",27-01-2017,21-12-2016,90 dias,"Portugal, Coimbra, Coimbra","Artigo 20.º, n.º 1, alínea a) do Código dos Contratos Públicos",04-04-2017,"1.939,22 €",,fornecimento abaixo das quantidades previstas,,Não aplicável.,Não aplicável.,FALSE
Carne - 1º Trimestre 2017,Ajuste Direto Regime Geral,Aquisição de bens móveis,"15000000-8, Produtos alimentares, bebidas, tabaco e produtos afins","Instituto Português de Oncologia de Coimbra Francisco Gentil, E. P. E. (506361438)",METAS PRINCIPAIS - UNIPESSOAL LDA (513528563),"4.130,60 €",26-01-2017,21-12-2016,90 dias,"Portugal, Coimbra, Coimbra","Artigo 20.º, n.º 1, alínea a) do Código dos Contratos Públicos",30-03-2017,"3.930,39 €",,fornecimento abaixo das quantidades previstas,,Não aplicável.,Não aplicável.,FALSE
Carne - 1º Trimestre 2017,Ajuste Direto Regime Geral,Aquisição de bens móveis,"15000000-8, Produtos alimentares, bebidas, tabaco e produtos afins","Instituto Português de Oncologia de Coimbra Francisco Gentil, E. P. E. (506361438)",MEIGAL ALIMENTAÇÃO S.A. (502060433),"2.861,50 €",26-01-2017,21-12-2016,90 dias,"Portugal, Coimbra, Coimbra","Artigo 20.º, n.º 1, alínea a) do Código dos Contratos Públicos",31-03-2017,"3.940,14 €",,fornecimento acima das quantidades previstas,,Não aplicável.,Não aplicável.,FALSE
Carne - 1º Trimestre 2017,Ajuste Direto Regime Geral,Aquisição de bens móveis,"15000000-8, Produtos alimentares, bebidas, tabaco e produtos afins","Instituto Português de Oncologia de Coimbra Francisco Gentil, E. P. E. (506361438)","IRMAOS MONTEIRO,S.A. (501248757)","744,85 €",26-01-2017,21-12-2016,90 dias,"Portugal, Coimbra, Coimbra","Artigo 20.º, n.º 1, alínea a) do Código dos Contratos Públicos",23-03-2017,"335,11 €",,fornecimento abaixo das quantidades previstas,,Não aplicável.,Não aplicável.,FALSE
NP - DABRAFENIB 75 MG,Ajuste Direto Regime Geral,Aquisição de bens móveis,"33600000-6, Produtos farmacêuticos","Instituto Português de Oncologia de Coimbra Francisco Gentil, E. P. E. (506361438)","Novartis Farma - Produtos Farmacêuticos, SA (500063524)","6.205,71 €",26-01-2017,21-10-2016,1 dias,"Portugal, Coimbra, Coimbra","Artigo 24.º, n.º 1, alínea e) do Código dos Contratos Públicos",21-10-2016,"6.205,71 €",,"",,Não aplicável.,Não aplicável.,FALSE
Suplementos Alimentares - 2017,Ajuste Direto Regime Geral,Aquisição de bens móveis,"15000000-8, Produtos alimentares, bebidas, tabaco e produtos afins","Instituto Português de Oncologia de Coimbra Francisco Gentil, E. P. E. (506361438)","PALMEIRO FOODS, S.A. (506951049)","8.863,74 €",26-01-2017,16-12-2016,365 dias,"Portugal, Coimbra, Coimbra","Artigo 20.º, n.º 1, alínea a) do Código dos Contratos Públicos",19-12-2017,"2.878,65 €",,fornecimento abaixo do valor previsto,,Não aplicável.,Não aplicável.,FALSE
Suplementos Alimentares - 2017,Ajuste Direto Regime Geral,Aquisição de bens móveis,"15000000-8, Produtos alimentares, bebidas, tabaco e produtos afins","Instituto Português de Oncologia de Coimbra Francisco Gentil, E. P. E. (506361438)","NESTLE PORTUGAL, SA (500201307)","2.446,67 €",26-01-2017,16-12-2016,365 dias,"Portugal, Coimbra, Coimbra","Artigo 20.º, n.º 1, alínea a) do Código dos Contratos Públicos",27-12-2017,"3.850,77 €",,fornecimento acima do valor previsto,,Não aplicável.,Não aplicável.,FALSE
Produtos de Padaria  - 2017,Ajuste Direto Regime Geral,Aquisição de bens móveis,"15000000-8, Produtos alimentares, bebidas, tabaco e produtos afins","Instituto Português de Oncologia de Coimbra Francisco Gentil, E. P. E. (506361438)",PAES E DOCES CHALE DE OURO LDA (503094072),"12.505,00 €",26-01-2017,20-12-2016,365 dias,"Portugal, Coimbra, Coimbra","Artigo 20.º, n.º 1, alínea a) do Código dos Contratos Públicos",31-12-2017,"10.352,44 €",,fornecimento abaixo do valor previsto,,Não aplicável.,Não aplicável.,FALSE
Latícinios - 2017,Ajuste Direto Regime Geral,Aquisição de bens móveis,"15000000-8, Produtos alimentares, bebidas, tabaco e produtos afins","Instituto Português de Oncologia de Coimbra Francisco Gentil, E. P. E. (506361438)","LONGA VIDA - INDUST. LACTEAS, SA (500011443)","11.351,25 €",26-01-2017,30-12-2016,365 dias,"Portugal, Coimbra, Coimbra","Artigo 20.º, n.º 1, alínea a) do Código dos Contratos Públicos",31-12-2017,"12.548,98 €",,fornecimento acima do valor previsto,,Não aplicável.,Não aplicável.,FALSE
Latícinios - 2017,Ajuste Direto Regime Geral,Aquisição de bens móveis,"15000000-8, Produtos alimentares, bebidas, tabaco e produtos afins","Instituto Português de Oncologia de Coimbra Francisco Gentil, E. P. E. (506361438)","PAC E BOM- COMERCIO E SERVICOS, LDA (503554049)","304,25 €",26-01-2017,21-12-2016,365 dias,"Portugal, Coimbra, Coimbra","Artigo 20.º, n.º 1, alínea a) do Código dos Contratos Públicos",19-12-2017,"220,22 €",,fornecimento abaixo do valor previsto,,Não aplicável.,Não aplicável.,FALSE
Latícinios - 2017,Ajuste Direto Regime Geral,Aquisição de bens móveis,"15000000-8, Produtos alimentares, bebidas, tabaco e produtos afins","Instituto Português de Oncologia de Coimbra Francisco Gentil, E. P. E. (506361438)","ANTONIO EZEQUIEL, LDA (502046511)","4.473,16 €",26-01-2017,21-12-2016,365 dias,"Portugal, Coimbra, Coimbra","Artigo 20.º, n.º 1, alínea a) do Código dos Contratos Públicos",27-12-2017,"3.619,36 €",,fornecimento abaixo do valor previsto,,Não aplicável.,Não aplicável.,FALSE
Latícinios - 2017,Ajuste Direto Regime Geral,Aquisição de bens móveis,"15000000-8, Produtos alimentares, bebidas, tabaco e produtos afins","Instituto Português de Oncologia de Coimbra Francisco Gentil, E. P. E. (506361438)","PEREIRA & SANTOS, S.A. (500395691)","2.313,05 €",26-01-2017,21-12-2016,365 dias,"Portugal, Coimbra, Coimbra","Artigo 20.º, n.º 1, alínea a) do Código dos Contratos Públicos",13-12-2017,"2.758,51 €",,fornecimento acima do valor previsto,,Não aplicável.,Não aplicável.,FALSE
Latícinios - 2017,Ajuste Direto Regime Geral,Aquisição de bens móveis,"15000000-8, Produtos alimentares, bebidas, tabaco e produtos afins","Instituto Português de Oncologia de Coimbra Francisco Gentil, E. P. E. (506361438)","LACTOGAL - PRODUTOS ALIMENTARES, S.A. (503183997)","20.255,00 €",26-01-2017,30-12-2016,365 dias,"Portugal, Coimbra, Coimbra","Artigo 20.º, n.º 1, alínea a) do Código dos Contratos Públicos",27-12-2017,"20.178,76 €",,fornecimento abaixo do valor previsto,,Não aplicável.,Não aplicável.,FALSE
Gorduras Alimentares - 2017,Ajuste Direto Regime Geral,Aquisição de bens móveis,"15000000-8, Produtos alimentares, bebidas, tabaco e produtos afins","Instituto Português de Oncologia de Coimbra Francisco Gentil, E. P. E. (506361438)","PAC E BOM- COMERCIO E SERVICOS, LDA (503554049)","11.272,50 €",26-01-2017,30-12-2016,365 dias,"Portugal, Coimbra, Coimbra","Artigo 20.º, n.º 1, alínea a) do Código dos Contratos Públicos",28-12-2017,"10.419,56 €",,fornecimento abaixo do valor previsto,,Não aplicável.,Não aplicável.,FALSE
Mercearia - 2017,Ajuste Direto Regime Geral,Aquisição de bens móveis,"15000000-8, Produtos alimentares, bebidas, tabaco e produtos afins","Instituto Português de Oncologia de Coimbra Francisco Gentil, E. P. E. (506361438)","PAC E BOM- COMERCIO E SERVICOS, LDA (503554049)","10.944,47 €",25-01-2017,30-12-2016,365 dias,"Portugal, Coimbra, Coimbra","Artigo 20.º, n.º 1, alínea a) do Código dos Contratos Públicos",28-12-2017,"11.714,05 €",,fornecimento acima do valor previsto,,Não aplicável.,Não aplicável.,FALSE
Mercearia - 2017,Ajuste Direto Regime Geral,Aquisição de bens móveis,"15000000-8, Produtos alimentares, bebidas, tabaco e produtos afins","Instituto Português de Oncologia de Coimbra Francisco Gentil, E. P. E. (506361438)","PEREIRA & SANTOS, S.A. (500395691)","3.312,57 €",25-01-2017,21-12-2016,365 dias,"Portugal, Coimbra, Coimbra","Artigo 20.º, n.º 1, alínea a) do Código dos Contratos Públicos",27-12-2017,"2.896,36 €",,fornecimento abaixo do valor previsto,,Não aplicável.,Não aplicável.,FALSE
Mercearia - 2017,Ajuste Direto Regime Geral,Aquisição de bens móveis,"15000000-8, Produtos alimentares, bebidas, tabaco e produtos afins","Instituto Português de Oncologia de Coimbra Francisco Gentil, E. P. E. (506361438)",ARLINDO DAS NEVES ANDRADE (174515227),"10.140,16 €",25-01-2017,30-12-2016,365 dias,"Portugal, Coimbra, Coimbra","Artigo 20.º, n.º 1, alínea a) do Código dos Contratos Públicos",20-12-2017,"9.576,73 €",,fornecimento abaixo do valor previsto,,Não aplicável.,Não aplicável.,FALSE
Bebidas - 2017,Ajuste Direto Regime Geral,Aquisição de bens móveis,"15000000-8, Produtos alimentares, bebidas, tabaco e produtos afins","Instituto Português de Oncologia de Coimbra Francisco Gentil, E. P. E. (506361438)","PAC E BOM- COMERCIO E SERVICOS, LDA (503554049)","335,50 €",24-01-2017,21-12-2016,365 dias,"Portugal, Coimbra, Coimbra","Artigo 20.º, n.º 1, alínea a) do Código dos Contratos Públicos",28-12-2017,"403,74 €",,fornecimento acima do valor previsto,,Não aplicável.,Não aplicável.,FALSE
Bebidas - 2017,Ajuste Direto Regime Geral,Aquisição de bens móveis,"15000000-8, Produtos alimentares, bebidas, tabaco e produtos afins","Instituto Português de Oncologia de Coimbra Francisco Gentil, E. P. E. (506361438)","ANTONIO EZEQUIEL, LDA (502046511)","473,15 €",24-01-2017,21-12-2016,365 dias,"Portugal, Coimbra, Coimbra","Artigo 20.º, n.º 1, alínea a) do Código dos Contratos Públicos",28-12-2017,"741,57 €",,fornecimento acima do valor previsto,,Não aplicável.,Não aplicável.,FALSE
Bebidas - 2017,Ajuste Direto Regime Geral,Aquisição de bens móveis,"15000000-8, Produtos alimentares, bebidas, tabaco e produtos afins","Instituto Português de Oncologia de Coimbra Francisco Gentil, E. P. E. (506361438)","PEREIRA & SANTOS, S.A. (500395691)","1.481,10 €",24-01-2017,21-12-2016,365 dias,"Portugal, Coimbra, Coimbra","Artigo 20.º, n.º 1, alínea a) do Código dos Contratos Públicos",16-12-2017,"2.088,21 €",,fornecimento acima do valor previsto,,Não aplicável.,Não aplicável.,FALSE
Bebidas - 2017,Ajuste Direto Regime Geral,Aquisição de bens móveis,"15000000-8, Produtos alimentares, bebidas, tabaco e produtos afins","Instituto Português de Oncologia de Coimbra Francisco Gentil, E. P. E. (506361438)",ARLINDO DAS NEVES ANDRADE (174515227),"9.095,00 €",24-01-2017,21-12-2016,365 dias,"Portugal, Coimbra, Coimbra","Artigo 20.º, n.º 1, alínea a) do Código dos Contratos Públicos",20-12-2017,"14.537,62 €",,fornecimento acima do valor previsto,,Não aplicável.,Não aplicável.,FALSE
Bebidas - 2017,Ajuste Direto Regime Geral,Aquisição de bens móveis,"15000000-8, Produtos alimentares, bebidas, tabaco e produtos afins","Instituto Português de Oncologia de Coimbra Francisco Gentil, E. P. E. (506361438)","LACTOGAL - PRODUTOS ALIMENTARES, S.A. (503183997)","13.920,00 €",24-01-2017,30-12-2016,365 dias,"Portugal, Coimbra, Coimbra","Artigo 20.º, n.º 1, alínea a) do Código dos Contratos Públicos",27-12-2017,"16.692,46 €",,fornecimento acima do valor previsto,,Não aplicável.,Não aplicável.,FALSE
NP DABRAFENIB 75 MG,Ajuste Direto Regime Geral,Aquisição de bens móveis,"33600000-6, Produtos farmacêuticos","Instituto Português de Oncologia de Coimbra Francisco Gentil, E. P. E. (506361438)","NOVARTIS FARMA - PROD.FARMACEUTICOS, SA (500063524)","6.205,71 €",24-01-2017,14-12-2016,17 dias,"Portugal, Coimbra, Coimbra","Artigo 24.º, n.º 1, alínea e) do Código dos Contratos Públicos","","",,"",,Não aplicável.,Não aplicável.,FALSE
NP DABRAFENIB 75 MG,Ajuste Direto Regime Geral,Aquisição de bens móveis,"33600000-6, Produtos farmacêuticos","Instituto Português de Oncologia de Coimbra Francisco Gentil, E. P. E. (506361438)","NOVARTIS FARMA - PROD.FARMACEUTICOS, SA (500063524)","24.822,84 €",24-01-2017,04-11-2016,57 dias,"Portugal, Coimbra, Coimbra","Artigo 24.º, n.º 1, alínea e) do Código dos Contratos Públicos",07-11-2016,"24.822,84 €",,"",,Não aplicável.,Não aplicável.,FALSE
NP OSIMERTINIB,Ajuste Direto Regime Geral,Aquisição de bens móveis,"33600000-6, Produtos farmacêuticos","Instituto Português de Oncologia de Coimbra Francisco Gentil, E. P. E. (506361438)","ASTRAZENECA PROD. FARMACEUTICOS, LDA (502942240)","24.857,16 €",23-01-2017,21-10-2016,71 dias,"Portugal, Coimbra, Coimbra","Artigo 24.º, n.º 1, alínea a) do Código dos Contratos Públicos",14-12-2016,"41.428,60 €",,"",,Não aplicável.,Não aplicável.,FALSE
