Objeto do Contrato,Tipo de Procedimento,Tipo(s) de Contrato,CPVs,Entidade(s) Adjudicante(s),Entidade(s) Adjudicatária(s),Preço Contratual,Data de Publicação,Data de Celebração do Contrato,Prazo de Execução,Local de Execução,Fundamentação,Data de Fecho do Contrato,Preço Total Efetivo,Causas das Alterações ao Prazo,Causas das Alterações ao Preço,Estado,N.º registo do Acordo Quadro,Descrição do Acordo Quadro,Procedimento Centralizado
49003216-Serviços medicos de ortopedia,Ajuste Direto Regime Geral,Aquisição de serviços,"79600000-0, Serviços de recrutamento",Hospital Dr. Francisco Zagalo (501510150),"ORLANDO HORÁCIO GOMES LUÍS, UNIPESSOAL LDA (510351891)","8.400,00 €",01-03-2017,02-02-2017,365 dias,"Portugal, Aveiro, Ovar","Artigo 20.º, n.º 1, alínea a) do Código dos Contratos Públicos",31-10-2017,"8.460,00 €",,Serviços acima da previsão,,Não aplicável.,Não aplicável.,FALSE
AD-49003216-Contratação serviços medicos de ortopedia,Ajuste Direto Regime Geral,Aquisição de serviços,"79600000-0, Serviços de recrutamento",Hospital Dr. Francisco Zagalo (501510150),"ORLANDO HORÁCIO GOMES LUÍS, UNIPESSOAL LDA (510351891)","12.000,00 €",30-12-2016,04-02-2016,365 dias,"Portugal, Aveiro, Ovar","Artigo 20.º, n.º 1, alínea a) do Código dos Contratos Públicos",31-12-2016,"9.300,00 €",,serviços abaixo do previsto,,Não aplicável.,Não aplicável.,FALSE
Serviços medicos,Ajuste Direto Regime Geral,Aquisição de serviços,"79600000-0, Serviços de recrutamento",Hospital Dr. Francisco Zagalo (501510150),"ORLANDO HORÁCIO GOMES LUÍS, UNIPESSOAL LDA (510351891)","3.967,67 €",16-02-2016,20-01-2016,30 dias,"Portugal, Aveiro, Ovar","Artigo 20.º, n.º 1, alínea a) do Código dos Contratos Públicos",31-01-2016,"3.967,67 €",,"",,Não aplicável.,Não aplicável.,FALSE
SERVIÇOS MEDICOS DE ORTOPEDIA,Ajuste Direto Regime Geral,Aquisição de serviços,"85000000-9, Serviços de saúde e acção social",Hospital Dr. Francisco Zagalo (501510150),"ORLANDO HORÁCIO GOMES LUÍS, UNIPESSOAL LDA (510351891)","2.085,22 €",01-10-2015,01-10-2014,90 dias,"Portugal, Aveiro, Ovar","Artigo 20.º, n.º 1, alínea a) do Código dos Contratos Públicos",31-12-2014,"2.085,22 €",,"",,Não aplicável.,Não aplicável.,FALSE
Serviços medicos na area de ortopedia,Ajuste Direto Regime Geral,Aquisição de serviços,"85100000-0, Serviços de saúde",Hospital Dr. Francisco Zagalo (501510150),"Orlando Horacio Gomes Luis, Unipessoal, Lda. (510351891)","8.640,00 €",24-03-2015,13-02-2015,365 dias,"Portugal, Aveiro, Ovar","Artigo 20.º, n.º 1, alínea a) do Código dos Contratos Públicos",31-12-2015,"7.845,00 €",,Serviço abaixo do previsto,,Não aplicável.,Não aplicável.,FALSE
