Objeto do Contrato,Tipo de Procedimento,Tipo(s) de Contrato,CPVs,Entidade(s) Adjudicante(s),Entidade(s) Adjudicatária(s),Preço Contratual,Data de Publicação,Data de Celebração do Contrato,Prazo de Execução,Local de Execução,Fundamentação,Data de Fecho do Contrato,Preço Total Efetivo,Causas das Alterações ao Prazo,Causas das Alterações ao Preço,Estado,N.º registo do Acordo Quadro,Descrição do Acordo Quadro,Procedimento Centralizado
Prestação de Serviços Médicos de Urgencia Geral,Ajuste Direto Regime Geral,Aquisição de serviços,"85121000-3, Serviços de prática médica","Centro Hospitalar Universitário do Algarve, E. P. E. (510745997)",Ilya & Elena - Serviços Médicos Lda (510504485),"15.600,00 €",15-03-2018,09-01-2018,90 dias,"Portugal, Faro, Portimão","Artigo 24.º, n.º 1, alínea e) do Código dos Contratos Públicos",31-12-2018,"30.825,00 €",,De acordo com as necessidades efectivas no ano 2018,,Não aplicável.,Não aplicável.,FALSE
"Serviços Médicos de Urgência Geral- Ilya & Elena, Serviços Médicos, Lda",Ajuste Direto Regime Geral,Aquisição de serviços,"85121100-4, Serviços de médicos de clínica geral","Centro Hospitalar Universitário do Algarve, E. P. E. (510745997)",Ilya & Elena - Serviços Médicos Lda (510504485),"31.200,00 €",03-11-2017,31-08-2017,183 dias,"Portugal, Faro, Portimão","Artigo 24.º, n.º 1, alínea e) do Código dos Contratos Públicos",31-12-2017,"15.675,00 €",,"O valor inicial do Contrato teve por base as necessidades estimadas para o período de 1 de julho de 2017 a 31 dezembro de 2017, o valor final reflete as necessidades efectivas.",,Não aplicável.,Não aplicável.,FALSE
Serviços Médicos de Urgência Geral e Básica,Ajuste Direto Regime Geral,Aquisição de serviços,"85121100-4, Serviços de médicos de clínica geral","Centro Hospitalar do Algarve, E.P.E. (510745997)","Ilya & Elena - Serviços Médicos, Lda (510504485)","31.200,00 €",22-03-2017,16-03-2017,180 dias,"Portugal, Faro, Portimão","Artigo 24.º, n.º 1, alínea e) do Código dos Contratos Públicos",30-06-2017,"14.500,00 €",,"O valor inicial teve por base o valor estimado para o período de Janeiro a Junho de 2017, o valor final reflecte as necessidades efetivas",,Não aplicável.,Não aplicável.,FALSE
Serviços Médicos Urgência Geral e Básica,Ajuste Direto Regime Geral,Aquisição de serviços,"85121100-4, Serviços de médicos de clínica geral","Centro Hospitalar do Algarve, E. P. E. (510745997)","Ilya & Elena - Serviços Médicos, Lda (510504485)","46.800,00 €",29-07-2016,26-07-2016,180 dias,"Portugal, Faro, Lagos<BR/>Portugal, Faro, Portimão","Artigo 24.º, n.º 1, alínea c) do Código dos Contratos Públicos",31-12-2016,"19.650,00 €",,"O valor inicial do Contrato teve por base as necessidades estimadas para o período de 1 Julho de 2016 a 31 Dezembro de 2016, o valor final reflecte as necessidades efectivas.",,Não aplicável.,Não aplicável.,FALSE
"Serviços Médicos Urgência Geral e Básica, Sala Reanimação , Cuidados Intermédios, Vmer",Ajuste Direto Regime Geral,Aquisição de serviços,"85121100-4, Serviços de médicos de clínica geral","Centro Hospitalar do Algarve, E. P. E. (510745997)","Ilya & Elena - Serviços Médicos, Lda (510504485)","15.600,00 €",04-03-2016,24-02-2016,91 dias,"Portugal, Faro, Albufeira<BR/>Portugal, Faro, Lagos<BR/>Portugal, Faro, Portimão<BR/>Portugal, Faro, Loulé<BR/>Portugal, Faro, Faro","Artigo 24.º, n.º 1, alínea c) do Código dos Contratos Públicos",30-06-2016,"23.350,00 €",,"O valor inicial do Contrato teve por base as necessidades estimadas para o período de 1 Janeiro de 2016 a 30 Junho de 2016, o valor final reflecte as necessidades efectivas.",,Não aplicável.,Não aplicável.,FALSE
"Serviços Médicos Urg Geral, Ped e Basica e Vmer",Ajuste Direto Regime Geral,Aquisição de serviços,"85140000-2, Serviços de saúde diversos","Centro Hospitalar do Algarve, E. P. E. (510745997)","Ilya & Elena - Serviços Médicos, Lda (510504485)","23.400,00 €",21-04-2015,13-04-2015,275 dias,"Portugal, Faro, Faro<BR/>Portugal, Faro, Lagos<BR/>Portugal, Faro, Portimão","Artigo 24.º, n.º 1, alínea c) do Código dos Contratos Públicos",31-12-2015,"32.950,00 €",,"O valor inicial do Contrato teve por base as necessidades estimadas para o período de 1 Abril de 2015 a 31 Dezembro de 2015, o valor final reflecte as necessidades efectivas.",,Não aplicável.,Não aplicável.,FALSE
"Serv Méd Urgência Geral e Básica e Ped , Cuidados Inter, Vmer, Sala Reanim",Ajuste Direto Regime Geral,Aquisição de serviços,"85121100-4, Serviços de médicos de clínica geral","Centro Hospitalar do Algarve, E. P. E. (510745997)","Ilya&Elena - Serviços Médicos, Lda (510504485)","5.400,00 €",18-03-2015,06-03-2015,59 dias,"Portugal, Faro, Portimão<BR/>Portugal, Faro, Lagos<BR/>Portugal, Faro, Faro","Artigo 24.º, n.º 1, alínea c) do Código dos Contratos Públicos",31-03-2015,"7.800,00 €",,"",,Não aplicável.,Não aplicável.,FALSE
