freguesia,acronym,validVotesPercentage,votes,dicofre
União das freguesias de Marrancos e Arcozelo,PPD/PSD.CDS-PP,69.64,211,031364
União das freguesias de Marrancos e Arcozelo,PS,14.85,45,031364
União das freguesias de Marrancos e Arcozelo,MPT,5.28,16,031364
União das freguesias de Marrancos e Arcozelo,B.E.,1.98,6,031364
União das freguesias de Marrancos e Arcozelo,PCP-PEV,1.98,6,031364
União das freguesias de Marrancos e Arcozelo,PAN,1.65,5,031364
União das freguesias de Marrancos e Arcozelo,PCTP/MRPP,1.32,4,031364
União das freguesias de Marrancos e Arcozelo,L,0.99,3,031364
União das freguesias de Marrancos e Arcozelo,MAS,0.66,2,031364
União das freguesias de Marrancos e Arcozelo,PPV,0.66,2,031364
União das freguesias de Marrancos e Arcozelo,PTP,0.66,2,031364
União das freguesias de Marrancos e Arcozelo,PPM,0.33,1,031364
União das freguesias de Marrancos e Arcozelo,PDA,0,0,031364
União das freguesias de Marrancos e Arcozelo,PND,0,0,031364
União das freguesias de Marrancos e Arcozelo,PNR,0,0,031364
União das freguesias de Marrancos e Arcozelo,POUS,0,0,031364
