freguesia,acronym,validVotesPercentage,votes,dicofre
Nogueira e Silva Escura,PS,32.84,777,130620
Nogueira e Silva Escura,PPD/PSD.CDS-PP,30.9,731,130620
Nogueira e Silva Escura,MPT,9.59,227,130620
Nogueira e Silva Escura,PCP-PEV,7.73,183,130620
Nogueira e Silva Escura,B.E.,7.19,170,130620
Nogueira e Silva Escura,PAN,3.04,72,130620
Nogueira e Silva Escura,L,2.83,67,130620
Nogueira e Silva Escura,PCTP/MRPP,1.78,42,130620
Nogueira e Silva Escura,PTP,0.97,23,130620
Nogueira e Silva Escura,PND,0.93,22,130620
Nogueira e Silva Escura,PPM,0.85,20,130620
Nogueira e Silva Escura,PNR,0.51,12,130620
Nogueira e Silva Escura,MAS,0.3,7,130620
Nogueira e Silva Escura,PPV,0.3,7,130620
Nogueira e Silva Escura,POUS,0.17,4,130620
Nogueira e Silva Escura,PDA,0.08,2,130620
