Objeto do Contrato,Tipo de Procedimento,Tipo(s) de Contrato,CPVs,Entidade(s) Adjudicante(s),Entidade(s) Adjudicatária(s),Preço Contratual,Data de Publicação,Data de Celebração do Contrato,Prazo de Execução,Local de Execução,Fundamentação,Data de Fecho do Contrato,Preço Total Efetivo,Causas das Alterações ao Prazo,Causas das Alterações ao Preço,Estado,N.º registo do Acordo Quadro,Descrição do Acordo Quadro,Procedimento Centralizado
AJ/18/2017 Fornecimento de frutas e produtos hortícolas e da 4ª gama para o ano de 2017,Ajuste Direto Regime Geral,Aquisição de bens móveis,"15000000-8, Produtos alimentares, bebidas, tabaco e produtos afins","Hospital de Magalhães Lemos, E. P. E. (502828790)","HORTIDOURO-PRODUTOS HORTICOLAS,LDA (507144007)","672,84 €",21-04-2017,02-01-2017,8 dias,"Portugal, Porto, Porto","Artigo 20.º, n.º 1, alínea a) do Código dos Contratos Públicos",,,,,,Não aplicável.,Não aplicável.,FALSE
"AJ/19/2017 Fornecimento de congelados – peixes, derivados de peixe e legumes para o ano de 2017",Ajuste Direto Regime Geral,Aquisição de bens móveis,"15000000-8, Produtos alimentares, bebidas, tabaco e produtos afins","Hospital de Magalhães Lemos, E. P. E. (502828790)","Futuro em Relevo - Comércio de Carnes, Unip (509485693)","429,50 €",21-04-2017,02-01-2017,8 dias,"Portugal, Porto, Porto<BR/>Portugal","Artigo 20.º, n.º 1, alínea a) do Código dos Contratos Públicos",,,,,,Não aplicável.,Não aplicável.,FALSE
"AJ/17/2017 Fornecimento de carnes frescas, congeladas, derivados de carne, enchidos e fumados durante 2017",Ajuste Direto Regime Geral,Aquisição de bens móveis,"15000000-8, Produtos alimentares, bebidas, tabaco e produtos afins","Hospital de Magalhães Lemos, E. P. E. (502828790)","Futuro em Relevo - Comércio de Carnes, Unip (509485693)","588,37 €",21-04-2017,02-01-2017,8 dias,"Portugal, Porto, Porto","Artigo 20.º, n.º 1, alínea a) do Código dos Contratos Públicos",,,,,,Não aplicável.,Não aplicável.,FALSE
"AJ/17/2017 Fornecimento de carnes frescas, congeladas, derivados de carne, enchidos e fumados durante 2017",Ajuste Direto Regime Geral,Aquisição de bens móveis,"15000000-8, Produtos alimentares, bebidas, tabaco e produtos afins","Hospital de Magalhães Lemos, E. P. E. (502828790)","Futuro em Relevo - Comércio de Carnes, Unip (509485693)","370,75 €",21-04-2017,02-01-2017,8 dias,"Portugal, Porto, Porto","Artigo 20.º, n.º 1, alínea a) do Código dos Contratos Públicos",,,,,,Não aplicável.,Não aplicável.,FALSE
"AJ/19/2017 - Fornecimento de congelados – peixes, derivados de peixe e legumes para o ano de 2017",Ajuste Direto Regime Geral,Aquisição de bens móveis,"15000000-8, Produtos alimentares, bebidas, tabaco e produtos afins","Hospital de Magalhães Lemos, E. P. E. (502828790)",A.MENDES TORRADO (501544984),"55,40 €",21-04-2017,02-01-2017,8 dias,"Portugal, Porto, Porto","Artigo 20.º, n.º 1, alínea a) do Código dos Contratos Públicos",,,,,,Não aplicável.,Não aplicável.,FALSE
AM/1014/2017 Contrato de Assistência Técnica aos Elevadores do HML para 2017,Ajuste Direto Regime Geral,Aquisição de serviços,"50000000-5, Serviços de reparação e manutenção","Hospital de Magalhães Lemos, E. P. E. (502828790)",SCHMITT+SOHN ELEVADORES (500230757),"383,95 €",21-04-2017,02-01-2017,90 dias,"Portugal, Porto, Porto","Artigo 20.º, n.º 1, alínea a) do Código dos Contratos Públicos",,,,,,Não aplicável.,Não aplicável.,FALSE
AJ/39/2017 Aquisição de serviços de transporte de doentes em ambulância para o ano de 2017,Ajuste Direto Regime Geral,Aquisição de serviços,"60000000-8, Serviços de transporte (excl. transporte de resíduos)","Hospital de Magalhães Lemos, E. P. E. (502828790)","SALVAVIDA Transporte de Doentes, Lda (506532160)","2.295,28 €",21-04-2017,02-01-2017,30 dias,"Portugal, Porto, Porto","Artigo 20.º, n.º 1, alínea a) do Código dos Contratos Públicos",,,,,,Não aplicável.,Não aplicável.,FALSE
CE/1011/2017 Consumo de Água para o ano de 2017,Ajuste Direto Regime Geral,Aquisição de serviços,"79000000-4, Serviços a empresas: direito, comercialização, consultoria, recrutamento, impressão e segurança","Hospital de Magalhães Lemos, E. P. E. (502828790)","AGUAS DO PORTO, EM (507718666)","5.275,96 €",20-04-2017,04-04-2017,31 dias,"Portugal, Porto, Porto","Artigo 20.º, n.º 1, alínea a) do Código dos Contratos Públicos",,,,,,Não aplicável.,Não aplicável.,FALSE
AM/1014/2017 - Contrato de Assistência Técnica aos Elevadores do HML para 2017,Ajuste Direto Regime Geral,Aquisição de serviços,"50000000-5, Serviços de reparação e manutenção","Hospital de Magalhães Lemos, E. P. E. (502828790)",SCHMITT+SOHN ELEVADORES (500230757),"1.132,99 €",20-04-2017,02-01-2017,90 dias,"Portugal, Porto, Porto","Artigo 20.º, n.º 1, alínea a) do Código dos Contratos Públicos",,,,,,Não aplicável.,Não aplicável.,FALSE
AM/1016/2017 - Contrato de assistência técnica aos multifunções e fotocopiadores para 2017,Ajuste Direto Regime Geral,Aquisição de serviços,"50000000-5, Serviços de reparação e manutenção","Hospital de Magalhães Lemos, E. P. E. (502828790)",XEROX (501656677),"330,00 €",20-04-2017,02-01-2017,90 dias,"Portugal, Porto, Porto","Artigo 20.º, n.º 1, alínea a) do Código dos Contratos Públicos",,,,,,Não aplicável.,Não aplicável.,FALSE
"AJ/19/2017 - Fornecimento de congelados – peixes, derivados de peixe e legumes para o ano de 2017",Ajuste Direto Regime Geral,Aquisição de bens móveis,"15000000-8, Produtos alimentares, bebidas, tabaco e produtos afins","Hospital de Magalhães Lemos, E. P. E. (502828790)",A.MENDES TORRADO (501544984),"30,20 €",20-04-2017,02-03-2017,8 dias,"Portugal, Porto, Porto","Artigo 20.º, n.º 1, alínea a) do Código dos Contratos Públicos",,,,,,Não aplicável.,Não aplicável.,FALSE
"AJ/17 /2017 - Fornecimento de congelados – peixes, derivados de peixe e legumes para o ano de 2017",Ajuste Direto Regime Geral,Aquisição de bens móveis,"15000000-8, Produtos alimentares, bebidas, tabaco e produtos afins","Hospital de Magalhães Lemos, E. P. E. (502828790)","Futuro em Relevo - Comércio de Carnes, Unip (509485693)","279,03 €",20-04-2017,02-01-2017,8 dias,"Portugal, Porto, Porto","Artigo 20.º, n.º 1, alínea a) do Código dos Contratos Públicos",,,,,,Não aplicável.,Não aplicável.,FALSE
"AJ/17/2017 - Fornecimento de carnes frescas, congeladas, derivados de carne, enchidos e fumados durante 2017",Ajuste Direto Regime Geral,Aquisição de bens móveis,"15000000-8, Produtos alimentares, bebidas, tabaco e produtos afins","Hospital de Magalhães Lemos, E. P. E. (502828790)","Carnes São José - Comércio e Industria de Carnes, Lda (501235574)","624,47 €",20-04-2017,02-01-2017,8 dias,"Portugal, Porto, Porto","Artigo 20.º, n.º 1, alínea a) do Código dos Contratos Públicos",,,,,,Não aplicável.,Não aplicável.,FALSE
"AJ/17/2017 - Fornecimento de carnes frescas, congeladas, derivados de carne, enchidos e fumados durante 2017",Ajuste Direto Regime Geral,Aquisição de bens móveis,"15000000-8, Produtos alimentares, bebidas, tabaco e produtos afins","Hospital de Magalhães Lemos, E. P. E. (502828790)","Futuro em Relevo - Comércio de Carnes, Unip (509485693)","17,19 €",20-04-2017,02-01-2017,8 dias,"Portugal, Porto, Porto","Artigo 20.º, n.º 1, alínea a) do Código dos Contratos Públicos",,,,,,Não aplicável.,Não aplicável.,FALSE
"Fornecimento de carnes frescas, congeladas, derivados de carne, enchidos e fumados durante 2017",Ajuste Direto Regime Geral,Aquisição de bens móveis,"15000000-8, Produtos alimentares, bebidas, tabaco e produtos afins","Hospital de Magalhães Lemos, E. P. E. (502828790)","Futuro em Relevo - Comércio de Carnes, Unip (509485693)","669,48 €",20-04-2017,02-01-2017,8 dias,"Portugal, Porto, Porto","Artigo 20.º, n.º 1, alínea a) do Código dos Contratos Públicos",,,,,,Não aplicável.,Não aplicável.,FALSE
AJ/18/2017 - Fornecimento de frutas e produtos hortícolas e da 4ª gama para o ano de 2017,Ajuste Direto Regime Geral,Aquisição de bens móveis,"15000000-8, Produtos alimentares, bebidas, tabaco e produtos afins","Hospital de Magalhães Lemos, E. P. E. (502828790)","HORTIDOURO-PRODUTOS HORTICOLAS,LDA (507144007)","78,69 €",20-04-2017,02-01-2017,8 dias,"Portugal, Porto, Porto","Artigo 20.º, n.º 1, alínea a) do Código dos Contratos Públicos",,,,,,Não aplicável.,Não aplicável.,FALSE
AAJ/18/2017 -  Fornecimento de frutas e produtos hortícolas e da 4ª gama para o ano de 2017,Ajuste Direto Regime Geral,Aquisição de bens móveis,"15000000-8, Produtos alimentares, bebidas, tabaco e produtos afins","Hospital de Magalhães Lemos, E. P. E. (502828790)","HORTIDOURO-PRODUTOS HORTICOLAS,LDA (507144007)","528,35 €",20-04-2017,02-02-2017,8 dias,"Portugal, Porto, Porto","Artigo 20.º, n.º 1, alínea a) do Código dos Contratos Públicos",,,,,,Não aplicável.,Não aplicável.,FALSE
AJ/23/2017 - Fornecimento de produtos de mercearia para o ano de 2017,Ajuste Direto Regime Geral,Aquisição de bens móveis,"15000000-8, Produtos alimentares, bebidas, tabaco e produtos afins","Hospital de Magalhães Lemos, E. P. E. (502828790)",VILANDORINHO-ARMAZEM MERCEARIA (501140450),"718,93 €",20-04-2017,02-01-2017,8 dias,"Portugal, Porto, Porto","Artigo 20.º, n.º 1, alínea a) do Código dos Contratos Públicos",,,,,,Não aplicável.,Não aplicável.,FALSE
"IG/24/2017 - Material de Consumo Clínico - Fraldas, cuecas, chinelos, pensos, resguardos",Ajuste Direto Regime Geral,Aquisição de bens móveis,"33000000-0, Equipamento médico, medicamentos e produtos para cuidados pessoais","Hospital de Magalhães Lemos, E. P. E. (502828790)",PAUL HARTMANN (502271728),"840,00 €",20-04-2017,19-01-2017,15 dias,"Portugal, Porto, Porto","Artigo 20.º, n.º 1, alínea a) do Código dos Contratos Públicos",,,,,,Não aplicável.,Não aplicável.,FALSE
"IG/24/2017 - Material de Consumo Clínico - Fraldas, cuecas, chinelos, pensos, resguardos",Ajuste Direto Regime Geral,Aquisição de bens móveis,"33000000-0, Equipamento médico, medicamentos e produtos para cuidados pessoais","Hospital de Magalhães Lemos, E. P. E. (502828790)","Procter & Gamble Portugal - Produtos de Consumo Higiene e Saúde, SA (503037753)","681,60 €",20-04-2017,19-01-2017,15 dias,"Portugal, Porto, Porto","Artigo 20.º, n.º 1, alínea a) do Código dos Contratos Públicos",,,,,,Não aplicável.,Não aplicável.,FALSE
IG/9/2017 - Material de consumo hoteleiro - Sabão liquido na SPMS,Ajuste Direto Regime Geral,Aquisição de bens móveis,"39000000-2, Mobiliário (incl. de escritório), acessórios, aparelhos domésticos (excl. iluminação) e produtos de limpeza","Hospital de Magalhães Lemos, E. P. E. (502828790)",Vygon (503232785),"339,00 €",18-04-2017,28-12-2016,15 dias,"Portugal, Porto, Porto","Artigo 20.º, n.º 1, alínea a) do Código dos Contratos Públicos",,,,,,Não aplicável.,Não aplicável.,FALSE
"AJ/18/2017 - Fornecimento de frutas e legumes,produtos hortícolas e 4.ª gama",Ajuste Direto Regime Geral,Aquisição de bens móveis,"15000000-8, Produtos alimentares, bebidas, tabaco e produtos afins","Hospital de Magalhães Lemos, E. P. E. (502828790)","HORTIDOURO-PRODUTOS HORTICOLAS,LDA (507144007)","74,49 €",18-04-2017,02-01-2017,8 dias,"Portugal, Porto, Porto","Artigo 20.º, n.º 1, alínea a) do Código dos Contratos Públicos",,,,,,Não aplicável.,Não aplicável.,FALSE
"AJ/17/2017 Fornecimento de carnes frescas, congeladas, derivados de carne, enchidos e fumados durante 2017",Ajuste Direto Regime Geral,Aquisição de bens móveis,"15000000-8, Produtos alimentares, bebidas, tabaco e produtos afins","Hospital de Magalhães Lemos, E. P. E. (502828790)","Carnes São José - Comércio e Industria de Carnes, Lda (501235574)","43,90 €",18-04-2017,02-01-2017,8 dias,"Portugal<BR/>Portugal, Porto, Porto","Artigo 20.º, n.º 1, alínea a) do Código dos Contratos Públicos",,,,,,Não aplicável.,Não aplicável.,FALSE
"AJ/17/2017 - Fornecimento de carnes frescas,congeladas ,derivados de carne,enchidos e fumados durante o ano de 2017",Ajuste Direto Regime Geral,Aquisição de bens móveis,"15000000-8, Produtos alimentares, bebidas, tabaco e produtos afins","Hospital de Magalhães Lemos, E. P. E. (502828790)","Futuro em Relevo - Comércio de Carnes, Unip (509485693)","608,60 €",18-04-2017,30-12-2016,8 dias,"Portugal, Porto, Porto","Artigo 20.º, n.º 1, alínea a) do Código dos Contratos Públicos",,,,,,Não aplicável.,Não aplicável.,FALSE
AJ/18/2017 - Fornecimento de frutas e produtos hortícolas e legumes de 4.ª gama,Ajuste Direto Regime Geral,Aquisição de bens móveis,"15000000-8, Produtos alimentares, bebidas, tabaco e produtos afins","Hospital de Magalhães Lemos, E. P. E. (502828790)","HORTIDOURO-PRODUTOS HORTICOLAS,LDA (507144007)","528,35 €",18-04-2017,02-01-2017,8 dias,"Portugal, Porto, Porto","Artigo 20.º, n.º 1, alínea a) do Código dos Contratos Públicos",,,,,,Não aplicável.,Não aplicável.,FALSE
"AJ/19/2017 - Fornecimento de congelados – peixes, derivados de peixe e legumes para o ano de 2017",Ajuste Direto Regime Geral,Aquisição de bens móveis,"15000000-8, Produtos alimentares, bebidas, tabaco e produtos afins","Hospital de Magalhães Lemos, E. P. E. (502828790)",A.Mendes Torrado (501544984),"38,85 €",17-04-2017,02-01-2017,8 dias,"Portugal, Porto, Porto","Artigo 20.º, n.º 1, alínea a) do Código dos Contratos Públicos",,,,,,Não aplicável.,Não aplicável.,FALSE
"AJ/19/2017 - Fornecimento de congelados – peixes, derivados de peixe e legumes para o ano de 2017",Ajuste Direto Regime Geral,Aquisição de bens móveis,"15000000-8, Produtos alimentares, bebidas, tabaco e produtos afins","Hospital de Magalhães Lemos, E. P. E. (502828790)",Futuro em Relevo (509485693),"594,40 €",17-04-2017,02-01-2017,8 dias,"Portugal, Porto, Porto","Artigo 20.º, n.º 1, alínea a) do Código dos Contratos Públicos",,,,,,Não aplicável.,Não aplicável.,FALSE
AM/1007/2017- Serviços de higiene e limpeza para o ano de 2017,Ajuste Direto Regime Geral,Aquisição de serviços,"90000000-7, Serviços relativos a águas residuais, resíduos, limpeza e ambiente","Hospital de Magalhães Lemos, E. P. E. (502828790)",AFUA (504455389),"5.130,00 €",17-04-2017,11-01-2017,30 dias,"Portugal, Porto, Porto","Artigo 20.º, n.º 1, alínea a) do Código dos Contratos Públicos",,,,,,Não aplicável.,Não aplicável.,FALSE
"AJ/38/2017 - Serviços de Jardinagem no Hospital Magalhães Lemos, E.P.E durante o mês de Março",Ajuste Direto Regime Geral,Aquisição de serviços,"50000000-5, Serviços de reparação e manutenção","Hospital de Magalhães Lemos, E. P. E. (502828790)",509456111 (509456111),"4.000,00 €",17-04-2017,21-12-2016,30 dias,"Portugal, Porto, Porto","Artigo 20.º, n.º 1, alínea a) do Código dos Contratos Públicos",,,,,,Não aplicável.,Não aplicável.,FALSE
AM/1023/2017 - Contrato de manutenção da HP para o ano de 2017,Ajuste Direto Regime Geral,Aquisição de serviços,"50000000-5, Serviços de reparação e manutenção","Hospital de Magalhães Lemos, E. P. E. (502828790)",HP (502407697),"9.922,08 €",17-04-2017,28-02-2017,365 dias,"Portugal, Porto, Porto","Artigo 20.º, n.º 1, alínea a) do Código dos Contratos Públicos",,,,,,Não aplicável.,Não aplicável.,FALSE
AM/1014/2017 - Contrato de assistência aos elevadores do HML,Ajuste Direto Regime Geral,Aquisição de serviços,"50000000-5, Serviços de reparação e manutenção","Hospital de Magalhães Lemos, E. P. E. (502828790)",SCHMITT+SOHN ELEVADORES (500230757),"1.430,93 €",17-04-2017,02-01-2017,90 dias,"Portugal, Porto, Porto","Artigo 20.º, n.º 1, alínea a) do Código dos Contratos Públicos",,,,,,Não aplicável.,Não aplicável.,FALSE
AM/1014 - Contrato de assistência técnica aos elevadores do HML para 2017,Ajuste Direto Regime Geral,Aquisição de serviços,"50000000-5, Serviços de reparação e manutenção","Hospital de Magalhães Lemos, E. P. E. (502828790)",ORONA PORTUGAL (501606319),"150,00 €",17-04-2017,02-01-2017,90 dias,"Portugal, Porto, Porto","Artigo 20.º, n.º 1, alínea a) do Código dos Contratos Públicos",,,,,,Não aplicável.,Não aplicável.,FALSE
Remoção de resíduos sólidos referente ao período de 01-02-2017 a 28-02-2017,Ajuste Direto Regime Geral,Aquisição de serviços,"90000000-7, Serviços relativos a águas residuais, resíduos, limpeza e ambiente","Hospital de Magalhães Lemos, E. P. E. (502828790)",Câmara Municipal do Porto (501306099),"4.921,68 €",17-04-2017,01-01-2017,30 dias,"Portugal, Porto, Porto","Artigo 22.º, n.º 3 do Código dos Contratos Públicos",,,,,,Não aplicável.,Não aplicável.,FALSE
AM/1016/2017 - Contrato de assistência técnica aos Multifunções e Fotocopiadores para 2017,Ajuste Direto Regime Geral,Aquisição de serviços,"79000000-4, Serviços a empresas: direito, comercialização, consultoria, recrutamento, impressão e segurança","Hospital de Magalhães Lemos, E. P. E. (502828790)",XEROX (501656677),"209,70 €",13-04-2017,02-01-2017,60 dias,Portugal,"Artigo 20.º, n.º 1, alínea a) do Código dos Contratos Públicos",,,,,,Não aplicável.,Não aplicável.,FALSE
"IG 8007/2017 - Sistema Nervoso Cerebroespinal exceto: anestésicos, relaxantes musculares, analgésicos",Ajuste Direto Regime Geral,Aquisição de bens móveis,"33600000-6, Produtos farmacêuticos","Hospital de Magalhães Lemos, E. P. E. (502828790)",LABESFAL (501169580),"7.245,40 €",11-04-2017,31-03-2017,66 dias,"Portugal, Porto, Porto","Artigo 20.º, n.º 1, alínea a) do Código dos Contratos Públicos",,,,,,Não aplicável.,Não aplicável.,FALSE
IG/199/2017 Consumo de energia até inicio do novo contrato,Ajuste Direto Regime Geral,Aquisição de serviços,"79000000-4, Serviços a empresas: direito, comercialização, consultoria, recrutamento, impressão e segurança","Hospital de Magalhães Lemos, E. P. E. (502828790)",EDP COMERCIAL (503504564),"267,78 €",11-04-2017,13-02-2017,30 dias,"Portugal, Porto, Porto","Artigo 20.º, n.º 1, alínea a) do Código dos Contratos Públicos",,,,,,Não aplicável.,Não aplicável.,FALSE
IG/199/2017 Consumo de energia até inicio do novo contrato,Ajuste Direto Regime Geral,Aquisição de serviços,"79000000-4, Serviços a empresas: direito, comercialização, consultoria, recrutamento, impressão e segurança","Hospital de Magalhães Lemos, E. P. E. (502828790)",EDP COMERCIAL (503504564),"1.745,15 €",11-04-2017,13-02-2017,30 dias,"Portugal, Porto, Porto","Artigo 20.º, n.º 1, alínea a) do Código dos Contratos Públicos",,,,,,Não aplicável.,Não aplicável.,FALSE
