freguesia,acronym,validVotesPercentage,votes,dicofre
São Pedro d'Arcos,PPD/PSD.CDS-PP,51.26,102,160703
São Pedro d'Arcos,PS,25.13,50,160703
São Pedro d'Arcos,PCP-PEV,7.04,14,160703
São Pedro d'Arcos,MPT,5.03,10,160703
São Pedro d'Arcos,B.E.,3.52,7,160703
São Pedro d'Arcos,L,2.01,4,160703
São Pedro d'Arcos,PDA,2.01,4,160703
São Pedro d'Arcos,PCTP/MRPP,1.51,3,160703
São Pedro d'Arcos,PPV,1.01,2,160703
São Pedro d'Arcos,MAS,0.5,1,160703
São Pedro d'Arcos,PND,0.5,1,160703
São Pedro d'Arcos,PNR,0.5,1,160703
São Pedro d'Arcos,PAN,0,0,160703
São Pedro d'Arcos,POUS,0,0,160703
São Pedro d'Arcos,PPM,0,0,160703
São Pedro d'Arcos,PTP,0,0,160703
