freguesia,acronym,validVotesPercentage,votes,dicofre
Gavião,PS,36.29,467,031216
Gavião,PPD/PSD,27.74,357,031216
Gavião,CDS-PP,14.3,184,031216
Gavião,B.E.,8.08,104,031216
Gavião,PAN,4.04,52,031216
Gavião,PCP-PEV,1.94,25,031216
Gavião,L,1.71,22,031216
Gavião,PCTP/MRPP,1.17,15,031216
Gavião,PDR,1.01,13,031216
Gavião,PPM.PPV/CDC,0.78,10,031216
Gavião,A,0.7,9,031216
Gavião,NC,0.7,9,031216
Gavião,IL,0.54,7,031216
Gavião,PTP,0.39,5,031216
Gavião,PNR,0.31,4,031216
Gavião,MAS,0.16,2,031216
Gavião,PURP,0.16,2,031216
