freguesia,acronym,validVotesPercentage,votes,dicofre
Barrosa,PS,42.48,65,140504
Barrosa,PCP-PEV,35.95,55,140504
Barrosa,MPT,7.84,12,140504
Barrosa,B.E.,5.23,8,140504
Barrosa,L,2.61,4,140504
Barrosa,PAN,1.96,3,140504
Barrosa,PPD/PSD.CDS-PP,1.96,3,140504
Barrosa,PCTP/MRPP,1.31,2,140504
Barrosa,PPM,0.65,1,140504
Barrosa,MAS,0,0,140504
Barrosa,PDA,0,0,140504
Barrosa,PND,0,0,140504
Barrosa,PNR,0,0,140504
Barrosa,POUS,0,0,140504
Barrosa,PPV,0,0,140504
Barrosa,PTP,0,0,140504
