Objeto do Contrato,Tipo de Procedimento,Tipo(s) de Contrato,CPVs,Entidade(s) Adjudicante(s),Entidade(s) Adjudicatária(s),Preço Contratual,Data de Publicação,Data de Celebração do Contrato,Prazo de Execução,Local de Execução,Fundamentação,Data de Fecho do Contrato,Preço Total Efetivo,Causas das Alterações ao Prazo,Causas das Alterações ao Preço,Estado,N.º registo do Acordo Quadro,Descrição do Acordo Quadro,Procedimento Centralizado
SISTEMA CIRCULAR VENTILACAO C/BALAO RESERVATORIO,Ajuste Direto Regime Geral,Aquisição de bens móveis,"33000000-0, Equipamento médico, medicamentos e produtos para cuidados pessoais","Centro Hospitalar e Universitário de Coimbra, E. P. E. (510103448)","INTERSURGICAL PORTUGAL, LDA (503480045)","9.439,50 €",01-10-2015,24-07-2015,68 dias,"Portugal, Coimbra, Coimbra","Artigo 24.º, n.º 1, alínea e) do Código dos Contratos Públicos",01-10-2015,"9.439,50 €",,,,Não aplicável.,Não aplicável.,FALSE
AGULHA HIPODERMICA 21G,Ajuste Direto Regime Geral,Aquisição de bens móveis,"33000000-0, Equipamento médico, medicamentos e produtos para cuidados pessoais","Centro Hospitalar e Universitário de Coimbra, E. P. E. (510103448)","BASTOS VIEGAS, SA (500042772)","9.672,00 €",01-10-2015,18-08-2015,44 dias,"Portugal, Coimbra, Coimbra","Artigo 24.º, n.º 1, alínea e) do Código dos Contratos Públicos","","",,,,Não aplicável.,Não aplicável.,FALSE
AGULHA HIPODERMICA 20G,Ajuste Direto Regime Geral,Aquisição de bens móveis,"33000000-0, Equipamento médico, medicamentos e produtos para cuidados pessoais","Centro Hospitalar e Universitário de Coimbra, E. P. E. (510103448)","BASTOS VIEGAS, SA (500042772)","9.943,00 €",01-10-2015,23-07-2015,157 dias,"Portugal, Coimbra, Coimbra","Artigo 24.º, n.º 1, alínea e) do Código dos Contratos Públicos","","",,,,Não aplicável.,Não aplicável.,FALSE
Agulha p/colheita de ovocitos e agulha de punção,Ajuste Direto Regime Geral,Aquisição de bens móveis,"33000000-0, Equipamento médico, medicamentos e produtos para cuidados pessoais","Centro Hospitalar e Universitário de Coimbra, E. P. E. (510103448)","EMB - EQUIPAMENTOS MÉDICOS BIOLÓGICOS, LDA (507364457)","9.820,00 €",01-10-2015,21-07-2015,160 dias,"Portugal, Coimbra, Coimbra","Artigo 24.º, n.º 1, alínea e) do Código dos Contratos Públicos","","",,,,Não aplicável.,Não aplicável.,FALSE
SISTEMA COMPLETO INJECCAO CONTRASTE P/ACIST_Up Medical,Ajuste Direto Regime Geral,Aquisição de bens móveis,"33000000-0, Equipamento médico, medicamentos e produtos para cuidados pessoais","Centro Hospitalar e Universitário de Coimbra, E. P. E. (510103448)","UP MEDICAL - COMERCIAL. DISPOSITIVOS MEDICOS, LDA (506921069)","9.850,00 €",30-09-2015,10-07-2015,81 dias,"Portugal, Coimbra, Coimbra","Artigo 24.º, n.º 1, alínea e) do Código dos Contratos Públicos","","",,,,Não aplicável.,Não aplicável.,FALSE
Lente de contacto terapeutica; Lente com iris desenhada; Lente para correcção afaquia,Ajuste Direto Regime Geral,Aquisição de bens móveis,"33140000-3, Material médico de consumo","Centro Hospitalar e Universitário de Coimbra, E. P. E. (510103448)","ABBOTT MEDICAL OPTICS SPAIN , S.L. (980262364), OFTALDATA - PRODUTOS P\ OFTALMOLOGIA, LDA (504887459), ALCON PORTUGAL-PROD.EQUIP.OFTALMOLOGICOS (501251685)","24.056,70 €",30-09-2015,07-04-2015,360 dias,"Portugal, Coimbra, Coimbra","Artigo 20.º, n.º 1, alínea a) do Código dos Contratos Públicos","","",,,,Não aplicável.,Não aplicável.,FALSE
Material de Proteses,Concurso público,Aquisição de bens móveis,"33140000-3, Material médico de consumo","Centro Hospitalar e Universitário de Coimbra, E. P. E. (510103448)","ALCON PORTUGAL-PROD.EQUIP.OFTALMOLOGICOS (501251685), OFTALDATA - PRODUTOS P\ OFTALMOLOGIA, LDA (504887459), JOSE COTTA EQUIPAMENTOS MEDICOS E  SERVIÇOS, SA (500155739), OVERPHARMA-PRODUTOS MÉDICOS E FARMACÉUTICOS,LDA (505792362)","54.112,20 €",30-09-2015,18-05-2015,360 dias,"Portugal, Coimbra, Coimbra","Artigo 20.º, n.º 1, alínea b) do Código dos Contratos Públicos","","",,,,Não aplicável.,Não aplicável.,FALSE
Lente para correcção da miopia,Concurso público,Aquisição de bens móveis,"33140000-3, Material médico de consumo","Centro Hospitalar e Universitário de Coimbra, E. P. E. (510103448)",ALCON PORTUGAL-PROD.EQUIP.OFTALMOLOGICOS (501251685),"42.687,00 €",30-09-2015,30-03-2015,360 dias,"Portugal, Coimbra, Coimbra","Artigo 20.º, n.º 1, alínea b) do Código dos Contratos Públicos","","",,,,Não aplicável.,Não aplicável.,FALSE
"Fibra laser para fragmentação pulverização calculos na bexiga, rim e ureteres",Concurso público,Aquisição de bens móveis,"33100000-1, Equipamento médico","Centro Hospitalar e Universitário de Coimbra, E.P. (510103448)","BIOSONDA - COMERCIO MAT. HOSPITALAR, LDA (501463313)","24.000,00 €",30-09-2015,13-04-2015,360 dias,"Portugal, Coimbra, Coimbra","Artigo 20.º, n.º 1, alínea b) do Código dos Contratos Públicos","","",,,,Não aplicável.,Não aplicável.,FALSE
Sistemas  de cardioversores dedfibrilhadores implantaveis,Ajuste Direto Regime Geral,Aquisição de bens móveis,"33182210-4, Estimulador cardíaco (pacemaker)","Centro Hospitalar e Universitário de Coimbra, E. P. E. (510103448)","SORINCARDIO COM DIST EQUIP MED, LDA  (505514010), BOSTON SCIENTIFIC PORTUGAL, LDA (504988964), BIOTRONIK PORTUGAL UNIPESSOAL LDA (510726941), MEDTRONIC PORTUGAL, LDA (504223933), ST. JUDE MEDICAL PORTUGAL (504180746)","3.180.380,00 €",30-09-2015,27-11-2014,360 dias,"Portugal, Coimbra, Coimbra",Artigo 258.º do Código dos Contratos Públicos,"","",,,,Não aplicável.,Não aplicável.,FALSE
040222922015 - FRALDAS,Ajuste Direto Regime Geral,Aquisição de bens móveis,"33000000-0, Equipamento médico, medicamentos e produtos para cuidados pessoais","Centro Hospitalar e Universitário de Coimbra, E.P. (510103448)",INDAS (503505196),"9.937,44 €",29-09-2015,19-08-2015,20 dias,"Portugal, Coimbra, Coimbra","Artigo 24.º, n.º 1, alínea e) do Código dos Contratos Públicos","","",,,,Não aplicável.,Não aplicável.,FALSE
Lente intraocular moldavel não hidrofilica monobloco; Lente intraocular moldavel não hidrofilica 3 peças,Concurso público,Aquisição de bens móveis,"33140000-3, Material médico de consumo","Centro Hospitalar e Universitário de Coimbra, E. P. E. (510103448)",ALCON PORTUGAL-PROD.EQUIP.OFTALMOLOGICOS (501251685),"166.175,00 €",29-09-2015,27-03-2015,360 dias,"Portugal, Coimbra, Coimbra","Artigo 20.º, n.º 1, alínea b) do Código dos Contratos Públicos","","",,,,Não aplicável.,Não aplicável.,FALSE
Lamina para turbina Moria,Ajuste Direto Regime Geral,Aquisição de bens móveis,"33140000-3, Material médico de consumo","Centro Hospitalar e Universitário de Coimbra, E.P. (510103448)","GRUPO TAPER - EQUIP PRECISAO CIENTIFICA,LDA(EX PG) (506886336)","3.055,00 €",29-09-2015,19-02-2015,360 dias,"Portugal, Coimbra, Coimbra","Artigo 24.º, n.º 1, alínea e) do Código dos Contratos Públicos","","",,,,Não aplicável.,Não aplicável.,FALSE
Lente intra ocular torica para cirurgia da catarata; Lente  intra ocular asferica para cirurgia da catarata: Lente I.O. cam. post multifocal; Lente I.O. suspensão escleral,Concurso público,Aquisição de bens móveis,"33140000-3, Material médico de consumo","Centro Hospitalar e Universitário de Coimbra, E. P. E. (510103448)",ALCON PORTUGAL-PROD.EQUIP.OFTALMOLOGICOS (501251685),"166.795,00 €",28-09-2015,27-03-2015,360 dias,"Portugal, Coimbra, Coimbra","Artigo 20.º, n.º 1, alínea b) do Código dos Contratos Públicos","","",,,,Não aplicável.,Não aplicável.,FALSE
040220782015 - OUTRO MATERIAL DE CONSUMO,Ajuste Direto Regime Geral,Aquisição de bens móveis,"33000000-0, Equipamento médico, medicamentos e produtos para cuidados pessoais","Centro Hospitalar e Universitário de Coimbra, E.P. (510103448)",BASTOS E VIEGAS (500042772),"9.800,00 €",28-09-2015,14-07-2015,20 dias,"Portugal, Coimbra, Coimbra","Artigo 24.º, n.º 1, alínea e) do Código dos Contratos Públicos","","",,,,Não aplicável.,Não aplicável.,FALSE
040222742015 - outro material de consumo,Ajuste Direto Regime Geral,Aquisição de bens móveis,"33000000-0, Equipamento médico, medicamentos e produtos para cuidados pessoais","Centro Hospitalar e Universitário de Coimbra, E. P. E. (510103448)",COVIDIEN (503413410),"9.660,00 €",28-09-2015,31-08-2015,20 dias,"Portugal, Coimbra, Coimbra","Artigo 24.º, n.º 1, alínea e) do Código dos Contratos Públicos","","",,,,Não aplicável.,Não aplicável.,FALSE
Pacemaker dupla câmara com resposta frequência (DDD-R) c/ ATP) com terapia para arritmia auricular,Ajuste Direto Regime Geral,Aquisição de bens móveis,"33182210-4, Estimulador cardíaco (pacemaker)","Centro Hospitalar e Universitário de Coimbra, E. P. E. (510103448)","MEDTRONIC PORTUGAL, LDA (504223933)","3.710,00 €",28-09-2015,28-09-2015,10 dias,"Portugal, Coimbra, Coimbra","Artigo 24.º, n.º 1, alínea e) do Código dos Contratos Públicos","","",,,,Não aplicável.,Não aplicável.,FALSE
040103712014 - Betaina 1000mg pó oral frs 180g,Ajuste Direto Regime Geral,Aquisição de bens móveis,"33698000-9, Produtos para fins clínicos","Centro Hospitalar e Universitário de Coimbra, E. P. E. (510103448)","Orphan Europe Portugal - Soc. Unipessoal, Lda (507966953)","44.800,00 €",24-09-2015,18-09-2014,365 dias,"Portugal, Coimbra, Coimbra","Artigo 24.º, n.º 1, alínea e) do Código dos Contratos Públicos",31-12-2014,"44.800,00 €",,,,Não aplicável.,Não aplicável.,FALSE
040104692014 - Sistema Hemostatico Polissacarido saq 3g,Ajuste Direto Regime Geral,Aquisição de bens móveis,"33698000-9, Produtos para fins clínicos","Centro Hospitalar e Universitário de Coimbra, E. P. E. (510103448)",Lusopalex Soc. Dist. Prod. Hospitalares Unipessoal Lda (503531588),"6.650,00 €",22-09-2015,16-07-2014,365 dias,"Portugal, Coimbra, Coimbra","Artigo 20.º, n.º 1, alínea a) do Código dos Contratos Públicos",31-12-2014,"6.650,00 €",,,,Não aplicável.,Não aplicável.,FALSE
040104762014 - Acido Ioxitalamico 550.5mg/ml sol inj frs 20ml luterina,Ajuste Direto Regime Geral,Aquisição de bens móveis,"33698000-9, Produtos para fins clínicos","Centro Hospitalar e Universitário de Coimbra, E. P. E. (510103448)",A. Martins & Fernandes SA (501172114),"10.800,00 €",22-09-2015,30-07-2014,365 dias,"Portugal, Coimbra, Coimbra","Artigo 24.º, n.º 1, alínea e) do Código dos Contratos Públicos",31-12-2014,"10.800,00 €",,,,Não aplicável.,Não aplicável.,FALSE
040103622014 - Darbepoetina Alfa sol inj,Ajuste Direto Regime Geral,Aquisição de bens móveis,"33698000-9, Produtos para fins clínicos","Centro Hospitalar e Universitário de Coimbra, E. P. E. (510103448)",Amgen Biofarmaceutica Lda (502942959),"107.121,38 €",22-09-2015,01-09-2014,365 dias,"Portugal, Coimbra, Coimbra","Artigo 24.º, n.º 1, alínea e) do Código dos Contratos Públicos",31-12-2014,"107.121,38 €",,,,Não aplicável.,Não aplicável.,FALSE
168 unid - Pinças de selagem e corte de vasos 5mm c /Haste  36cm,Ajuste Direto Regime Geral,Aquisição de bens móveis,"33000000-0, Equipamento médico, medicamentos e produtos para cuidados pessoais","Centro Hospitalar e Universitário de Coimbra, E. P. E. (510103448)","JOHNSON & JOHNSON, LDA (500153370)","73.080,00 €",22-09-2015,14-08-2015,30 dias,"Portugal, Coimbra, Coimbra","Artigo 24.º, n.º 1, alínea e) do Código dos Contratos Públicos","","",,,,Não aplicável.,Não aplicável.,FALSE
040104562014 - Lenalidomid 25mg caps,Ajuste Direto Regime Geral,Aquisição de bens móveis,"33698000-9, Produtos para fins clínicos","Centro Hospitalar e Universitário de Coimbra, E. P. E. (510103448)",Celgene Sociedade Unipessoal Lda (507791690),"254.605,53 €",22-09-2015,29-07-2014,365 dias,"Portugal, Coimbra, Coimbra","Artigo 24.º, n.º 1, alínea e) do Código dos Contratos Públicos",31-12-2014,"297.942,64 €",,,,Não aplicável.,Não aplicável.,FALSE
040104432014 - Carboximaltose Férrica 50mg/ml sol inj frs 2ml IV,Ajuste Direto Regime Geral,Aquisição de bens móveis,"33698000-9, Produtos para fins clínicos","Centro Hospitalar e Universitário de Coimbra, E. P. E. (510103448)",OM Pharma SA (500207410),"381,76 €",22-09-2015,19-06-2014,365 dias,"Portugal, Coimbra, Coimbra","Artigo 24.º, n.º 1, alínea e) do Código dos Contratos Públicos",31-12-2014,"381,76 €",,,,Não aplicável.,Não aplicável.,FALSE
Material para cirurgia artroscópica do punho,Ajuste Direto Regime Geral,Aquisição de bens móveis,"33000000-0, Equipamento médico, medicamentos e produtos para cuidados pessoais","Centro Hospitalar e Universitário de Coimbra, E. P. E. (510103448)",Smith & Nephew (503552461),"22.458,00 €",21-09-2015,11-04-2015,90 dias,"Portugal, Coimbra, Coimbra","Artigo 24.º, n.º 1, alínea e) do Código dos Contratos Públicos","","",,,,Não aplicável.,Não aplicável.,FALSE
