Objeto do Contrato,Tipo de Procedimento,Tipo(s) de Contrato,CPVs,Entidade(s) Adjudicante(s),Entidade(s) Adjudicatária(s),Preço Contratual,Data de Publicação,Data de Celebração do Contrato,Prazo de Execução,Local de Execução,Fundamentação,Data de Fecho do Contrato,Preço Total Efetivo,Causas das Alterações ao Prazo,Causas das Alterações ao Preço,Estado,N.º registo do Acordo Quadro,Descrição do Acordo Quadro,Procedimento Centralizado
Peças de reparação autoclave,Ajuste Direto Regime Geral,Outros Tipos (Prestação do Serviço Universal)<br/>Aquisição de bens móveis,"38540000-2, Máquinas e aparelhos para ensaios e medição","Instituto Nacional de Saúde Dr. Ricardo Jorge, I. P. (501427511)","A.J.Costa (Irmãos), LDA (500002576)","4.824,46 €",23-02-2015,23-07-2014,100 dias,"Portugal, Porto, Porto","Artigo 20.º, n.º 1, alínea a) do Código dos Contratos Públicos",,,,,,Não aplicável.,Não aplicável.,FALSE
Peças para camara frigorifica,Ajuste Direto Regime Geral,Aquisição de bens móveis,"31000000-6, Maquinaria, aparelhagem, equipamento e consumíveis eléctricos; iluminação","Instituto Nacional de Saúde Dr. Ricardo Jorge, I. P. (501427511)",SORJECLIMA (508565839),"2.821,26 €",23-02-2015,26-12-2014,60 dias,"Portugal, Lisboa, Lisboa","Artigo 24.º, n.º 1, alínea e) do Código dos Contratos Públicos",,,,,,Não aplicável.,Não aplicável.,FALSE
Aquisição de peças para veículos da frota automóvel,Ajuste Direto Regime Geral,Aquisição de bens móveis,"34300000-0, Peças e acessórios para veículos e seus motores","Instituto Nacional de Saúde Dr. Ricardo Jorge, I. P. (501427511)",Nuno Miguel Salgueiro (221334750),"4.150,23 €",23-02-2015,01-04-2014,180 dias,"Portugal, Lisboa, Lisboa","Artigo 20.º, n.º 1, alínea a) do Código dos Contratos Públicos",,,,,,Não aplicável.,Não aplicável.,FALSE
