Objeto do Contrato,Tipo de Procedimento,Tipo(s) de Contrato,CPVs,Entidade(s) Adjudicante(s),Entidade(s) Adjudicatária(s),Preço Contratual,Data de Publicação,Data de Celebração do Contrato,Prazo de Execução,Local de Execução,Fundamentação,Data de Fecho do Contrato,Preço Total Efetivo,Causas das Alterações ao Prazo,Causas das Alterações ao Preço,Estado,N.º registo do Acordo Quadro,Descrição do Acordo Quadro,Procedimento Centralizado
CONTRATO DE PRESTAÇÃO DE SERVIÇOS MÉDICOS,Ajuste Direto Regime Geral,Aquisição de serviços,"85121283-0, Serviços de ortopedia","Hospital Professor Doutor Fernando Fonseca, E. P. E. (503035416)",Vintagetalents - Clínica Médica Lda (510817734),"12.960,00 €",18-02-2016,15-02-2016,45 dias,"Portugal, Lisboa, Amadora","Artigo 20.º, n.º 1, alínea a) do Código dos Contratos Públicos",,,,,,Não aplicável.,Não aplicável.,FALSE
CONTRATO DE PRESTAÇÃO DE SERVIÇOS MÉDICOS,Ajuste Direto Regime Geral,Aquisição de serviços,"85121100-4, Serviços de médicos de clínica geral","Hospital Professor Doutor Fernando Fonseca, E. P. E. (503035416)","CMVCruz - Unipessoal, Lda. (513479856)","49.725,00 €",17-02-2016,22-01-2016,270 dias,"Portugal, Lisboa, Amadora","Artigo 20.º, n.º 1, alínea a) do Código dos Contratos Públicos",,,,,,Não aplicável.,Não aplicável.,FALSE
CONTRATO DE PRESTAÇÃO DE SERVIÇOS MÉDICOS,Ajuste Direto Regime Geral,Aquisição de serviços,"85141000-9, Serviços prestados pelo pessoal médico","Hospital Professor Doutor Fernando Fonseca, E. P. E. (503035416)",Lucas Reis Costa Gomes (204150701),"15.600,00 €",17-02-2016,22-12-2015,150 dias,"Portugal, Lisboa, Amadora","Artigo 20.º, n.º 1, alínea a) do Código dos Contratos Públicos",,,,,,Não aplicável.,Não aplicável.,FALSE
CONTRATO DE PRESTAÇÃO DE SERVIÇOS MÉDICOS,Ajuste Direto Regime Geral,Aquisição de serviços,"85121291-9, Serviços de pediatria","Hospital Professor Doutor Fernando Fonseca, E. P. E. (503035416)",Sofia Maria Rodrigues Bota (231323450),"5.700,00 €",17-02-2016,25-09-2015,100 dias,"Portugal, Lisboa, Amadora","Artigo 20.º, n.º 1, alínea a) do Código dos Contratos Públicos",,,,,,Não aplicável.,Não aplicável.,FALSE
CONTRATO DE PRESTAÇÃO DE SERVIÇOS TÉCNICOS DE INFORMÁTICA,Ajuste Direto Regime Geral,Aquisição de serviços,"72590000-7, Serviços de informática prestados por profissionais","Hospital Professor Doutor Fernando Fonseca, E. P. E. (503035416)",Tiago Rosa Vardasca (242235271),"11.583,54 €",17-02-2016,15-10-2015,270 dias,"Portugal, Lisboa, Amadora","Artigo 20.º, n.º 1, alínea a) do Código dos Contratos Públicos",,,,,,Não aplicável.,Não aplicável.,FALSE
CONTRATO DE PRESTAÇÃO DE SERVIÇOS MÉDICOS,Ajuste Direto Regime Geral,Aquisição de serviços,"85121291-9, Serviços de pediatria","Hospital Professor Doutor Fernando Fonseca, E. P. E. (503035416)",Dora Margarida Mariano Leal (242373151),"5.500,00 €",17-02-2016,19-06-2015,150 dias,"Portugal, Lisboa, Amadora","Artigo 20.º, n.º 1, alínea a) do Código dos Contratos Públicos",,,,,,Não aplicável.,Não aplicável.,FALSE
CONTRATO DE PRESTAÇÃO DE SERVIÇOS PROFISSIONAIS,Ajuste Direto Regime Geral,Aquisição de serviços,"85121270-6, Serviços de psiquiatria ou psicologia","Hospital Professor Doutor Fernando Fonseca, E. P. E. (503035416)",Sara Sofia Arantes Henriques dos Santos (217770436),"7.827,21 €",17-02-2016,15-06-2015,200 dias,"Portugal, Lisboa, Amadora","Artigo 20.º, n.º 1, alínea a) do Código dos Contratos Públicos",,,,,,Não aplicável.,Não aplicável.,FALSE
CONTRATO DE PRESTAÇÃO DE SERVIÇOS PROFISSIONAIS,Ajuste Direto Regime Geral,Aquisição de serviços,"85121270-6, Serviços de psiquiatria ou psicologia","Hospital Professor Doutor Fernando Fonseca, E. P. E. (503035416)",Raúl Miguel das Neves Caeiro (228403090),"7.827,21 €",17-02-2016,15-06-2015,200 dias,"Portugal, Lisboa, Amadora","Artigo 20.º, n.º 1, alínea a) do Código dos Contratos Públicos",,,,,,Não aplicável.,Não aplicável.,FALSE
CONTRATO DE PRESTAÇÃO DE SERVIÇOS,Ajuste Direto Regime Geral,Aquisição de serviços,"85140000-2, Serviços de saúde diversos","Hospital Professor Doutor Fernando Fonseca, E. P. E. (503035416)",Mónica Menezes Leal de Loureiro (225758598),"8.394,75 €",17-02-2016,15-06-2015,130 dias,"Portugal, Lisboa, Amadora","Artigo 20.º, n.º 1, alínea a) do Código dos Contratos Públicos",,,,,,Não aplicável.,Não aplicável.,FALSE
Serviço de Benchmarking Clínico Online IAmetrics,Ajuste Direto Regime Geral,Aquisição de serviços,"50312000-5, Manutenção e reparação de equipamento informático","Hospital Professor Doutor Fernando Fonseca, E. P. E. (503035416)",IASIST Portugal (508052971),"30.000,00 €",16-02-2016,28-12-2015,365 dias,"Portugal, Lisboa, Amadora","Artigo 20.º, n.º 1, alínea a) do Código dos Contratos Públicos",,,,,,Não aplicável.,Não aplicável.,FALSE
CONTRATO DE PRESTAÇÃO DE SERVIÇOS PROFISSIONAIS,Ajuste Direto Regime Geral,Aquisição de serviços,"85140000-2, Serviços de saúde diversos","Hospital Professor Doutor Fernando Fonseca, E. P. E. (503035416)",Daniela Pinto de Almeida Leite (230928218),"6.508,43 €",16-02-2016,15-06-2015,200 dias,"Portugal, Lisboa, Sintra","Artigo 20.º, n.º 1, alínea a) do Código dos Contratos Públicos",,,,,,Não aplicável.,Não aplicável.,FALSE
"Serviços profissionais, Daniela Pinto de Almeida Leite - Técnica de Serviço Social",Ajuste Direto Regime Geral,Aquisição de serviços,"85140000-2, Serviços de saúde diversos","Hospital Professor Doutor Fernando Fonseca, E. P. E. (503035416)",Daniela Pinto de Almeida Leite (230928218),"6.508,43 €",16-02-2016,15-06-2015,200 dias,"Portugal, Lisboa, Amadora","Artigo 20.º, n.º 1, alínea a) do Código dos Contratos Públicos",,,,,,Não aplicável.,Não aplicável.,FALSE
CONTRATO DE PRESTAÇÃO DE SERVIÇOS MÉDICOS,Ajuste Direto Regime Geral,Aquisição de serviços,"85121210-8, Serviços de ginecologia ou obstetrícia","Hospital Professor Doutor Fernando Fonseca, E. P. E. (503035416)",Marta Sofia Gaspar da Vitória Magro (218237200),"17.000,00 €",12-02-2016,12-10-2015,120 dias,"Portugal, Lisboa, Amadora","Artigo 20.º, n.º 1, alínea a) do Código dos Contratos Públicos",,,,,,Não aplicável.,Não aplicável.,FALSE
COMUNICAÇÕES MÓVEIS,Ajuste Direto Regime Geral,Aquisição de serviços,"64200000-8, Serviços de telecomunicações",Hospital Prof. Doutor Fernando Fonseca E.P.E. (503035416),"MEO Serviços de Comunicações e Multimédia, S.A (504615947)","28.660,50 €",12-02-2016,22-09-2015,270 dias,"Portugal, Lisboa, Amadora","Artigo 20.º, n.º 1, alínea a) do Código dos Contratos Públicos",,,,,,Não aplicável.,Não aplicável.,FALSE
"Prestação de Serviços Médicos, para o Serviço de Saúde Ocupacional",Ajuste Direto Regime Geral,Aquisição de serviços,"98110000-7, Serviços prestados por organizações empresariais, profissionais e especializadas","Hospital Professor Doutor Fernando Fonseca, E. P. E. (503035416)","GS24 – Healthcare Solutions, S.A (507824652)","9.425,00 €",11-02-2016,02-12-2015,90 dias,"Portugal, Lisboa, Amadora","Artigo 20.º, n.º 1, alínea a) do Código dos Contratos Públicos",,,,,,Não aplicável.,Não aplicável.,FALSE
Contrato de prestação de serviços profissionais,Ajuste Direto Regime Geral,Aquisição de serviços,"85140000-2, Serviços de saúde diversos","Hospital Professor Doutor Fernando Fonseca, E. P. E. (503035416)",Adriana Carolina Domingos Pedras de Almeida Santos (234115238),"7.327,94 €",11-02-2016,19-06-2015,161 dias,"Portugal, Lisboa, Amadora","Artigo 20.º, n.º 1, alínea a) do Código dos Contratos Públicos",,,,,,Não aplicável.,Não aplicável.,FALSE
Prestação de Serviços Médicos de Neurorradiologia,Ajuste Direto Regime Geral,Aquisição de serviços,"85150000-5, Serviços de imagiologia médica","Hospital Professor Doutor Fernando Fonseca, E. P. E. (503035416)","Nuno Caçador, Unipessoal Lda. (509792707)","5.625,00 €",11-02-2016,25-09-2015,90 dias,"Portugal, Lisboa, Amadora","Artigo 20.º, n.º 1, alínea a) do Código dos Contratos Públicos",,,,,,Não aplicável.,Não aplicável.,FALSE
Prestação de serviços médicos,Ajuste Direto Regime Geral,Aquisição de serviços,"85141000-9, Serviços prestados pelo pessoal médico","Hospital Professor Doutor Fernando Fonseca, E. P. E. (503035416)","Djossa & Rodrigues Serviços de Saúde, Lda  (513401636)","70.548,00 €",11-02-2016,21-01-2016,180 dias,"Portugal, Lisboa, Amadora","Artigo 20.º, n.º 1, alínea a) do Código dos Contratos Públicos",,,,,,Não aplicável.,Não aplicável.,FALSE
Prestação de serviços médicos,Ajuste Direto Regime Geral,Aquisição de serviços,"85141000-9, Serviços prestados pelo pessoal médico","Hospital Professor Doutor Fernando Fonseca, E. P. E. (503035416)",Susana Patrícia Baltasar Pacheco (237291045),"3.240,00 €",11-02-2016,22-12-2015,60 dias,"Portugal, Lisboa, Amadora","Artigo 20.º, n.º 1, alínea a) do Código dos Contratos Públicos",,,,,,Não aplicável.,Não aplicável.,FALSE
Prestação de serviços médicos,Ajuste Direto Regime Geral,Aquisição de serviços,"85141000-9, Serviços prestados pelo pessoal médico","Hospital Professor Doutor Fernando Fonseca, E. P. E. (503035416)","Ritual d´escolhas, Lda. (509743595)","13.770,00 €",11-02-2016,17-11-2015,120 dias,"Portugal, Lisboa, Amadora","Artigo 20.º, n.º 1, alínea a) do Código dos Contratos Públicos",,,,,,Não aplicável.,Não aplicável.,FALSE
Serviços médicos,Ajuste Direto Regime Geral,Aquisição de serviços,"85141000-9, Serviços prestados pelo pessoal médico","Hospital Professor Doutor Fernando Fonseca, E. P. E. (503035416)"," Barros Ruival, Serviços Médicos, Lda. (510003168)","16.830,00 €",11-02-2016,14-12-2015,120 dias,"Portugal, Lisboa, Amadora","Artigo 20.º, n.º 1, alínea a) do Código dos Contratos Públicos",,,,,,Não aplicável.,Não aplicável.,FALSE
