freguesia,acronym,validVotesPercentage,votes,dicofre
União das freguesias de Nogueira do Cravo e Pindelo,PS,42.81,718,011320
União das freguesias de Nogueira do Cravo e Pindelo,PPD/PSD,26.36,442,011320
União das freguesias de Nogueira do Cravo e Pindelo,B.E.,7.33,123,011320
União das freguesias de Nogueira do Cravo e Pindelo,CDS-PP,6.26,105,011320
União das freguesias de Nogueira do Cravo e Pindelo,PAN,4.95,83,011320
União das freguesias de Nogueira do Cravo e Pindelo,PCP-PEV,2.62,44,011320
União das freguesias de Nogueira do Cravo e Pindelo,PDR,1.61,27,011320
União das freguesias de Nogueira do Cravo e Pindelo,L,1.55,26,011320
União das freguesias de Nogueira do Cravo e Pindelo,NC,1.43,24,011320
União das freguesias de Nogueira do Cravo e Pindelo,A,1.31,22,011320
União das freguesias de Nogueira do Cravo e Pindelo,PCTP/MRPP,1.07,18,011320
União das freguesias de Nogueira do Cravo e Pindelo,PPM.PPV/CDC,0.83,14,011320
União das freguesias de Nogueira do Cravo e Pindelo,PNR,0.54,9,011320
União das freguesias de Nogueira do Cravo e Pindelo,PTP,0.54,9,011320
União das freguesias de Nogueira do Cravo e Pindelo,IL,0.42,7,011320
União das freguesias de Nogueira do Cravo e Pindelo,PURP,0.36,6,011320
União das freguesias de Nogueira do Cravo e Pindelo,MAS,0,0,011320
