freguesia,acronym,validVotesPercentage,votes,dicofre
Sanfins Lamoso Codessos,PS,39.89,562,130919
Sanfins Lamoso Codessos,PPD/PSD,32.72,461,130919
Sanfins Lamoso Codessos,B.E.,7.38,104,130919
Sanfins Lamoso Codessos,PAN,5.11,72,130919
Sanfins Lamoso Codessos,CDS-PP,4.97,70,130919
Sanfins Lamoso Codessos,PCP-PEV,2.27,32,130919
Sanfins Lamoso Codessos,L,1.49,21,130919
Sanfins Lamoso Codessos,PCTP/MRPP,0.99,14,130919
Sanfins Lamoso Codessos,PDR,0.99,14,130919
Sanfins Lamoso Codessos,A,0.92,13,130919
Sanfins Lamoso Codessos,PPM.PPV/CDC,0.71,10,130919
Sanfins Lamoso Codessos,NC,0.64,9,130919
Sanfins Lamoso Codessos,PURP,0.57,8,130919
Sanfins Lamoso Codessos,PNR,0.43,6,130919
Sanfins Lamoso Codessos,PTP,0.43,6,130919
Sanfins Lamoso Codessos,IL,0.35,5,130919
Sanfins Lamoso Codessos,MAS,0.14,2,130919
