Objeto do Contrato,Tipo de Procedimento,Tipo(s) de Contrato,CPVs,Entidade(s) Adjudicante(s),Entidade(s) Adjudicatária(s),Preço Contratual,Data de Publicação,Data de Celebração do Contrato,Prazo de Execução,Local de Execução,Fundamentação,Data de Fecho do Contrato,Preço Total Efetivo,Causas das Alterações ao Prazo,Causas das Alterações ao Preço,Estado,N.º registo do Acordo Quadro,Descrição do Acordo Quadro,Procedimento Centralizado
"IG 8007 - Sistema Nervoso Cerebroespinal: exceto anestésicos, relaxantes musculares, analgésicos",Ajuste Direto Regime Geral,Aquisição de bens móveis,"33600000-6, Produtos farmacêuticos","Hospital de Magalhães Lemos, E. P. E. (502828790)","Novartis Farma - Produtos Farmacêuticos, S.A. (500063524)","9.501,30 €",26-04-2017,30-03-2017,66 dias,"Portugal, Porto, Porto","Artigo 20.º, n.º 1, alínea a) do Código dos Contratos Públicos",,,,,,Não aplicável.,Não aplicável.,FALSE
AJ/18/2017 Fornecimento de frutas e produtos hortícolas e da 4ª gama para o ano de 2017,Ajuste Direto Regime Geral,Aquisição de bens móveis,"15000000-8, Produtos alimentares, bebidas, tabaco e produtos afins","Hospital de Magalhães Lemos, E. P. E. (502828790)","HORTIDOURO-PRODUTOS HORTICOLAS,LDA (507144007)","672,84 €",21-04-2017,02-01-2017,8 dias,"Portugal, Porto, Porto","Artigo 20.º, n.º 1, alínea a) do Código dos Contratos Públicos",,,,,,Não aplicável.,Não aplicável.,FALSE
"AJ/19/2017 Fornecimento de congelados – peixes, derivados de peixe e legumes para o ano de 2017",Ajuste Direto Regime Geral,Aquisição de bens móveis,"15000000-8, Produtos alimentares, bebidas, tabaco e produtos afins","Hospital de Magalhães Lemos, E. P. E. (502828790)","Futuro em Relevo - Comércio de Carnes, Unip (509485693)","429,50 €",21-04-2017,02-01-2017,8 dias,"Portugal, Porto, Porto<BR/>Portugal","Artigo 20.º, n.º 1, alínea a) do Código dos Contratos Públicos",,,,,,Não aplicável.,Não aplicável.,FALSE
"AJ/17/2017 Fornecimento de carnes frescas, congeladas, derivados de carne, enchidos e fumados durante 2017",Ajuste Direto Regime Geral,Aquisição de bens móveis,"15000000-8, Produtos alimentares, bebidas, tabaco e produtos afins","Hospital de Magalhães Lemos, E. P. E. (502828790)","Futuro em Relevo - Comércio de Carnes, Unip (509485693)","588,37 €",21-04-2017,02-01-2017,8 dias,"Portugal, Porto, Porto","Artigo 20.º, n.º 1, alínea a) do Código dos Contratos Públicos",,,,,,Não aplicável.,Não aplicável.,FALSE
"AJ/17/2017 Fornecimento de carnes frescas, congeladas, derivados de carne, enchidos e fumados durante 2017",Ajuste Direto Regime Geral,Aquisição de bens móveis,"15000000-8, Produtos alimentares, bebidas, tabaco e produtos afins","Hospital de Magalhães Lemos, E. P. E. (502828790)","Futuro em Relevo - Comércio de Carnes, Unip (509485693)","370,75 €",21-04-2017,02-01-2017,8 dias,"Portugal, Porto, Porto","Artigo 20.º, n.º 1, alínea a) do Código dos Contratos Públicos",,,,,,Não aplicável.,Não aplicável.,FALSE
"AJ/19/2017 - Fornecimento de congelados – peixes, derivados de peixe e legumes para o ano de 2017",Ajuste Direto Regime Geral,Aquisição de bens móveis,"15000000-8, Produtos alimentares, bebidas, tabaco e produtos afins","Hospital de Magalhães Lemos, E. P. E. (502828790)",A.MENDES TORRADO (501544984),"55,40 €",21-04-2017,02-01-2017,8 dias,"Portugal, Porto, Porto","Artigo 20.º, n.º 1, alínea a) do Código dos Contratos Públicos",,,,,,Não aplicável.,Não aplicável.,FALSE
AM/1014/2017 Contrato de Assistência Técnica aos Elevadores do HML para 2017,Ajuste Direto Regime Geral,Aquisição de serviços,"50000000-5, Serviços de reparação e manutenção","Hospital de Magalhães Lemos, E. P. E. (502828790)",SCHMITT+SOHN ELEVADORES (500230757),"383,95 €",21-04-2017,02-01-2017,90 dias,"Portugal, Porto, Porto","Artigo 20.º, n.º 1, alínea a) do Código dos Contratos Públicos",,,,,,Não aplicável.,Não aplicável.,FALSE
AJ/39/2017 Aquisição de serviços de transporte de doentes em ambulância para o ano de 2017,Ajuste Direto Regime Geral,Aquisição de serviços,"60000000-8, Serviços de transporte (excl. transporte de resíduos)","Hospital de Magalhães Lemos, E. P. E. (502828790)","SALVAVIDA Transporte de Doentes, Lda (506532160)","2.295,28 €",21-04-2017,02-01-2017,30 dias,"Portugal, Porto, Porto","Artigo 20.º, n.º 1, alínea a) do Código dos Contratos Públicos",,,,,,Não aplicável.,Não aplicável.,FALSE
