Objeto do Contrato,Tipo de Procedimento,Tipo(s) de Contrato,CPVs,Entidade(s) Adjudicante(s),Entidade(s) Adjudicatária(s),Preço Contratual,Data de Publicação,Data de Celebração do Contrato,Prazo de Execução,Local de Execução,Fundamentação,Data de Fecho do Contrato,Preço Total Efetivo,Causas das Alterações ao Prazo,Causas das Alterações ao Preço,Estado,N.º registo do Acordo Quadro,Descrição do Acordo Quadro,Procedimento Centralizado
Aquisição de cateter periférico anti-picada 22G,Ao abrigo de acordo-quadro (art.º 259.º),Aquisição de bens móveis,"33141200-2, Cateteres","Administração Regional de Saúde de Lisboa e Vale do Tejo, I. P. (503148776)","OVERPHARMA,LDA. (505792362)","2.035,00 €",02-03-2018,15-02-2018,320 dias,"Portugal, Lisboa, Lisboa",Artigo 259.º do Código dos Contratos Públicos,"","","","",,2349386,Acordo Quadro para o fornecimento de Cateteres às Instituições e Serviços do Serviço Nacional de Saúde,FALSE
Aquisição de cateter periférico anti-picada 24 G,Ao abrigo de acordo-quadro (art.º 259.º),Aquisição de bens móveis,"33141200-2, Cateteres","Administração Regional de Saúde de Lisboa e Vale do Tejo, I. P. (503148776)","OVERPHARMA,LDA. (505792362)","3.216,40 €",02-03-2018,15-02-2018,320 dias,"Portugal, Lisboa, Lisboa",Artigo 259.º do Código dos Contratos Públicos,"","","","",,2349386,Acordo Quadro para o fornecimento de Cateteres às Instituições e Serviços do Serviço Nacional de Saúde,FALSE
Aquisição de penso pos-operatório esteril. impermeável 9x15,Ao abrigo de acordo-quadro (art.º 259.º),Aquisição de bens móveis,"33141100-1, Pensos; clipes, suturas, ligaduras",Adm.Reg.de Saúde de Lisboa e Vale do Tejo (ARSLVT) (503148776),"OVERPHARMA,LDA. (505792362)","8.400,00 €",02-03-2018,15-02-2018,620 dias,"Portugal, Lisboa, Lisboa",Artigo 259.º do Código dos Contratos Públicos,"","","","",,2183748,Pensos especiais,FALSE
"Aquisição de agulha irrecuperável 21 G (0,8x50)",Ao abrigo de acordo-quadro (art.º 259.º),Aquisição de bens móveis,"33141320-9, Agulhas para fins médicos","Administração Regional de Saúde de Lisboa e Vale do Tejo, I. P. (503148776)","OVERPHARMA,LDA. (505792362)","1.036,00 €",02-03-2018,15-02-2018,320 dias,"Portugal, Lisboa, Lisboa",Artigo 259.º do Código dos Contratos Públicos,"","","","",,1341769,"ACORDO QUADRO PARA FORNECIMENTO DE SERINGAS, AGULHAS E CONTENTORES ÀS INSTITUIÇÕES E SERVIÇOS DO SERVIÇO NACIONAL DE SAÚDE PROGRAMA DE CONCURSO",FALSE
Aquisição de bata irrecuperável impermeável,Ao abrigo de acordo-quadro (art.º 259.º),Aquisição de bens móveis,"33199000-1, Vestuário para pessoal médico","Administração Regional de Saúde de Lisboa e Vale do Tejo, I. P. (503148776)",Quilaban-Quimica laboratorial e análitica (500399670),"2.090,40 €",02-03-2018,15-02-2018,320 dias,"Portugal, Lisboa, Lisboa",Artigo 259.º do Código dos Contratos Públicos,"","","","",,2078840,CP 2016/24 - Acordo quadro para fornecimento de Material disposable de bloco operatório - Parte I-A às Instituições e Serviços do Serviço Nacional de Saúde,FALSE
Aquisição de penso pós-operatório estéril. impermeável (6x9),Ao abrigo de acordo-quadro (art.º 259.º),Aquisição de bens móveis,"33141100-1, Pensos; clipes, suturas, ligaduras",Adm.Reg.de Saúde de Lisboa e Vale do Tejo (ARSLVT) (503148776),OVERPHARMA (505792362),"9.223,20 €",02-03-2018,15-02-2018,365 dias,"Portugal, Lisboa, Lisboa",Artigo 259.º do Código dos Contratos Públicos,"","","","",,2183748,Pensos especiais,FALSE
"Aquisição de manga c/fole p/esterilização 7,5 cm",Ao abrigo de acordo-quadro (art.º 259.º),Aquisição de bens móveis,"33140000-3, Material médico de consumo","Administração Regional de Saúde de Lisboa e Vale do Tejo, I. P. (503148776)","DIMOR LUSITANA, LDA (500730741)","1.968,00 €",02-03-2018,15-02-2018,320 dias,"Portugal, Lisboa, Lisboa",Artigo 259.º do Código dos Contratos Públicos,"","","","",,1974943,CP 2016/43 - Acordo quadro para fornecimento de Material para Empacotamento em Esterilização às Instituições e Serviços do Serviço Nacional de Saúde.,FALSE
Aquisição de agulha epicraniana 27 G,Ao abrigo de acordo-quadro (art.º 259.º),Aquisição de bens móveis,"33141320-9, Agulhas para fins médicos","Administração Regional de Saúde de Lisboa e Vale do Tejo, I. P. (503148776)",B Braun Medical Lda (501506543),"55,30 €",02-03-2018,15-02-2018,320 dias,"Portugal, Lisboa, Lisboa",Artigo 259.º do Código dos Contratos Públicos,"","","","",,1341769,"ACORDO QUADRO PARA FORNECIMENTO DE SERINGAS, AGULHAS E CONTENTORES ÀS INSTITUIÇÕES E SERVIÇOS DO SERVIÇO NACIONAL DE SAÚDE PROGRAMA DE CONCURSO",FALSE
Aquisição de agulha epicraniana 25 G,Ao abrigo de acordo-quadro (art.º 259.º),Aquisição de bens móveis,"33141320-9, Agulhas para fins médicos","Administração Regional de Saúde de Lisboa e Vale do Tejo, I. P. (503148776)","ANASTACIO SALDANHA UNIPESSOAL, LDA. (505804441)","60,84 €",02-03-2018,15-02-2018,320 dias,"Portugal, Lisboa, Lisboa",Artigo 259.º do Código dos Contratos Públicos,"","","","",,1341769,"ACORDO QUADRO PARA FORNECIMENTO DE SERINGAS, AGULHAS E CONTENTORES ÀS INSTITUIÇÕES E SERVIÇOS DO SERVIÇO NACIONAL DE SAÚDE PROGRAMA DE CONCURSO",FALSE
Aquisição de compressa TNT N/EST. 5x5,Ao abrigo de acordo-quadro (art.º 259.º),Aquisição de bens móveis,"33100000-1, Equipamento médico",Adm.Reg.de Saúde de Lisboa e Vale do Tejo (ARSLVT) (503148776),"ALBINO DIAS ANDRADE, LDA (500013810)","1.600,00 €",02-03-2018,14-02-2018,320 dias,"Portugal, Lisboa, Lisboa",Artigo 259.º do Código dos Contratos Públicos,"","","","",,2190354,CP 2016/21 - Acordo quadro para fornecimento de Gazes Medicadas e Ligaduras de Gaze às Instituições e Serviços do Serviço Nacional de Saúde,FALSE
Aquisição de compressa TNT N/EST. 10x10,Ao abrigo de acordo-quadro (art.º 259.º),Aquisição de bens móveis,"33100000-1, Equipamento médico",Adm.Reg.de Saúde de Lisboa e Vale do Tejo (ARSLVT) (503148776),"Docworld, Lda (508592909)","3.024,00 €",02-03-2018,14-02-2018,320 dias,"Portugal, Lisboa, Lisboa",Artigo 259.º do Código dos Contratos Públicos,"","","","",,2190354,CP 2016/21 - Acordo quadro para fornecimento de Gazes Medicadas e Ligaduras de Gaze às Instituições e Serviços do Serviço Nacional de Saúde,FALSE
Aquisição de penso n/tecido 20x8,Ao abrigo de acordo-quadro (art.º 259.º),Aquisição de bens móveis,"33141100-1, Pensos; clipes, suturas, ligaduras",Adm.Reg.de Saúde de Lisboa e Vale do Tejo (ARSLVT) (503148776),"PAUL HARTMANN,LDA (502271728)","5.888,00 €",02-03-2018,14-02-2018,320 dias,"Portugal, Lisboa, Lisboa",Artigo 259.º do Código dos Contratos Públicos,"","","","",,2183748,Pensos especiais,FALSE
Aquisição de penso adesivo n/tecido 7x5,Ao abrigo de acordo-quadro (art.º 259.º),Aquisição de bens móveis,"33141100-1, Pensos; clipes, suturas, ligaduras",Adm.Reg.de Saúde de Lisboa e Vale do Tejo (ARSLVT) (503148776),OVERPHARMA (505792362),"7.200,00 €",02-03-2018,14-02-2018,320 dias,"Portugal, Lisboa, Lisboa",Artigo 259.º do Código dos Contratos Públicos,"","","","",,2183748,Pensos especiais,FALSE
Aquisição de adesivo comum 5 cm,Ao abrigo de acordo-quadro (art.º 259.º),Aquisição de bens móveis,"33600000-6, Produtos farmacêuticos",Adm.Reg.de Saúde de Lisboa e Vale do Tejo (ARSLVT) (503148776),"BSN MEDICAL, S.A. (505385058)","10.396,00 €",02-03-2018,14-02-2018,320 dias,"Portugal, Lisboa, Lisboa",Artigo 259.º do Código dos Contratos Públicos,"","","","",,2183753,CP 2016/82 - Acordo quadro para fornecimento de Nastros e Fitas Cirúrgicas às Instituições e Serviços do Serviço Nacional de Saúde,FALSE
"Aquisição de pelicula de contacto p/terap. compr. 7,5x10",Ao abrigo de acordo-quadro (art.º 259.º),Aquisição de bens móveis,"33141100-1, Pensos; clipes, suturas, ligaduras","Administração Regional de Saúde de Lisboa e Vale do Tejo, I. P. (503148776)",MOLNLYCKE HEALTH CARE (511101066),"29.550,00 €",02-03-2018,14-02-2018,320 dias,"Portugal, Lisboa, Lisboa",Artigo 259.º do Código dos Contratos Públicos,"","","","",,2371297,CP 2016/10 - Acordo Quadro para fornecimento de Material de Penso de Efeito Terapêutico às Instituições e Serviços do Serviço Nacional de Saúde,FALSE
Aquisição de pelicula transparente c/ vaporizador,Ao abrigo de acordo-quadro (art.º 259.º),Aquisição de bens móveis,"33141110-4, Pensos","Administração Regional de Saúde de Lisboa e Vale do Tejo, I. P. (503148776)","SMITH & NEPHEW, LDA (503552461)","1.125,00 €",02-03-2018,14-02-2018,320 dias,"Portugal, Lisboa, Lisboa",Artigo 259.º do Código dos Contratos Públicos,"","","","",,2371297,CP 2016/10 - Acordo Quadro para fornecimento de Material de Penso de Efeito Terapêutico às Instituições e Serviços do Serviço Nacional de Saúde,FALSE
Aquisição de compressas TNT EST 15x20,Ao abrigo de acordo-quadro (art.º 259.º),Aquisição de bens móveis,"33100000-1, Equipamento médico",Adm.Reg.de Saúde de Lisboa e Vale do Tejo (ARSLVT) (503148776),"SILVA, GOMES & MOURA, LDA (513835717)","54.560,00 €",02-03-2018,14-02-2018,320 dias,"Portugal, Lisboa, Lisboa",Artigo 259.º do Código dos Contratos Públicos,"","","","",,2190354,CP 2016/21 - Acordo quadro para fornecimento de Gazes Medicadas e Ligaduras de Gaze às Instituições e Serviços do Serviço Nacional de Saúde,FALSE
Aquisição de compressas TNT esterilizadas 10x10,Ao abrigo de acordo-quadro (art.º 259.º),Aquisição de bens móveis,"33100000-1, Equipamento médico",Adm.Reg.de Saúde de Lisboa e Vale do Tejo (ARSLVT) (503148776),"ABILIO FREIRE, LDA (500432600)","64.600,00 €",02-03-2018,14-02-2018,320 dias,"Portugal, Lisboa, Lisboa",Artigo 259.º do Código dos Contratos Públicos,"","","","",,2190354,CP 2016/21 - Acordo quadro para fornecimento de Gazes Medicadas e Ligaduras de Gaze às Instituições e Serviços do Serviço Nacional de Saúde,FALSE
Aquisição de penso adesivo n/tecido 15x8,Ao abrigo de acordo-quadro (art.º 259.º),Aquisição de bens móveis,"33141110-4, Pensos","Administração Regional de Saúde de Lisboa e Vale do Tejo, I. P. (503148776)",OVERPHARMA (505792362),"3.350,00 €",02-03-2018,14-02-2018,320 dias,"Portugal, Lisboa, Lisboa",Artigo 259.º do Código dos Contratos Públicos,"","","","",,2183748,Pensos especiais,FALSE
Prestação de serviços da especialidade médica dentista e assistentes de dentista para o Centro de Saúde Mafra-Ericeira (1 janeiro - 8 setembro),Ajuste Direto Regime Geral,Aquisição de serviços,"85100000-0, Serviços de saúde",Adm.Reg.de Saúde de Lisboa e Vale do Tejo (ARSLVT) (503148776),"Precise, SA (513993274)","20.833,36 €",02-03-2018,23-02-2018,250 dias,"Portugal, Lisboa, Mafra","Artigo 20.º, n.º 1, alínea a) do Código dos Contratos Públicos",28-09-2018,"22.633,36 €",O aumento em 15 dias do prazo de execução do contrato para assegurar a prestação dos serviços médicos em causa,O aumento do valor do contrato corresponde ao aumento do prazo de execução do contrato,,Não aplicável.,Não aplicável.,TRUE
Aquisição de penso rápido seco 15x40,Ao abrigo de acordo-quadro (art.º 259.º),Aquisição de bens móveis,"33141110-4, Pensos","Administração Regional de Saúde de Lisboa e Vale do Tejo, I. P. (503148776)","BASTOS VIEGAS, SA (500042772)","3.920,00 €",02-03-2018,14-02-2018,320 dias,"Portugal, Lisboa, Lisboa",Artigo 259.º do Código dos Contratos Públicos,"","","","",,2183748,Pensos especiais,FALSE
Prestação de serviços da especialidade médica dentista e assistentes de dentista para o Centro de Saúde da Lourinhã,Ajuste Direto Regime Geral,Aquisição de serviços,"85100000-0, Serviços de saúde",Adm.Reg.de Saúde de Lisboa e Vale do Tejo (ARSLVT) (503148776),"Precise, SA (513993274)","20.833,36 €",02-03-2018,23-02-2018,246 dias,"Portugal, Lisboa, Lourinhã","Artigo 20.º, n.º 1, alínea a) do Código dos Contratos Públicos",28-09-2018,"22.753,56 €",O prazo de execução foi aumentado em 16 dias para assegurar a prestação dos serviços médicos em causa,O aumento do valor do contrato corresponde ao aumento do prazo de execução do contrato,,Não aplicável.,Não aplicável.,TRUE
"Aquisição de serviços médicos sem especialidade para a ARSLVT, IP",Ajuste Direto Regime Geral,Aquisição de serviços,"85141000-9, Serviços prestados pelo pessoal médico","Administração Regional de Saúde de Lisboa e Vale do Tejo, I. P. (503148776)",Maria Virginia Sequeira dos Reis e Passos (160656710),"41.600,00 €",01-03-2018,29-01-2018,365 dias,"Portugal, Lisboa, Sintra","Artigo 20.º, n.º 1, alínea a) do Código dos Contratos Públicos","","","","",,Não aplicável.,Não aplicável.,FALSE
"Aquisição de serviços médicos sem especialidade para a ARSLVT, IP",Ajuste Direto Regime Geral,Aquisição de serviços,"85141000-9, Serviços prestados pelo pessoal médico","Administração Regional de Saúde de Lisboa e Vale do Tejo, I. P. (503148776)",Eduard Birsanu (235745570),"41.600,00 €",01-03-2018,24-01-2018,365 dias,"Portugal, Santarém","Artigo 20.º, n.º 1, alínea a) do Código dos Contratos Públicos","","","","",,Não aplicável.,Não aplicável.,FALSE
"Aquisição de serviços médicos sem especialidade para a ARSLVT, IP",Ajuste Direto Regime Geral,Aquisição de serviços,"85141000-9, Serviços prestados pelo pessoal médico","Administração Regional de Saúde de Lisboa e Vale do Tejo, I. P. (503148776)",Mercedes Martinez Garcia (282336974),"41.600,00 €",01-03-2018,24-01-2018,365 dias,"Portugal, Santarém","Artigo 20.º, n.º 1, alínea a) do Código dos Contratos Públicos","","","","",,Não aplicável.,Não aplicável.,FALSE
"Aquisição de serviços de manutenção de instalações de elevação ao abrigo do lote 3 do acordo quadro celebrado pela ESPAP para a ARSLVT, IP",Ajuste Direto Regime Geral,Aquisição de serviços,"50000000-5, Serviços de reparação e manutenção","Administração Regional de Saúde de Lisboa e Vale do Tejo, I. P. (503148776)","Pinto & Cruz, SA (500217904)","0,00 €",28-02-2018,19-02-2018,334 dias,"Portugal, Leiria<BR/>Portugal, Lisboa<BR/>Portugal, Setúbal<BR/>Portugal, Santarém",Artigo 258.º do Código dos Contratos Públicos,"","","","",,3294121,"Aquisição de serviços de manutenção de instalações de elevação ao abrigo do lote 3 do acordo quadro celebrado pela ESPAP para a ARSLVT, IP",FALSE
Prestação de serviços médicos sem especialidade,Ajuste Direto Regime Geral,Aquisição de serviços,"85121100-4, Serviços de médicos de clínica geral","Administração Regional de Saúde de Lisboa e Vale do Tejo, I. P. (503148776)",Kelly Healthcare Resourses (510723691),"66.203,45 €",26-02-2018,15-02-2018,30 dias,"Portugal, Lisboa","Artigo 24.º, n.º 1, alínea c) do Código dos Contratos Públicos","","","","",,Não aplicável.,Não aplicável.,FALSE
Aquisição  da vacina contra a doença Meningocócica B (Men B) [UDOSE] (V136).,Ajuste Direto Regime Geral,Aquisição de bens móveis,"33651600-4, Vacinas",Adm.Reg.de Saúde de Lisboa e Vale do Tejo (ARSLVT) (503148776),GLAXO SMITH KLINE-PROD. FARMACEUTICOS (500139962),"10.806,00 €",26-02-2018,26-02-2018,300 dias,"Portugal, Lisboa",Artigo 258.º do Código dos Contratos Públicos,"","","","",,Não aplicável.,Não aplicável.,FALSE
Aquisição da vacina contra a Raiva [UDOSE] (V30).,Ajuste Direto Regime Geral,Aquisição de bens móveis,"33651600-4, Vacinas",Adm.Reg.de Saúde de Lisboa e Vale do Tejo (ARSLVT) (503148776),GLAXO SMITH KLINE-PROD. FARMACEUTICOS (500139962),"4.500,00 €",26-02-2018,26-02-2018,300 dias,"Portugal, Lisboa",Artigo 258.º do Código dos Contratos Públicos,"","","","",,Não aplicável.,Não aplicável.,FALSE
Aquisição  da vacina conjugada contra a Doença Meningococócica C (Men c) (V116).,Ajuste Direto Regime Geral,Aquisição de bens móveis,"33651600-4, Vacinas",Adm.Reg.de Saúde de Lisboa e Vale do Tejo (ARSLVT) (503148776),GLAXO SMITH KLINE-PROD. FARMACEUTICOS (500139962),"262.250,00 €",26-02-2018,26-02-2018,300 dias,"Portugal, Lisboa",Artigo 258.º do Código dos Contratos Públicos,"","","","",,Não aplicável.,Não aplicável.,FALSE
Aquisição da vacina Pentavalente contra Dif. Tet. Pert. [UDOSE] (V126).,Ajuste Direto Regime Geral,Aquisição de bens móveis,"33651600-4, Vacinas",Adm.Reg.de Saúde de Lisboa e Vale do Tejo (ARSLVT) (503148776),"SANOFI - PRODUTOS FARMACÊUTICOS, LDA. (500134960)","1.498.500,00 €",26-02-2018,26-02-2018,300 dias,"Portugal, Lisboa",Artigo 258.º do Código dos Contratos Públicos,"","","","",,Não aplicável.,Não aplicável.,FALSE
Aquisição da vacina inactivada contra a Poliomielite (VIP)  (V6).,Ajuste Direto Regime Geral,Aquisição de bens móveis,"33651600-4, Vacinas","Administração Regional de Saúde de Lisboa e Vale do Tejo, I. P. (503148776)","SANOFI - PRODUTOS FARMACÊUTICOS, LDA. (500134960)","81.600,00 €",26-02-2018,26-02-2018,300 dias,"Portugal, Lisboa",Artigo 258.º do Código dos Contratos Públicos,"","","","",,Não aplicável.,Não aplicável.,FALSE
Aquisição  de  Vacina Conjugada contra doença Meningococócica C (Men C) [UDOSE] (V116).,Ajuste Direto Regime Geral,Aquisição de bens móveis,"33651600-4, Vacinas","Administração Regional de Saúde de Lisboa e Vale do Tejo, I. P. (503148776)","Pfizer Biofarmacêutica, Sociedade Unipessoal, Lda. (513300376)","274.737,50 €",26-02-2018,26-02-2018,200 dias,"Portugal, Lisboa",Artigo 258.º do Código dos Contratos Públicos,"","","","",,Não aplicável.,Não aplicável.,FALSE
"Aquisição de agulha irrecuperável 20 G (0,9x40)",Ao abrigo de acordo-quadro (art.º 259.º),Aquisição de bens móveis,"33141320-9, Agulhas para fins médicos","Administração Regional de Saúde de Lisboa e Vale do Tejo, I. P. (503148776)","OVERPHARMA - PROD. MÉDICOS E FARMACÊUTICOS, LDA. (505792362)","2.132,00 €",22-02-2018,15-02-2018,365 dias,"Portugal, Lisboa, Lisboa",Artigo 259.º do Código dos Contratos Públicos,"","","","",,1341769,"ACORDO QUADRO PARA FORNECIMENTO DE SERINGAS, AGULHAS E CONTENTORES ÀS INSTITUIÇÕES E SERVIÇOS DO SERVIÇO NACIONAL DE SAÚDE PROGRAMA DE CONCURSO",FALSE
"Aquisição de agulha irrecuperável 20 G (0,9x25)",Ao abrigo de acordo-quadro (art.º 259.º),Aquisição de bens móveis,"33141320-9, Agulhas para fins médicos","Administração Regional de Saúde de Lisboa e Vale do Tejo, I. P. (503148776)","OVERPHARMA - PROD. MÉDICOS E FARMACÊUTICOS, LDA. (505792362)","664,00 €",22-02-2018,15-02-2018,365 dias,"Portugal, Lisboa, Lisboa",Artigo 259.º do Código dos Contratos Públicos,"","","","",,1341769,"ACORDO QUADRO PARA FORNECIMENTO DE SERINGAS, AGULHAS E CONTENTORES ÀS INSTITUIÇÕES E SERVIÇOS DO SERVIÇO NACIONAL DE SAÚDE PROGRAMA DE CONCURSO",FALSE
"Aquisição de agulha irrecuperável (0,45x12)",Ao abrigo de acordo-quadro (art.º 259.º),Aquisição de bens móveis,"33141320-9, Agulhas para fins médicos","Administração Regional de Saúde de Lisboa e Vale do Tejo, I. P. (503148776)","OVERPHARMA - PROD. MÉDICOS E FARMACÊUTICOS, LDA. (505792362)","364,80 €",22-02-2018,15-02-2018,320 dias,"Portugal, Lisboa, Lisboa",Artigo 259.º do Código dos Contratos Públicos,"","","","",,1341769,"ACORDO QUADRO PARA FORNECIMENTO DE SERINGAS, AGULHAS E CONTENTORES ÀS INSTITUIÇÕES E SERVIÇOS DO SERVIÇO NACIONAL DE SAÚDE PROGRAMA DE CONCURSO",FALSE
Prestação de serviços da especialidade médica dentista e assistente de dentista para o Centro de Saúde de Fátima (01 janeiro a 10 novembro 2018),Ajuste Direto Regime Geral,Aquisição de serviços,"85100000-0, Serviços de saúde",Adm.Reg.de Saúde de Lisboa e Vale do Tejo (ARSLVT) (503148776),MEDIPEOPLE- LDA (508543436),"25.754,85 €",22-02-2018,16-02-2018,314 dias,"Portugal, Santarém, Ourém","Artigo 20.º, n.º 1, alínea a) do Código dos Contratos Públicos","","","","",,Não aplicável.,Não aplicável.,TRUE
Prestação de serviços da especialidade médica dentista e assistentes de dentista para o Centro de Saúde do Cartaxo (1 janeiro a 4 setembro 2018),Ajuste Direto Regime Geral,Aquisição de serviços,"85100000-0, Serviços de saúde",Adm.Reg.de Saúde de Lisboa e Vale do Tejo (ARSLVT) (503148776),MEDIPEOPLE- LDA (508543436),"20.833,36 €",22-02-2018,16-02-2018,245 dias,"Portugal, Santarém, Cartaxo","Artigo 20.º, n.º 1, alínea a) do Código dos Contratos Públicos","","","","",,Não aplicável.,Não aplicável.,TRUE
Prestação de serviços da especialidade médica dentista e assistentes de dentista para o Centro de Saúde da Moita (janeiro-agosto 2018),Ajuste Direto Regime Geral,Aquisição de serviços,"85100000-0, Serviços de saúde",Adm.Reg.de Saúde de Lisboa e Vale do Tejo (ARSLVT) (503148776),"Precise, SA (513993274)","20.609,07 €",22-02-2018,19-02-2018,240 dias,"Portugal, Setúbal, Moita","Artigo 20.º, n.º 1, alínea a) do Código dos Contratos Públicos","","","","",,Não aplicável.,Não aplicável.,TRUE
Prestação de serviços da especialidade médica dentista e assistentes de dentista para o Centro de Saúde do Rio de Mouro (01 janeiro a 6 de setembro 2018),Ajuste Direto Regime Geral,Aquisição de serviços,"85100000-0, Serviços de saúde",Adm.Reg.de Saúde de Lisboa e Vale do Tejo (ARSLVT) (503148776),"Precise, SA (513993274)","20.833,36 €",22-02-2018,19-02-2018,246 dias,"Portugal, Santarém, Rio Maior","Artigo 20.º, n.º 1, alínea a) do Código dos Contratos Públicos",28-09-2018,"22.753,56 €",O prazo de execução foi aumentado em 16 dias para assegurar a prestação dos serviços médicos em causa,O aumento do valor do contrato corresponde ao aumento do prazo de prazo de execução,,Não aplicável.,Não aplicável.,TRUE
Prestação de serviços da especialidade médica dentista e assistentes de dentista para o Centro de Saúde Alenquer (1 janeiro a 6 setembro 2018),Ajuste Direto Regime Geral,Aquisição de serviços,"85100000-0, Serviços de saúde",Adm.Reg.de Saúde de Lisboa e Vale do Tejo (ARSLVT) (503148776),"Precise, SA (513993274)","20.833,36 €",22-02-2018,19-02-2018,246 dias,"Portugal, Lisboa, Alenquer","Artigo 20.º, n.º 1, alínea a) do Código dos Contratos Públicos",28-09-2018,"22.753,60 €",Aumento do prazo de execução para assegurar a prestação de serviços médicos em causa,O aumento do valor do contrato corresponde ao aumento do prazo de execução,,Não aplicável.,Não aplicável.,TRUE
Prestação de serviços da especialidade médica dentista e assistentes de dentista para o Centro de Saúde Arruda dos Vinhos ( 1 janeiro a 6 de setembro),Ajuste Direto Regime Geral,Aquisição de serviços,"85100000-0, Serviços de saúde",Adm.Reg.de Saúde de Lisboa e Vale do Tejo (ARSLVT) (503148776),"Precise, SA (513993274)","20.833,36 €",22-02-2018,19-02-2018,246 dias,"Portugal, Lisboa, Arruda dos Vinhos","Artigo 20.º, n.º 1, alínea a) do Código dos Contratos Públicos",28-09-2018,"22.753,60 €",O prazo de execução foi alterado/aumentado em 16 dias para assegurar a prestação de serviços médicos em causa,O aumento do valor do contrato corresponde ao aumento do prazo de execução,,Não aplicável.,Não aplicável.,TRUE
Prestação de serviços da especialidade médica dentista e assistentes de dentista  para o Centro de Saúde do Monte da Caparica (janeiro-agosto 2018),Ajuste Direto Regime Geral,Aquisição de serviços,"85100000-0, Serviços de saúde",Adm.Reg.de Saúde de Lisboa e Vale do Tejo (ARSLVT) (503148776),"Precise, SA (513993274)","20.609,07 €",21-02-2018,19-02-2018,240 dias,"Portugal, Setúbal, Almada","Artigo 20.º, n.º 1, alínea a) do Código dos Contratos Públicos","","","","",,Não aplicável.,Não aplicável.,TRUE
Prestação de serviços da especialidade médica dentista e assistentes de dentista para Centro de Saúde de Salvaterra de Magos,Ajuste Direto Regime Geral,Aquisição de serviços,"85100000-0, Serviços de saúde",Adm.Reg.de Saúde de Lisboa e Vale do Tejo (ARSLVT) (503148776),MEDIPEOPLE- LDA (508543436),"20.603,88 €",21-02-2018,16-02-2018,240 dias,"Portugal, Santarém, Salvaterra de Magos","Artigo 20.º, n.º 1, alínea a) do Código dos Contratos Públicos","","","","",,Não aplicável.,Não aplicável.,TRUE
AQUISIÇÃO DE SERVIÇO DE SUBSTITUIÇÃO/REPARAÇÃO PARA SOLUÇÃO DE GESTÃO DE ATENDIMENTOS/FILAS DE ESPERA PARA O EDIFICIO DE OEIRAS,Ajuste Direto Regime Geral,Aquisição de serviços,"50000000-5, Serviços de reparação e manutenção","Administração Regional de Saúde de Lisboa e Vale do Tejo, I. P. (503148776)",ATTENDSYS (510306802),"9.830,00 €",21-02-2018,20-02-2018,20 dias,"Portugal, Lisboa, Lisboa","Artigo 20.º, n.º 1, alínea d) do Código dos Contratos Públicos","","","","",,Não aplicável.,Não aplicável.,FALSE
AQUISIÇÃO DE SERVIÇOS DE SUPORTE APLICACIONAL E DE MANUTENÇÃO SIGCM,Ajuste Direto Regime Geral,Aquisição de serviços,"50324100-3, Serviços de manutenção de sistemas","Administração Regional de Saúde de Lisboa e Vale do Tejo, I. P. (503148776)","GLINTT - HEALTHCARE SOLUTIONS, S.A. (502479418)","9.999,99 €",21-02-2018,20-02-2018,360 dias,"Portugal, Lisboa, Lisboa","Artigo 20.º, n.º 1, alínea d) do Código dos Contratos Públicos","","","","",,Não aplicável.,Não aplicável.,FALSE
