Objeto do Contrato,Tipo de Procedimento,Tipo(s) de Contrato,CPVs,Entidade(s) Adjudicante(s),Entidade(s) Adjudicatária(s),Preço Contratual,Data de Publicação,Data de Celebração do Contrato,Prazo de Execução,Local de Execução,Fundamentação,Data de Fecho do Contrato,Preço Total Efetivo,Causas das Alterações ao Prazo,Causas das Alterações ao Preço,Estado,N.º registo do Acordo Quadro,Descrição do Acordo Quadro,Procedimento Centralizado
Aquisição de serviços para análise e tratamento de reclamações apresentadas pelos utentes,Ajuste Direto Regime Geral,Aquisição de serviços,"79570000-0, Serviços de compilação de listas de endereços e de envio por correio",Entidade Reguladora da Saúde (507021266),Liliana Cristina Pinto Mota (220114455),"4.800,00 €",13-07-2015,03-07-2015,180 dias,"Portugal, Porto, Porto","Artigo 20.º, n.º 1, alínea a) do Código dos Contratos Públicos",,,,,,Não aplicável.,Não aplicável.,FALSE
Aquisição de serviços para análise e tratamento de reclamações apresentadas pelos utentes,Ajuste Direto Regime Geral,Aquisição de serviços,"79570000-0, Serviços de compilação de listas de endereços e de envio por correio",Entidade Reguladora da Saúde (507021266),Pedro Nuno Marques Gomes (212053051),"4.800,00 €",13-07-2015,03-07-2015,180 dias,"Portugal, Porto, Porto","Artigo 20.º, n.º 1, alínea a) do Código dos Contratos Públicos",,,,,,Não aplicável.,Não aplicável.,FALSE
Aquisição de serviços para análise e tratamento de reclamações apresentadas pelos utentes,Ajuste Direto Regime Geral,Aquisição de serviços,"79570000-0, Serviços de compilação de listas de endereços e de envio por correio",Entidade Reguladora da Saúde (507021266),Teresa Raquel da Silva Costa (217356699),"4.800,00 €",13-07-2015,03-07-2015,180 dias,"Portugal, Porto, Porto","Artigo 20.º, n.º 1, alínea a) do Código dos Contratos Públicos",,,,,,Não aplicável.,Não aplicável.,FALSE
Aquisição de serviços para análise e tratamento de reclamações apresentadas pelos utentes,Ajuste Direto Regime Geral,Aquisição de serviços,"79570000-0, Serviços de compilação de listas de endereços e de envio por correio",Entidade Reguladora da Saúde (507021266),Valeriana Maria Branco Sernadas Ferreira (174572204),"4.800,00 €",13-07-2015,03-07-2015,180 dias,"Portugal, Porto, Porto","Artigo 20.º, n.º 1, alínea a) do Código dos Contratos Públicos",,,,,,Não aplicável.,Não aplicável.,FALSE
