Objeto do Contrato,Tipo de Procedimento,Tipo(s) de Contrato,CPVs,Entidade(s) Adjudicante(s),Entidade(s) Adjudicatária(s),Preço Contratual,Data de Publicação,Data de Celebração do Contrato,Prazo de Execução,Local de Execução,Fundamentação,Data de Fecho do Contrato,Preço Total Efetivo,Causas das Alterações ao Prazo,Causas das Alterações ao Preço,Estado,N.º registo do Acordo Quadro,Descrição do Acordo Quadro,Procedimento Centralizado
"Aquisição de Servidor para Upgrade e Unificação da LIS da ULSNA, EPE",Ajuste Direto Regime Geral,Aquisição de bens móveis,"30000000-9, Máquinas, equipamento e material de escritório e de informática, excepto mobiliário e pacotes de programas (software)","Unidade Local de Saúde do Norte Alentejano, E. P. E. (508094461)",Informantem (503670693),"6.299,00 €",08-04-2015,16-04-2014,15 dias,"Portugal, Portalegre, Portalegre","Artigo 20.º, n.º 1, alínea a) do Código dos Contratos Públicos","","",,"",,Não aplicável.,Não aplicável.,FALSE
"Aquisição de Dois Servidores Cluster Base Dados SQL para o Serviço de Sistemas de Tecnologias de Informação da ULSNA, EPE.",Ajuste Direto Regime Geral,Aquisição de bens móveis,"30000000-9, Máquinas, equipamento e material de escritório e de informática, excepto mobiliário e pacotes de programas (software)","Unidade Local de Saúde do Norte Alentejano, E. P. E. (508094461)",Informantem (503670693),"7.186,46 €",08-04-2015,10-10-2014,15 dias,"Portugal, Portalegre, Portalegre","Artigo 20.º, n.º 1, alínea a) do Código dos Contratos Públicos","","",,"",,Não aplicável.,Não aplicável.,FALSE
"Aquisição de um Detetor de Mamógrafo para o Serviço de Radiologia do Hospital Santa Luzia de Elvas - ULSNA, EPE",Ajuste Direto Regime Geral,Aquisição de bens móveis,"33000000-0, Equipamento médico, medicamentos e produtos para cuidados pessoais","Unidade Local de Saúde do Norte Alentejano, E. P. E. (508094461)",General Electric Portuguesa (500357129),"47.500,00 €",08-04-2015,18-02-2015,15 dias,"Portugal, Portalegre, Elvas","Artigo 24.º, n.º 1, alínea e) do Código dos Contratos Públicos","","",,"",,Não aplicável.,Não aplicável.,FALSE
"Aquisição de Seis Apoios de Braços para Mesas Operatórias do Bloco Operatório do HDJMG - ULSNA, EPE",Ajuste Direto Regime Geral,Aquisição de bens móveis,"33000000-0, Equipamento médico, medicamentos e produtos para cuidados pessoais","Unidade Local de Saúde do Norte Alentejano, E. P. E. (508094461)",Medicinália Cormédica (500684324),"7.094,00 €",08-04-2015,21-01-2015,15 dias,"Portugal, Portalegre, Portalegre","Artigo 24.º, n.º 1, alínea e) do Código dos Contratos Públicos","","",,"",,Não aplicável.,Não aplicável.,FALSE
Aquisição de Medicamentos Exclusivos,Ajuste Direto Regime Geral,Aquisição de bens móveis,"33000000-0, Equipamento médico, medicamentos e produtos para cuidados pessoais","Unidade Local de Saúde do Norte Alentejano, E. P. E. (508094461)",A. Martins & Fernandes S.A. (501172114),"61.214,30 €",07-04-2015,09-02-2015,365 dias,"Portugal, Portalegre, Portalegre<BR/>Portugal, Portalegre, Elvas","Artigo 24.º, n.º 1, alínea e) do Código dos Contratos Públicos",31-12-2015,"44.685,40 €",,Não foram adquiridas as quantidades totais estimadas,,Não aplicável.,Não aplicável.,FALSE
"Fornecimento de Electricidade (Média e Baixa Tensão Especial para a ULSNA, EPE)",Ao abrigo de acordo-quadro (art.º 259.º),Aquisição de bens móveis,"09000000-3, Produtos petrolíferos, combustíveis, electricidade e outras fontes de energia","Unidade Local de Saúde do Norte Alentejano, E. P. E. (508094461)","Galp Power, SA (504723456)","747.584,79 €",02-04-2015,22-01-2015,337 dias,"Portugal, Portalegre",Artigo 259.º do Código dos Contratos Públicos,02-04-2015,"747.584,79 €",,"",,314294,Acordo quadro para o fornecimento de electricidade em regime de mercado livre para Portugal Continental,FALSE
"Prestação de Serviços Médicos na Especialidade de Obstetrícia e Ginecologia na ULSNA, EPE",Ao abrigo de acordo-quadro (art.º 259.º),Aquisição de serviços,"85000000-9, Serviços de saúde e acção social","Unidade Local de Saúde do Norte Alentejano, E. P. E. (508094461)","GS24 - Healthcare Solutions, SA (507824652)","358.407,06 €",02-04-2015,09-01-2015,365 dias,"Portugal, Portalegre, Portalegre",Artigo 259.º do Código dos Contratos Públicos,02-04-2015,"358.407,06 €",,"",,454020,"CONCURSO PÚBLICO PARA A CELEBRAÇÃO DE CONTRATOS PÚBLICOS DE APROVISIONAMENTO PARA A ÁREA DA SAÚDE, COM VISTA À PRESTAÇÃO DE SERVIÇOS MÉDICOS ÀS INSTITUIÇÕES E SERVIÇOS DO SERVIÇO NACIONAL DE SAÚDE",FALSE
Aquisição de medicamentos usados no tratamento de afeções oculares e otorinolaringológicas,Ao abrigo de acordo-quadro (art.º 259.º),Aquisição de bens móveis,"33000000-0, Equipamento médico, medicamentos e produtos para cuidados pessoais","Unidade Local de Saúde do Norte Alentejano, E. P. E. (508094461)",Davi II (508309450),"829,40 €",01-04-2015,11-03-2015,270 dias,"Portugal, Portalegre, Elvas<BR/>Portugal, Portalegre, Portalegre",Artigo 259.º do Código dos Contratos Públicos,31-12-2015,"715,00 €",,Não foram adquiridas as quantidades totais estimadas.,,1377420,Acordo quadro para fornecimento de medicamentos usados nas afecções oculares e otorrinolaringologias às instituições e serviços do serviço nacional de saúde,FALSE
Aquisição de medicamentos usados no tratamento de afeções oculares e otorinolaringológicas,Ao abrigo de acordo-quadro (art.º 259.º),Aquisição de bens móveis,"33000000-0, Equipamento médico, medicamentos e produtos para cuidados pessoais","Unidade Local de Saúde do Norte Alentejano, E. P. E. (508094461)","Tecnifar, Industria Técnica Farmacêutica, SA (500280436)","77,20 €",01-04-2015,11-03-2015,270 dias,"Portugal, Portalegre, Portalegre<BR/>Portugal, Portalegre, Elvas",Artigo 259.º do Código dos Contratos Públicos,31-12-2015,"50,18 €",,Não foram adquiridas as quantidades totais estimadas.,,1377420,Acordo quadro para fornecimento de medicamentos usados nas afecções oculares e otorrinolaringologias às instituições e serviços do serviço nacional de saúde,FALSE
Aquisição de medicamentos usados no tratamento de afeções oculares e otorinolaringológicas,Ao abrigo de acordo-quadro (art.º 259.º),Aquisição de bens móveis,"33000000-0, Equipamento médico, medicamentos e produtos para cuidados pessoais","Unidade Local de Saúde do Norte Alentejano, E. P. E. (508094461)",Laboratório Edol (507072642),"534,50 €",01-04-2015,11-03-2015,270 dias,"Portugal, Portalegre, Portalegre<BR/>Portugal, Portalegre, Elvas",Artigo 259.º do Código dos Contratos Públicos,31-12-2015,"270,82 €",,Não foram adquiridas as quantidades totais estimadas.,,1377420,Acordo quadro para fornecimento de medicamentos usados nas afecções oculares e otorrinolaringologias às instituições e serviços do serviço nacional de saúde,FALSE
Fornecimento de medicamentos usados no tratamento de afeções oculares e otorinolaringologicas,Ao abrigo de acordo-quadro (art.º 259.º),Aquisição de bens móveis,"33000000-0, Equipamento médico, medicamentos e produtos para cuidados pessoais","Unidade Local de Saúde do Norte Alentejano, E. P. E. (508094461)",Profarin (500223238),"205,50 €",01-04-2015,01-04-2015,270 dias,"Portugal, Portalegre, Elvas<BR/>Portugal, Portalegre, Portalegre","Artigo 20.º, n.º 2, alínea b), subalínea i) do Código dos Contratos Públicos",31-12-2015,"",,Não foram adquiridas as quantidades totais estimadas.,,1377420,Acordo quadro para fornecimento de medicamentos usados nas afecções oculares e otorrinolaringologias às instituições e serviços do serviço nacional de saúde,FALSE
"Aquisição de Upgrade ao Sistema Storage da ULSNA, EPE.",Concurso público,Aquisição de bens móveis,"48000000-8, Pacotes de software e sistemas de informação","Unidade Local de Saúde do Norte Alentejano, E. P. E. (508094461)",Informantem (503670693),"120.404,85 €",01-04-2015,18-07-2014,60 dias,"Portugal, Portalegre, Portalegre","Artigo 20.º, n.º 1, alínea b) do Código dos Contratos Públicos","","",,"",,Não aplicável.,Não aplicável.,FALSE
"Aquisição de Material Diverso de Gastro, para a ULSNA, EPE, para 2015",Ajuste Direto Regime Geral,Aquisição de bens móveis,"33140000-3, Material médico de consumo","Unidade Local de Saúde do Norte Alentejano, E. P. E. (508094461)","Olympus Iberia, S.A.U. (980474710)","6.156,00 €",31-03-2015,07-01-2015,365 dias,"Portugal, Portalegre, Portalegre","Artigo 20.º, n.º 1, alínea a) do Código dos Contratos Públicos",31-03-2015,"6.156,00 €",,"",,Não aplicável.,Não aplicável.,FALSE
"Fornecimento de Lentes Intra Oculares e Outros para Cirurgia de Cataratas, para a ULSNA, EPE, para 2015",Ajuste Direto Regime Geral,Aquisição de bens móveis,"33140000-3, Material médico de consumo","Unidade Local de Saúde do Norte Alentejano, E. P. E. (508094461)",Abbott Medical Optics Spain S.L. (980262364),"198.124,00 €",31-03-2015,09-03-2015,365 dias,"Portugal, Portalegre, Portalegre","Artigo 24.º, n.º 1, alínea c) do Código dos Contratos Públicos",31-03-2015,"198.124,00 €",,"",,Não aplicável.,Não aplicável.,FALSE
"Prestação de Serviços Médicos, na Especialidade de Ginecologia/Obstetrícia, na ULSNA, EPE (Janeiro a Julho de 2015)",Ajuste Direto Regime Geral,Aquisição de serviços,"85100000-0, Serviços de saúde","Unidade Local de Saúde do Norte Alentejano, E. P. E. (508094461)","Policlinica Rainha Santa Isabel, Lda (503076031)","17.267,18 €",31-03-2015,25-03-2015,212 dias,"Portugal, Portalegre, Portalegre","Artigo 24.º, n.º 1, alínea c) do Código dos Contratos Públicos",25-03-2015,"17.267,18 €",,"",,Não aplicável.,Não aplicável.,FALSE
"Prestação de Serviços Médicos, na Especialidade de Ginecologia/Obstetrícia, na ULSNA, EPE (Janeiro a Julho de 2015)",Ajuste Direto Regime Geral,Aquisição de serviços,"85100000-0, Serviços de saúde","Unidade Local de Saúde do Norte Alentejano, E. P. E. (508094461)","Dr. Cienfuegos Campini, SLU (B06599369)","24.717,14 €",31-03-2015,25-03-2015,212 dias,"Portugal, Portalegre, Portalegre","Artigo 24.º, n.º 1, alínea c) do Código dos Contratos Públicos",25-03-2015,"24.717,14 €",,"",,Não aplicável.,Não aplicável.,FALSE
"Prestação de Serviços Médicos, na Especialidade de Ginecologia/Obstetrícia, na ULSNA, EPE (Janeiro a Julho de 2015)",Ajuste Direto Regime Geral,Aquisição de serviços,"85100000-0, Serviços de saúde","Unidade Local de Saúde do Norte Alentejano, E. P. E. (508094461)","Enrique Matallana, Lda (507839587)","26.082,00 €",31-03-2015,11-03-2015,212 dias,"Portugal, Portalegre, Elvas","Artigo 24.º, n.º 1, alínea c) do Código dos Contratos Públicos",11-03-2015,"26.082,00 €",,"",,Não aplicável.,Não aplicável.,FALSE
