Objeto do Contrato,Tipo de Procedimento,Tipo(s) de Contrato,CPVs,Entidade(s) Adjudicante(s),Entidade(s) Adjudicatária(s),Preço Contratual,Data de Publicação,Data de Celebração do Contrato,Prazo de Execução,Local de Execução,Fundamentação,Data de Fecho do Contrato,Preço Total Efetivo,Causas das Alterações ao Prazo,Causas das Alterações ao Preço,Estado,N.º registo do Acordo Quadro,Descrição do Acordo Quadro,Procedimento Centralizado
Reparação de videoduodenoscópio.,Ajuste Direto Regime Geral,Aquisição de serviços,"50421000-2, Serviços de reparação e manutenção de equipamento médico",Serviço de Utilização Comum dos Hospitais (500900469),"OLYMPUS IBERIA, S.A.U. (980474710)","9.581,79 €",19-10-2017,18-10-2017,5 dias,"Portugal, Lisboa, Lisboa","Artigo 24.º, n.º 1, alínea e) do Código dos Contratos Públicos",,,,,,Não aplicável.,Não aplicável.,FALSE
Kit de motores do colimador para eq. de radiologia.,Ajuste Direto Regime Geral,Aquisição de bens móveis,"33111000-1, Aparelhos para radiologia",Serviço de Utilização Comum dos Hospitais (500900469),PHILIPS PORTUGESA S.A. (500216843),"8.935,00 €",19-10-2017,19-10-2017,5 dias,"Portugal, Lisboa, Lisboa","Artigo 20.º, n.º 1, alínea a) do Código dos Contratos Públicos",,,,,,Não aplicável.,Não aplicável.,FALSE
"Empreitada de Instalação de Sistema de Bombagem para o Furo Artesiano do SECH, no segundo Parque da Saúde de Lisboa – Hospital Pulido Valente",Ajuste Direto Regime Geral,Empreitadas de obras públicas,"45000000-7, Construção",Serviço de Utilização Comum dos Hospitais (500900469),"Sondagens Batalha,Lda (506606228)","19.306,50 €",19-10-2017,13-10-2017,30 dias,"Portugal, Lisboa","Artigo 19.º, alínea a) do Código dos Contratos Públicos",,,,,,Não aplicável.,Não aplicável.,FALSE
"FORNECIMENTO, INSTALAÇÃO E MANUTENÇÃO DE CENTRAL DE ABASTECIMENTO AUTOMÁTICO DE DETERGENTES",Ajuste Direto Regime Geral,Aquisição de bens móveis,"33191000-5, Aparelhos para esterilização, desinfecção e higiene",SUCH | Serviço de Utilização Comum dos Hospitais (500900469),"GETINGE GROUP PORTUGAL, UNIP LDA (MAQUET PORT) (506819698)","72.998,74 €",19-10-2017,19-10-2017,73 dias,"Portugal, Lisboa","Artigo 20.º, n.º 1, alínea a) do Código dos Contratos Públicos",,,,,,Não aplicável.,Não aplicável.,FALSE
Aquisição de Sacos Plásticos para a Unidade de Gestão de Resíduos Hospitalares,Ajuste Direto Regime Geral,Aquisição de bens móveis,"19520000-7, Produtos de plástico",Serviço de Utilização Comum dos Hospitais (500900469),"SOMOS AMBIENTE, A.C.E. (508653479)","74.263,50 €",19-10-2017,19-10-2017,73 dias,Portugal,"Artigo 20.º, n.º 1, alínea a) do Código dos Contratos Públicos",,,,,,Não aplicável.,Não aplicável.,FALSE
APOIO OPERACIONAL NO ÂMBITO DA PRESTAÇÃO DE HIGIENE E LIMPEZA,Ajuste Direto Regime Geral,Aquisição de serviços,"90910000-9, Serviços de limpeza",Serviço de Utilização Comum dos Hospitais (500900469),"Reilimpa - Limpeza e Serviços, S. A. (503088323)","1.032.000,00 €",12-10-2017,28-09-2017,120 dias,"Portugal, Coimbra","Artigo 24.º, n.º 1, alínea c) do Código dos Contratos Públicos",,,,,,Não aplicável.,Não aplicável.,FALSE
