Objeto do Contrato,Tipo de Procedimento,Tipo(s) de Contrato,CPVs,Entidade(s) Adjudicante(s),Entidade(s) Adjudicatária(s),Preço Contratual,Data de Publicação,Data de Celebração do Contrato,Prazo de Execução,Local de Execução,Fundamentação,Data de Fecho do Contrato,Preço Total Efetivo,Causas das Alterações ao Prazo,Causas das Alterações ao Preço,Estado,N.º registo do Acordo Quadro,Descrição do Acordo Quadro,Procedimento Centralizado
Concurso Público Proc. N.º 121/2018,Concurso público,Aquisição de serviços,"79340000-9, Serviços de publicidade e marketing",Direcção-Geral da Saúde (DGS) (600037100),"FNYHOW, Lda. (509372210)","143.730,00 €",13-07-2018,04-06-2018,21 dias,"Portugal, Lisboa, Lisboa","Artigo 20.º, n.º 1, alínea b) do Código dos Contratos Públicos",,,,,,Não aplicável.,Não aplicável.,FALSE
Aquisição de serviços de carregamento e arrumação de diversos móveis e equipamentos dentro da DGS,Consulta Prévia,Aquisição de serviços,"79000000-4, Serviços a empresas: direito, comercialização, consultoria, recrutamento, impressão e segurança",Direção-Geral da Saúde (600037100),"Benamudis, Lda. (506010899)","9.990,00 €",11-07-2018,07-06-2018,209 dias,"Portugal, Lisboa, Lisboa","Artigo 20.º, n.º 1, alínea c) do Código dos Contratos Públicos",,,,,,Não aplicável.,Não aplicável.,FALSE
Aquisição de serviços para apoio à implementação do novo Regulamento Geral de Proteção de Dados (‘RGPD’),Consulta Prévia,Aquisição de serviços,"79000000-4, Serviços a empresas: direito, comercialização, consultoria, recrutamento, impressão e segurança",Direção-Geral da Saúde (600037100),"Significado, Consultoria, Formação e Informática, Lda (504939378)","29.983,00 €",11-07-2018,08-06-2018,86 dias,"Portugal, Lisboa, Lisboa","Artigo 20.º, n.º 1, alínea c) do Código dos Contratos Públicos",,,,,,Não aplicável.,Não aplicável.,FALSE
Aquisição de uma Central Telefónica e Telefones Digitais,Ajuste Direto Regime Geral,Aquisição de bens móveis,"32550000-3, Equipamento telefónico",Direção-Geral da Saúde (600037100),"LUSOFÓNICA, Equipamento Elétrico E Eletrónico Lda. (501793054)","19.970,00 €",11-07-2018,22-06-2018,15 dias,"Portugal, Lisboa, Lisboa","Artigo 20.º, n.º 1, alínea d) do Código dos Contratos Públicos",,,,,,Não aplicável.,Não aplicável.,FALSE
