Objeto do Contrato,Tipo de Procedimento,Tipo(s) de Contrato,CPVs,Entidade(s) Adjudicante(s),Entidade(s) Adjudicatária(s),Preço Contratual,Data de Publicação,Data de Celebração do Contrato,Prazo de Execução,Local de Execução,Fundamentação,Data de Fecho do Contrato,Preço Total Efetivo,Causas das Alterações ao Prazo,Causas das Alterações ao Preço,Estado,N.º registo do Acordo Quadro,Descrição do Acordo Quadro,Procedimento Centralizado
Tratamentos de Fisioterapia,Ajuste Direto Regime Geral,Aquisição de serviços,"85000000-9, Serviços de saúde e acção social",Centro Hospitalar de Setúbal E.P.E. (507606787),Santa Casa da Misericordia de Setubal (500731187),"24.000,00 €",08-07-2013,19-06-2013,196 dias,"Portugal, Setúbal, Setúbal","Artigo 20.º, n.º 1, alínea a) do Código dos Contratos Públicos",31-12-2013,"24.000,00 €",,"",,Não aplicável.,Não aplicável.,
Execução de Ressonância Magnética no Exterior,Ajuste Direto Regime Geral,Aquisição de serviços,"85000000-9, Serviços de saúde e acção social",Centro Hospitalar de Setúbal E.P.E. (507606787),ressonancia magnetica - caselas (501834249),"18.455,00 €",02-07-2013,22-04-2013,114 dias,"Portugal, Lisboa, Lisboa","Artigo 20.º, n.º 1, alínea a) do Código dos Contratos Públicos",31-12-2013,"18.455,00 €",,"",,Não aplicável.,Não aplicável.,
Tratamento por pressao negativa,Ajuste Direto Regime Geral,Aquisição de bens móveis,"33000000-0, Equipamento médico, medicamentos e produtos para cuidados pessoais",Centro Hospitalar de Setúbal E.P.E. (507606787),"expomedica - soc. export. import. material medico, lda (501886621)","30.000,00 €",02-07-2013,08-04-2013,260 dias,"Portugal, Setúbal, Setúbal","Artigo 20.º, n.º 1, alínea a) do Código dos Contratos Públicos",31-12-2013,"30.000,00 €",,"",,Não aplicável.,Não aplicável.,
Exames de Ressonancia magnetica,Ajuste Direto Regime Geral,Aquisição de serviços,"85000000-9, Serviços de saúde e acção social",Centro Hospitalar de Setúbal E.P.E. (507606787),hospor - Hospitais portugueses sa (501245570),"23.520,00 €",02-07-2013,09-05-2013,237 dias,"Portugal, Setúbal, Setúbal","Artigo 20.º, n.º 1, alínea a) do Código dos Contratos Públicos","","",,"",,Não aplicável.,Não aplicável.,
Exames por Telerradiologia,Ajuste Direto Regime Geral,Aquisição de serviços,"85000000-9, Serviços de saúde e acção social",Centro Hospitalar de Setúbal E.P.E. (507606787),"gs24 healthcare solutions, lda (507824652)","47.000,00 €",02-07-2013,28-02-2013,306 dias,"Portugal, Setúbal, Setúbal","Artigo 20.º, n.º 1, alínea a) do Código dos Contratos Públicos",30-08-2013,"43.995,72 €",,menos serv.prestados,,Não aplicável.,Não aplicável.,
Tratamentos de Fisioterapia,Ajuste Direto Regime Geral,Aquisição de serviços,"85000000-9, Serviços de saúde e acção social",Centro Hospitalar de Setúbal E.P.E. (507606787),"Centro Fisioterapia Nª Sª Conceição, Lda (501960490)","16.450,00 €",02-07-2013,07-05-2013,238 dias,"Portugal, Setúbal, Setúbal","Artigo 20.º, n.º 1, alínea a) do Código dos Contratos Públicos",31-12-2013,"16.450,00 €",,"",,Não aplicável.,Não aplicável.,
