Objeto do Contrato,Tipo de Procedimento,Tipo(s) de Contrato,CPVs,Entidade(s) Adjudicante(s),Entidade(s) Adjudicatária(s),Preço Contratual,Data de Publicação,Data de Celebração do Contrato,Prazo de Execução,Local de Execução,Fundamentação,Data de Fecho do Contrato,Preço Total Efetivo,Causas das Alterações ao Prazo,Causas das Alterações ao Preço,Estado,N.º registo do Acordo Quadro,Descrição do Acordo Quadro,Procedimento Centralizado
Prestação de serviços de imunocitoquimica e hibridação in situ por sish automatizadas,Ajuste Direto Regime Geral,Locação de bens móveis<br/>Aquisição de bens móveis,"33694000-1, Meios de diagnóstico","Instituto Português de Oncologia de Lisboa Francisco Gentil, E. P. E. (506361616)","ROCHE SISTEMAS DE DIAGNOSTICOS, LDA  (504282921)","124.290,00 €",14-08-2013,18-07-2013,7 dias,"Portugal, Lisboa, Lisboa","Artigo 24.º, n.º 1, alínea e) do Código dos Contratos Públicos",04-12-2013,"124.290,00 €",,,,Não aplicável.,Não aplicável.,
Hemoculturas,Ajuste Direto Regime Geral,Aquisição de bens móveis,"33696500-0, Reagentes de laboratório","Instituto Português de Oncologia de Lisboa FG, E.P.E. (506361616)",QUILABAN-QUÍMICA LABORATORIAL ANALITICA LDA (500399670),"17.550,00 €",12-08-2013,17-07-2013,7 dias,"Portugal, Lisboa, Lisboa","Artigo 20.º, n.º 1, alínea a) do Código dos Contratos Públicos",11-12-2013,"17.550,00 €",,,,Não aplicável.,Não aplicável.,
