Objeto do Contrato,Tipo de Procedimento,Tipo(s) de Contrato,CPVs,Entidade(s) Adjudicante(s),Entidade(s) Adjudicatária(s),Preço Contratual,Data de Publicação,Data de Celebração do Contrato,Prazo de Execução,Local de Execução,Fundamentação,Data de Fecho do Contrato,Preço Total Efetivo,Causas das Alterações ao Prazo,Causas das Alterações ao Preço,Estado,N.º registo do Acordo Quadro,Descrição do Acordo Quadro,Procedimento Centralizado
"Aquisição de MAt. Cons. Clínico - Solução Conservação de Plaquetas Submetidas à Inativação, até conclusão do Concurso Público nº 1200317.",Ajuste Direto Regime Geral,Aquisição de bens móveis,"33141500-5, Produtos hematológicos","Instituto Português do Sangue e da Transplantação, I. P. (502423943)","Fresenius Kabi Pharma Portugal, Ldª (504293753)","13.348,80 €",11-02-2017,01-02-2017,20 dias,"Portugal, Lisboa, Lisboa<BR/>Portugal, Coimbra, Coimbra","Artigo 26.º, n.º 1, alínea a) do Código dos Contratos Públicos",,,,,,Não aplicável.,Não aplicável.,FALSE
Aquisição de Tubos de Colheita para o CEDACE,Ajuste Direto Regime Geral,Aquisição de bens móveis,"33140000-3, Material médico de consumo","Instituto Português do Sangue e da Transplantação, I. P. (502423943)",Vacuette Portugal (505348470),"1.250,00 €",11-02-2017,26-01-2017,30 dias,"Portugal, Lisboa, Lisboa","Artigo 24.º, n.º 1, alínea c) do Código dos Contratos Públicos",,,,,,Não aplicável.,Não aplicável.,FALSE
Aquisição de Compressas de Gaze,Ajuste Direto Regime Geral,Aquisição de bens móveis,"33141119-7, Compressas","Instituto Português do Sangue e da Transplantação, I. P. (502423943)",Albino Dias e Andrade (500013810),"8.381,00 €",04-02-2017,20-01-2017,315 dias,"Portugal, Coimbra, Coimbra<BR/>Portugal, Lisboa, Lisboa<BR/>Portugal, Porto, Porto","Artigo 20.º, n.º 1, alínea a) do Código dos Contratos Públicos",,,,,,Não aplicável.,Não aplicável.,FALSE
