Objeto do Contrato,Tipo de Procedimento,Tipo(s) de Contrato,CPVs,Entidade(s) Adjudicante(s),Entidade(s) Adjudicatária(s),Preço Contratual,Data de Publicação,Data de Celebração do Contrato,Prazo de Execução,Local de Execução,Fundamentação,Data de Fecho do Contrato,Preço Total Efetivo,Causas das Alterações ao Prazo,Causas das Alterações ao Preço,Estado,N.º registo do Acordo Quadro,Descrição do Acordo Quadro,Procedimento Centralizado
Aquisição de endoprótese aórtica,Ajuste Direto Regime Geral,Aquisição de bens móveis,"33184300-6, Próteses cardíacas","Centro Hospitalar Lisboa Norte, EPE (508481287)","Lusopalex, Lda. (503531588)","15.000,00 €",21-06-2013,21-06-2013,3 dias,"Portugal, Lisboa, Lisboa","Artigo 20.º, n.º 1, alínea a) do Código dos Contratos Públicos",,,,,,Não aplicável.,Não aplicável.,
Aquisição de consumíveis de cardiologia,Ajuste Direto Regime Geral,Aquisição de bens móveis,"33141200-2, Cateteres","Centro Hospitalar Lisboa Norte, EPE (508481287)","Boston Scientific Portugal, Lda. (504988964)","8.220,00 €",21-06-2013,21-06-2013,1 dias,"Portugal, Lisboa, Lisboa","Artigo 20.º, n.º 1, alínea a) do Código dos Contratos Públicos",,,,,,Não aplicável.,Não aplicável.,
Aquisição de consumíveis de cardiologia,Ajuste Direto Regime Geral,Aquisição de bens móveis,"33182000-9, Material de assistência à função cardíaca","Centro Hospitalar Lisboa Norte, EPE (508481287)","Boston-Scientific Portugal, Lda. (504988964)","11.805,40 €",21-06-2013,21-06-2013,1 dias,"Portugal, Lisboa, Lisboa","Artigo 20.º, n.º 1, alínea a) do Código dos Contratos Públicos",,,,,,Não aplicável.,Não aplicável.,
Aquisição de CDIs,Ajuste Direto Regime Geral,Aquisição de bens móveis,"33182100-0, Desfibrilhador","Centro Hospitalar Lisboa Norte, EPE (508481287)","ST Jude Medical, Lda. (504180746)","29.757,00 €",21-06-2013,21-06-2013,1 dias,"Portugal, Lisboa, Lisboa","Artigo 20.º, n.º 1, alínea a) do Código dos Contratos Públicos",,,,,,Não aplicável.,Não aplicável.,
"  Aquisição de Fibrinogenio humano 5,5mg+trombina humana",Ajuste Direto Regime Geral,Aquisição de bens móveis,"33141127-6, Hemostáticos reabsorvíveis","Centro Hospitalar Lisboa Norte, EPE (508481287)",Takeda-Farmaceuticos Portugal Lda (502801204),"8.400,00 €",20-06-2013,20-06-2013,1 dias,"Portugal, Lisboa, Lisboa","Artigo 24.º, n.º 1, alínea e) do Código dos Contratos Públicos",,,,,,Não aplicável.,Não aplicável.,
Aquisição de Alprostadil Alfadex sol.inj.Ext. 20 mcg,Ajuste Direto Regime Geral,Aquisição de bens móveis,"33622000-6, Medicamentos para o aparelho cardiovascular","Centro Hospitalar Lisboa Norte, EPE (508481287)",UCB Pharma (500291322),"144.473,70 €",20-06-2013,20-06-2013,5 dias,"Portugal, Lisboa, Lisboa","Artigo 24.º, n.º 1, alínea e) do Código dos Contratos Públicos",,,,,,Não aplicável.,Não aplicável.,
Aquisição de cateters guia,Ajuste Direto Regime Geral,Aquisição de bens móveis,"33141200-2, Cateteres","Centro Hospitalar Lisboa Norte, EPE (508481287)",Johnson & Johnson (500153370),"6.888,00 €",20-06-2013,20-06-2013,1 dias,"Portugal, Lisboa, Lisboa","Artigo 20.º, n.º 1, alínea a) do Código dos Contratos Públicos",,,,,,Não aplicável.,Não aplicável.,
Aquisição de sistema de aspiração,Ajuste Direto Regime Geral,Aquisição de bens móveis,"33141200-2, Cateteres","Centro Hospitalar Lisboa Norte, EPE (508481287)","Medtronic Portugal, lda (504223933)","12.470,00 €",20-06-2013,20-06-2013,1 dias,"Portugal, Lisboa, Lisboa","Artigo 20.º, n.º 1, alínea a) do Código dos Contratos Públicos",,,,,,Não aplicável.,Não aplicável.,
Aquisição de CDI VR,Ajuste Direto Regime Geral,Aquisição de bens móveis,"33182100-0, Desfibrilhador","Centro Hospitalar Lisboa Norte, EPE (508481287)",St Jude Medical Lda (504180746),"10.320,00 €",19-06-2013,19-06-2013,1 dias,"Portugal, Lisboa, Lisboa","Artigo 20.º, n.º 1, alínea a) do Código dos Contratos Públicos",,,,,,Não aplicável.,Não aplicável.,
Aquisição de HIV 1 Genotipo/resistencia teste det 30T,Ajuste Direto Regime Geral,Aquisição de bens móveis,"33141620-2, Kits médicos","Centro Hospitalar Lisboa Norte, EPE (508481287)","Siemens Healthcare, Lda (507925173)","14.358,00 €",19-06-2013,11-06-2013,4 dias,"Portugal, Lisboa, Lisboa","Artigo 24.º, n.º 1, alínea e) do Código dos Contratos Públicos",,,,,,Não aplicável.,Não aplicável.,
ReReparação de uma camara de endoscopia,Ajuste Direto Regime Geral,Aquisição de serviços,"50421000-2, Serviços de reparação e manutenção de equipamento médico","Centro Hospitalar Lisboa Norte, EPE (508481287)","Teprel Eq. médicos, lda (502262184)","5.300,93 €",19-06-2013,19-06-2013,5 dias,"Portugal, Lisboa, Lisboa","Artigo 20.º, n.º 1, alínea a) do Código dos Contratos Públicos",,,,,,Não aplicável.,Não aplicável.,
Aquisição de CDI BIV,Ajuste Direto Regime Geral,Aquisição de bens móveis,"33182100-0, Desfibrilhador","Centro Hospitalar Lisboa Norte, EPE (508481287)","Medtronic, lda (504223933)","15.657,00 €",19-06-2013,19-06-2013,2 dias,"Portugal, Lisboa, Lisboa","Artigo 20.º, n.º 1, alínea a) do Código dos Contratos Públicos",,,,,,Não aplicável.,Não aplicável.,
Aquisição de Sevelamer comp 800 mg,Ajuste Direto Regime Geral,Aquisição de bens móveis,"33690000-3, Medicamentos vários","Centro Hospitalar Lisboa Norte, EPE (508481287)","Sanofi, Lda (500134960)","11.564,10 €",19-06-2013,30-05-2013,1 dias,"Portugal, Lisboa, Lisboa","Artigo 24.º, n.º 1, alínea e) do Código dos Contratos Públicos",,,,,,Não aplicável.,Não aplicável.,
Aquisição de Imunoglobulina sol inj 100 mg/ml fr 200,Ajuste Direto Regime Geral,Aquisição de bens móveis,"33651520-9, Imunoglobulinas","Centro Hospitalar Lisboa Norte, EPE (508481287)",CSL Behring Lda (503047201),"140.000,00 €",18-06-2013,12-06-2013,1 dias,"Portugal, Lisboa, Lisboa","Artigo 24.º, n.º 1, alínea e) do Código dos Contratos Públicos",,,,,,Não aplicável.,Não aplicável.,
Aquisição de sistema ID ABO/D Cards 4x12,Ajuste Direto Regime Geral,Aquisição de bens móveis,"33696000-5, Reagentes e meios de contraste","Centro Hospitalar Lisboa Norte, EPE (508481287)","Diamed Portuguesa, SA (501675809)","5.516,80 €",18-06-2013,11-06-2013,1 dias,"Portugal, Lisboa, Lisboa","Artigo 24.º, n.º 1, alínea e) do Código dos Contratos Públicos",,,,,,Não aplicável.,Não aplicável.,
Aquisição de factor VIII 500ui+ factor von Willebrand 500 ui inj,Ajuste Direto Regime Geral,Aquisição de bens móveis,"33621200-1, Anti-hemorrágicos","Centro Hospitalar Lisboa Norte, EPE (508481287)","Octapharma, Lda (502820780)","12.000,00 €",18-06-2013,06-06-2013,2 dias,"Portugal, Lisboa, Lisboa","Artigo 24.º, n.º 1, alínea e) do Código dos Contratos Públicos",,,,,,Não aplicável.,Não aplicável.,
Aquisição de Reg. Mat. Ortopedia,Ajuste Direto Regime Geral,Aquisição de bens móveis,"33141700-7, Material ortopédico","Centro Hospitalar Lisboa Norte, EPE (508481287)","Johnson & Johnson, Lda (500153370)","10.175,00 €",18-06-2013,18-06-2013,1 dias,"Portugal, Lisboa, Lisboa","Artigo 20.º, n.º 1, alínea a) do Código dos Contratos Públicos",,,,,,Não aplicável.,Não aplicável.,
Aquisição de Dispositivo,Ajuste Direto Regime Geral,Aquisição de bens móveis,"33184300-6, Próteses cardíacas","Centro Hospitalar Lisboa Norte, EPE (508481287)","Abbott Laboratórios, Lda (500006148)","20.000,00 €",18-06-2013,18-06-2013,1 dias,"Portugal, Lisboa, Lisboa","Artigo 20.º, n.º 1, alínea a) do Código dos Contratos Públicos",,,,,,Não aplicável.,Não aplicável.,
Aquisição de Cateter de Diagnostico,Ajuste Direto Regime Geral,Aquisição de bens móveis,"33141200-2, Cateteres","Centro Hospitalar Lisboa Norte, EPE (508481287)","CR Bard Portugal, Lda (502438274)","10.490,00 €",18-06-2013,18-06-2013,2 dias,"Portugal, Lisboa, Lisboa","Artigo 20.º, n.º 1, alínea a) do Código dos Contratos Públicos",,,,,,Não aplicável.,Não aplicável.,
Aquisição de Fenotipos RH+Kell 4X12 CARDS,Ajuste Direto Regime Geral,Aquisição de bens móveis,"33696000-5, Reagentes e meios de contraste","Centro Hospitalar Lisboa Norte, EPE (508481287)","Diamed, SA (501675809)","5.878,40 €",17-06-2013,11-06-2013,1 dias,"Portugal, Lisboa, Lisboa","Artigo 24.º, n.º 1, alínea e) do Código dos Contratos Públicos",,,,,,Não aplicável.,Não aplicável.,
Aquisição de ABD Teste Confirmatório P/dadores 4X12,Ajuste Direto Regime Geral,Aquisição de bens móveis,"33141620-2, Kits médicos","Centro Hospitalar Lisboa Norte, EPE (508481287)","Diamed Portuguesa, SA (501675809)","5.350,40 €",17-06-2013,06-06-2013,1 dias,"Portugal, Lisboa, Lisboa","Artigo 24.º, n.º 1, alínea e) do Código dos Contratos Públicos",,,,,,Não aplicável.,Não aplicável.,
Aquisição de HBV Genotipo teste DET 28 T,Ajuste Direto Regime Geral,Aquisição de bens móveis,"33141620-2, Kits médicos","Centro Hospitalar Lisboa Norte, EPE (508481287)",Siemens Lda (507925173),"5.600,00 €",17-06-2013,11-06-2013,3 dias,"Portugal, Lisboa, Lisboa","Artigo 24.º, n.º 1, alínea e) do Código dos Contratos Públicos",,,,,,Não aplicável.,Não aplicável.,
Aquisição de Toxina Butolinica 100 UI,Ajuste Direto Regime Geral,Aquisição de bens móveis,"33692500-2, Soluções injectáveis","Centro Hospitalar Lisboa Norte, EPE (508481287)","Profarin , Lda (500223238)","27.300,00 €",17-06-2013,29-05-2013,1 dias,"Portugal, Lisboa, Lisboa","Artigo 20.º, n.º 1, alínea a) do Código dos Contratos Públicos",,,,,,Não aplicável.,Não aplicável.,
Aquisição de Sugamadex sol.inj.100mg/ml frs 5 ml,Ajuste Direto Regime Geral,Aquisição de bens móveis,"33690000-3, Medicamentos vários","Centro Hospitalar Lisboa Norte, EPE (508481287)","Merck Sharp & Dohme, lda (500191360)","11.407,44 €",17-06-2013,03-06-2013,1 dias,"Portugal, Lisboa, Lisboa","Artigo 24.º, n.º 1, alínea e) do Código dos Contratos Públicos",,,,,,Não aplicável.,Não aplicável.,
Aquisição de Gliclazida LM comp. 30 mg,Ajuste Direto Regime Geral,Aquisição de bens móveis,"33615000-4, Medicamentos utilizados na diabetes","Centro Hospitalar Lisboa Norte, EPE (508481287)","Generis, SA (508107997)","70,20 €",17-06-2013,07-06-2013,1 dias,"Portugal, Lisboa, Lisboa","Artigo 20.º, n.º 1, alínea a) do Código dos Contratos Públicos",,,,,,Não aplicável.,Não aplicável.,
Aquisição de Diverso Material para Cardiologia,Ajuste Direto Regime Geral,Aquisição de bens móveis,"33141200-2, Cateteres","Centro Hospitalar Lisboa Norte, EPE (508481287)",Johnson & Johnson (500153370),"57.205,00 €",17-06-2013,17-06-2013,2 dias,"Portugal, Lisboa, Lisboa","Artigo 20.º, n.º 1, alínea a) do Código dos Contratos Públicos",,,,,,Não aplicável.,Não aplicável.,
Aquisição de Consumiveis de cardiologia,Ajuste Direto Regime Geral,Aquisição de bens móveis,"33141200-2, Cateteres","Centro Hospitalar Lisboa Norte, EPE (508481287)",VOLCANO EUROPE SPRL (859842345),"13.500,00 €",17-06-2013,17-06-2013,1 dias,"Portugal, Lisboa, Lisboa","Artigo 20.º, n.º 1, alínea a) do Código dos Contratos Públicos",,,,,,Não aplicável.,Não aplicável.,
"  Aquisição de Polielectrolitico sol p/ hemof/hemod 1,2 mmol/l",Ajuste Direto Regime Geral,Aquisição de bens móveis,"33692800-5, Soluções para diálise","Centro Hospitalar Lisboa Norte, EPE (508481287)",Gambro Lundia AB-Sucursal em Portugal (980367751),"22.800,00 €",17-06-2013,06-06-2013,1 dias,"Portugal, Lisboa, Lisboa","Artigo 24.º, n.º 1, alínea e) do Código dos Contratos Públicos",,,,,,Não aplicável.,Não aplicável.,
Aquisição de Azul Metileno 5 mg/ml amp. 10 ml,Ajuste Direto Regime Geral,Aquisição de bens móveis,"33690000-3, Medicamentos vários","Centro Hospitalar Lisboa Norte, EPE (508481287)","Labesfal, S.A. (501169580)","12.600,00 €",17-06-2013,03-06-2013,1 dias,"Portugal, Lisboa, Lisboa","Artigo 24.º, n.º 1, alínea e) do Código dos Contratos Públicos",,,,,,Não aplicável.,Não aplicável.,
Aquisição de Parafina e Lanolina composta creme bisnaga,Ajuste Direto Regime Geral,Aquisição de bens móveis,"33690000-3, Medicamentos vários","Centro Hospitalar Lisboa Norte, EPE (508481287)",Laboratorios Mendifar-S.A (500384045),"6.480,00 €",17-06-2013,12-06-2013,3 dias,"Portugal, Lisboa, Lisboa","Artigo 20.º, n.º 1, alínea a) do Código dos Contratos Públicos",,,,,,Não aplicável.,Não aplicável.,
Aquisição de Cards anti A/B/AB/D/CDE 100 cassetes,Ajuste Direto Regime Geral,Aquisição de bens móveis,"33696000-5, Reagentes e meios de contraste","Centro Hospitalar Lisboa Norte, EPE (508481287)","Johnson & Johnson, Lda (500153370)","7.303,80 €",17-06-2013,14-06-2013,1 dias,"Portugal, Lisboa, Lisboa","Artigo 24.º, n.º 1, alínea e) do Código dos Contratos Públicos",,,,,,Não aplicável.,Não aplicável.,
Aquisição de iobitridol sol. inj.35% iodo fras.200ml,Ajuste Direto Regime Geral,Aquisição de bens móveis,"33696000-5, Reagentes e meios de contraste","Centro Hospitalar Lisboa Norte, EPE (508481287)","A.Martins & Fernandes, SA (501172114)","9.500,00 €",14-06-2013,05-06-2013,1 dias,"Portugal, Lisboa, Lisboa","Artigo 24.º, n.º 1, alínea e) do Código dos Contratos Públicos",,,,,,Não aplicável.,Não aplicável.,
Aquisição de vitaminas,Ajuste Direto Regime Geral,Aquisição de bens móveis,"33616000-1, Vitaminas","Centro Hospitalar Lisboa Norte, EPE (508481287)","Laboratorios Mendifar, SA (500384045)","180,00 €",14-06-2013,12-06-2013,3 dias,"Portugal, Lisboa, Lisboa","Artigo 20.º, n.º 1, alínea a) do Código dos Contratos Públicos",,,,,,Não aplicável.,Não aplicável.,
Aquisição de clotrimazol creme 10 mg,Ajuste Direto Regime Geral,Aquisição de bens móveis,"33631100-3, Antifúngicos usados em dermatologia","Centro Hospitalar Lisboa Norte, EPE (508481287)","Farmoz, SA (501505334)","199,50 €",14-06-2013,12-06-2013,1 dias,"Portugal, Lisboa, Lisboa","Artigo 20.º, n.º 1, alínea a) do Código dos Contratos Públicos",,,,,,Não aplicável.,Não aplicável.,
Aquisição de Lopinavir 200 mg+Ritonavir 50 mg comp,Ajuste Direto Regime Geral,Aquisição de bens móveis,"33651400-2, Antivíricos de uso sistémico","Centro Hospitalar Lisboa Norte, EPE (508481287)","Abbvie, Lda (510229050)","253.654,31 €",14-06-2013,07-06-2013,1 dias,"Portugal, Lisboa, Lisboa","Artigo 24.º, n.º 1, alínea e) do Código dos Contratos Públicos",,,,,,Não aplicável.,Não aplicável.,
Aquisição de Ioversol inj 35% seringa pré cheia 50 ml,Ajuste Direto Regime Geral,Aquisição de bens móveis,"33696800-3, Meios de contraste para raios X","Centro Hospitalar Lisboa Norte, EPE (508481287)","Advanced Portugal, Lda (509917267)","5.238,00 €",14-06-2013,12-06-2013,1 dias,"Portugal, Lisboa, Lisboa","Artigo 24.º, n.º 1, alínea e) do Código dos Contratos Públicos",,,,,,Não aplicável.,Não aplicável.,
Aquisição de complexo de protrombina humana 500 UI/20 ml,Ajuste Direto Regime Geral,Aquisição de bens móveis,"33621200-1, Anti-hemorrágicos","Centro Hospitalar Lisboa Norte, EPE (508481287)","Octapharma, lda (502820780)","15.300,00 €",14-06-2013,07-06-2013,2 dias,"Portugal, Lisboa, Lisboa","Artigo 20.º, n.º 1, alínea a) do Código dos Contratos Públicos",,,,,,Não aplicável.,Não aplicável.,
Aquisição de plasma congelado,Ajuste Direto Regime Geral,Aquisição de bens móveis,"33692500-2, Soluções injectáveis","Centro Hospitalar Lisboa Norte, EPE (508481287)","Octapharma, Lda (502820780)","81.000,00 €",14-06-2013,07-06-2013,2 dias,"Portugal, Lisboa, Lisboa","Artigo 24.º, n.º 1, alínea e) do Código dos Contratos Públicos",,,,,,Não aplicável.,Não aplicável.,
Aquisição de Boceprevir 200 mg caps,Ajuste Direto Regime Geral,Aquisição de bens móveis,"33651400-2, Antivíricos de uso sistémico","Centro Hospitalar Lisboa Norte, EPE (508481287)","Merck Sharp, Lda (500191360)","99.200,64 €",14-06-2013,03-06-2013,3 dias,"Portugal, Lisboa, Lisboa","Artigo 24.º, n.º 1, alínea e) do Código dos Contratos Públicos",,,,,,Não aplicável.,Não aplicável.,
Aquisição de Somatropina inj 6 mg,Ajuste Direto Regime Geral,Aquisição de bens móveis,"33642100-3, Hormonas hipofisárias, hipotalâmicas e semelhantes","Centro Hospitalar Lisboa Norte, EPE (508481287)","Lilly-Portugal, lda (500165602)","5.878,50 €",14-06-2013,11-06-2013,2 dias,"Portugal, Lisboa, Lisboa","Artigo 24.º, n.º 1, alínea e) do Código dos Contratos Públicos",,,,,,Não aplicável.,Não aplicável.,
Aquisição de Neuroestimulador,Ajuste Direto Regime Geral,Aquisição de bens móveis,"33158210-7, Estimulador","Centro Hospitalar Lisboa Norte, EPE (508481287)",Socime II Produtos Medicos lda (504453939),"11.699,00 €",14-06-2013,14-06-2013,5 dias,"Portugal, Lisboa, Lisboa","Artigo 20.º, n.º 1, alínea a) do Código dos Contratos Públicos",,,,,,Não aplicável.,Não aplicável.,
Aquisição de Iobitridol inj 35% iodo frasco 500 ml,Ajuste Direto Regime Geral,Aquisição de bens móveis,"33692500-2, Soluções injectáveis","Centro Hospitalar Lisboa Norte, EPE (508481287)","A. Martins & Fernandes, S.A (501172114)","7.600,00 €",14-06-2013,05-06-2013,1 dias,"Portugal, Lisboa, Lisboa","Artigo 24.º, n.º 1, alínea e) do Código dos Contratos Públicos",,,,,,Não aplicável.,Não aplicável.,
Aquisição de Clopidogrel comp 75 mg,Ajuste Direto Regime Geral,Aquisição de bens móveis,"33621100-0, Antitrombóticos","Centro Hospitalar Lisboa Norte, EPE (508481287)",Farmoz SA (501505334),"862,40 €",14-06-2013,07-06-2013,1 dias,"Portugal, Lisboa, Lisboa","Artigo 20.º, n.º 1, alínea a) do Código dos Contratos Públicos",,,,,,Não aplicável.,Não aplicável.,
Aquisição de Albumina humana sol. inj.20% fras 50 ml,Ajuste Direto Regime Geral,Aquisição de bens móveis,"33621400-3, Substitutos do plasma e soluções para perfusão","Centro Hospitalar Lisboa Norte, EPE (508481287)","CSL Behring, Lda (503047201)","48.600,00 €",14-06-2013,07-06-2013,1 dias,"Portugal, Lisboa, Lisboa","Artigo 20.º, n.º 1, alínea a) do Código dos Contratos Públicos",,,,,,Não aplicável.,Não aplicável.,
Aquisição de Fosfato +Cloreto calcio sol oral,Ajuste Direto Regime Geral,Aquisição de bens móveis,"33690000-3, Medicamentos vários","Centro Hospitalar Lisboa Norte, EPE (508481287)",Eusa Pharma  (980376580),"15.000,00 €",14-06-2013,06-06-2013,1 dias,"Portugal, Lisboa, Lisboa","Artigo 24.º, n.º 1, alínea e) do Código dos Contratos Públicos",,,,,,Não aplicável.,Não aplicável.,
Aquisição de CDI BIV e electrodos,Ajuste Direto Regime Geral,Aquisição de bens móveis,"33182100-0, Desfibrilhador","Centro Hospitalar Lisboa Norte, EPE (508481287)","Medtronic Portugal, lda (504223933)","18.039,00 €",14-06-2013,14-06-2013,1 dias,"Portugal, Lisboa, Lisboa","Artigo 20.º, n.º 1, alínea a) do Código dos Contratos Públicos",,,,,,Não aplicável.,Não aplicável.,
Aquisição de cateter intra card ablacao c/termistor 4,Ajuste Direto Regime Geral,Aquisição de bens móveis,"33141200-2, Cateteres","Centro Hospitalar Lisboa Norte, EPE (508481287)",Medtronic Portugal lda (504223933),"7.700,00 €",14-06-2013,14-06-2013,1 dias,"Portugal, Lisboa, Lisboa","Artigo 20.º, n.º 1, alínea a) do Código dos Contratos Públicos",,,,,,Não aplicável.,Não aplicável.,
Aquisição de Bircabonato de sodio,Ajuste Direto Regime Geral,Aquisição de bens móveis,"33692500-2, Soluções injectáveis","Centro Hospitalar Lisboa Norte, EPE (508481287)","Labesfal, SA (501169580)","7.228,00 €",14-06-2013,12-06-2013,1 dias,"Portugal, Lisboa, Lisboa","Artigo 24.º, n.º 1, alínea e) do Código dos Contratos Públicos",,,,,,Não aplicável.,Não aplicável.,
Aquisição de Gem Prmier 3000 cassetes 300T,Ajuste Direto Regime Geral,Aquisição de bens móveis,"33692500-2, Soluções injectáveis","Centro Hospitalar Lisboa Norte, EPE (508481287)","Izasa Portugal, Lda (501086110)","6.320,00 €",14-06-2013,12-06-2013,2 dias,"Portugal, Lisboa, Lisboa","Artigo 24.º, n.º 1, alínea e) do Código dos Contratos Públicos",,,,,,Não aplicável.,Não aplicável.,
Prestação de Serviços de Tesouraria e Conferência de facturas no Centro Hospitalar Lisboa Norte EPE,Ajuste Direto Regime Geral,Aquisição de serviços,"66600000-6, Serviços de tesouraria","Centro Hospitalar Lisboa Norte, EPE (508481287)",Manpowergroup Lda (503626007),"72.880,92 €",12-06-2013,12-06-2013,1 dias,"Portugal, Lisboa, Lisboa","Artigo 20.º, n.º 1, alínea a) do Código dos Contratos Públicos",,,,,,Não aplicável.,Não aplicável.,
Prestação de Serviços de higiene e limpeza das instalações do Centro Hospitalar Lisboa Norte EPE,Ajuste Direto Regime Geral,Aquisição de serviços,"90910000-9, Serviços de limpeza","Centro Hospitalar Lisboa Norte, EPE (508481287)",Safira Services SA (504669451),"533.144,00 €",12-06-2013,30-05-2013,1 dias,"Portugal, Lisboa, Lisboa","Artigo 24.º, n.º 1, alínea c) do Código dos Contratos Públicos",,,,,,Não aplicável.,Não aplicável.,
Aquisição de Gem Premier cassetes 150T,Ajuste Direto Regime Geral,Aquisição de bens móveis,"33696500-0, Reagentes de laboratório","Centro Hospitalar Lisboa Norte, EPE (508481287)","izasa, LDA (501086110)","5.520,00 €",12-06-2013,12-06-2013,2 dias,"Portugal, Lisboa, Lisboa","Artigo 24.º, n.º 1, alínea e) do Código dos Contratos Públicos",,,,,,Não aplicável.,Não aplicável.,
Aquisição de Vários Medicamentos,Ajuste Direto Regime Geral,Aquisição de bens móveis,"33690000-3, Medicamentos vários","Centro Hospitalar Lisboa Norte, EPE (508481287)","Angelini  Farmaceutica, Lda (500583650)","44.471,64 €",11-06-2013,11-06-2013,3 dias,"Portugal, Lisboa, Lisboa","Artigo 24.º, n.º 1, alínea e) do Código dos Contratos Públicos",,,,,,Não aplicável.,Não aplicável.,
Aquisição de Lactulose  50% sol oral saqueta 15 ml,Ajuste Direto Regime Geral,Aquisição de bens móveis,"33613000-0, Laxantes","Centro Hospitalar Lisboa Norte, EPE (508481287)","Ferraz, Lynce, S.A. (500113270)","8.655,06 €",11-06-2013,07-06-2013,3 dias,"Portugal, Lisboa, Lisboa","Artigo 20.º, n.º 1, alínea a) do Código dos Contratos Públicos",,,,,,Não aplicável.,Não aplicável.,
Aquisição de Parecoxib sol inj 40 mg fras/amp.,Ajuste Direto Regime Geral,Aquisição de bens móveis,"33661200-3, Analgésicos","Centro Hospitalar Lisboa Norte, EPE (508481287)","Laboratórios Pfizer, lda (500162166)","8.107,20 €",11-06-2013,07-06-2013,2 dias,"Portugal, Lisboa, Lisboa","Artigo 24.º, n.º 1, alínea e) do Código dos Contratos Públicos",,,,,,Não aplicável.,Não aplicável.,
