Objeto do Contrato,Tipo de Procedimento,Tipo(s) de Contrato,CPVs,Entidade(s) Adjudicante(s),Entidade(s) Adjudicatária(s),Preço Contratual,Data de Publicação,Data de Celebração do Contrato,Prazo de Execução,Local de Execução,Fundamentação,Data de Fecho do Contrato,Preço Total Efetivo,Causas das Alterações ao Prazo,Causas das Alterações ao Preço,Estado,N.º registo do Acordo Quadro,Descrição do Acordo Quadro,Procedimento Centralizado
Aquisição de penso pós-operatório impermeável 9x15,Ajuste Direto Regime Geral,Aquisição de bens móveis,"33141100-1, Pensos; clipes, suturas, ligaduras","Administração Regional de Saúde de Lisboa e Vale do Tejo, I.P. (503148776)","3M Portugal, Lda. (500193940)","9.900,00 €",20-07-2012,19-07-2012,20 dias,"Portugal, Lisboa","Artigo 26.º, n.º 1, alínea e) do Código dos Contratos Públicos",,,,,,Não aplicável.,Não aplicável.,
Aquisição de película transparente com vaporizador,Ajuste Direto Regime Geral,Aquisição de bens móveis,"33140000-3, Material médico de consumo","Administração Regional de Saúde de Lisboa e Vale do Tejo, I.P. (503148776)",Smith & Nephew (503552461),"5.006,40 €",20-07-2012,19-07-2012,20 dias,"Portugal, Lisboa","Artigo 26.º, n.º 1, alínea e) do Código dos Contratos Públicos",,,,,,Não aplicável.,Não aplicável.,
Aquisição de película de contacto não aderente com silicone para terapia compressiva e pensos pós-operatório esterilizados impermeáveis,Ajuste Direto Regime Geral,Aquisição de bens móveis,"33141100-1, Pensos; clipes, suturas, ligaduras","Administração Regional de Saúde de Lisboa e Vale do Tejo, I.P. (503148776)",Molnlycke Health Care (511101066),"13.666,00 €",20-07-2012,19-07-2012,20 dias,"Portugal, Lisboa","Artigo 26.º, n.º 1, alínea e) do Código dos Contratos Públicos",,,,,,Não aplicável.,Não aplicável.,
"Aquisição de lancetas, esterilizadas, irrecuperáveis",Ajuste Direto Regime Geral,Aquisição de bens móveis,"33141900-9, Lancetas para sangria","Administração Regional de Saúde de Lisboa e Vale do Tejo, I.P. (503148776)",Iberlab e Imunoreage - Soluções para Laboratórios Lda. (503406694),"7.350,00 €",20-07-2012,19-07-2012,20 dias,"Portugal, Lisboa","Artigo 26.º, n.º 1, alínea e) do Código dos Contratos Públicos",,,,,,Não aplicável.,Não aplicável.,
"Serviços na àrea de arquitectura para a ARSLVt, IP para o periodo de Janeiro a Novembro de 2011",Ajuste Direto Regime Geral,Aquisição de serviços,"98390000-3, Outros serviços","Administração Regional de Saúde de Lisboa e Vale do Tejo, I.P. (503148776)","Monjardino & Coucello Unipessoal, Lda (505206188)","24.750,00 €",19-07-2012,16-07-2012,334 dias,"Portugal, Lisboa, Lisboa","Artigo 27.º, n.º 1, alínea b) do Código dos Contratos Públicos",,,,,,Não aplicável.,Não aplicável.,
Aquisição de vacina contra a hepatite B - adulto,Ajuste Direto Regime Geral,Aquisição de bens móveis,"33651600-4, Vacinas","Administração Regional de Saúde de Lisboa e Vale do Tejo, I.P. (503148776)","GlaxoSmithKline, Lda. (500139962)","12.860,00 €",18-07-2012,10-07-2012,22 dias,"Portugal, Lisboa","Artigo 26.º, n.º 1, alínea e) do Código dos Contratos Públicos",,,,,,Não aplicável.,Não aplicável.,
Aquisição de vacinas contra a hepatite B infantil,Ajuste Direto Regime Geral,Aquisição de bens móveis,"33651600-4, Vacinas","Administração Regional de Saúde de Lisboa e Vale do Tejo, I.P. (503148776)","GlaxoSmithKline, Lda. (500139962)","111.250,00 €",18-07-2012,11-07-2012,22 dias,"Portugal, Lisboa","Artigo 26.º, n.º 1, alínea e) do Código dos Contratos Públicos",,,,,,Não aplicável.,Não aplicável.,
Contrato de Gestao do Hospital de V. Franca de Xira - Revisão do Projecto de Execução do Novo Edifício Hospitalar,Ajuste Direto Regime Geral,Aquisição de serviços,"98390000-3, Outros serviços","Administração Regional de Saúde de Lisboa e Vale do Tejo, I.P. (503148776)",W. S. Atkins (501912290),"24.192,00 €",18-07-2012,29-06-2012,365 dias,"Portugal, Lisboa, Vila Franca de Xira","Artigo 24.º, n.º 1, alínea e) do Código dos Contratos Públicos",,,,,,Não aplicável.,Não aplicável.,
Manutenção da plataforma SIARS da ARSLVT em 2012,Ajuste Direto Regime Geral,Aquisição de serviços,"98390000-3, Outros serviços","Administração Regional de Saúde de Lisboa e Vale do Tejo, I.P. (503148776)","SPMS, EPE (509540716)","32.175,00 €",18-07-2012,16-07-2012,365 dias,"Portugal, Lisboa","Artigo 20.º, n.º 1, alínea a) do Código dos Contratos Públicos",,,,,,Não aplicável.,Não aplicável.,
"Aquisição de combustivel rodoviário para a ARSLVT, IP para o ano de 2012",Ajuste Direto Regime Geral,Aquisição de serviços,"98390000-3, Outros serviços","Administração Regional de Saúde de Lisboa e Vale do Tejo, I.P. (503148776)","Petrogal, SA (500697370)","325.203,25 €",18-07-2012,01-06-2012,275 dias,"Portugal, Lisboa, Lisboa",Artigo 258.º do Código dos Contratos Públicos,,,,,,Não aplicável.,Não aplicável.,
Aquisição de vacina tetra DTP acelular,Ajuste Direto Regime Geral,Aquisição de bens móveis,"33651600-4, Vacinas","Administração Regional de Saúde de Lisboa e Vale do Tejo, I.P. (503148776)","GlaxoSmithKline, Lda. (500139962)","148.500,00 €",13-07-2012,11-06-2012,20 dias,"Portugal, Lisboa","Artigo 26.º, n.º 1, alínea e) do Código dos Contratos Públicos",,,,,,Não aplicável.,Não aplicável.,
Aquisição de Vacinas contra a meningococos C,Ajuste Direto Regime Geral,Aquisição de bens móveis,"33651600-4, Vacinas","Administração Regional de Saúde de Lisboa e Vale do Tejo, I.P. (503148776)","Novartis Farma - Produtos Farmaceuticos, S.A. (500063524)","190.950,00 €",13-07-2012,10-07-2012,22 dias,"Portugal, Lisboa","Artigo 26.º, n.º 1, alínea e) do Código dos Contratos Públicos",,,,,,Não aplicável.,Não aplicável.,
Aquisição de receituário medico à INCM (mod. 1806 e mod. 1806.A) para o ano de 2012,Ajuste Direto Regime Geral,Aquisição de bens móveis,"22820000-4, Formulários","Administração Regional de Saúde de Lisboa e Vale do Tejo, I.P. (503148776)","Imprensa Nacional Casa da Moeda, SA (500792887)","61.350,00 €",13-07-2012,02-03-2012,183 dias,"Portugal, Lisboa","Artigo 24.º, n.º 1, alínea e) do Código dos Contratos Públicos",,,,,,Não aplicável.,Não aplicável.,
Aquisição de Vacinas contra a meningococos e Hib-Monodose,Ajuste Direto Regime Geral,Aquisição de bens móveis,"33651600-4, Vacinas","Administração Regional de Saúde de Lisboa e Vale do Tejo, I.P. (503148776)","GlaxoSmithKline - Produtos Farmacêutcos, Lda. (500139962)","10.295,00 €",11-07-2012,06-06-2012,20 dias,"Portugal, Lisboa","Artigo 26.º, n.º 1, alínea e) do Código dos Contratos Públicos",,,,,,Não aplicável.,Não aplicável.,
