Objeto do Contrato,Tipo de Procedimento,Tipo(s) de Contrato,CPVs,Entidade(s) Adjudicante(s),Entidade(s) Adjudicatária(s),Preço Contratual,Data de Publicação,Data de Celebração do Contrato,Prazo de Execução,Local de Execução,Fundamentação,Data de Fecho do Contrato,Preço Total Efetivo,Causas das Alterações ao Prazo,Causas das Alterações ao Preço,Estado,N.º registo do Acordo Quadro,Descrição do Acordo Quadro,Procedimento Centralizado
61/2485/2016 Medicamentos Lenalidomida,Ajuste Direto Regime Geral,Aquisição de bens móveis,"33690000-3, Medicamentos vários","Centro Hospitalar do Algarve, E. P. E. (510745997)","CELGENE - SOCIEDADE UNIPESSOAL, LDA (507791690)","244.482,81 €",09-12-2016,01-06-2016,214 dias,"Portugal, Faro, Faro","Artigo 24.º, n.º 1, alínea e) do Código dos Contratos Públicos","","",,,,Não aplicável.,Não aplicável.,FALSE
61/2261/2016 Medicamento 10 mg cáps,Ajuste Direto Regime Geral,Aquisição de bens móveis,"33690000-3, Medicamentos vários","Centro Hospitalar do Algarve, E. P. E. (510745997)","CELGENE - SOCIEDADE UNIPESSOAL, LDA (507791690)","23.436,50 €",09-12-2016,11-05-2016,30 dias,"Portugal, Faro, Faro","Artigo 24.º, n.º 1, alínea e) do Código dos Contratos Públicos","","",,,,Não aplicável.,Não aplicável.,FALSE
61/2101/2016 Medicamentos Lenalidomida 10 mg cáps e Lenalidomida 25 mg cáps,Ajuste Direto Regime Geral,Aquisição de bens móveis,"33690000-3, Medicamentos vários","Centro Hospitalar do Algarve, E. P. E. (510745997)","CELGENE - SOCIEDADE UNIPESSOAL, LDA (507791690)","46.564,74 €",09-12-2016,21-04-2016,31 dias,"Portugal, Faro, Faro","Artigo 24.º, n.º 1, alínea e) do Código dos Contratos Públicos","","",,,,Não aplicável.,Não aplicável.,FALSE
61/1971/2016 Medicamentos Lenalidomida 25mg e 10 mg,Ajuste Direto Regime Geral,Aquisição de bens móveis,"33690000-3, Medicamentos vários","Centro Hospitalar do Algarve, E. P. E. (510745997)","CELGENE - SOCIEDADE UNIPESSOAL, LDA (507791690)","46.564,74 €",09-12-2016,06-04-2016,31 dias,"Portugal, Faro, Faro","Artigo 24.º, n.º 1, alínea e) do Código dos Contratos Públicos","","",,,,Não aplicável.,Não aplicável.,FALSE
61/1713/2016 Medicamento Lenalidomida 10 mg cáps,Ajuste Direto Regime Geral,Aquisição de bens móveis,"33690000-3, Medicamentos vários","Centro Hospitalar do Algarve, E. P. E. (510745997)","CELGENE - SOCIEDADE UNIPESSOAL, LDA (507791690)","9.374,60 €",09-12-2016,08-03-2016,31 dias,"Portugal, Faro, Faro","Artigo 24.º, n.º 1, alínea e) do Código dos Contratos Públicos","","",,,,Não aplicável.,Não aplicável.,FALSE
61/525/2016 Medicamento Toxina Botulinica A,Ajuste Direto Regime Geral,Aquisição de bens móveis,"33690000-3, Medicamentos vários","Centro Hospitalar do Algarve, E. P. E. (510745997)","Logista, Transportes, Transitários e Pharma, Unipessoal, Lda (503538108)","38.400,00 €",09-12-2016,26-04-2016,250 dias,"Portugal, Faro, Faro","Artigo 24.º, n.º 1, alínea e) do Código dos Contratos Públicos","","",,,,Não aplicável.,Não aplicável.,FALSE
71/504/2016 Reagentes ação de INR por Point of Care,Ajuste Direto Regime Geral,Aquisição de bens móveis,"33696500-0, Reagentes de laboratório","Centro Hospitalar do Algarve, E. P. E. (510745997)","ROCHE SISTEMAS DIAGNOSTICO,LDA (504282921)","8.812,80 €",09-12-2016,06-01-2016,361 dias,"Portugal, Faro, Faro","Artigo 20.º, n.º 1, alínea a) do Código dos Contratos Públicos","","",,,,Não aplicável.,Não aplicável.,FALSE
71/503/2016 Reagentes para Electroforeses,Ajuste Direto Regime Geral,Aquisição de bens móveis,"33696500-0, Reagentes de laboratório","Centro Hospitalar do Algarve, E. P. E. (510745997)","PHADIA, Sociedade Unipessoal, Lda (506916243)","17.886,00 €",09-12-2016,11-01-2016,356 dias,"Portugal, Faro, Faro","Artigo 20.º, n.º 1, alínea a) do Código dos Contratos Públicos","","",,,,Não aplicável.,Não aplicável.,FALSE
"71/502/2016 Reagentes e consumiveis para doseamento de HBA 1C, HBA 2 e Rastreio de hemoglobina",Ajuste Direto Regime Geral,Aquisição de bens móveis,"33696500-0, Reagentes de laboratório","Centro Hospitalar do Algarve, E. P. E. (510745997)","ALERE, LDA. (502518863), MENARINI DIAGNOSTICOS,LDA. (502610069)","22.588,30 €",09-12-2016,11-01-2016,356 dias,"Portugal, Faro, Faro","Artigo 20.º, n.º 1, alínea a) do Código dos Contratos Públicos","","",,,,Não aplicável.,Não aplicável.,FALSE
Aquisição de equipamento de cópia e impressão,Ajuste Direto Regime Geral,Aquisição de bens móveis,"30200000-1, Equipamento e material informático","Centro Hospitalar do Algarve, E. P. E. (510745997)","Canon Portugal (507477740), Konica Minolta (502120070)","0,00 €",09-12-2016,07-12-2016,22 dias,"Portugal, Faro, Lagos<BR/>Portugal, Faro, Portimão<BR/>Portugal, Faro, Faro","Artigo 20.º, n.º 1, alínea a) do Código dos Contratos Públicos","","",,,,2462588,Aquisição de Equipamento para Cópia e Impressão,FALSE
71/3437/2016 Medicamentos Albumina humana 50g/l sol inj Fr 250 ml IV,Ajuste Direto Regime Geral,Aquisição de bens móveis,"33690000-3, Medicamentos vários","Centro Hospitalar do Algarve, E. P. E. (510745997)",OCTAFHARMA- PROD. FARMACEUTICO (502820780),"13.516,80 €",09-12-2016,29-09-2016,94 dias,"Portugal, Faro, Faro","Artigo 20.º, n.º 1, alínea a) do Código dos Contratos Públicos","","",,,,Não aplicável.,Não aplicável.,FALSE
Proc. 68/4005/2016- Fornecimento de filtros para hottes da cozinha,Ajuste Direto Regime Geral,Aquisição de serviços,"50530000-9, Serviços de reparação e manutenção de máquinas","Centro Hospitalar do Algarve, E. P. E. (510745997)","CISEC - Soluções Técnicas de Engenharia e Serviços, S.A. (500205698)","1.254,75 €",09-12-2016,15-11-2016,60 dias,"Portugal, Faro, Faro","Artigo 24.º, n.º 1, alínea e) do Código dos Contratos Públicos","","",,,,Não aplicável.,Não aplicável.,FALSE
Proc. 67/3926/2016-  Fornecimento  de motores p/ ventiloconvectores,Ajuste Direto Regime Geral,Aquisição de bens móveis,"42531000-7, Peças para equipamento de refrigeração","Centro Hospitalar do Algarve, E. P. E. (510745997)","CISEC - Soluções Técnicas de Engenharia e Serviços, S.A. (500205698)","919,70 €",09-12-2016,11-11-2016,60 dias,"Portugal, Faro, Faro","Artigo 24.º, n.º 1, alínea e) do Código dos Contratos Públicos","","",,,,Não aplicável.,Não aplicável.,FALSE
Proc. 67/3926/2016- Reparação de maquina de lavar roupa,Ajuste Direto Regime Geral,Aquisição de serviços,"50532000-3, Serviços de reparação e manutenção de máquinas e aparelhos eléctricos e de equipamento afim","Centro Hospitalar do Algarve, E. P. E. (510745997)","ACCIONA Facility Services, SA (503431397)","113,40 €",09-12-2016,08-11-2016,60 dias,"Portugal, Faro, Faro","Artigo 24.º, n.º 1, alínea e) do Código dos Contratos Públicos","","",,,,Não aplicável.,Não aplicável.,FALSE
Proc. 67/3910/2016- Reparação sistema de transporte pneumatico,Ajuste Direto Regime Geral,Aquisição de serviços,"50800000-3, Serviços de reparação e manutenção diversos","Centro Hospitalar do Algarve, E. P. E. (510745997)","J. J. L., LDA. (506310132)","1.270,94 €",09-12-2016,11-11-2016,60 dias,"Portugal, Faro, Faro","Artigo 24.º, n.º 1, alínea e) do Código dos Contratos Públicos","","",,,,Não aplicável.,Não aplicável.,FALSE
71/506/2016 Reagentes para anatomia patologica,Ajuste Direto Regime Geral,Aquisição de bens móveis,"33696500-0, Reagentes de laboratório","Centro Hospitalar do Algarve, E. P. E. (510745997)","VWR INTERNACIONAL, LDA. (503842770), ENZIFARMA (503636975), ZMWay,LDA. (508085349)","7.985,83 €",09-12-2016,06-01-2016,361 dias,"Portugal, Faro, Faro","Artigo 20.º, n.º 1, alínea a) do Código dos Contratos Públicos","","",,,,Não aplicável.,Não aplicável.,FALSE
Proc. 68/3824/2016- Fornecimento de macaco hidráulico p/ reparação de cama hospitalar,Ajuste Direto Regime Geral,Aquisição de serviços,"50850000-8, Serviços de reparação e manutenção de mobiliário","Centro Hospitalar do Algarve, E. P. E. (510745997)",MUNDINTER INTERCAMBIO MUNDIAL DE COMERCIO SA (500199906),"331,11 €",09-12-2016,15-11-2016,60 dias,"Portugal, Faro, Faro","Artigo 24.º, n.º 1, alínea e) do Código dos Contratos Públicos","","",,,,Não aplicável.,Não aplicável.,FALSE
Proc. 68/3812/2016- Fornecimento de filtros p/ AVAC,Ajuste Direto Regime Geral,Aquisição de serviços,"50730000-1, Serviços de reparação e manutenção de grupos de refrigeração","Centro Hospitalar do Algarve, E. P. E. (510745997)","CISEC - Soluções Técnicas de Engenharia e Serviços, S.A. (500205698)","7.948,23 €",09-12-2016,15-11-2016,60 dias,"Portugal, Faro, Faro","Artigo 24.º, n.º 1, alínea e) do Código dos Contratos Públicos","","",,,,Não aplicável.,Não aplicável.,FALSE
Proc. 68/3810/2016- Fornecimento de materiais diversos parta reparações,Ajuste Direto Regime Geral,Aquisição de bens móveis,"31100000-7, Motores, geradores e transformadores eléctricos","Centro Hospitalar do Algarve, E. P. E. (510745997)","CISEC - Soluções Técnicas de Engenharia e Serviços, S.A. (500205698)","3.462,92 €",09-12-2016,15-11-2016,30 dias,"Portugal, Faro, Faro","Artigo 24.º, n.º 1, alínea e) do Código dos Contratos Públicos","","",,,,Não aplicável.,Não aplicável.,FALSE
Proc. 68/3806/2016- Fornecimento Válvulas de segurança p/ Gerador de Vapor,Ajuste Direto Regime Geral,Aquisição de serviços,"50510000-3, Serviços de reparação e manutenção de bombas, válvulas, torneiras e contentores de metal","Centro Hospitalar do Algarve, E. P. E. (510745997)","TECNIQUEIMA - Caldeiras Equip. Técnicos, Lda (503706604)","1.062,44 €",09-12-2016,15-11-2016,30 dias,"Portugal, Faro, Faro","Artigo 24.º, n.º 1, alínea e) do Código dos Contratos Públicos","","",,,,Não aplicável.,Não aplicável.,FALSE
Proc. 67/3804/2016- Reparação maquina desinfecção,Ajuste Direto Regime Geral,Aquisição de serviços,"50800000-3, Serviços de reparação e manutenção diversos","Centro Hospitalar do Algarve, E. P. E. (510745997)","Olympus Ibéria, S.A.U. - Suc. em Portugal (980474710)","796,61 €",09-12-2016,15-11-2016,30 dias,"Portugal, Faro, Faro","Artigo 24.º, n.º 1, alínea e) do Código dos Contratos Públicos","","",,,,Não aplicável.,Não aplicável.,FALSE
"Prestação de Serviços de Manutenção Assistência Técnica de Equipamentos AVAC, Instalações Frigoríficas",Ajuste Direto Regime Geral,Aquisição de serviços,"50000000-5, Serviços de reparação e manutenção","Centro Hospitalar do Algarve, E. P. E. (510745997)","CISEC - Soluções Técnicas de Engenharia e Serviços, S.A. (500205698)","15.488,24 €",08-12-2016,24-11-2016,31 dias,"Portugal, Faro, Lagos<BR/>Portugal, Faro, Faro<BR/>Portugal, Faro, Portimão","Artigo 24.º, n.º 1, alínea c) do Código dos Contratos Públicos","","",,,,Não aplicável.,Não aplicável.,FALSE
Procedimento n.º 4.235/2016 - Prestação de Serviços de Radioterapia,Ajuste Direto Regime Geral,Aquisição de serviços,"85100000-0, Serviços de saúde","Centro Hospitalar do Algarve, E. P. E. (510745997)","Quadrantes Faro, Unidade de Radioterapia do Algarve, Lda. (505446120)","166.014,00 €",08-12-2016,01-12-2016,31 dias,"Portugal, Faro, Faro","Artigo 24.º, n.º 1, alínea c) do Código dos Contratos Públicos","","",,,,Não aplicável.,Não aplicável.,FALSE
Procedimento n.º 4.236/2016 - Prestação de Serviços de Lavagem e Tratamento de Roupa,Ajuste Direto Regime Geral,Aquisição de serviços,"98311000-6, Serviços de recolha de roupa por lavandarias","Centro Hospitalar do Algarve, E. P. E. (510745997)",SUCH | Serviço de Utilização Comum dos Hospitais (500900469),"80.400,08 €",08-12-2016,24-11-2016,31 dias,"Portugal, Faro, Vila Real Sto Antonio<BR/>Portugal, Faro, Loulé<BR/>Portugal, Faro, Portimão<BR/>Portugal, Faro, Lagos<BR/>Portugal, Faro, Faro<BR/>Portugal, Faro, Albufeira","Artigo 24.º, n.º 1, alínea c) do Código dos Contratos Públicos","","",,,,Não aplicável.,Não aplicável.,FALSE
Prestação de Serviços de Transporte de Doentes em Ambulância (Avença),Ajuste Direto Regime Geral,Aquisição de serviços,"85143000-3, Serviços de ambulâncias","Centro Hospitalar do Algarve, E. P. E. (510745997)","Transportes Flor da Ria, SA (502606460)","64.348,35 €",08-12-2016,24-11-2016,31 dias,"Portugal, Faro, Portimão<BR/>Portugal, Faro, Lagos<BR/>Portugal, Faro, Faro","Artigo 24.º, n.º 1, alínea c) do Código dos Contratos Públicos","","",,,,Não aplicável.,Não aplicável.,FALSE
"Prestação de Serviços de Manutenção das Instalações do Centro Hospitalar do Algarve, EPE",Ajuste Direto Regime Geral,Aquisição de serviços,"50000000-5, Serviços de reparação e manutenção","Centro Hospitalar do Algarve, E. P. E. (510745997)","ACCIONA Facility Services, SA (503431397)","39.815,10 €",08-12-2016,01-12-2016,31 dias,"Portugal, Faro, Loulé<BR/>Portugal, Faro, Vila Real Sto Antonio<BR/>Portugal, Faro, Lagos<BR/>Portugal, Faro, Faro<BR/>Portugal, Faro, Albufeira<BR/>Portugal, Faro, Portimão","Artigo 24.º, n.º 1, alínea c) do Código dos Contratos Públicos","","",,,,Não aplicável.,Não aplicável.,FALSE
71/2330/2016 Peróxido de Hidrogénio 56% (Vaprox HC),Ajuste Direto Regime Geral,Aquisição de bens móveis,"33690000-3, Medicamentos vários","Centro Hospitalar do Algarve, E. P. E. (510745997)",Vitatech Lda  (510693660),"8.950,00 €",07-12-2016,12-05-2016,234 dias,"Portugal, Faro, Faro","Artigo 20.º, n.º 1, alínea a) do Código dos Contratos Públicos","","",,,,Não aplicável.,Não aplicável.,FALSE
71/2324/2016 Hialuronato de sódio 1% - 0.85ml,Ajuste Direto Regime Geral,Aquisição de bens móveis,"33690000-3, Medicamentos vários","Centro Hospitalar do Algarve, E. P. E. (510745997)",ALCON PORTUGAL (501251685),"10.080,00 €",07-12-2016,13-05-2016,233 dias,"Portugal, Faro, Faro","Artigo 20.º, n.º 1, alínea a) do Código dos Contratos Públicos","","",,,,Não aplicável.,Não aplicável.,FALSE
71/2227/2016 Reagentes para as Sub`s,Ajuste Direto Regime Geral,Aquisição de bens móveis,"33696500-0, Reagentes de laboratório","Centro Hospitalar do Algarve, E. P. E. (510745997)","MENARINI DIAGNOSTICOS,LDA. (502610069)","7.661,80 €",07-12-2016,12-10-2016,90 dias,"Portugal, Faro, Faro","Artigo 20.º, n.º 1, alínea a) do Código dos Contratos Públicos","","",,,,Não aplicável.,Não aplicável.,FALSE
72/4075/2016 - Aquisição de Próteses cimetadas e Não Cimentadas,Ajuste Direto Regime Geral,Aquisição de bens móveis,"33183200-8, Próteses ortopédicas","Centro Hospitalar do Algarve, E. P. E. (510745997)",Johnson & Johnson Medical (500153370),"17.490,00 €",07-12-2016,21-11-2016,15 dias,"Portugal, Faro, Portimão<BR/>Portugal, Faro, Lagos<BR/>Portugal, Faro, Faro","Artigo 20.º, n.º 1, alínea a) do Código dos Contratos Públicos","","",,,,Não aplicável.,Não aplicável.,FALSE
71/2007/2016 Colistimetato de sódio 1000000 U.I. Pó sol inj ou sol neb Fr IV Inalatória,Ajuste Direto Regime Geral,Aquisição de bens móveis,"33690000-3, Medicamentos vários","Centro Hospitalar do Algarve, E. P. E. (510745997)",PHARMIS BIOFARMACEUTICA (502595442),"6.867,36 €",07-12-2016,15-04-2016,261 dias,"Portugal, Faro, Faro","Artigo 20.º, n.º 1, alínea a) do Código dos Contratos Públicos","","",,,,Não aplicável.,Não aplicável.,FALSE
71/850/2016 Reagentes para doseamento de imunoalergologia e hormonas,Ajuste Direto Regime Geral,Aquisição de bens móveis,"33696500-0, Reagentes de laboratório","Centro Hospitalar do Algarve, E. P. E. (510745997)","SIEMENS HEALTHCARE DIAGNOSTICS, LDA (507925173)","39.074,00 €",07-12-2016,23-02-2016,284 dias,"Portugal, Faro, Faro","Artigo 20.º, n.º 1, alínea a) do Código dos Contratos Públicos","","",,,,Não aplicável.,Não aplicável.,FALSE
71/1372/2016 Medicamento Imunoglobulina Humana Normal 100 mg/ml Sol inj Fr 100 ml IV,Ajuste Direto Regime Geral,Aquisição de bens móveis,"33690000-3, Medicamentos vários","Centro Hospitalar do Algarve, E. P. E. (510745997)","CSL  BEHRING, LDA (503047201)","37.974,00 €",07-12-2016,04-04-2016,284 dias,"Portugal, Faro, Faro","Artigo 20.º, n.º 1, alínea a) do Código dos Contratos Públicos","","",,,,Não aplicável.,Não aplicável.,FALSE
Serviços Médicos Urgência de Ortopedia,Ajuste Direto Regime Geral,Aquisição de serviços,"85121283-0, Serviços de ortopedia","Centro Hospitalar do Algarve, E. P. E. (510745997)","TALENTER - GESTÃO DE PROJECTOS, LDA (506111148)","32.040,00 €",06-12-2016,17-11-2016,180 dias,"Portugal, Faro, Faro","Artigo 24.º, n.º 1, alínea c) do Código dos Contratos Públicos",30-12-2016,"32.040,00 €",,,,Não aplicável.,Não aplicável.,FALSE
Aquisição de Sistemas de Pacemakers,Ao abrigo de acordo-quadro (art.º 259.º),Aquisição de bens móveis,"33182000-9, Material de assistência à função cardíaca","Centro Hospitalar do Algarve, E. P. E. (510745997)","LIVANOVA PORTUGAL, LDA. (505514010)","9.880,00 €",05-12-2016,05-12-2016,26 dias,"Portugal, Faro, Portimão<BR/>Portugal, Faro, Lagos<BR/>Portugal, Faro, Faro","Artigo 20.º, n.º 1, alínea b) do Código dos Contratos Públicos","","",,,,600105,"CONCURSO PÚBLICO PARA A CELEBRAÇÃO DE CONTRATOS PÚBLICOS DE APROVISIONAMENTO PARA A ÁREA DA SAÚDE, COM VISTA AO FORNECIMENTO SISTEMAS DE PACEMAKERS ÀS INSTITUIÇÕES E SERVIÇOS DO SERVIÇO NACIONAL DE SAÚDE",FALSE
Realização de Análises Clínicas,Ajuste Direto Regime Geral,Aquisição de serviços,"85100000-0, Serviços de saúde","Centro Hospitalar do Algarve, E. P. E. (510745997)","Dr. Joaquim Chaves - Laboratório de Análises Clínicas, S.A (500753636)","7.000,00 €",02-12-2016,21-11-2016,60 dias,"Portugal, Faro, Faro","Artigo 20.º, n.º 1, alínea a) do Código dos Contratos Públicos","","",,,,Não aplicável.,Não aplicável.,FALSE
78.3741.2016 - Projeto de Rede de Água para a SUB de VRSA,Ajuste Direto Regime Geral,Aquisição de serviços,"50800000-3, Serviços de reparação e manutenção diversos","Centro Hospitalar do Algarve, E. P. E. (510745997)","Rolear On, SA (501408304)","27.347,11 €",02-12-2016,14-11-2016,30 dias,"Portugal, Faro, Faro","Artigo 20.º, n.º 1, alínea a) do Código dos Contratos Públicos","","",,,,Não aplicável.,Não aplicável.,FALSE
