freguesia,acronym,validVotesPercentage,votes,dicofre
Atalaia,PS,41.4,224,142001
Atalaia,PCP-PEV,20.7,112,142001
Atalaia,PPD/PSD.CDS-PP,14.23,77,142001
Atalaia,MPT,8.5,46,142001
Atalaia,B.E.,4.25,23,142001
Atalaia,PCTP/MRPP,2.59,14,142001
Atalaia,L,2.4,13,142001
Atalaia,PAN,1.66,9,142001
Atalaia,PND,1.11,6,142001
Atalaia,PPM,1.11,6,142001
Atalaia,MAS,0.74,4,142001
Atalaia,PTP,0.55,3,142001
Atalaia,PNR,0.37,2,142001
Atalaia,PDA,0.18,1,142001
Atalaia,PPV,0.18,1,142001
Atalaia,POUS,0,0,142001
