freguesia,acronym,validVotesPercentage,votes,dicofre
Favaios,PS,46.27,155,170107
Favaios,PPD/PSD.CDS-PP,32.54,109,170107
Favaios,MPT,9.55,32,170107
Favaios,PCP-PEV,4.78,16,170107
Favaios,B.E.,2.39,8,170107
Favaios,L,0.9,3,170107
Favaios,MAS,0.9,3,170107
Favaios,PCTP/MRPP,0.9,3,170107
Favaios,PND,0.9,3,170107
Favaios,PNR,0.6,2,170107
Favaios,PTP,0.3,1,170107
Favaios,PAN,0,0,170107
Favaios,PDA,0,0,170107
Favaios,POUS,0,0,170107
Favaios,PPM,0,0,170107
Favaios,PPV,0,0,170107
