freguesia,acronym,validVotesPercentage,votes,dicofre
Rego,PPD/PSD.CDS-PP,63.19,242,030517
Rego,PS,15.67,60,030517
Rego,MPT,10.44,40,030517
Rego,PCP-PEV,2.61,10,030517
Rego,B.E.,1.57,6,030517
Rego,L,1.31,5,030517
Rego,PND,1.31,5,030517
Rego,PAN,1.04,4,030517
Rego,PCTP/MRPP,1.04,4,030517
Rego,POUS,0.78,3,030517
Rego,PTP,0.52,2,030517
Rego,MAS,0.26,1,030517
Rego,PNR,0.26,1,030517
Rego,PDA,0,0,030517
Rego,PPM,0,0,030517
Rego,PPV,0,0,030517
