Objeto do Contrato,Tipo de Procedimento,Tipo(s) de Contrato,CPVs,Entidade(s) Adjudicante(s),Entidade(s) Adjudicatária(s),Preço Contratual,Data de Publicação,Data de Celebração do Contrato,Prazo de Execução,Local de Execução,Fundamentação,Data de Fecho do Contrato,Preço Total Efetivo,Causas das Alterações ao Prazo,Causas das Alterações ao Preço,Estado,N.º registo do Acordo Quadro,Descrição do Acordo Quadro,Procedimento Centralizado
"4SEX0015/2014 - CAT e Manut dos Ecografos Toshiba, Mod.Aplio, Xario, Némio e Aplio 300 p/2014",Ajuste Direto Regime Geral,Aquisição de serviços,"50000000-5, Serviços de reparação e manutenção","Centro Hospitalar Barreiro Montijo, E. P. E. (509186998)",Toshiba Medical Systems SA (980023700),"14.575,00 €",01-08-2014,09-07-2014,365 dias,"Portugal, Setúbal, Barreiro","Artigo 24.º, n.º 1, alínea e) do Código dos Contratos Públicos",31-12-2014,"14.575,00 €",,,,Não aplicável.,Não aplicável.,FALSE
4SEX0010/2014 - CAT e Manut aos 6 elevadores do Hosp Barreiro p/ 2014,Ajuste Direto Regime Geral,Aquisição de serviços,"50000000-5, Serviços de reparação e manutenção","Centro Hospitalar Barreiro Montijo, E. P. E. (509186998)","Otis Elevadores, Lda. (500069824)","14.325,12 €",01-08-2014,09-01-2014,365 dias,"Portugal, Setúbal, Barreiro","Artigo 24.º, n.º 1, alínea e) do Código dos Contratos Públicos",31-12-2014,"14.325,12 €",,,,Não aplicável.,Não aplicável.,FALSE
