Objeto do Contrato,Tipo de Procedimento,Tipo(s) de Contrato,CPVs,Entidade(s) Adjudicante(s),Entidade(s) Adjudicatária(s),Preço Contratual,Data de Publicação,Data de Celebração do Contrato,Prazo de Execução,Local de Execução,Fundamentação,Data de Fecho do Contrato,Preço Total Efetivo,Causas das Alterações ao Prazo,Causas das Alterações ao Preço,Estado,N.º registo do Acordo Quadro,Descrição do Acordo Quadro,Procedimento Centralizado
"AP 319 aquisição de 420 Pilha alcalina (size C) - LR14; 250 Pilha alcalina 12V (LR 932); 940 Pilha alcalina 9V (LR61); 800 Pilha alcalina (CR2032); 290 Pilha alcalina LR41/A192 (AG3/1,55V) ",Consulta Prévia,Aquisição de bens móveis,"31411000-0, Pilhas alcalinas","Administração Regional de Saúde do Norte, I. P. (503135593)",Quadrigira - Consumiveis Unipessoal (508109574),"40,60 €",08-06-2018,09-05-2018,210 dias,"Portugal, Vila Real, Vila Real<BR/>Portugal, Porto, Maia","Artigo 20.º, n.º 1, alínea c) do Código dos Contratos Públicos",25-05-2018,"40,60 €",,,,Não aplicável.,Não aplicável.,FALSE
"AP 796 Aquisição produtos farmacêuticos de 600 testes Legiolert teste, 600 Unidades legiolert trays; 2 unidades kit de suplemento; 4 unidades Pré-tratamento legiolert",Ajuste Direto Regime Geral,Aquisição de bens móveis,"33600000-6, Produtos farmacêuticos","Administração Regional de Saúde do Norte, I. P. (503135593)",Iberlab & Imunoreage (503406694),"22.933,68 €",08-06-2018,04-06-2018,240 dias,"Portugal, Porto, Maia<BR/>Portugal, Vila Real, Vila Real","Artigo 24.º, n.º 1, alínea e), subalínea ii) do Código dos Contratos Públicos","","",,,,Não aplicável.,Não aplicável.,FALSE
Aquisição de 3 300 Comprimidos de MOXIFLOXACINA (comp. revestidos) [400 MG; CÁP/COMP],Ao abrigo de acordo-quadro (art.º 259.º),Aquisição de bens móveis,"33600000-6, Produtos farmacêuticos","Administração Regional de Saúde do Norte,IP (ARSN) (503135593)","Bayer Portugal, Lda (500043256)","6.732,00 €",08-06-2018,23-04-2018,247 dias,"Portugal, Porto, Maia<BR/>Portugal, Distrito não determinado, Concelho não determinado<BR/>Portugal, Vila Real, Vila Real",Artigo 259.º do Código dos Contratos Públicos,"","",,,,2775691,CP 2017/5 - Acordo Quadro para fornecimento de Medicamentos anti-infeciosos: exceto antivíricos e antifúngicos,FALSE
Aquisição de 300 Capsulas de FLUCLOXACILINA [500MG;CÁP/COMP] e 12 500 Comprimidos de LEVOFLOXACINA (comp. revestidos) [500 MG; CÁP/COMP],Ao abrigo de acordo-quadro (art.º 259.º),Aquisição de bens móveis,"33600000-6, Produtos farmacêuticos","Administração Regional de Saúde do Norte,IP (ARSN) (503135593)","TECNIMEDE-SOC.TECNICO MEDICINAL, LDA (500626413)","2.499,00 €",08-06-2018,23-04-2018,247 dias,"Portugal, Distrito não determinado, Concelho não determinado<BR/>Portugal, Vila Real, Vila Real<BR/>Portugal, Porto, Maia",Artigo 259.º do Código dos Contratos Públicos,"","",,,,2775691,CP 2017/5 - Acordo Quadro para fornecimento de Medicamentos anti-infeciosos: exceto antivíricos e antifúngicos,FALSE
Aquisição de 16 000 Comprimidos de CLARITROMICINA [500 MG; CÁP/COMP],Ao abrigo de acordo-quadro (art.º 259.º),Aquisição de bens móveis,"33600000-6, Produtos farmacêuticos","Administração Regional de Saúde do Norte,IP (ARSN) (503135593)","SANDOZ FARMACEUTICA, LDA (506985261)","2.800,00 €",08-06-2018,23-04-2018,247 dias,"Portugal, Distrito não determinado, Concelho não determinado<BR/>Portugal, Porto, Maia<BR/>Portugal, Vila Real, Vila Real",Artigo 259.º do Código dos Contratos Públicos,"","",,,,2775691,CP 2017/5 - Acordo Quadro para fornecimento de Medicamentos anti-infeciosos: exceto antivíricos e antifúngicos,FALSE
Aquisição de 1 500 Comprimidos de CIPROFLOXACINA [500 MG; CÁP/COMP],Ao abrigo de acordo-quadro (art.º 259.º),Aquisição de bens móveis,"33600000-6, Produtos farmacêuticos","Administração Regional de Saúde do Norte,IP (ARSN) (503135593)",Laboratorio Medinfar-Produtos Farmaceuticos S.a  (500384045),"90,00 €",08-06-2018,23-04-2018,247 dias,"Portugal, Vila Real, Vila Real<BR/>Portugal, Porto, Maia<BR/>Portugal, Distrito não determinado, Concelho não determinado",Artigo 259.º do Código dos Contratos Públicos,"","",,,,2775691,CP 2017/5 - Acordo Quadro para fornecimento de Medicamentos anti-infeciosos: exceto antivíricos e antifúngicos,FALSE
Aquisição de 35 Frascos AMOXICILINA + ÁCIDO CLAVULANICO [2000 + 200 MG; IV; F/AMP],Ao abrigo de acordo-quadro (art.º 259.º),Aquisição de bens móveis,"33600000-6, Produtos farmacêuticos","Administração Regional de Saúde do Norte,IP (ARSN) (503135593)","LABORATORIOS ATRAL, SA (500162085)","62,65 €",08-06-2018,23-04-2018,247 dias,"Portugal, Porto, Maia<BR/>Portugal, Vila Real, Vila Real<BR/>Portugal, Distrito não determinado, Concelho não determinado",Artigo 259.º do Código dos Contratos Públicos,"","",,,,2775691,CP 2017/5 - Acordo Quadro para fornecimento de Medicamentos anti-infeciosos: exceto antivíricos e antifúngicos,FALSE
AP 324 - Aquisição de produtos para laboratório,Consulta Prévia,Aquisição de bens móveis,"33695000-8, Todos os outros produtos não terapêuticos","Administração Regional de Saúde do Norte, I. P. (503135593)","Normax - Fábrica de Vidros Científicos, Lda (500203130)","534,92 €",07-06-2018,15-05-2018,210 dias,"Portugal, Porto, Maia<BR/>Portugal, Vila Real, Vila Real","Artigo 20.º, n.º 1, alínea c) do Código dos Contratos Públicos",14-12-2018,"534,92 €",,,,Não aplicável.,Não aplicável.,FALSE
AP 324 - Aquisição de produtos para laboratório - Filtro de seringa,Consulta Prévia,Aquisição de bens móveis,"33695000-8, Todos os outros produtos não terapêuticos","Administração Regional de Saúde do Norte, I. P. (503135593)","Type Solution, S.A. (508400317)","103,42 €",07-06-2018,15-05-2018,210 dias,"Portugal, Vila Real, Vila Real<BR/>Portugal, Porto, Maia","Artigo 20.º, n.º 1, alínea c) do Código dos Contratos Públicos",22-05-2018,"103,42 €",,,,Não aplicável.,Não aplicável.,FALSE
AP 324 - Aquisição de produtos para laboratório,Consulta Prévia,Aquisição de bens móveis,"33695000-8, Todos os outros produtos não terapêuticos","Administração Regional de Saúde do Norte, I. P. (503135593)","PVL - Produtos para Laboratório, Lda (501411852)","1.584,00 €",07-06-2018,15-05-2018,210 dias,"Portugal, Vila Real, Vila Real<BR/>Portugal, Porto, Maia","Artigo 20.º, n.º 1, alínea c) do Código dos Contratos Públicos",22-05-2018,"1.584,00 €",,,,Não aplicável.,Não aplicável.,FALSE
AP 324 - Aquisição de produtos para laboratório - Frasco Plástico N/ Esterilizado 250 ml com tampa,Consulta Prévia,Aquisição de bens móveis,"33695000-8, Todos os outros produtos não terapêuticos","Administração Regional de Saúde do Norte, I. P. (503135593)",VWR Internacional - Material de laboratório (503842770),"652,03 €",07-06-2018,15-05-2018,210 dias,"Portugal, Vila Real, Vila Real<BR/>Portugal, Porto, Maia","Artigo 20.º, n.º 1, alínea c) do Código dos Contratos Públicos",11-06-2018,"652,03 €",,,,Não aplicável.,Não aplicável.,FALSE
AP 324 - Aquisição de produtos para laboratório,Consulta Prévia,Aquisição de bens móveis,"33695000-8, Todos os outros produtos não terapêuticos","Administração Regional de Saúde do Norte, I. P. (503135593)","FRILABO, Lda (507958861)","410,17 €",07-06-2018,15-05-2018,210 dias,"Portugal, Porto, Maia<BR/>Portugal, Vila Real, Vila Real","Artigo 20.º, n.º 1, alínea c) do Código dos Contratos Públicos",22-10-2018,"410,17 €",,,,Não aplicável.,Não aplicável.,FALSE
AP 667 - Aquisição de 4 000 unidades de pipeta de pasteur 3 ml esterilizada,Consulta Prévia,Aquisição de bens móveis,"33693000-4, Todos os outros produtos terapêuticos","Administração Regional de Saúde do Norte, I. P. (503135593)",VWR Internacional (503842770),"51,20 €",07-06-2018,14-05-2018,210 dias,"Portugal, Vila Real, Vila Real<BR/>Portugal, Porto, Maia","Artigo 20.º, n.º 1, alínea c) do Código dos Contratos Públicos",29-05-2018,"51,20 €",,,,Não aplicável.,Não aplicável.,FALSE
AP 522 - Aquisição de 37 unidades de dispensador de papel das mãos,Ajuste Direto Regime Geral,Aquisição de bens móveis,"42968300-2, Sistema de distribuição de rolos de papel higiénico","Administração Regional de Saúde do Norte, I. P. (503135593)","SERVISAN PRODUTOS HIGIENE, S.A. (500246530)","370,00 €",07-06-2018,15-05-2018,210 dias,"Portugal, Vila Real, Vila Real<BR/>Portugal, Porto, Maia","Artigo 20.º, n.º 1, alínea d) do Código dos Contratos Públicos",18-05-2018,"370,00 €",,,,Não aplicável.,Não aplicável.,FALSE
"Aquisição de Extensão de Termociclador para LRSP (instalação, manutenção e calibração) - APROV-PRT 18000321 (AP162)",Ajuste Direto Regime Geral,Aquisição de bens móveis,"38000000-5, Equipamento laboratorial, óptico e de precisão (exc. óculos)","Administração Regional de Saúde do Norte, I. P. (503135593)","Tecnilab Portugal - Sociedade de Planeamento Técnico e Científico, S.A. (500758158)","10.970,00 €",06-06-2018,15-03-2018,270 dias,"Portugal, Braga, Braga","Artigo 24.º, n.º 1, alínea e), subalínea ii) do Código dos Contratos Públicos",29-03-2018,"10.970,00 €",,,,Não aplicável.,Não aplicável.,FALSE
Serviços de Manutenção e Suporte aos Equipamentos Cisco Aprov-Prt 18000110 Refª. 00031_2018,Consulta Prévia,Aquisição de serviços,"72611000-6, Serviços de assistência técnica informática","Administração Regional de Saúde do Norte, I. P. (503135593)","Cilnet - Comunicações e Projectos Especiais, SA (505267772)","51.489,89 €",05-06-2018,08-03-2018,66 dias,"Portugal, Porto, Porto","Artigo 20.º, n.º 1, alínea c) do Código dos Contratos Públicos",12-12-2018,"51.489,89 €",,,,Não aplicável.,Não aplicável.,FALSE
Serviços de Manutenção Corretiva e Evolutiva  dos Sistemas Clinidata Refª. 00076_2018,Ajuste Direto Regime Geral,Aquisição de serviços,"72610000-9, Serviços de assistência informática","Administração Regional de Saúde do Norte, I. P. (503135593)","Maxdata Software, S.A. (502250259)","5.869,44 €",05-06-2018,09-03-2018,275 dias,"Portugal, Porto, Porto","Artigo 24.º, n.º 1, alínea e), subalínea iii) do Código dos Contratos Públicos",03-12-2018,"5.869,44 €",,,,Não aplicável.,Não aplicável.,FALSE
Aquisição Bancadas Hospitalares USF Ruães - APROV-PRT 1800780 (AP836),Ajuste Direto Regime Geral,Aquisição de bens móveis,"39181000-4, Bancadas de laboratório","Administração Regional de Saúde do Norte, I. P. (503135593)","LABOROFFICE, LDA (513112065)","8.800,00 €",05-06-2018,07-05-2018,240 dias,"Portugal, Braga, Braga","Artigo 20.º, n.º 1, alínea d) do Código dos Contratos Públicos",29-05-2018,"8.800,00 €",,,,Não aplicável.,Não aplicável.,FALSE
Aquisição de 800 Unidades de Amicacina 250mg/ml Sol Inj 2ml IM IV,Ao abrigo de acordo-quadro (art.º 259.º),Aquisição de bens móveis,"33600000-6, Produtos farmacêuticos","Administração Regional de Saúde do Norte,IP (ARSN) (503135593)","LABESFAL-LABORATORIOS ALMIRO, SA (501169580)","960,00 €",04-06-2018,25-05-2018,216 dias,"Portugal, Vila Real, Vila Real<BR/>Portugal, Porto, Maia<BR/>Portugal, Distrito não determinado, Concelho não determinado",Artigo 259.º do Código dos Contratos Públicos,05-06-2018,"960,00 €",,,,2775691,CP 2017/5 - Acordo Quadro para fornecimento de Medicamentos anti-infeciosos: exceto antivíricos e antifúngicos,FALSE
