Objeto do Contrato,Tipo de Procedimento,Tipo(s) de Contrato,CPVs,Entidade(s) Adjudicante(s),Entidade(s) Adjudicatária(s),Preço Contratual,Data de Publicação,Data de Celebração do Contrato,Prazo de Execução,Local de Execução,Fundamentação,Data de Fecho do Contrato,Preço Total Efetivo,Causas das Alterações ao Prazo,Causas das Alterações ao Preço,Estado,N.º registo do Acordo Quadro,Descrição do Acordo Quadro,Procedimento Centralizado
RAMUCIZUMAB 500 MG E 10 MG,Ajuste Direto Regime Geral,Aquisição de bens móveis,"33600000-6, Produtos farmacêuticos","Centro Hospitalar de Setúbal, E. P. E. (507606787)","LILLY PORTUGAL PORTUGAL - PROD. FARM., LDA. (500165602)","45.080,00 €",21-09-2017,04-08-2017,365 dias,"Portugal, Setúbal, Setúbal","Artigo 24.º, n.º 1, alínea e) do Código dos Contratos Públicos",,,,,,Não aplicável.,Não aplicável.,FALSE
Termo-higrómetros,Ajuste Direto Regime Geral,Aquisição de bens móveis,"33000000-0, Equipamento médico, medicamentos e produtos para cuidados pessoais","Centro Hospitalar de Setúbal, E. P. E. (507606787)","Normax, Lda (500203130)","7.425,00 €",21-09-2017,08-09-2017,30 dias,"Portugal, Setúbal, Setúbal","Artigo 20.º, n.º 1, alínea a) do Código dos Contratos Públicos",,,,,,Não aplicável.,Não aplicável.,FALSE
sistema de gestão de atendimento para os utentes da urgência de ginecologia/obstetricia através do Sclinico,Ajuste Direto Regime Geral,Aquisição de bens móveis,"48000000-8, Pacotes de software e sistemas de informação","Centro Hospitalar de Setúbal, E. P. E. (507606787)",New Vision Technology Centre (504983474),"9.980,00 €",21-09-2017,07-09-2017,60 dias,"Portugal, Setúbal, Setúbal","Artigo 20.º, n.º 1, alínea a) do Código dos Contratos Públicos",,,,,,Não aplicável.,Não aplicável.,FALSE
"4C003217 - MCDT's de Otorrinolaringologia, para o Ano de 2017",Ajuste Direto Regime Geral,Aquisição de serviços,"85140000-2, Serviços de saúde diversos","Centro Hospitalar de Setúbal, E. P. E. (507606787)",Audicem (501099530),"16.209,00 €",18-09-2017,21-04-2017,272 dias,"Portugal, Setúbal, Setúbal","Artigo 20.º, n.º 1, alínea a) do Código dos Contratos Públicos",,,,,,Não aplicável.,Não aplicável.,FALSE
MEDICAMENTOS ANTIRRETROVÍRICOS PARA O TRATAMENTO DA INFEÇÃO POR VIH,Ao abrigo de acordo-quadro (art.º 259.º),Aquisição de bens móveis,"33600000-6, Produtos farmacêuticos","Centro Hospitalar de Setúbal, E. P. E. (507606787)","BRISTOL-MYERS SQUIBB FARMACÊUTICA PORTUGUESA, S.A. (500048193)","160.710,32 €",18-09-2017,17-08-2017,365 dias,"Portugal, Setúbal, Setúbal",Artigo 259.º do Código dos Contratos Públicos,,,,,,2183729,Medicamentos antirretrovíricos para o tratamento da infeção por VIH,FALSE
MEDICAMENTOS DO FORO ONCOLÓGICO,Ao abrigo de acordo-quadro (art.º 259.º),Aquisição de bens móveis,"33600000-6, Produtos farmacêuticos","Centro Hospitalar de Setúbal, E. P. E. (507606787)",ROCHE FARMACÊUTICA (500233810),"74.042,75 €",13-09-2017,24-07-2017,365 dias,"Portugal, Setúbal, Setúbal",Artigo 259.º do Código dos Contratos Públicos,,,,,,1771819,CP 2015/6 - Acordo quadro para o fornecimento de Medicamentos do Foro Oncológico,FALSE
DIVERSOS MEDICAMENTOS AUE,Ajuste Direto Regime Geral,Aquisição de bens móveis,"33600000-6, Produtos farmacêuticos","Centro Hospitalar de Setúbal, E. P. E. (507606787)","MEDA PHARMA, S.A. (500082090), LABORATÓRIOS PFIZER, LDA. (500162166), DUXPHARMA, LDA. (510803679), GLAXOSMITHKLINE PROD. FARMACÊUTICOS, LDA. (500139962), Merck Sharp & Dohme, Lda. (500191360), R2MC RANGEL, PRODUTOS FARMACÊUTICOS, S.A. (510599818), Lofarma Lusitana Limitada (502105488), B BRAUN MEDICAL LDA (501506543), MERCK, S.A. (500650870), MOVIANTO (509040411), NORGINE Portugal Farmacêutica Unipessoal, Lda (508676746), PHARMIS BIOFARMACÊUTICA, LDA. (502595442), BIOJAM S.A. (513642749), IDIS Ltd. (GB700513982)","67.173,40 €",13-09-2017,07-02-2017,365 dias,"Portugal, Setúbal, Setúbal","Artigo 20.º, n.º 1, alínea a) do Código dos Contratos Públicos",,,,,,Não aplicável.,Não aplicável.,FALSE
Monitores Sinais Vitais,Ajuste Direto Regime Geral,Aquisição de bens móveis,"33000000-0, Equipamento médico, medicamentos e produtos para cuidados pessoais","Centro Hospitalar de Setúbal, E. P. E. (507606787)",MEDICINÁLIA CORMEDICA (500684324),"7.630,00 €",11-09-2017,21-12-2015,30 dias,"Portugal, Setúbal, Setúbal","Artigo 20.º, n.º 1, alínea a) do Código dos Contratos Públicos",,,,,,Não aplicável.,Não aplicável.,FALSE
Incubadora para UCEN,Ajuste Direto Regime Geral,Aquisição de bens móveis,"33000000-0, Equipamento médico, medicamentos e produtos para cuidados pessoais","Centro Hospitalar de Setúbal, E. P. E. (507606787)","SPECULUM-ARTIGOS MÉDICOS, SA (502996323)","9.818,00 €",11-09-2017,17-10-2016,30 dias,"Portugal, Setúbal, Setúbal","Artigo 20.º, n.º 1, alínea a) do Código dos Contratos Públicos",,,,,,Não aplicável.,Não aplicável.,FALSE
Audiómetro e Impedanciometro,Ajuste Direto Regime Geral,Aquisição de bens móveis,"33000000-0, Equipamento médico, medicamentos e produtos para cuidados pessoais","Centro Hospitalar de Setúbal, E. P. E. (507606787)",Coselgi Portugal S.A. (509230598),"18.770,00 €",11-09-2017,25-08-2016,30 dias,"Portugal, Setúbal, Setúbal","Artigo 20.º, n.º 1, alínea a) do Código dos Contratos Públicos",,,,,,Não aplicável.,Não aplicável.,FALSE
Mesa RX para Intensificador Imagem,Ajuste Direto Regime Geral,Aquisição de bens móveis,"33000000-0, Equipamento médico, medicamentos e produtos para cuidados pessoais","Centro Hospitalar de Setúbal, E. P. E. (507606787)","MICROMIL - SISTEMAS MÉDICOS INDUSTRIAIS, SA  (501605770)","23.962,00 €",11-09-2017,21-08-2015,30 dias,"Portugal, Setúbal, Setúbal","Artigo 20.º, n.º 1, alínea a) do Código dos Contratos Públicos",,,,,,Não aplicável.,Não aplicável.,FALSE
