Objeto do Contrato,Tipo de Procedimento,Tipo(s) de Contrato,CPVs,Entidade(s) Adjudicante(s),Entidade(s) Adjudicatária(s),Preço Contratual,Data de Publicação,Data de Celebração do Contrato,Prazo de Execução,Local de Execução,Fundamentação,Data de Fecho do Contrato,Preço Total Efetivo,Causas das Alterações ao Prazo,Causas das Alterações ao Preço,Estado,N.º registo do Acordo Quadro,Descrição do Acordo Quadro,Procedimento Centralizado
Serviços medicos de MCDT de Medicina Nuclear,Ajuste Direto Regime Geral,Aquisição de serviços,"85145000-7, Serviços prestados por laboratórios médicos",Hospital Dr. Francisco Zagalo (501510150),CIMC-Centro Imagiologia Med. Computorizada (502767006),"8.827,00 €",01-08-2014,05-06-2014,120 dias,"Portugal, Aveiro, Ovar","Artigo 20.º, n.º 1, alínea a) do Código dos Contratos Públicos",25-10-2014,"8.447,56 €",,serviços efectuados abaixo do previsto,,Não aplicável.,Não aplicável.,FALSE
Aquisição diverso material consumo clinico,Ajuste Direto Regime Geral,Aquisição de bens móveis,"33162000-3, Aparelhos e instrumentos para blocos operatórios",Hospital Dr. Francisco Zagalo (501510150),"Geranswers, Lda (507683528)","110,00 €",31-07-2014,30-07-2014,150 dias,"Portugal, Aveiro, Ovar","Artigo 20.º, n.º 1, alínea a) do Código dos Contratos Públicos",31-12-2014,"110,00 €",,"",,Não aplicável.,Não aplicável.,FALSE
Aquisição de diverso material consumo clinico,Ajuste Direto Regime Geral,Aquisição de bens móveis,"33162000-3, Aparelhos e instrumentos para blocos operatórios",Hospital Dr. Francisco Zagalo (501510150),Covidien Portugal - Produt. Saude Unip. Lda (503413410),"5.400,00 €",31-07-2014,30-07-2014,150 dias,"Portugal, Aveiro, Ovar","Artigo 20.º, n.º 1, alínea a) do Código dos Contratos Públicos",31-12-2014,"5.400,00 €",,"",,Não aplicável.,Não aplicável.,FALSE
Aquisição diverso material consumo clinico,Ajuste Direto Regime Geral,Aquisição de bens móveis,"33162000-3, Aparelhos e instrumentos para blocos operatórios",Hospital Dr. Francisco Zagalo (501510150),"Visional Unipessoal, Lda (508798280)","145,00 €",31-07-2014,30-07-2014,150 dias,"Portugal, Aveiro, Ovar","Artigo 20.º, n.º 1, alínea a) do Código dos Contratos Públicos",31-12-2014,"145,00 €",,"",,Não aplicável.,Não aplicável.,FALSE
Aquisição de diverso material consumo clinico,Ajuste Direto Regime Geral,Aquisição de bens móveis,"33162000-3, Aparelhos e instrumentos para blocos operatórios",Hospital Dr. Francisco Zagalo (501510150),Filsat - Equipamentos Tecnicos Lda (506708616),"135,00 €",31-07-2014,30-07-2014,160 dias,"Portugal, Aveiro, Ovar","Artigo 20.º, n.º 1, alínea a) do Código dos Contratos Públicos",31-12-2014,"",,Sem fornecimentos,,Não aplicável.,Não aplicável.,FALSE
Aquisição de diverso material consumo clinico,Ajuste Direto Regime Geral,Aquisição de bens móveis,"33162000-3, Aparelhos e instrumentos para blocos operatórios",Hospital Dr. Francisco Zagalo (501510150),Teprel - Equipamentos tecnicos SA (502262184),"904,00 €",31-07-2014,30-07-2014,150 dias,"Portugal, Aveiro, Ovar","Artigo 20.º, n.º 1, alínea a) do Código dos Contratos Públicos",31-12-2014,"904,00 €",,"",,Não aplicável.,Não aplicável.,FALSE
