freguesia,acronym,validVotesPercentage,votes,dicofre
União das freguesias de São Sebastião da Giesteira e Nossa Senhora da Boa Fé,PCP-PEV,38.9,156,070527
União das freguesias de São Sebastião da Giesteira e Nossa Senhora da Boa Fé,PS,32.42,130,070527
União das freguesias de São Sebastião da Giesteira e Nossa Senhora da Boa Fé,PPD/PSD.CDS-PP,11.22,45,070527
União das freguesias de São Sebastião da Giesteira e Nossa Senhora da Boa Fé,PCTP/MRPP,6.48,26,070527
União das freguesias de São Sebastião da Giesteira e Nossa Senhora da Boa Fé,B.E.,4.74,19,070527
União das freguesias de São Sebastião da Giesteira e Nossa Senhora da Boa Fé,MPT,2.99,12,070527
União das freguesias de São Sebastião da Giesteira e Nossa Senhora da Boa Fé,L,0.75,3,070527
União das freguesias de São Sebastião da Giesteira e Nossa Senhora da Boa Fé,PAN,0.75,3,070527
União das freguesias de São Sebastião da Giesteira e Nossa Senhora da Boa Fé,PPM,0.75,3,070527
União das freguesias de São Sebastião da Giesteira e Nossa Senhora da Boa Fé,PND,0.5,2,070527
União das freguesias de São Sebastião da Giesteira e Nossa Senhora da Boa Fé,PNR,0.25,1,070527
União das freguesias de São Sebastião da Giesteira e Nossa Senhora da Boa Fé,PTP,0.25,1,070527
União das freguesias de São Sebastião da Giesteira e Nossa Senhora da Boa Fé,MAS,0,0,070527
União das freguesias de São Sebastião da Giesteira e Nossa Senhora da Boa Fé,PDA,0,0,070527
União das freguesias de São Sebastião da Giesteira e Nossa Senhora da Boa Fé,POUS,0,0,070527
União das freguesias de São Sebastião da Giesteira e Nossa Senhora da Boa Fé,PPV,0,0,070527
