Objeto do Contrato,Tipo de Procedimento,Tipo(s) de Contrato,CPVs,Entidade(s) Adjudicante(s),Entidade(s) Adjudicatária(s),Preço Contratual,Data de Publicação,Data de Celebração do Contrato,Prazo de Execução,Local de Execução,Fundamentação,Data de Fecho do Contrato,Preço Total Efetivo,Causas das Alterações ao Prazo,Causas das Alterações ao Preço,Estado,N.º registo do Acordo Quadro,Descrição do Acordo Quadro,Procedimento Centralizado
Aquisição de rádios portáteis e respetivos acessórios,Ajuste Direto Regime Geral,Aquisição de bens móveis,"32500000-8, Equipamento e material para telecomunicações","Instituto Nacional de Emergência Médica, I. P. (501356126)","NEC Portugal - Telecomunicações e Sistemas, S.A. (501676309)","20.155,00 €",26-10-2018,22-10-2018,60 dias,"Portugal, Lisboa, Lisboa","Artigo 24.º, n.º 1, alínea e), subalínea ii) do Código dos Contratos Públicos",,,,,,Não aplicável.,Não aplicável.,FALSE
Licenciamento do software Code-Stat e Lifenet,Ajuste Direto Regime Geral,Aquisição de bens móveis,"48000000-8, Pacotes de software e sistemas de informação","Instituto Nacional de Emergência Médica, I. P. (501356126)","Stryker Portugal, Produtos Médicos, Unip., Lda. (504594214)","14.036,00 €",25-10-2018,10-10-2018,60 dias,"Portugal, Lisboa, Lisboa","Artigo 24.º, n.º 1, alínea e), subalínea ii) do Código dos Contratos Públicos",,,,,,Não aplicável.,Não aplicável.,FALSE
Fornecimento do Upgrade Avaya Communication Manager R7.1 e CallBack Automático,Ajuste Direto Regime Geral,Aquisição de bens móveis,"32000000-3, Equipamento de rádio, televisão, comunicação, telecomunicações e afins","Instituto Nacional de Emergência Médica, I. P. (501356126)","PAPTI - Soluções Globais de Telecomunicações e Infonmática, S.A. (503280550)","237.381,83 €",23-10-2018,31-07-2018,30 dias,"Portugal, Portugal Continental","Artigo 24.º, n.º 1, alínea e), subalínea ii) do Código dos Contratos Públicos",,,,,,Não aplicável.,Não aplicável.,FALSE
