Objeto do Contrato,Tipo de Procedimento,Tipo(s) de Contrato,CPVs,Entidade(s) Adjudicante(s),Entidade(s) Adjudicatária(s),Preço Contratual,Data de Publicação,Data de Celebração do Contrato,Prazo de Execução,Local de Execução,Fundamentação,Data de Fecho do Contrato,Preço Total Efetivo,Causas das Alterações ao Prazo,Causas das Alterações ao Preço,Estado,N.º registo do Acordo Quadro,Descrição do Acordo Quadro,Procedimento Centralizado
Lote 3 - DP5 - Complexo Protrombina 500 UI,Ao abrigo de acordo-quadro (art.º 259.º),Aquisição de bens móveis,"33100000-1, Equipamento médico","Hospital Distrital Figueira da Foz, E.P.E. (506361527)","OCTAPHARMA - PRODUTOS FARMACÊUTICOS, LDA (502820780)","1.572,80 €",16-01-2019,01-10-2018,91 dias,"Portugal, Coimbra, Figueira da Foz",Artigo 259.º do Código dos Contratos Públicos,,,,,,2800702,CP 2017/9 - Acordo quadro para fornecimento de Derivados do Plasma Humano às Instituições e Serviços do Serviço Nacional de Saúde,TRUE
Lote 10 - I1092 - Ibrutinib (140 Mg; Cáp./Comp.),Ao abrigo de acordo-quadro (art.º 259.º),Aquisição de bens móveis,"33600000-6, Produtos farmacêuticos","Hospital Distrital Figueira da Foz, E.P.E. (506361527)","JANSSEN CILAG FARMACÊUTICA, LDA (500189412)","21.986,28 €",16-01-2019,06-08-2018,147 dias,"Portugal, Coimbra, Figueira da Foz",Artigo 259.º do Código dos Contratos Públicos,,,,,,2969238,"CP 2017/6 - Acordo Quadro para fornecimento de Medicamentos do Foro Oncológico e Imunomoduladores, às Instituições e Serviços do Serviço Nacional de Saúde",TRUE
AQUISIÇÃO DE GAZE CELULOSE OXIDADA 5X7 CM - CARTEIRA,Consulta Prévia,Aquisição de bens móveis,"33600000-6, Produtos farmacêuticos","Hospital Distrital Figueira da Foz, E.P.E. (506361527)","CLINIFAR - PROD. CLINICOS E FARMACEUTICOS, S.A. (503281115)","1.508,64 €",14-01-2019,26-11-2018,35 dias,"Portugal, Coimbra, Figueira da Foz","Artigo 20.º, n.º 1, alínea c) do Código dos Contratos Públicos",,,,,,Não aplicável.,Não aplicável.,FALSE
AQUISIÇÃO DE SULFADIAZINA ARGÊNTICA,Consulta Prévia,Aquisição de bens móveis,"33631000-2, Medicamentos usados em dermatologia","Hospital Distrital Figueira da Foz, E.P.E. (506361527)",EXPOMEDICA (501886621),"371,18 €",14-01-2019,23-11-2018,38 dias,"Portugal, Coimbra, Figueira da Foz","Artigo 20.º, n.º 1, alínea c) do Código dos Contratos Públicos",,,,,,Não aplicável.,Não aplicável.,FALSE
AQUISIÇÃO DE OCTENIDINA,Consulta Prévia,Aquisição de bens móveis,"33631000-2, Medicamentos usados em dermatologia","Hospital Distrital Figueira da Foz, E.P.E. (506361527)",LOGIFARMA - LOGISTICA FARMACÊUTICA S.A. (503934640),"1.728,00 €",14-01-2019,23-11-2018,38 dias,"Portugal, Coimbra, Figueira da Foz","Artigo 20.º, n.º 1, alínea c) do Código dos Contratos Públicos",,,,,,Não aplicável.,Não aplicável.,FALSE
AQUISIÇÃO DE VEDOLIZUMAB 300 MG - AMPOLAS,Ajuste Direto Regime Geral,Aquisição de bens móveis,"33652000-5, Antineoplásicos e imunomoduladores","Hospital Distrital Figueira da Foz, E.P.E. (506361527)","Takeda-Farmaceuticos Portugal, Lda. (502801204)","6.140,48 €",14-01-2019,30-11-2018,31 dias,"Portugal, Coimbra, Figueira da Foz","Artigo 20.º, n.º 1, alínea d) do Código dos Contratos Públicos",,,,,,Não aplicável.,Não aplicável.,FALSE
