freguesia,acronym,validVotesPercentage,votes,dicofre
Góis,PS,51.98,341,060604
Góis,PPD/PSD.CDS-PP,22.26,146,060604
Góis,MPT,10.06,66,060604
Góis,B.E.,5.49,36,060604
Góis,PCP-PEV,4.88,32,060604
Góis,L,1.37,9,060604
Góis,PCTP/MRPP,1.37,9,060604
Góis,PTP,0.76,5,060604
Góis,MAS,0.46,3,060604
Góis,PAN,0.46,3,060604
Góis,PPM,0.46,3,060604
Góis,PND,0.15,1,060604
Góis,PNR,0.15,1,060604
Góis,POUS,0.15,1,060604
Góis,PDA,0,0,060604
Góis,PPV,0,0,060604
