freguesia,acronym,validVotesPercentage,votes,dicofre
Alto do Palurdo,PPD/PSD.CDS-PP,45.37,49,091032
Alto do Palurdo,PS,41.67,45,091032
Alto do Palurdo,MPT,3.7,4,091032
Alto do Palurdo,PCP-PEV,3.7,4,091032
Alto do Palurdo,B.E.,1.85,2,091032
Alto do Palurdo,PCTP/MRPP,1.85,2,091032
Alto do Palurdo,MAS,0.93,1,091032
Alto do Palurdo,PPM,0.93,1,091032
Alto do Palurdo,L,0,0,091032
Alto do Palurdo,PAN,0,0,091032
Alto do Palurdo,PDA,0,0,091032
Alto do Palurdo,PND,0,0,091032
Alto do Palurdo,PNR,0,0,091032
Alto do Palurdo,POUS,0,0,091032
Alto do Palurdo,PPV,0,0,091032
Alto do Palurdo,PTP,0,0,091032
