Objeto do Contrato,Tipo de Procedimento,Tipo(s) de Contrato,CPVs,Entidade(s) Adjudicante(s),Entidade(s) Adjudicatária(s),Preço Contratual,Data de Publicação,Data de Celebração do Contrato,Prazo de Execução,Local de Execução,Fundamentação,Data de Fecho do Contrato,Preço Total Efetivo,Causas das Alterações ao Prazo,Causas das Alterações ao Preço,Estado,N.º registo do Acordo Quadro,Descrição do Acordo Quadro,Procedimento Centralizado
AQUISIÇÃO DE SERVIÇOS DE CONSULTORIA FINANCEIRA AO PROCEDIMENTO PRÉ-CONTRATUAL DE CONCURSO LIMITADO POR PRÉVIA QUALIFICAÇÃO COM PUBLICAÇÃO NO JOUE PARA A GESTÃO DO CENTRO DE CONFERÊNCIA DE FATURAS,Concurso público,Aquisição de serviços,"66171000-9, Serviços de consultoria financeira","Serviço Partilhados do Ministério da Saúde, E. P. E. (509540716)","Oliveira, Reis e Associados, SROC, Lda (501266259)","30.500,01 €",28-06-2013,25-06-2013,554 dias,Portugal,"Artigo 20.º, n.º 1, alínea b) do Código dos Contratos Públicos",31-05-2014,"30.500,01 €",,,,Não aplicável.,Não aplicável.,
Serviços Desenvolvimento e Manutenção Aplicacional GESTCARE CCI,Ao abrigo de acordo-quadro (art.º 259.º),Aquisição de serviços,"72600000-6, Serviços de consultoria e assistência informáticas","Serviço Partilhados do Ministério da Saúde, E. P. E. (509540716)","CARE4IT, Lda (505959224)","9.150,00 €",26-06-2013,26-06-2013,182 dias,"Portugal, Lisboa, Lisboa",Artigo 259.º do Código dos Contratos Públicos,31-12-2013,"9.150,00 €",,,,494439,"CONCURSO PÚBLICO COM PUBLICAÇÃO NO JOUE PARA A CELEBRAÇÃO DE ACORDO QUADRO PARA A PRESTAÇÃO DE SERVIÇOS DE CONSULTADORIA, DESENVOLVIMENTO E MANUTENÇÃO DE SOFTWARE  ",
