freguesia,acronym,validVotesPercentage,votes,dicofre
Bertiandos,PPD/PSD,37.74,60,160708
Bertiandos,CDS-PP,25.16,40,160708
Bertiandos,PS,22.01,35,160708
Bertiandos,B.E.,5.66,9,160708
Bertiandos,L,1.89,3,160708
Bertiandos,PCTP/MRPP,1.89,3,160708
Bertiandos,A,1.26,2,160708
Bertiandos,PDR,1.26,2,160708
Bertiandos,NC,0.63,1,160708
Bertiandos,PAN,0.63,1,160708
Bertiandos,PCP-PEV,0.63,1,160708
Bertiandos,PPM.PPV/CDC,0.63,1,160708
Bertiandos,PURP,0.63,1,160708
Bertiandos,IL,0,0,160708
Bertiandos,MAS,0,0,160708
Bertiandos,PNR,0,0,160708
Bertiandos,PTP,0,0,160708
