freguesia,acronym,validVotesPercentage,votes,dicofre
União das freguesias de Santa Marinha e São Martinho,PS,52,247,091232
União das freguesias de Santa Marinha e São Martinho,PPD/PSD.CDS-PP,25.47,121,091232
União das freguesias de Santa Marinha e São Martinho,MPT,7.79,37,091232
União das freguesias de Santa Marinha e São Martinho,PCP-PEV,5.05,24,091232
União das freguesias de Santa Marinha e São Martinho,B.E.,4.21,20,091232
União das freguesias de Santa Marinha e São Martinho,L,1.26,6,091232
União das freguesias de Santa Marinha e São Martinho,PCTP/MRPP,1.26,6,091232
União das freguesias de Santa Marinha e São Martinho,PTP,0.84,4,091232
União das freguesias de Santa Marinha e São Martinho,PAN,0.63,3,091232
União das freguesias de Santa Marinha e São Martinho,PPM,0.63,3,091232
União das freguesias de Santa Marinha e São Martinho,PND,0.42,2,091232
União das freguesias de Santa Marinha e São Martinho,PDA,0.21,1,091232
União das freguesias de Santa Marinha e São Martinho,POUS,0.21,1,091232
União das freguesias de Santa Marinha e São Martinho,MAS,0,0,091232
União das freguesias de Santa Marinha e São Martinho,PNR,0,0,091232
União das freguesias de Santa Marinha e São Martinho,PPV,0,0,091232
