bd_hospitais.Instituição,bd_hospitais..Localização.Geográfica.,nif
"Centro Hospitalar Trás-os-Montes e Alto Douro, EPE","41.3031784, -7.7515252",""
"Centro Hospitalar Vila Nova de Gaia/Espinho, EPE","41.1094138, -8.5972617",""
"Hospital da Senhora da Oliveira, Guimarães, EPE","41.4387173, -8.3086907",""
"Hospital Santa Maria Maior, EPE","41.5324234, -8.6171561",""
Instituto Nacional de Emergência Médica,"38.731388, -9.142606",""
"Centro Hospitalar Médio Ave, EPE","41.3423984, -8.4802503",""
"Centro Hospitalar Entre Douro e Vouga, EPE","40.9293884, -8.5458794",""
"Unidade Local de Saúde de Matosinhos, EPE","41.1794456, -8.6745115",""
"Instituto Português Oncologia do Porto, EPE","41.1785642, -8.6062881",""
"Unidade Local de Saúde do Alto Minho, EPE","41.7056054, -8.8252713",""
"Unidade Local de Saúde do Nordeste, EPE","41.8056532, -6.7888197",""
"Administração Regional de Saúde do Centro, IP","40.203689, -8.41931",""
"Centro Hospitalar do Algarve, EPE","37.0238973, -7.9281554",""
"Centro Hospitalar Universitário Cova da Beira, EPE","40.2804158, -7.4922407",""
"Centro Hospitalar de Leiria, EPE","39.7414812, -8.7982706",""
"Centro Hospitalar Baixo Vouga, EPE","40.6362453, -8.6543716",""
"Centro Hospitalar e Universitário de Coimbra, EPE","40.2191523, -8.4098211",""
"Centro Hospitalar Médio Tejo, EPE","39.478072, -8.5404429",""
"Unidade Local de Saúde do Litoral Alentejano, EPE","38.0162314, -8.6956768",""
"Unidade Local de Saúde do Norte Alentejano, EPE","39.3003425, -7.4263845",""
"Centro Hospitalar Universitário de Lisboa Norte, EPE","38.7500861, -9.1616116",""
"Centro Hospitalar Lisboa Ocidental, EPE","38.708454, -9.216985",""
"Centro Hospitalar de Setúbal, EPE","38.5283754, -8.8818638",""
"Hospital Distrital de Santarém, EPE","39.2410946, -8.6937515",""
"Hospital Garcia de Orta, EPE","38.6658713, -9.1822554",""
"Hospital Professor Doutor Fernando Fonseca, EPE","38.7422257, -9.2264834",""
Centro Hospitalar Psiquiátrico de Lisboa,"38.7569771, -9.1460705",""
"Centro Hospitalar Tondela-Viseu, EPE","40.516364, -8.0827433",""
Centro de Medicina de Reabilitação da Região Centro,"40.297919, -8.7707806",""
Hospital Arcebispo João Crisóstomo,"40.3470015, -8.5933462",""
"Hospital Distrital Figueira da Foz, EPE","40.117897, -8.8586755",""
Hospital Dr. Francisco Zagalo,"40.8571967, -8.6318023",""
"Instituto Português do Sangue e da Transplantação,IP","38.7567758, -9.1505021",""
"Unidade Local de Saúde da Guarda, EPE","40.5309916, -7.2734793",""
"Unidade Local de Saúde de Castelo Branco, EPE","39.8212263, -7.4981271",""
"Centro Hospitalar Barreiro/Montijo, EPE","38.6554005, -9.0592392",""
"Centro Hospitalar Universitário Lisboa Central, EPE","38.7166948, -9.1371248",""
"Centro Hospitalar do Oeste, EPE","39.4054629, -9.1258493",""
"Unidade Local de Saúde do Baixo Alentejo, EPE","38.014123, -7.8721227",""
"Administração Regional de Saúde de Lisboa e Vale do Tejo, IP","38.748871, -9.139639",""
"Hospital Espírito Santo de Évora, EPE","38.5684861, -7.9032848",""
"Administração Regional de Saúde do Alentejo, IP","38.00989, -7.85548",""
"Instituto Português Oncologia de Lisboa, EPE","38.7396768, -9.1634516",""
"Administração Regional de Saúde do Norte, IP","41.157511, -8.604463",""
"Centro Hospitalar Universitário do Porto, EPE","41.1472498, -8.6172617",""
"Centro Hospitalar Tâmega e Sousa, EPE","41.2494561, -8.264901",""
"Centro Hospitalar Póvoa de Varzim/Vila do Conde, EPE","41.3828711, -8.7589945",""
"Centro Hospitalar Universitário de São João, EPE","41.1831056, -8.6010558",""
"Hospital de Magalhães Lemos, EPE","41.1764649, -8.6649823",""
Instituto Oftalmológico Dr. Gama Pinto,"38.7218793, -9.144249",""
"Administração Regional de Saúde do Algarve, IP","37.027148, -7.946896",""
"Instituto Português Oncologia de Coimbra, EPE","40.2162514, -8.4103814",""
