Objeto do Contrato,Tipo de Procedimento,Tipo(s) de Contrato,CPVs,Entidade(s) Adjudicante(s),Entidade(s) Adjudicatária(s),Preço Contratual,Data de Publicação,Data de Celebração do Contrato,Prazo de Execução,Local de Execução,Fundamentação,Data de Fecho do Contrato,Preço Total Efetivo,Causas das Alterações ao Prazo,Causas das Alterações ao Preço,Estado,N.º registo do Acordo Quadro,Descrição do Acordo Quadro,Procedimento Centralizado
AD1809-2018DISPOSITIVO MEDICO REAGENTES PARA EXTRAÇÃO DE ACIDOS NUCLEICOS E TESTES MOLECULARES HPV,Ajuste Direto Regime Geral,Aquisição de bens móveis,"33600000-6, Produtos farmacêuticos","Instituto Português de Oncologia de Lisboa Francisco Gentil, E. P. E. (506361616)",WERFEN PORTUGAL LIMITADA (501086110),"88.230,30 €",21-12-2018,22-11-2018,30 dias,"Portugal, Lisboa, Lisboa","Artigo 24.º, n.º 1, alínea e), subalínea ii) do Código dos Contratos Públicos",,,,,,Não aplicável.,Não aplicável.,FALSE
Migração do Clinidata XXI para Clinidata WEB,Ajuste Direto Regime Geral,Aquisição de serviços,"72500000-0, Serviços relacionados com a informática","Instituto Português de Oncologia de Lisboa FG, E.P.E. (506361616)","Maxdata Software, S.A. (502250259)","47.250,00 €",21-12-2018,21-11-2018,30 dias,"Portugal, Lisboa, Lisboa<BR/>Portugal","Artigo 24.º, n.º 1, alínea e), subalínea ii) do Código dos Contratos Públicos",,,,,,Não aplicável.,Não aplicável.,FALSE
