Objeto do Contrato,Tipo de Procedimento,Tipo(s) de Contrato,CPVs,Entidade(s) Adjudicante(s),Entidade(s) Adjudicatária(s),Preço Contratual,Data de Publicação,Data de Celebração do Contrato,Prazo de Execução,Local de Execução,Fundamentação,Data de Fecho do Contrato,Preço Total Efetivo,Causas das Alterações ao Prazo,Causas das Alterações ao Preço,Estado,N.º registo do Acordo Quadro,Descrição do Acordo Quadro,Procedimento Centralizado
Aquisição de vinhetas e blocos de receituario - ACES Oeste Sul,Ajuste Direto Regime Geral,Aquisição de bens móveis,"30199761-2, Etiquetas com códigos de barras","Administração Regional de Saúde de Lisboa e Vale do Tejo, I. P. (503148776)",INCM - Imprensa Nacional Casa da Moeda (500792887),"95,00 €",11-03-2015,27-02-2015,20 dias,"Portugal, Lisboa, Torres Vedras","Artigo 24.º, n.º 1, alínea e) do Código dos Contratos Públicos",04-03-2015,"95,00 €",,,,Não aplicável.,Não aplicável.,FALSE
Aqusição de Metoclopramida 10MG/2ML,Ajuste Direto Regime Geral,Aquisição de bens móveis,"33000000-0, Equipamento médico, medicamentos e produtos para cuidados pessoais","Administração Regional de Saúde de Lisboa e Vale do Tejo, I. P. (503148776)","LABESFAL - LABORATORIOS ALMIRO, S.A. (501169580)","1.650,00 €",11-03-2015,05-03-2015,289 dias,"Portugal, Lisboa","Artigo 26.º, n.º 1, alínea e) do Código dos Contratos Públicos","","",,,,Não aplicável.,Não aplicável.,FALSE
Aquisição de Salbutamol 100MCG/dose Susp Press Inal,Ajuste Direto Regime Geral,Aquisição de bens móveis,"33000000-0, Equipamento médico, medicamentos e produtos para cuidados pessoais","Administração Regional de Saúde de Lisboa e Vale do Tejo, I. P. (503148776)","GLAXOSMITHKLINE - PRODUTOS FARMACEUTICOS, LDA. (500139962)","1.000,00 €",10-03-2015,03-03-2015,290 dias,"Portugal, Lisboa","Artigo 26.º, n.º 1, alínea e) do Código dos Contratos Públicos","","",,,,Não aplicável.,Não aplicável.,FALSE
Serv transporte pessoal - Aces Oeste sul,Ajuste Direto Regime Geral,Aquisição de serviços,"60120000-5, Serviços de táxis","Administração Regional de Saúde de Lisboa e Vale do Tejo, I. P. (503148776)",Antonio Luis Sousa Ferreira Martins (116358882),"16,75 €",09-03-2015,25-03-2014,20 dias,"Portugal, Lisboa, Torres Vedras","Artigo 20.º, n.º 1, alínea a) do Código dos Contratos Públicos","","",,,,Não aplicável.,Não aplicável.,FALSE
serv transp pessoal - Aces oeste sul,Ajuste Direto Regime Geral,Aquisição de serviços,"60120000-5, Serviços de táxis","Administração Regional de Saúde de Lisboa e Vale do Tejo, I. P. (503148776)","Corrida Brilhante taxi, Lda (508790751)","650,94 €",09-03-2015,25-03-2014,20 dias,"Portugal, Lisboa, Torres Vedras","Artigo 20.º, n.º 1, alínea a) do Código dos Contratos Públicos","","",,,,Não aplicável.,Não aplicável.,FALSE
"PRESTAÇÃO DE SERVIÇOS MÉDICOS PARA A ÁREA DA DEPENDÊNCIA DA ARSLVT, IP PARA 2015",Ajuste Direto Regime Geral,Aquisição de serviços,"85100000-0, Serviços de saúde","Administração Regional de Saúde de Lisboa e Vale do Tejo, I. P. (503148776)","SUCESSO 24 HORAS, S.A.  (507328310)","7.335,20 €",09-03-2015,30-01-2015,365 dias,"Portugal, Setúbal, Setúbal",Artigo 258.º do Código dos Contratos Públicos,"","",,,,Não aplicável.,Não aplicável.,FALSE
"PRESTAÇÃO DE SERVIÇOS MÉDICOS PARA A ÁREA DA DEPENDÊNCIA DA ARSLVT, IP PARA 2015",Ajuste Direto Regime Geral,Aquisição de serviços,"85100000-0, Serviços de saúde","Administração Regional de Saúde de Lisboa e Vale do Tejo, I. P. (503148776)","KELLY SERVICES - HEALTHCARE, UNIPESSOAL, LDA  (510723691)","38.948,11 €",09-03-2015,30-01-2015,365 dias,"Portugal, Lisboa, Lisboa",Artigo 258.º do Código dos Contratos Públicos,"","",,,,Não aplicável.,Não aplicável.,FALSE
"PRESTAÇÃO DE SERVIÇOS MÉDICOS PARA A ÁREA DA DEPENDÊNCIA DA ARSLVT, IP PARA 2015",Ajuste Direto Regime Geral,Aquisição de serviços,"85100000-0, Serviços de saúde","Administração Regional de Saúde de Lisboa e Vale do Tejo, I. P. (503148776)","SUCESSO 24 HORAS, S.A. (507328310)","365.843,10 €",09-03-2015,30-01-2015,365 dias,"Portugal, Santarém, Torres Novas",Artigo 258.º do Código dos Contratos Públicos,"","",,,,Não aplicável.,Não aplicável.,FALSE
"PRESTAÇÃO DE SERVIÇOS MÉDICOS PARA A ÁREA DA DEPENDÊNCIA DA ARSLVT, IP PARA 2015",Ajuste Direto Regime Geral,Aquisição de serviços,"85100000-0, Serviços de saúde","Administração Regional de Saúde de Lisboa e Vale do Tejo, I. P. (503148776)","SUCESSO 24 HORAS, S.A. (507328310)","223.723,60 €",09-03-2015,30-01-2015,365 dias,"Portugal, Lisboa, Vila Franca de Xira",Artigo 258.º do Código dos Contratos Públicos,"","",,,,Não aplicável.,Não aplicável.,FALSE
"PRESTAÇÃO DE SERVIÇOS MÉDICOS PARA A ÁREA DA DEPENDÊNCIA DA ARSLVT, IP PARA 2015",Ajuste Direto Regime Geral,Aquisição de serviços,"85100000-0, Serviços de saúde","Administração Regional de Saúde de Lisboa e Vale do Tejo, I. P. (503148776)","KELLY SERVICES - HEALTHCARE, UNIPESSOAL, LDA  (510723691)","542.264,73 €",09-03-2015,30-01-2015,365 dias,"Portugal, Lisboa, Torres Vedras",Artigo 258.º do Código dos Contratos Públicos,"","",,,,Não aplicável.,Não aplicável.,FALSE
"PRESTAÇÃO DE SERVIÇOS MÉDICOS PARA A ÁREA DA DEPENDÊNCIA DA ARSLVT, IP PARA 2015",Ajuste Direto Regime Geral,Aquisição de serviços,"85100000-0, Serviços de saúde","Administração Regional de Saúde de Lisboa e Vale do Tejo, I. P. (503148776)","SUCESSO 24 HORAS, S.A. (507328310)","110.028,00 €",09-03-2015,30-01-2015,365 dias,"Portugal, Leiria, Caldas da Rainha",Artigo 258.º do Código dos Contratos Públicos,"","",,,,Não aplicável.,Não aplicável.,FALSE
"PRESTAÇÃO DE SERVIÇOS MÉDICOS PARA A ÁREA DA DEPENDÊNCIA DA ARSLVT, IP PARA 2015",Ajuste Direto Regime Geral,Aquisição de serviços,"85100000-0, Serviços de saúde","Administração Regional de Saúde de Lisboa e Vale do Tejo, I. P. (503148776)","SUCESSO 24 HORAS, S.A. (507328310)","183.380,00 €",09-03-2015,30-01-2015,365 dias,"Portugal, Setúbal, Barreiro",Artigo 258.º do Código dos Contratos Públicos,"","",,,,Não aplicável.,Não aplicável.,FALSE
"PRESTAÇÃO DE SERVIÇOS MÉDICOS PARA A ÁREA DA DEPENDÊNCIA DA ARSLVT, IP PARA 2015",Ajuste Direto Regime Geral,Aquisição de serviços,"85100000-0, Serviços de saúde","Administração Regional de Saúde de Lisboa e Vale do Tejo, I. P. (503148776)","SUCESSO 24 HORAS, S.A. (507328310)","290.657,30 €",09-03-2015,30-01-2015,365 dias,"Portugal, Setúbal, Setúbal",Artigo 258.º do Código dos Contratos Públicos,"","",,,,Não aplicável.,Não aplicável.,FALSE
"PRESTAÇÃO DE SERVIÇOS MÉDICOS PARA A ÁREA DA DEPENDÊNCIA DA ARSLVT, IP PARA 2015",Ajuste Direto Regime Geral,Aquisição de serviços,"85100000-0, Serviços de saúde","Administração Regional de Saúde de Lisboa e Vale do Tejo, I. P. (503148776)","KELLY SERVICES - HEALTHCARE, UNIPESSOAL, LDA  (510723691)","347.815,68 €",09-03-2015,30-01-2015,365 dias,"Portugal, Setúbal, Almada",Artigo 258.º do Código dos Contratos Públicos,"","",,,,Não aplicável.,Não aplicável.,FALSE
"PRESTAÇÃO DE SERVIÇOS MÉDICOS PARA A ÁREA DA DEPENDÊNCIA DA ARSLVT, IP PARA 2015",Ajuste Direto Regime Geral,Aquisição de serviços,"85100000-0, Serviços de saúde","Administração Regional de Saúde de Lisboa e Vale do Tejo, I. P. (503148776)","SUCESSO 24 HORAS, S.A. (507328310)","344.754,40 €",09-03-2015,30-01-2015,365 dias,"Portugal, Santarém, Santarém",Artigo 258.º do Código dos Contratos Públicos,"","",,,,Não aplicável.,Não aplicável.,FALSE
"PRESTAÇÃO DE SERVIÇOS MÉDICOS PARA A ÁREA DA DEPENDÊNCIA DA ARSLVT, IP PARA 2015",Ajuste Direto Regime Geral,Aquisição de serviços,"85100000-0, Serviços de saúde","Administração Regional de Saúde de Lisboa e Vale do Tejo, I. P. (503148776)","KELLY SERVICES - HEALTHCARE, UNIPESSOAL, LDA  (510723691)","95.105,85 €",09-03-2015,30-01-2015,365 dias,"Portugal, Lisboa, Cascais",Artigo 258.º do Código dos Contratos Públicos,"","",,,,Não aplicável.,Não aplicável.,FALSE
"PRESTAÇÃO DE SERVIÇOS MÉDICOS PARA A ÁREA DA DEPENDÊNCIA DA ARSLVT, IP PARA 2015",Ajuste Direto Regime Geral,Aquisição de serviços,"85100000-0, Serviços de saúde","Administração Regional de Saúde de Lisboa e Vale do Tejo, I. P. (503148776)","KELLY SERVICES - HEALTHCARE, UNIPESSOAL, LDA  (510723691)","330.606,05 €",09-03-2015,30-01-2015,365 dias,"Portugal, Lisboa, Sintra",Artigo 258.º do Código dos Contratos Públicos,"","",,,,Não aplicável.,Não aplicável.,FALSE
"PRESTAÇÃO DE SERVIÇOS MÉDICOS PARA A ÁREA DA DEPENDÊNCIA DA ARSLVT, IP PARA 2015",Ajuste Direto Regime Geral,Aquisição de serviços,"85100000-0, Serviços de saúde","Administração Regional de Saúde de Lisboa e Vale do Tejo, I. P. (503148776)","KELLY SERVICES - HEALTHCARE, UNIPESSOAL, LDA  (510723691)","90.577,00 €",09-03-2015,30-01-2015,365 dias,"Portugal, Lisboa, Lisboa",Artigo 258.º do Código dos Contratos Públicos,"","",,,,Não aplicável.,Não aplicável.,FALSE
"PRESTAÇÃO DE SERVIÇOS MÉDICOS PARA A ÁREA DA DEPENDÊNCIA DA ARSLVT, IP PARA 2015",Ajuste Direto Regime Geral,Aquisição de serviços,"85100000-0, Serviços de saúde","Administração Regional de Saúde de Lisboa e Vale do Tejo, I. P. (503148776)","KELLY SERVICES - HEALTHCARE, UNIPESSOAL, LDA  (510723691)","90.577,00 €",09-03-2015,30-01-2015,365 dias,"Portugal, Lisboa, Loures",Artigo 258.º do Código dos Contratos Públicos,"","",,,,Não aplicável.,Não aplicável.,FALSE
"PRESTAÇÃO DE SERVIÇOS MÉDICOS PARA A ÁREA DA DEPENDÊNCIA DA ARSLVT, IP PARA 2015",Ajuste Direto Regime Geral,Aquisição de serviços,"85100000-0, Serviços de saúde","Administração Regional de Saúde de Lisboa e Vale do Tejo, I. P. (503148776)","KELLY SERVICES - HEALTHCARE, UNIPESSOAL, LDA  (510723691)","36.230,80 €",09-03-2015,30-01-2015,365 dias,"Portugal, Lisboa, Lisboa",Artigo 258.º do Código dos Contratos Públicos,"","",,,,Não aplicável.,Não aplicável.,FALSE
"PRESTAÇÃO DE SERVIÇOS MÉDICOS PARA A ÁREA DA DEPENDÊNCIA DA ARSLVT, IP PARA 2015",Ajuste Direto Regime Geral,Aquisição de serviços,"85100000-0, Serviços de saúde","Administração Regional de Saúde de Lisboa e Vale do Tejo, I. P. (503148776)","KELLY SERVICES - HEALTHCARE, UNIPESSOAL, LDA  (510723691)","60.686,59 €",09-03-2015,30-01-2015,365 dias,"Portugal, Lisboa, Lisboa",Artigo 258.º do Código dos Contratos Públicos,"","",,,,Não aplicável.,Não aplicável.,FALSE
"PRESTAÇÃO DE SERVIÇOS MÉDICOS PARA A ÁREA DA DEPENDÊNCIA DA ARSLVT, IP PARA 2015",Ajuste Direto Regime Geral,Aquisição de serviços,"85100000-0, Serviços de saúde","Administração Regional de Saúde de Lisboa e Vale do Tejo, I. P. (503148776)","KELLY SERVICES - HEALTHCARE, UNIPESSOAL, LDA  (510723691)","65.215,44 €",09-03-2015,30-01-2015,365 dias,"Portugal, Lisboa, Lisboa",Artigo 258.º do Código dos Contratos Públicos,"","",,,,Não aplicável.,Não aplicável.,FALSE
INSULINA HUMANA 100UI/ML - ACÇÃO CURTA - SOLUÇÃO INJECTÁVEL - FRASCO DE 10ML,Ajuste Direto Regime Geral,Aquisição de bens móveis,"33690000-3, Medicamentos vários","Administração Regional de Saúde de Lisboa e Vale do Tejo, I. P. (503148776)","NOVO NORDISK - COMÉRCIO PRODUTOS FARMACÊUTICOS, LDA (501485210)","4.135,00 €",09-03-2015,19-02-2015,20 dias,"Portugal, Lisboa, Lisboa","Artigo 24.º, n.º 1, alínea e) do Código dos Contratos Públicos","","",,,,Não aplicável.,Não aplicável.,FALSE
CLEMASTINA 2MG/2ML SOLUÇÃO INJETAVEL (IM/IV),Ajuste Direto Regime Geral,Aquisição de bens móveis,"33690000-3, Medicamentos vários","Administração Regional de Saúde de Lisboa e Vale do Tejo, I. P. (503148776)","NOVARTIS CONSUMER HEALTH - PRODUTOS FARMACÊUTICOS E NUTRIÇÃO, LDA (500268215)","5.562,00 €",09-03-2015,05-02-2015,365 dias,"Portugal, Lisboa, Lisboa","Artigo 24.º, n.º 1, alínea e) do Código dos Contratos Públicos","","",,,,Não aplicável.,Não aplicável.,FALSE
TERBUTALINA 500UG/DOSE,Ajuste Direto Regime Geral,Aquisição de bens móveis,"33690000-3, Medicamentos vários","Administração Regional de Saúde de Lisboa e Vale do Tejo, I. P. (503148776)",Astrazeneca - Produtos Farmacêuticos Lda (502942240),"662,00 €",09-03-2015,02-02-2015,3 dias,"Portugal, Lisboa, Lisboa","Artigo 26.º, n.º 1, alínea e) do Código dos Contratos Públicos","","",,,,Não aplicável.,Não aplicável.,FALSE
SOLUÇÃO POLIMERICA PARA REFORÇO DE EXTRATO DE CORNEA - EM SPRAY 28ML,Ajuste Direto Regime Geral,Aquisição de bens móveis,"33690000-3, Medicamentos vários","Administração Regional de Saúde de Lisboa e Vale do Tejo, I. P. (503148776)",Smith & Nephew Lda (503552461),"30.289,68 €",09-03-2015,03-02-2015,365 dias,"Portugal, Lisboa, Lisboa","Artigo 26.º, n.º 1, alínea e) do Código dos Contratos Públicos","","",,,,Não aplicável.,Não aplicável.,FALSE
HALOPERIDOL 5MG/ML - SOLUÇÃO INJECTÁVEL,Ajuste Direto Regime Geral,Aquisição de bens móveis,"33690000-3, Medicamentos vários","Administração Regional de Saúde de Lisboa e Vale do Tejo, I. P. (503148776)","RATIOPHARM - COMÉRCIO E INDÚSTRIA DE PRODUTOS FARMACÊUTICOS, LDA (502414910)","111,00 €",09-03-2015,04-03-2015,1 dias,"Portugal, Lisboa, Lisboa","Artigo 24.º, n.º 1, alínea e) do Código dos Contratos Públicos","","",,,,Não aplicável.,Não aplicável.,FALSE
CEFTRIAXONA 500MG IM - AMPOLA,Ajuste Direto Regime Geral,Aquisição de bens móveis,"33690000-3, Medicamentos vários","Administração Regional de Saúde de Lisboa e Vale do Tejo, I. P. (503148776)","LABESFAL - LABORATÓRIOS ALMIRO, S.A. (501169580)","748,80 €",09-03-2015,04-03-2015,1 dias,"Portugal, Lisboa, Lisboa","Artigo 26.º, n.º 1, alínea e) do Código dos Contratos Públicos","","",,,,Não aplicável.,Não aplicável.,FALSE
"SABAO FISIOLOG DERMOPROT PH 5,5 FR 500ML",Ajuste Direto Regime Geral,Aquisição de bens móveis,"33140000-3, Material médico de consumo","Administração Regional de Saúde de Lisboa e Vale do Tejo, I. P. (503148776)","B.BRAUN MEDICAL, LDA (501506543)","5.700,00 €",09-03-2015,03-03-2015,365 dias,"Portugal, Lisboa, Lisboa","Artigo 26.º, n.º 1, alínea e) do Código dos Contratos Públicos","","",,,,Não aplicável.,Não aplicável.,FALSE
"TROLAMINA 6,7MG EMULSÃO CUTÂNEA - BISNAGA DE 100ML",Ajuste Direto Regime Geral,Aquisição de bens móveis,"33690000-3, Medicamentos vários","Administração Regional de Saúde de Lisboa e Vale do Tejo, I. P. (503148776)","JOHNSON & JOHNSON, LDA (500153370)","61.680,00 €",09-03-2015,30-12-2014,365 dias,"Portugal, Lisboa, Lisboa","Artigo 24.º, n.º 1, alínea e) do Código dos Contratos Públicos","","",,,,Não aplicável.,Não aplicável.,FALSE
HIDROCORTISONA 10 MG/G - BISNAGA 30MG,Ajuste Direto Regime Geral,Aquisição de bens móveis,"33690000-3, Medicamentos vários","Administração Regional de Saúde de Lisboa e Vale do Tejo, I. P. (503148776)","OVERPHARMA - PRODUTOS MÉDICOS E FARMACÊUTICOS, LDA (505792362)","13.600,00 €",06-03-2015,03-03-2015,365 dias,"Portugal, Lisboa, Lisboa","Artigo 26.º, n.º 1, alínea e) do Código dos Contratos Públicos","","",,,,Não aplicável.,Não aplicável.,FALSE
ETIQUETAS ZEBRA 57X32,Ajuste Direto Regime Geral,Aquisição de bens móveis,"30192800-9, Etiquetas autocolantes","Administração Regional de Saúde de Lisboa e Vale do Tejo, I. P. (503148776)","OLMAR - ARTIGOS DE PAPELARIA, LDA (508831989)","9.520,00 €",06-03-2015,04-03-2015,5 dias,"Portugal, Lisboa, Lisboa","Artigo 20.º, n.º 1, alínea a) do Código dos Contratos Públicos","","",,,,Não aplicável.,Não aplicável.,FALSE
"PRESTAÇÃO DE SERVIÇOS DE ACOMPANHAMENTO À PRODUÇÃO DOS HOSPITAIS DE LOURES E VILA FRANCA DE XIRA EM REGIME DE PPP, PARA O ANO DE 2015.",Ajuste Direto Regime Geral,Aquisição de serviços,"79413000-2, Serviços de consultoria em matéria de gestão de marketing","Administração Regional de Saúde de Lisboa e Vale do Tejo, I. P. (503148776)","BANCO BPI, S.A. (501214534)","103.994,00 €",06-03-2015,25-02-2015,365 dias,"Portugal, Lisboa, Lisboa","Artigo 27.º, n.º 1, alínea b) do Código dos Contratos Públicos","","",,,,Não aplicável.,Não aplicável.,FALSE
Aquisição de Solução Alcoolica c/dermoprotetor fr 500ml,Ajuste Direto Regime Geral,Aquisição de bens móveis,"33140000-3, Material médico de consumo","Administração Regional de Saúde de Lisboa e Vale do Tejo, I. P. (503148776)","PROCLINICA EQUIPAMENTOS E PRODUTOS CLINICOS, S.A. (500222665)","16.440,00 €",06-03-2015,27-02-2015,300 dias,"Portugal, Lisboa","Artigo 26.º, n.º 1, alínea e) do Código dos Contratos Públicos","","",,,,Não aplicável.,Não aplicável.,FALSE
Trabalhos de Conservação da Cobertura da Unidade de Saúde de Benavente,Ajuste Direto Regime Geral,Empreitadas de obras públicas,"45113000-2, Obras no local","Administração Regional de Saúde de Lisboa e Vale do Tejo, I. P. (503148776)","Ecoedifica, Ambiente e Construções, S.A. (503554138)","41.958,12 €",06-03-2015,24-02-2015,75 dias,"Portugal, Santarém, Benavente","Artigo 19.º, alínea a) do Código dos Contratos Públicos","","",,,,Não aplicável.,Não aplicável.,FALSE
Empreitada de Reabilitação do Centro de Saúde de Palmela,Ajuste Direto Regime Geral,Empreitadas de obras públicas,"45113000-2, Obras no local","Administração Regional de Saúde de Lisboa e Vale do Tejo, I. P. (503148776)","Betonit - Engenharia e Construções, Lda (504631080)","106.200,15 €",06-03-2015,26-02-2015,90 dias,"Portugal, Setúbal, Palmela","Artigo 19.º, alínea a) do Código dos Contratos Públicos","","",,,,Não aplicável.,Não aplicável.,FALSE
Aquisição de Captopril 25mg comprimidos,Ajuste Direto Regime Geral,Aquisição de bens móveis,"33000000-0, Equipamento médico, medicamentos e produtos para cuidados pessoais","Administração Regional de Saúde de Lisboa e Vale do Tejo, I. P. (503148776)","GENERIS FARMACEUTICA, S.A. (508107997)","200,00 €",04-03-2015,23-02-2015,302 dias,"Portugal, Lisboa",Artigo 258.º do Código dos Contratos Públicos,"","",,,,Não aplicável.,Não aplicável.,FALSE
AQUISIÇÃO DE CARBOXIMETILCELULOSE SODICA C/ PRATA 10X10CM,Ajuste Direto Regime Geral,Aquisição de bens móveis,"33000000-0, Equipamento médico, medicamentos e produtos para cuidados pessoais","Administração Regional de Saúde de Lisboa e Vale do Tejo, I. P. (503148776)","Kvtech Portugal, Lda. (508671531)","729.600,00 €",04-03-2015,16-02-2015,302 dias,"Portugal, Lisboa","Artigo 26.º, n.º 1, alínea e) do Código dos Contratos Públicos","","",,,,Não aplicável.,Não aplicável.,FALSE
AQUISIÇÃO DE SERVIÇOS DE ASSESSORIA JURÍDICA PARA O DEPARTAMENTO DE RECURSOS HUMANOS - ANO 2015.,Ajuste Direto Regime Geral,Aquisição de serviços,"79100000-5, Serviços jurídicos","Administração Regional de Saúde de Lisboa e Vale do Tejo, I. P. (503148776)","BRITO ARTUR SILVA & ASSOCIADOS - SOCIEDADE DE ADVOGADOS, R.L. (509100007)","42.120,00 €",04-03-2015,23-02-2015,365 dias,"Portugal, Lisboa, Lisboa","Artigo 27.º, n.º 1, alínea b) do Código dos Contratos Públicos","","",,,,Não aplicável.,Não aplicável.,FALSE
"Fornecimento de telecomunicações fixas de voz para as instalações da ARSLVT, IP",Ajuste Direto Regime Geral,Aquisição de serviços,"64200000-8, Serviços de telecomunicações","Administração Regional de Saúde de Lisboa e Vale do Tejo, I. P. (503148776)","MEO - Serviços de Comunicações Multimédia, SA (504615947)","14.700,56 €",03-03-2015,03-03-2015,59 dias,"Portugal, Aveiro","Artigo 24.º, n.º 1, alínea e) do Código dos Contratos Públicos","","",,,,Não aplicável.,Não aplicável.,FALSE
Aquisição de equipamento médico Cirúrgico e mobiliário hospitalar para várias Unidades do ACES Arco Ribeirinho,Ajuste Direto Regime Geral,Aquisição de bens móveis,"33192000-2, Mobiliário para fins médicos","Administração Regional de Saúde de Lisboa e Vale do Tejo, I. P. (503148776)","Sano-Tecnica, Lda (500239819)","4.748,95 €",03-03-2015,03-03-2015,30 dias,"Portugal, Setúbal, Barreiro","Artigo 20.º, n.º 1, alínea a) do Código dos Contratos Públicos","","",,,,Não aplicável.,Não aplicável.,FALSE
Aquisição de Sais p/rehidratação oral pó solução oral saquetas,Ajuste Direto Regime Geral,Aquisição de bens móveis,"33000000-0, Equipamento médico, medicamentos e produtos para cuidados pessoais","Administração Regional de Saúde de Lisboa e Vale do Tejo, I. P. (503148776)","SANOFI - PRODUTOS FARMACEUTICOS, LDA. (500134960)","900,00 €",03-03-2015,27-02-2015,303 dias,"Portugal, Lisboa","Artigo 24.º, n.º 1, alínea e) do Código dos Contratos Públicos","","",,,,Não aplicável.,Não aplicável.,FALSE
Aquisição de serviços de vigilância e segurança - Plano de Contingência da Gripe,Ajuste Direto Regime Geral,Aquisição de serviços,"79700000-1, Serviços de investigação e segurança","Administração Regional de Saúde de Lisboa e Vale do Tejo, I. P. (503148776)","Prestibel - Empresa de Segurança, S.A. (501326456)","8.388,00 €",03-03-2015,19-02-2015,27 dias,"Portugal, Setúbal<BR/>Portugal, Lisboa<BR/>Portugal, Leiria<BR/>Portugal, Santarém","Artigo 24.º, n.º 1, alínea c) do Código dos Contratos Públicos","","",,,,Não aplicável.,Não aplicável.,FALSE
