freguesia,acronym,validVotesPercentage,votes,dicofre
União das freguesias de São João das Lampas e Terrugem,PS,34.87,1707,111127
União das freguesias de São João das Lampas e Terrugem,PPD/PSD,20.77,1017,111127
União das freguesias de São João das Lampas e Terrugem,B.E.,11.4,558,111127
União das freguesias de São João das Lampas e Terrugem,PAN,9.03,442,111127
União das freguesias de São João das Lampas e Terrugem,PCP-PEV,6.27,307,111127
União das freguesias de São João das Lampas e Terrugem,CDS-PP,6.13,300,111127
União das freguesias de São João das Lampas e Terrugem,PPM.PPV/CDC,2.23,109,111127
União das freguesias de São João das Lampas e Terrugem,L,2.06,101,111127
União das freguesias de São João das Lampas e Terrugem,A,1.9,93,111127
União das freguesias de São João das Lampas e Terrugem,PCTP/MRPP,1.14,56,111127
União das freguesias de São João das Lampas e Terrugem,NC,1.02,50,111127
União das freguesias de São João das Lampas e Terrugem,PNR,1.02,50,111127
União das freguesias de São João das Lampas e Terrugem,IL,0.78,38,111127
União das freguesias de São João das Lampas e Terrugem,PDR,0.51,25,111127
União das freguesias de São João das Lampas e Terrugem,PURP,0.35,17,111127
União das freguesias de São João das Lampas e Terrugem,MAS,0.29,14,111127
União das freguesias de São João das Lampas e Terrugem,PTP,0.25,12,111127
