freguesia,acronym,validVotesPercentage,votes,dicofre
Vale de Espinho,PPD/PSD.CDS-PP,50.5,51,091136
Vale de Espinho,PS,27.72,28,091136
Vale de Espinho,PCP-PEV,7.92,8,091136
Vale de Espinho,MPT,2.97,3,091136
Vale de Espinho,B.E.,1.98,2,091136
Vale de Espinho,PAN,1.98,2,091136
Vale de Espinho,PPM,1.98,2,091136
Vale de Espinho,PTP,1.98,2,091136
Vale de Espinho,L,0.99,1,091136
Vale de Espinho,PCTP/MRPP,0.99,1,091136
Vale de Espinho,PDA,0.99,1,091136
Vale de Espinho,MAS,0,0,091136
Vale de Espinho,PND,0,0,091136
Vale de Espinho,PNR,0,0,091136
Vale de Espinho,POUS,0,0,091136
Vale de Espinho,PPV,0,0,091136
