Objeto do Contrato,Tipo de Procedimento,Tipo(s) de Contrato,CPVs,Entidade(s) Adjudicante(s),Entidade(s) Adjudicatária(s),Preço Contratual,Data de Publicação,Data de Celebração do Contrato,Prazo de Execução,Local de Execução,Fundamentação,Data de Fecho do Contrato,Preço Total Efetivo,Causas das Alterações ao Prazo,Causas das Alterações ao Preço,Estado,N.º registo do Acordo Quadro,Descrição do Acordo Quadro,Procedimento Centralizado
"Proc. n.º 16800680. Empreitada de recuperação das fachadas exteriores do Centro de Saúde de Tábua, Aces PIN.",Ajuste Direto Regime Geral,Empreitadas de obras públicas,"45000000-7, Construção","Administração Regional de Saúde do Centro, I. P. (503122165)","Construtora Santovaiense, Construção Civil e Obras Públicas (504043811)","48.544,27 €",10-07-2017,11-10-2016,150 dias,"Portugal, Coimbra, Arganil","Artigo 19.º, alínea a) do Código dos Contratos Públicos","","48.544,27 €",Não Houve,Não Houve,,Não aplicável.,Não aplicável.,FALSE
Aquisição de serviços de manutenção corretiva das aplicações FIRST,Ajuste Direto Regime Geral,Aquisição de serviços,"72000000-5, Serviços de TI: consultoria, desenvolvimento de software, Internet e apoio","Administração Regional de Saúde do Centro, I. P. (503122165)","First Solutions – Sistemas de Informação, S.A (505345978)","46.241,50 €",10-07-2017,04-04-2017,365 dias,Portugal,"Artigo 24.º, n.º 1, alínea e) do Código dos Contratos Públicos","","","","",,Não aplicável.,Não aplicável.,FALSE
Aquisição de serviços de manutenção de software MAXPRO,Ajuste Direto Regime Geral,Aquisição de serviços,"72000000-5, Serviços de TI: consultoria, desenvolvimento de software, Internet e apoio","Administração Regional de Saúde do Centro, I. P. (503122165)","SISQUAL- Empresa de Investigação e desenvolvimento de Sistemas Informáticos, Lda (502772298)","35.374,56 €",10-07-2017,04-04-2017,365 dias,Portugal,"Artigo 24.º, n.º 1, alínea e) do Código dos Contratos Públicos",05-12-2017,"35.374,56 €","","",,Não aplicável.,Não aplicável.,FALSE
Aquisição de serviços de suporte e manutenção corretiva e evolutiva do sistema MedicineOne,Ajuste Direto Regime Geral,Aquisição de serviços,"72000000-5, Serviços de TI: consultoria, desenvolvimento de software, Internet e apoio","Administração Regional de Saúde do Centro, I. P. (503122165)","MedicineONE, Life Science Compunting, SA (504799541)","48.760,00 €",10-07-2017,10-04-2017,365 dias,Portugal,"Artigo 24.º, n.º 1, alínea e) do Código dos Contratos Públicos","","","","",,Não aplicável.,Não aplicável.,FALSE
Aquisição de novos módulos para o sistema de controlo de gestão a integrar no SIARS,Ajuste Direto Regime Geral,Aquisição de bens móveis,"48000000-8, Pacotes de software e sistemas de informação","Administração Regional de Saúde do Centro, I. P. (503122165)","Nimble Portugal, serviços e consultoria gestão, Lda (510308759)","9.000,00 €",10-07-2017,05-06-2017,365 dias,Portugal,"Artigo 24.º, n.º 1, alínea e) do Código dos Contratos Públicos","","","","",,Não aplicável.,Não aplicável.,FALSE
Aquisição de serviços de manutenção de software LABWAY.,Ajuste Direto Regime Geral,Aquisição de serviços,"72000000-5, Serviços de TI: consultoria, desenvolvimento de software, Internet e apoio","Administração Regional de Saúde do Centro, I. P. (503122165)",Ambidata (504673734),"9.520,00 €",10-07-2017,06-04-2017,365 dias,"Portugal, Coimbra, Coimbra","Artigo 24.º, n.º 1, alínea e) do Código dos Contratos Públicos",07-04-2017,"9.520,00 €","","",,Não aplicável.,Não aplicável.,FALSE
Equipamento Informático ao abrigo do Lote 2 (Computadores de Secretária Avançado) da ESPAP.,Ao abrigo de acordo-quadro (art.º 259.º),Aquisição de bens móveis,"30230000-0, Equipamento informático","Administração Regional de Saúde do Centro, I. P. (503122165)","ITEN SOLUTIONS – Sistemas de Informação, SA (510728189)","418.168,40 €",07-07-2017,21-12-2016,30 dias,Portugal,Artigo 259.º do Código dos Contratos Públicos,27-02-2017,"418.168,40 €","","",,1196657,Acordo Quadro para aquisição e aluguer operacional de equipamento informático,TRUE
"Proc. n.º 17800132. Empreitada de Obras para execução de trabalhos de pintura exterior do edifício do Centro de Saúde Gafanha da Nazaré, Aces Baixo Vouga.",Ajuste Direto Regime Geral,Empreitadas de obras públicas,"45000000-7, Construção","Administração Regional de Saúde do Centro, I. P. (503122165)","Gadanha Pavimentos, Lda (507480988)","6.004,80 €",07-07-2017,24-05-2017,20 dias,"Portugal, Aveiro, Aveiro","Artigo 19.º, alínea a) do Código dos Contratos Públicos","","6.004,80 €",Não Houve,Não Houve,,Não aplicável.,Não aplicável.,FALSE
"Aquisição de serviços de higiene e limpeza para os meses de Janeiro e Fevereiro de 2017 (Aces BM, BV, DL, CB e SEDE)",Ajuste Direto Regime Geral,Aquisição de serviços,"90000000-7, Serviços relativos a águas residuais, resíduos, limpeza e ambiente","Administração Regional de Saúde do Centro, I. P. (503122165)",IBERLIM – SOCIEDADE TÉCNICA DE LIMPEZAS S.A. (503501670),"374.787,19 €",06-07-2017,02-01-2017,59 dias,"Portugal, Coimbra, Coimbra","Artigo 20.º, n.º 1, alínea a) do Código dos Contratos Públicos",06-07-2017,"360.373,46 €","",A diferença deriva das horas não realizadas por parte da empresa no serviço de higiene e limpeza.,,Não aplicável.,Não aplicável.,FALSE
Aquisição de Licenciamento de software ao abrigo do Lote 20 do AQ - LS-2015,Ao abrigo de acordo-quadro (art.º 259.º),Aquisição de bens móveis,"48218000-9, Pacote de software para gestão de licenças","Administração Regional de Saúde do Centro, I. P. (503122165)","CHIEF SECURITY OFFICERS, S.A  (507817842)","22.470,00 €",06-07-2017,04-04-2017,365 dias,Portugal,Artigo 259.º do Código dos Contratos Públicos,10-05-2017,"22.470,00 €","","",,610968,Acordo quadro de licenciamento de software e serviços conexos,TRUE
Proc. n.º 17800311. Aces Baixo Vouga. Centro de Saúde de Estarreja. Empreitada de remoção de azulejos em revestimento de paredes nas I.S. Homens / Cafetaria,Ajuste Direto Regime Geral,Empreitadas de obras públicas,"45000000-7, Construção","Administração Regional de Saúde do Centro, I. P. (503122165)","Construções Rodrigues e Filho, Lda (501799249)","1.648,13 €",03-07-2017,06-06-2017,25 dias,"Portugal, Aveiro, Estarreja","Artigo 19.º, alínea a) do Código dos Contratos Públicos","","1.648,13 €",Não Houve,Não Houve,,Não aplicável.,Não aplicável.,FALSE
