Objeto do Contrato,Tipo de Procedimento,Tipo(s) de Contrato,CPVs,Entidade(s) Adjudicante(s),Entidade(s) Adjudicatária(s),Preço Contratual,Data de Publicação,Data de Celebração do Contrato,Prazo de Execução,Local de Execução,Fundamentação,Data de Fecho do Contrato,Preço Total Efetivo,Causas das Alterações ao Prazo,Causas das Alterações ao Preço,Estado,N.º registo do Acordo Quadro,Descrição do Acordo Quadro,Procedimento Centralizado
"Aquisição de Filtro Eletroestático e Reservatório de 300ml para sistema Aspiração Subglótica """"EVAC""""",Ajuste Direto Regime Geral,Aquisição de bens móveis,"33140000-3, Material médico de consumo","Hospital Distrital de Santarém, EPE (506361462)","Medtronic Portugal, Lda (504223933)","560,00 €",21-09-2018,02-02-2018,340 dias,"Portugal, Santarém, Santarém","Artigo 26.º, n.º 1, alínea a) do Código dos Contratos Públicos",,,,,,Não aplicável.,Não aplicável.,FALSE
"Aquisição de Sistema Fechado Med. Diurese Horária, Cam. Rígida 500 e Saco Coletor Estéril p/ Sistema Medição Diurese Horária, 1500CC",Ajuste Direto Regime Geral,Aquisição de bens móveis,"33140000-3, Material médico de consumo","Hospital Distrital de Santarém, E. P. E. (506361462)","B.Braun Medical, Lda (501506543)","2.240,00 €",21-09-2018,18-09-2018,90 dias,"Portugal, Santarém, Santarém","Artigo 20.º, n.º 1, alínea d) do Código dos Contratos Públicos",,,,,,Não aplicável.,Não aplicável.,FALSE
Aquisição de Mantas Térmicas,Ajuste Direto Regime Geral,Aquisição de bens móveis,"33140000-3, Material médico de consumo","Hospital Distrital de Santarém, E. P. E. (506361462)","MEDTRONIC PORTUGAL, LDA (504223933)","539,00 €",21-09-2018,18-09-2018,90 dias,"Portugal, Santarém, Santarém","Artigo 20.º, n.º 1, alínea d) do Código dos Contratos Públicos",,,,,,Não aplicável.,Não aplicável.,FALSE
"170025/2018 Empreitada beneficiação Serviço Medicina Física e Reabilitação do HDS,EPE",Concurso público,Empreitadas de obras públicas,"45000000-7, Construção","Hospital Distrital de Santarém, EPE (506361462)","SECAL, SA (501982248)","137.938,38 €",21-09-2018,14-08-2018,120 dias,"Portugal, Santarém, Santarém","Artigo 19.º, alínea b) do Código dos Contratos Públicos",,,,,,Não aplicável.,Não aplicável.,FALSE
Concurso publico Nº 120044/2018 - Material descartável para ginecologia,Concurso público,Aquisição de bens móveis,"33000000-0, Equipamento médico, medicamentos e produtos para cuidados pessoais","Hospital Distrital de Santarém, EPE (506361462)","TELEFLEX MEDICAL, S.A. (980249783)","561,60 €",21-09-2018,07-08-2018,152 dias,"Portugal, Santarém, Santarém","Artigo 20.º, n.º 1, alínea b) do Código dos Contratos Públicos",,,,,,Não aplicável.,Não aplicável.,FALSE
Concurso publico Nº 120044/2018 - Material descartável para ginecologia,Concurso público,Aquisição de bens móveis,"33000000-0, Equipamento médico, medicamentos e produtos para cuidados pessoais","Hospital Distrital de Santarém, EPE (506361462)","SPECULUM, S.A. (502996323)","4.197,98 €",21-09-2018,07-08-2018,152 dias,"Portugal, Santarém, Santarém","Artigo 20.º, n.º 1, alínea b) do Código dos Contratos Públicos",,,,,,Não aplicável.,Não aplicável.,FALSE
Concurso publico Nº 120044/2018 - Material descartável para ginecologia,Concurso público,Aquisição de bens móveis,"33000000-0, Equipamento médico, medicamentos e produtos para cuidados pessoais","Hospital Distrital de Santarém, EPE (506361462)","MUNDINTER, S.A. (500199906)","450,50 €",21-09-2018,07-08-2018,152 dias,"Portugal, Santarém, Santarém","Artigo 20.º, n.º 1, alínea b) do Código dos Contratos Públicos",,,,,,Não aplicável.,Não aplicável.,FALSE
Concurso publico Nº 120044/2018 - Material descartável para ginecologia,Concurso público,Aquisição de bens móveis,"33000000-0, Equipamento médico, medicamentos e produtos para cuidados pessoais","Hospital Distrital de Santarém, EPE (506361462)","MEDLINE INTERNATIONAL PORTUGAL, LDA (510533515)","252,00 €",21-09-2018,07-08-2018,152 dias,"Portugal, Santarém, Santarém","Artigo 20.º, n.º 1, alínea b) do Código dos Contratos Públicos",,,,,,Não aplicável.,Não aplicável.,FALSE
Concurso publico Nº 120044/2018 - Material descartável para ginecologia,Concurso público,Aquisição de bens móveis,"33000000-0, Equipamento médico, medicamentos e produtos para cuidados pessoais","Hospital Distrital de Santarém, EPE (506361462)","HR - HOSPITALAR, LDA. (501895558)","95,20 €",21-09-2018,07-08-2018,152 dias,"Portugal, Santarém, Santarém","Artigo 20.º, n.º 1, alínea b) do Código dos Contratos Públicos",,,,,,Não aplicável.,Não aplicável.,FALSE
Concurso publico Nº 120044/2018 - Material descartável para ginecologia,Concurso público,Aquisição de bens móveis,"33000000-0, Equipamento médico, medicamentos e produtos para cuidados pessoais","Hospital Distrital de Santarém, EPE (506361462)","GRUPO VITALINO, S.A. (513083162)","110,00 €",21-09-2018,07-08-2018,152 dias,"Portugal, Santarém, Santarém","Artigo 20.º, n.º 1, alínea b) do Código dos Contratos Públicos",,,,,,Não aplicável.,Não aplicável.,FALSE
Concurso publico Nº 120044/2018 - Material descartável para ginecologia,Concurso público,Aquisição de bens móveis,"33000000-0, Equipamento médico, medicamentos e produtos para cuidados pessoais","Hospital Distrital de Santarém, EPE (506361462)","EZEQUIEL PANÃO JORGE, LDA (501412727)","336,10 €",20-09-2018,07-08-2018,152 dias,"Portugal, Santarém, Santarém","Artigo 20.º, n.º 1, alínea b) do Código dos Contratos Públicos",,,,,,Não aplicável.,Não aplicável.,FALSE
Concurso publico Nº 120044/2018 - Material descartável para ginecologia,Concurso público,Aquisição de bens móveis,"33000000-0, Equipamento médico, medicamentos e produtos para cuidados pessoais","Hospital Distrital de Santarém, EPE (506361462)",ANASTÁCIO SALDANHA UNIPESSOAL (505804441),"22,00 €",20-09-2018,07-08-2018,152 dias,"Portugal, Santarém, Santarém","Artigo 20.º, n.º 1, alínea b) do Código dos Contratos Públicos",,,,,,Não aplicável.,Não aplicável.,FALSE
110011/2017 - REAGENTES PARA CITOLOGIA/HISTOLOGIA,Concurso público,Aquisição de serviços,"50000000-5, Serviços de reparação e manutenção","Hospital Distrital de Santarém, E. P. E. (506361462)","VWR International - Material de Laboratório, Lda (503842770)","3.314,70 €",19-09-2018,06-02-2018,365 dias,"Portugal, Santarém, Santarém","Artigo 20.º, n.º 1, alínea b) do Código dos Contratos Públicos",,,,,,Não aplicável.,Não aplicável.,FALSE
110011/2017 - REAGENTES PARA CITOLOGIA/HISTOLOGIA,Concurso público,Aquisição de serviços,"50000000-5, Serviços de reparação e manutenção","Hospital Distrital de Santarém, E. P. E. (506361462)","Hologic Iberia, S.L. (980277230)","9.017,00 €",19-09-2018,06-02-2018,365 dias,"Portugal, Santarém, Santarém","Artigo 20.º, n.º 1, alínea b) do Código dos Contratos Públicos",,,,,,Não aplicável.,Não aplicável.,FALSE
110011/2017 - REAGENTES PARA CITOLOGIA/HISTOLOGIA,Concurso público,Aquisição de serviços,"50000000-5, Serviços de reparação e manutenção","Hospital Distrital de Santarém, E. P. E. (506361462)","Leica Microsistemas - Instrumentos de Precisão, S.U. (500301921)","66,00 €",19-09-2018,06-02-2018,365 dias,"Portugal, Santarém, Santarém","Artigo 20.º, n.º 1, alínea b) do Código dos Contratos Públicos",,,,,,Não aplicável.,Não aplicável.,FALSE
110011/2017 - REAGENTES PARA CITOLOGIA/HISTOLOGIA,Concurso público,Aquisição de serviços,"50000000-5, Serviços de reparação e manutenção","Hospital Distrital de Santarém, E. P. E. (506361462)",GRUPO TAPER (506886336),"461,72 €",19-09-2018,06-02-2018,365 dias,"Portugal, Santarém, Santarém","Artigo 20.º, n.º 1, alínea b) do Código dos Contratos Públicos",,,,,,Não aplicável.,Não aplicável.,FALSE
Aquisição de Seringa p/ Gasimetria s/ Agulha,Ajuste Direto Regime Geral,Aquisição de bens móveis,"33140000-3, Material médico de consumo","Hospital Distrital de Santarém, E. P. E. (506361462)",Radiometer (980201667),"3.660,00 €",19-09-2018,20-03-2018,365 dias,"Portugal, Santarém, Santarém","Artigo 26.º, n.º 1, alínea a) do Código dos Contratos Públicos",,,,,,Não aplicável.,Não aplicável.,FALSE
110006/2018 - REAGENTES P/ HISTOQUIMICA COM COLOCAÇÃO DE EQUIPAMENTO,Concurso público,Aquisição de bens móveis,"33696000-5, Reagentes e meios de contraste","Hospital Distrital de Santarém, EPE (506361462)","Roche Sistenas de Disgnósticos, Lda (504282921)","24.245,00 €",18-09-2018,21-03-2018,304 dias,"Portugal, Santarém, Santarém","Artigo 20.º, n.º 1, alínea b) do Código dos Contratos Públicos",,,,,,Não aplicável.,Não aplicável.,FALSE
110005/2018 - Reagentes para Microbiologia,Concurso público,Aquisição de bens móveis,"33696000-5, Reagentes e meios de contraste","Hospital Distrital de Santarém, EPE (506361462)","FILSAT-EQUIP.MED.CIENT.,LDª (506708616)","99,00 €",18-09-2018,11-05-2018,365 dias,"Portugal, Santarém, Santarém","Artigo 20.º, n.º 1, alínea b) do Código dos Contratos Públicos",,,,,,Não aplicável.,Não aplicável.,FALSE
110005/2018 - Reagentes para Microbiologia,Concurso público,Aquisição de bens móveis,"33696000-5, Reagentes e meios de contraste","Hospital Distrital de Santarém, EPE (506361462)",BIO-RAD LABORATORIES LDA. (501301321),"249,80 €",18-09-2018,11-05-2018,365 dias,"Portugal, Santarém, Santarém","Artigo 20.º, n.º 1, alínea b) do Código dos Contratos Públicos",,,,,,Não aplicável.,Não aplicável.,FALSE
110005/2018 - Reagentes para Microbiologia,Concurso público,Aquisição de bens móveis,"33696000-5, Reagentes e meios de contraste","Hospital Distrital de Santarém, EPE (506361462)","VWR INTERNACIONAL-MAT.LAB.,LDA (503842770)","243,60 €",18-09-2018,11-05-2018,365 dias,"Portugal, Santarém, Santarém","Artigo 20.º, n.º 1, alínea b) do Código dos Contratos Públicos",,,,,,Não aplicável.,Não aplicável.,FALSE
110005/2018 - Reagentes para Microbiologia,Concurso público,Aquisição de bens móveis,"33696000-5, Reagentes e meios de contraste","Hospital Distrital de Santarém, EPE (506361462)","QUILABAN,LDA. (500399670)","44,47 €",18-09-2018,11-05-2018,365 dias,"Portugal, Santarém, Santarém","Artigo 20.º, n.º 1, alínea b) do Código dos Contratos Públicos",,,,,,Não aplicável.,Não aplicável.,FALSE
110005/2018 - Reagentes para Microbiologia,Concurso público,Aquisição de bens móveis,"33696000-5, Reagentes e meios de contraste","Hospital Distrital de Santarém, EPE (506361462)","HEMICARE-Com.Rep.Mat.Equipamentos Medicos, LDA (506517080)","440,00 €",17-09-2018,11-05-2018,365 dias,"Portugal, Santarém, Santarém","Artigo 20.º, n.º 1, alínea b) do Código dos Contratos Públicos",,,,,,Não aplicável.,Não aplicável.,FALSE
110005/2018 - Reagentes para Microbiologia,Concurso público,Aquisição de bens móveis,"33696000-5, Reagentes e meios de contraste","Hospital Distrital de Santarém, EPE (506361462)",KNOW-HOW (509884296),"5.458,37 €",17-09-2018,11-05-2018,365 dias,"Portugal, Santarém, Santarém","Artigo 20.º, n.º 1, alínea b) do Código dos Contratos Públicos",,,,,,Não aplicável.,Não aplicável.,FALSE
110005/2018 - Reagentes para Microbiologia,Concurso público,Aquisição de bens móveis,"33696000-5, Reagentes e meios de contraste","Hospital Distrital de Santarém, EPE (506361462)","Fisher Scientific, Lda (506429210)","6.257,10 €",17-09-2018,11-05-2018,365 dias,"Portugal, Santarém, Santarém","Artigo 20.º, n.º 1, alínea b) do Código dos Contratos Públicos",,,,,,Não aplicável.,Não aplicável.,FALSE
110005/2018 - Reagentes para Microbiologia,Concurso público,Aquisição de bens móveis,"33696000-5, Reagentes e meios de contraste","Hospital Distrital de Santarém, EPE (506361462)","Alere, Lda (502518863)","504,00 €",17-09-2018,11-05-2018,365 dias,"Portugal, Santarém, Santarém","Artigo 20.º, n.º 1, alínea b) do Código dos Contratos Públicos",,,,,,Não aplicável.,Não aplicável.,FALSE
110005/2018 - Reagentes para Microbiologia,Concurso público,Aquisição de bens móveis,"33696000-5, Reagentes e meios de contraste","Hospital Distrital de Santarém, EPE (506361462)",CSP Saúde (508440246),"1.048,35 €",17-09-2018,11-05-2018,365 dias,"Portugal, Santarém, Santarém","Artigo 20.º, n.º 1, alínea b) do Código dos Contratos Públicos",,,,,,Não aplicável.,Não aplicável.,FALSE
Aquisição de Sonda Transesofágica Mod. 6VT-D,Ajuste Direto Regime Geral,Aquisição de bens móveis,"33100000-1, Equipamento médico","Hospital Distrital de Santarém, EPE (506361462)","GENERAL ELECTRIC HEALTHCARE PORTUGAL, SOC UNIP LDA (500357129)","20.000,00 €",17-09-2018,12-09-2018,3 dias,"Portugal, Santarém, Santarém","Artigo 26.º, n.º 1, alínea a) do Código dos Contratos Públicos",,,,,,Não aplicável.,Não aplicável.,FALSE
110005/2018 - Reagentes para Microbiologia,Concurso público,Aquisição de bens móveis,"33696000-5, Reagentes e meios de contraste","Hospital Distrital de Santarém, EPE (506361462)","Biportugal, Quimico-Farmacêutica, Lda (502380543)","10.932,00 €",14-09-2018,25-05-2018,365 dias,"Portugal, Santarém, Santarém","Artigo 20.º, n.º 1, alínea b) do Código dos Contratos Públicos",,,,,,Não aplicável.,Não aplicável.,FALSE
110005/2018 - Reagentes para Microbiologia,Concurso público,Aquisição de bens móveis,"33696000-5, Reagentes e meios de contraste","Hospital Distrital de Santarém, EPE (506361462)",Biomerieux Portugal (501524177),"72.249,09 €",14-09-2018,25-05-2018,365 dias,"Portugal, Santarém, Santarém","Artigo 20.º, n.º 1, alínea b) do Código dos Contratos Públicos",,,,,,Não aplicável.,Não aplicável.,FALSE
"Aquisição de Tubos Capilares Heparanizados, Pediátricos, 140ml",Ajuste Direto Regime Geral,Aquisição de bens móveis,"33140000-3, Material médico de consumo","Hospital Distrital de Santarém, EPE (506361462)","Radiometer Ibérica, S.L. (980201667)","419,48 €",12-09-2018,30-08-2018,120 dias,"Portugal, Santarém, Santarém<BR/>Portugal","Artigo 20.º, n.º 1, alínea d) do Código dos Contratos Públicos",,,,,,Não aplicável.,Não aplicável.,FALSE
Aquisição de Kits Pressão Negativa Portátil c/ Bateria,Ajuste Direto Regime Geral,Aquisição de bens móveis,"33140000-3, Material médico de consumo","Hospital Distrital de Santarém, E. P. E. (506361462)","Smith & Nephew, Lda. (503552461)","4.200,00 €",12-09-2018,27-08-2018,120 dias,"Portugal, Santarém, Santarém","Artigo 20.º, n.º 1, alínea d) do Código dos Contratos Públicos",,,,,,Não aplicável.,Não aplicável.,FALSE
420110/2018 - Set Cateterização Arterial,Ajuste Direto Regime Geral,Aquisição de bens móveis,"33140000-3, Material médico de consumo","Hospital Distrital de Santarém, EPE (506361462)",Teleflex Medical S.A. (980249783),"2.400,00 €",12-09-2018,12-09-2018,120 dias,"Portugal, Santarém, Santarém","Artigo 20.º, n.º 1, alínea d) do Código dos Contratos Públicos",,,,,,Não aplicável.,Não aplicável.,FALSE
Aquisição de Sondas Prost Dufour,Ajuste Direto Regime Geral,Aquisição de bens móveis,"33141641-5, Sondas","Hospital Distrital de Santarém, E. P. E. (506361462)","COLOPLAST PORTUGAL SOC. UNIP., LDA (EX PORGES) (503989037)","1.238,40 €",12-09-2018,17-08-2018,60 dias,"Portugal, Santarém, Santarém","Artigo 20.º, n.º 1, alínea d) do Código dos Contratos Públicos",,,,,,Não aplicável.,Não aplicável.,FALSE
Aquisição de Kit Descartável de Desinfeção p/ Anestesia Loco Regional,Ajuste Direto Regime Geral,Aquisição de bens móveis,"33140000-3, Material médico de consumo","Hospital Distrital de Santarém, E. P. E. (506361462)","B. Braun Medical, Lda (501506543)","4.095,00 €",12-09-2018,27-08-2018,120 dias,"Portugal, Santarém, Santarém","Artigo 20.º, n.º 1, alínea d) do Código dos Contratos Públicos",,,,,,Não aplicável.,Não aplicável.,FALSE
Aquisição de Tapetes Anti Microbiano 46x114x5x2,Ajuste Direto Regime Geral,Aquisição de bens móveis,"33140000-3, Material médico de consumo","Hospital Distrital de Santarém, E. P. E. (506361462)","VWR INTERNATIONAL MATERIAL DE  LABORATORIO, LDA (503842770)","2.402,40 €",12-09-2018,27-08-2018,120 dias,"Portugal, Santarém, Santarém","Artigo 20.º, n.º 1, alínea d) do Código dos Contratos Públicos",,,,,,Não aplicável.,Não aplicável.,FALSE
110004/2018 - AQUISIÇÃO DE REAGENTES P/ AUTOIMUNIDADE,Concurso público,Aquisição de bens móveis,"33696000-5, Reagentes e meios de contraste","Hospital Distrital de Santarém, E. P. E. (506361462)",Thermo Fisher Scientific (506916243),"3.008,11 €",12-09-2018,21-05-2018,304 dias,"Portugal, Santarém, Santarém","Artigo 20.º, n.º 1, alínea b) do Código dos Contratos Públicos",,,,,,Não aplicável.,Não aplicável.,FALSE
110004/2018 - AQUISIÇÃO DE REAGENTES P/ AUTOIMUNIDADE,Concurso público,Aquisição de bens móveis,"33696000-5, Reagentes e meios de contraste","Hospital Distrital de Santarém, E. P. E. (506361462)",Euroimmun (504022180),"9.016,00 €",12-09-2018,21-05-2018,304 dias,"Portugal, Santarém, Santarém","Artigo 20.º, n.º 1, alínea b) do Código dos Contratos Públicos",,,,,,Não aplicável.,Não aplicável.,FALSE
110004/2018 - AQUISIÇÃO DE REAGENTES P/ AUTOIMUNIDADE,Concurso público,Aquisição de bens móveis,"33696000-5, Reagentes e meios de contraste","Hospital Distrital de Santarém, E. P. E. (506361462)",Menarini Diagnosticos (502610069),"13.990,00 €",12-09-2018,04-06-2018,304 dias,"Portugal, Santarém, Santarém","Artigo 20.º, n.º 1, alínea b) do Código dos Contratos Públicos",,,,,,Não aplicável.,Não aplicável.,FALSE
120007/2018 - AQUISIÇÃO DE MATERIAL CIRURGIA VASCULAR - ENDOPROTESES PARA TRATAMENTO DE ANEURISMAS 4 adjudicatários : Biosonda/ Medtronic/ Medicinália/ CRBard,Concurso público,Aquisição de bens móveis,"33140000-3, Material médico de consumo","Hospital Distrital de Santarém, EPE (506361462)","Biosonda, Comércio de Material Hospitalar, Lda  (501463313)","153.740,00 €",11-09-2018,06-07-2018,274 dias,"Portugal, Santarém, Santarém","Artigo 20.º, n.º 1, alínea b) do Código dos Contratos Públicos",,,,,,Não aplicável.,Não aplicável.,FALSE
PRESTAÇÃO SERVIÇOS ALIMENTAÇÃO PERÍODO DE 25/06/2018 A 24/09/2018,Ajuste Direto Regime Geral,Aquisição de serviços,"55000000-0, Serviços de hotelaria, restauração e comércio a retalho","Hospital Distrital de Santarém, E. P. E. (506361462)",GERTAL S.A. (500126623),"258.971,42 €",11-09-2018,21-06-2018,90 dias,"Portugal, Santarém, Santarém","Artigo 24.º, n.º 1, alínea c) do Código dos Contratos Públicos",,,,,,Não aplicável.,Não aplicável.,FALSE
