Objeto do Contrato,Tipo de Procedimento,Tipo(s) de Contrato,CPVs,Entidade(s) Adjudicante(s),Entidade(s) Adjudicatária(s),Preço Contratual,Data de Publicação,Data de Celebração do Contrato,Prazo de Execução,Local de Execução,Fundamentação,Data de Fecho do Contrato,Preço Total Efetivo,Causas das Alterações ao Prazo,Causas das Alterações ao Preço,Estado,N.º registo do Acordo Quadro,Descrição do Acordo Quadro,Procedimento Centralizado
Aquisição de manuais escolares para a rede EPE na Califórnia.,Ajuste Direto Regime Geral,Aquisição de bens móveis,"22112000-8, Manuais escolares","Camões - Instituto da Cooperação e da Lingua, I. P. (510322506)",Lidel - Edições Técnicas Lda. (500165491),"6.232,01 €",11-01-2018,28-08-2017,20 dias,Estados Unidos,"Artigo 24.º, n.º 1, alínea e) do Código dos Contratos Públicos","","",,,,Não aplicável.,Não aplicável.,FALSE
Aquisição de manuais escolares para a rede EPE no Canadá.,Ajuste Direto Regime Geral,Aquisição de bens móveis,"22112000-8, Manuais escolares","Camões - Instituto da Cooperação e da Lingua, I. P. (510322506)",Lidel - Edições Técnicas Lda. (500165491),"9.094,08 €",11-01-2018,22-08-2017,20 dias,Canadá,"Artigo 24.º, n.º 1, alínea e) do Código dos Contratos Públicos","","",,,,Não aplicável.,Não aplicável.,FALSE
Aquisição de manuais escolares para a Rede de ensino de Português na Venezuela.,Ajuste Direto Regime Geral,Aquisição de bens móveis,"22112000-8, Manuais escolares","Camões - Instituto da Cooperação e da Lingua, I. P. (510322506)",Lidel - Edições Técnicas Lda. (500165491),"31.355,58 €",10-01-2018,30-03-2017,20 dias,Venezuela,"Artigo 24.º, n.º 1, alínea e) do Código dos Contratos Públicos","","",,,,Não aplicável.,Não aplicável.,FALSE
Aquisição de manuais escolares para a Rede de Ensino de Português nos Estados Unidos.,Ajuste Direto Regime Geral,Aquisição de bens móveis,"22112000-8, Manuais escolares","Camões - Instituto da Cooperação e da Lingua, I. P. (510322506)","Lidel - Edições Técnicas, Lda.  (500165491)","21.800,62 €",10-01-2018,13-07-2017,20 dias,Estados Unidos,"Artigo 24.º, n.º 1, alínea e) do Código dos Contratos Públicos","","",,,,Não aplicável.,Não aplicável.,FALSE
Aquisição de livros para o curso de ética - OERN,Ajuste Direto Regime Geral,Aquisição de bens móveis,"22121000-4, Publicações técnicas",Ordem dos Engenheiros (500839166),LIDEL EDIÇÕES TECNICAS LDA. (500165491),"4.671,00 €",11-05-2017,06-10-2016,1 dias,"Portugal, Porto, Porto","Artigo 20.º, n.º 1, alínea a) do Código dos Contratos Públicos","","",,,,Não aplicável.,Não aplicável.,FALSE
Aquisição de manuais escolares para alunos lusodescendentes nos EUA - Califórnia.,Ajuste Direto Regime Geral,Aquisição de bens móveis,"22110000-4, Livros impressos","Camões - Instituto da Cooperação e da Lingua, I. P. (510322506)","Lidel - Edições Técnicas, Lda.  (500165491)","5.291,07 €",24-01-2017,10-08-2016,20 dias,"Portugal, Lisboa, Lisboa","Artigo 24.º, n.º 1, alínea e) do Código dos Contratos Públicos","","",,,,Não aplicável.,Não aplicável.,FALSE
Aquisição de manuais escolares para a rede de ensino de português no estrangeiro na Polónia.,Ajuste Direto Regime Geral,Aquisição de bens móveis,"22100000-1, Livros, brochuras e folhetos impressos","Camões - Instituto da Cooperação e da Lingua, I. P. (510322506)","Lidel - Edições Técnicas, Lda. (500165491)","162,00 €",02-01-2017,22-12-2016,10 dias,"Portugal, Lisboa, Lisboa","Artigo 24.º, n.º 1, alínea e) do Código dos Contratos Públicos","","",,,,Não aplicável.,Não aplicável.,FALSE
Aquisição de manuais escolares para a rede de ensino português no estrangeiro em Nova Deli,Ajuste Direto Regime Geral,Aquisição de bens móveis,"22100000-1, Livros, brochuras e folhetos impressos","Camões - Instituto da Cooperação e da Lingua, I. P. (510322506)",Lidel - Edições Técnicas Lda. (500165491),"1.635,67 €",02-01-2017,22-12-2016,10 dias,"Portugal, Lisboa, Lisboa","Artigo 24.º, n.º 1, alínea e) do Código dos Contratos Públicos","","",,,,Não aplicável.,Não aplicável.,FALSE
Aquisição de manuais escolares para o ano letivo 2015/2016 - Canadá.,Ajuste Direto Regime Geral,Aquisição de bens móveis,"22100000-1, Livros, brochuras e folhetos impressos","Camões - Instituto da Cooperação e da Lingua, I. P. (510322506)",Lidel - Edições Técnicas Lda. (500165491),"11.909,78 €",27-10-2015,05-08-2015,20 dias,Canadá,"Artigo 24.º, n.º 1, alínea e) do Código dos Contratos Públicos","","",,,,Não aplicável.,Não aplicável.,FALSE
Aquisição de manuais escolares EPE ano letivo de 2015/2016 - EUA,Ajuste Direto Regime Geral,Aquisição de bens móveis,"22100000-1, Livros, brochuras e folhetos impressos","Camões - Instituto da Cooperação e da Lingua, I. P. (510322506)",Lidel - Edições Técnicas LDA (500165491),"8.061,63 €",20-10-2015,13-10-2015,20 dias,Estados Unidos,"Artigo 24.º, n.º 1, alínea e) do Código dos Contratos Públicos","","",,,,Não aplicável.,Não aplicável.,FALSE
Aquisição de manuais escolares para a Rede EPE ano letivo 2015/2016 - Venezuela,Ajuste Direto Regime Geral,Aquisição de bens móveis,"22100000-1, Livros, brochuras e folhetos impressos","Camões - Instituto da Cooperação e da Lingua, I. P. (510322506)",Lidel - Edições Técnicas Lda. (500165491),"30.339,52 €",20-10-2015,31-08-2015,20 dias,Venezuela,"Artigo 24.º, n.º 1, alínea e) do Código dos Contratos Públicos","","",,,,Não aplicável.,Não aplicável.,FALSE
Aquisição de manuais escolares para a Austrália.,Ajuste Direto Regime Geral,Aquisição de bens móveis,"22100000-1, Livros, brochuras e folhetos impressos","Camões - Instituto da Cooperação e da Lingua, I. P. (510322506)",Lidel - Edições Técnicas Lda. (500165491),"2.239,40 €",19-10-2015,05-08-2015,20 dias,Austrália,"Artigo 24.º, n.º 1, alínea e) do Código dos Contratos Públicos","","",,,,Não aplicável.,Não aplicável.,FALSE
Aquisição de manuais escolares para alunos lusodescendentes na Califórnia (Estados Unidos).,Ajuste Direto Regime Geral,Aquisição de bens móveis,"22100000-1, Livros, brochuras e folhetos impressos","Camões - Instituto da Cooperação e da Lingua, I. P. (510322506)",Lidel - Edições Técnicas Lda. (500165491),"4.162,54 €",19-10-2015,20-08-2015,20 dias,Estados Unidos,"Artigo 24.º, n.º 1, alínea e) do Código dos Contratos Públicos","","",,,,Não aplicável.,Não aplicável.,FALSE
Aquisição de manuais escolares para alunos lusodescendentes na Bulgária.,Ajuste Direto Regime Geral,Aquisição de bens móveis,"22100000-1, Livros, brochuras e folhetos impressos","Camões - Instituto da Cooperação e da Lingua, I. P. (510322506)","Lidel - Edições Técnicas, Lda.  (500165491)","7.341,00 €",19-10-2015,13-10-2015,20 dias,Bulgária,"Artigo 24.º, n.º 1, alínea e) do Código dos Contratos Públicos","","",,,,Não aplicável.,Não aplicável.,FALSE
Aquisição de Manuais escolares para a Rede de Ensino Português no Estrangeiro.,Ajuste Direto Regime Geral,Aquisição de bens móveis,"22100000-1, Livros, brochuras e folhetos impressos","Camões - Instituto da Cooperação e da Lingua, I. P. (510322506)","Lidel - Edições Técnicas, Lda. (500165491)","7.011,15 €",23-01-2015,02-10-2014,20 dias,Estados Unidos<BR/>Canadá,"Artigo 24.º, n.º 1, alínea e) do Código dos Contratos Públicos","","",,,,Não aplicável.,Não aplicável.,FALSE
Assinatura de enciclopédia médica,Ajuste Direto Regime Geral,Aquisição de serviços,"92511000-6, Serviços das bibliotecas","Hospital do Espírito Santo de Évora, E. P. E. (508085888)",Edições Lidel (500165491),"5.502,46 €",26-03-2014,02-01-2014,8 dias,"Portugal, Évora, Évora","Artigo 20.º, n.º 1, alínea a) do Código dos Contratos Públicos","","",,,,Não aplicável.,Não aplicável.,FALSE
"Aquisição, transporte e entrega de manuais escolares para a Rede de Ensino Portugês no Estrangueiro às coordenações da rede de ensino em Andorra,Bélgica,Alemanha, Espanha, Luxemburgo, Reino Unido, Holanda e Suiça. ",Ajuste Direto Regime Geral,Aquisição de bens móveis,"22100000-1, Livros, brochuras e folhetos impressos","Camões - Instituto da Cooperação e da Lingua, I. P. (510322506)","LIDEL - Edições Técnicas, Lda. (500165491)","272.164,49 €",11-03-2014,17-12-2013,20 dias,Andorra<BR/>Bélgica<BR/>Reino Unido<BR/>França<BR/>Espanha<BR/>Suiça<BR/>Luxemburgo<BR/>Alemanha,"Artigo 24.º, n.º 1, alínea e) do Código dos Contratos Públicos","","",,,,Não aplicável.,Não aplicável.,FALSE
"Aquisição, trransporte e entrega de manuais escolares à coordenação do Ensino Português no Reuno Unido e Ilhas do Canal ",Ajuste Direto Regime Geral,Aquisição de bens móveis,"22100000-1, Livros, brochuras e folhetos impressos","Camões - Instituto da Cooperação e da Lingua, I. P. (510322506)",Lidel - Edições Técnicas Lda. (500165491),"10.193,48 €",04-02-2014,16-12-2013,15 dias,Reino Unido,"Artigo 24.º, n.º 1, alínea e) do Código dos Contratos Públicos","","",,,,Não aplicável.,Não aplicável.,FALSE
"Aquisição, Transporte e entrega de manuais escolares para a Rede de Ensino Português no Estrangeiro - E.U.A (Boston)",Ajuste Direto Regime Geral,Aquisição de bens móveis,"22100000-1, Livros, brochuras e folhetos impressos","Camões - Instituto da Cooperação e da Lingua, I. P. (510322506)",Lidel - Edições Técnicas Lda. (500165491),"9.844,61 €",03-02-2014,16-12-2013,20 dias,Estados Unidos,"Artigo 24.º, n.º 1, alínea e) do Código dos Contratos Públicos","","",,,,Não aplicável.,Não aplicável.,FALSE
"Aquisição, transporte e entrega de manuais escolares para a Rede de Ensino no Estrangeiro - E.U.A. (Newark)",Ajuste Direto Regime Geral,Aquisição de bens móveis,"22100000-1, Livros, brochuras e folhetos impressos","Camões - Instituto da Cooperação e da Lingua, I. P. (510322506)",Lidel - Edições Técnicas Lda. (500165491),"9.462,38 €",03-02-2014,16-12-2013,20 dias,Estados Unidos,"Artigo 24.º, n.º 1, alínea e) do Código dos Contratos Públicos","","",,,,Não aplicável.,Não aplicável.,FALSE
"Aquisição, transporte e entrega de manuais escolares para a rede de Ensino Português no Estrangeiro - Canadá",Ajuste Direto Regime Geral,Aquisição de bens móveis,"22100000-1, Livros, brochuras e folhetos impressos","Camões - Instituto da Cooperação e da Lingua, I. P. (510322506)","Lidel - Edições Técnicas, Lda. (500165491)","9.688,72 €",03-02-2014,16-12-2013,20 dias,Canadá,"Artigo 24.º, n.º 1, alínea e) do Código dos Contratos Públicos","","",,,,Não aplicável.,Não aplicável.,FALSE
Aquisição de livros Autocad 2013 & AutoCad LT2013 Curso completo,Ajuste Direto Regime Geral,Aquisição de bens móveis,"22121000-4, Publicações técnicas",Centro de Formação Profissional da Indústria da Construção Civil e Obras Públicas do Norte (503716391),Lidel - Edições Técnicas Lda (500165491),"6.017,50 €",26-11-2013,26-11-2013,20 dias,"Portugal, Porto, Maia","Artigo 20.º, n.º 1, alínea a) do Código dos Contratos Públicos",19-12-2013,"6.017,50 €",,,,Não aplicável.,Não aplicável.,
Assinatura de revista,Ajuste Direto Regime Geral,Aquisição de serviços,"92511000-6, Serviços das bibliotecas","Hospital do Espírito Santo de Évora, E.P.E. (508085888)",Edições Lidel (500165491),"5.331,80 €",12-04-2013,11-04-2013,365 dias,"Portugal, Évora, Évora","Artigo 20.º, n.º 1, alínea a) do Código dos Contratos Públicos","","",,,,Não aplicável.,Não aplicável.,
Aquisição de 250 livros AutoCad 2013 & AutoCad LT 2013 Curso completo,Ajuste Direto Regime Geral,Aquisição de bens móveis,"22121000-4, Publicações técnicas",Centro de Formação Profissional da Indústria da Construção Civil e Obras Públicas do Norte (503716391),Lidel - Edições Técnicas Lda (500165491),"6.017,50 €",24-09-2012,24-09-2012,20 dias,"Portugal, Porto, Maia","Artigo 20.º, n.º 1, alínea a) do Código dos Contratos Públicos",15-10-2012,"6.017,50 €",,,,Não aplicável.,Não aplicável.,
Aquisição de 250 livros AutoCad LT 2012 Curso completo.,Ajuste Direto Regime Geral,Aquisição de bens móveis,"22121000-4, Publicações técnicas",Centro de Formação Profissional da Indústria da Construção Civil e Obras Públicas do Norte (503716391),Lidel - Edições Técnicas Lda (500165491),"5.908,75 €",23-12-2011,30-11-2011,20 dias,"Portugal, Porto, Maia","Artigo 20.º, n.º 1, alínea a) do Código dos Contratos Públicos",30-11-2011,"5.908,75 €",,,,Não aplicável.,Não aplicável.,
Aquisição de livros AutoCad LT 2011 Curso completo,Ajuste Direto Regime Geral,Aquisição de bens móveis,"22121000-4, Publicações técnicas",Centro de Formação Profissional da Indústria da Construção Civil e Obras Públicas do Norte (503716391),Lidel - Edições Técnicas Lda (500165491),"5.772,45 €",22-09-2010,22-09-2010,20 dias,"Portugal, Porto, Maia","Artigo 20.º, n.º 1, alínea a) do Código dos Contratos Públicos",14-10-2010,"5.772,45 €",,,,Não aplicável.,Não aplicável.,
Renovação da assinatura Traite Pathologie Professionnelle & Envt para o Ano 2010,Ajuste Direto Regime Geral,Aquisição de serviços,"79132100-9, Serviços de certificação de assinaturas electrónicas","Instituto Nacional de Emergência Médica, IP (501356126)","LIDEL EDIÇÕES TECNICAS, LDA (500165491)","89,00 €",22-07-2010,30-06-2010,5 dias,"Portugal, Lisboa, Lisboa","Artigo 24.º, n.º 1, alínea e) do Código dos Contratos Públicos","","",,,,Não aplicável.,Não aplicável.,
Aquisição de Equipamento - Programas Informáticos/Manuais para a Sala de Desenho Técnico do CEFP Guarda,Ajuste Direto Regime Geral,Aquisição de bens móveis,"22471000-2, Manuais de informática","Instituto do Emprego e Formação Profissional, I.P. (501442600)","Lidel Edições Técnicas, Lda. (500165491)","92,11 €",16-12-2009,24-06-2009,28 dias,"Portugal, Guarda, Guarda","Artigo 20.º, n.º 1, alínea a) do Código dos Contratos Públicos","","",,,,Não aplicável.,Não aplicável.,
"Tradução e Edição, para Português, do Atlas Geo-Histórico de Timor-Leste.",Ajuste Direto Regime Geral,Aquisição de serviços,"98300000-6, Serviços diversos","Instituto Português de Apoio ao Desenvolvimento, I.P. (506582485)","LIDEL - Edições Técnicas, Lda. (500165491)","15.000,00 €",05-11-2009,15-09-2009,107 dias,"Portugal, Lisboa, Lisboa","Artigo 20.º, n.º 1, alínea a) do Código dos Contratos Públicos","","",,,,Não aplicável.,Não aplicável.,
Aquisição de livros AutoCad 2010 Curso completo,Ajuste Direto Regime Geral,Aquisição de bens móveis,"22121000-4, Publicações técnicas",Centro de Formação Profissional da Indústria da Construção Civil e Obras Públicas do Norte (503716391),Lidel - Edições Técnicas Lda (500165491),"6.849,00 €",16-10-2009,09-10-2009,20 dias,"Portugal, Porto, Maia","Artigo 20.º, n.º 1, alínea a) do Código dos Contratos Públicos",26-10-2009,"6.849,00 €",,,,Não aplicável.,Não aplicável.,
Livros Microsoft Office 2007 Todos nós,Ajuste Direto Regime Geral,Aquisição de bens móveis,"22121000-4, Publicações técnicas",Centro de Formação Profissional da Indústria da Construção Civil e Obras Públicas do Norte (503716391),Lidel - Edições Técnicas Lda (500165491),"5.648,40 €",16-10-2009,09-10-2009,20 dias,"Portugal, Porto, Maia","Artigo 20.º, n.º 1, alínea a) do Código dos Contratos Públicos",26-10-2009,"5.648,40 €",,,,Não aplicável.,Não aplicável.,
Aquisição de livros técnicos,Ajuste Direto Regime Geral,"","",Centro de Formação Profissional da Industria Têxtil - CITEX (502256877),"LIDEL – EDIÇÕES TÉCNICAS, LDA (500165491)","29,12 €",12-05-2009,"",2 dias,"",Não Preenchido,"","",,,,Não aplicável.,Não aplicável.,
