Objeto do Contrato,Tipo de Procedimento,Tipo(s) de Contrato,CPVs,Entidade(s) Adjudicante(s),Entidade(s) Adjudicatária(s),Preço Contratual,Data de Publicação,Data de Celebração do Contrato,Prazo de Execução,Local de Execução,Fundamentação,Data de Fecho do Contrato,Preço Total Efetivo,Causas das Alterações ao Prazo,Causas das Alterações ao Preço,Estado,N.º registo do Acordo Quadro,Descrição do Acordo Quadro,Procedimento Centralizado
"Fornecimento de energia elétrica ao C.H.C.B., E.P.E.",Concurso público,Aquisição de serviços,"71314100-3, Serviços de electricidade","Centro Hospitalar Cova da Beira, E.P.E. (506361659)","Endesa Energia, S.A. - Sucursal Portugal (980245974)","479.717,58 €",09-11-2015,07-07-2011,365 dias,"Portugal, Castelo Branco, Covilhã","Artigo 20.º, n.º 1, alínea b) do Código dos Contratos Públicos",,,,,,Não aplicável.,Não aplicável.,FALSE
Aquisição de Serviços de Limpeza e Higiene Hospitalar e de recolha intra-hospitalar de resíduos no Centro Hospitalar Cova da Beira,Ajuste Direto Regime Geral,Aquisição de serviços,"90910000-9, Serviços de limpeza","Centro Hospitalar Cova da Beira, EPE (506361659)","Nova Serviços, Lda. (502117281)","400.288,08 €",09-11-2015,12-11-2014,365 dias,"Portugal, Castelo Branco, Covilhã","Artigo 24.º, n.º 1, alínea b) do Código dos Contratos Públicos",,,,,,Não aplicável.,Não aplicável.,FALSE
Fornecimento de uma unidade de ecografia topo de gama para o serviço de Imagiologia,Ajuste Direto Regime Geral,Aquisição de bens móveis,"33112000-8, Equipamento de imagiologia por ecos, ultra-sons e doppler","Centro Hospitalar Cova da Beira, EPE (506361659)",Toshiba Medical Systems S.A. (980023700),"54.500,00 €",09-11-2015,14-05-2014,30 dias,"Portugal, Castelo Branco, Covilhã","Artigo 20.º, n.º 1, alínea a) do Código dos Contratos Públicos",,,,,,Não aplicável.,Não aplicável.,FALSE
"Aquisição de serviços de manutenção e tratamento de áreas ajardinadas pertencentes ao Centro Hospitalar Cova da Beira, E.P.E. (Hospital Pêro da Covilhã e Departamento de Psiquiatria)",Ajuste Direto Regime Geral,Aquisição de serviços,"77310000-6, Serviços de plantação e manutenção de áreas verdes","Centro Hospitalar Cova da Beira, EPE (506361659)","Hidropaisagem - Espaços Verdes, Lda. (504905899)","11.699,88 €",09-11-2015,02-10-2013,365 dias,"Portugal, Castelo Branco, Covilhã","Artigo 20.º, n.º 1, alínea a) do Código dos Contratos Públicos",,,,,,Não aplicável.,Não aplicável.,FALSE
Prestação de serviços de Medicina no Trabalho,Ajuste Direto Regime Geral,Aquisição de serviços,"85147000-1, Serviços de medicina do trabalho","Centro Hospitalar Cova da Beira, EPE (506361659)","Medocuf - Medicina Ocupacional do Fundão, Lda. (503811416)","18.216,00 €",06-11-2015,30-08-2013,365 dias,"Portugal, Castelo Branco, Covilhã","Artigo 20.º, n.º 1, alínea a) do Código dos Contratos Públicos",,,,,,Não aplicável.,Não aplicável.,FALSE
Aquisição de prestação de serviços médicos de Anestesiologia,Ajuste Direto Regime Geral,Aquisição de serviços,"79625000-1, Serviços de fornecimento de pessoal médico","Centro Hospitalar Cova da Beira, EPE (506361659)","Medicsearch, S.A. (508080517)","37,36 €",06-11-2015,20-11-2013,335 dias,"Portugal, Castelo Branco, Covilhã",Artigo 258.º do Código dos Contratos Públicos,,,,,,Não aplicável.,Não aplicável.,FALSE
Prestação de serviços médicos licenciados em medicina geral,Ajuste Direto Regime Geral,Aquisição de serviços,"79625000-1, Serviços de fornecimento de pessoal médico","Centro Hospitalar Cova da Beira, EPE (506361659)","Randstad Clinical - Cuidados de Saúde, Lda. (505121247)","18,25 €",06-11-2015,01-09-2013,365 dias,"Portugal, Castelo Branco, Covilhã",Artigo 258.º do Código dos Contratos Públicos,,,,,,Não aplicável.,Não aplicável.,FALSE
Aquisição de uma unidade de ecografia para ginecologia,Ajuste Direto Regime Geral,Aquisição de bens móveis,"33112000-8, Equipamento de imagiologia por ecos, ultra-sons e doppler","Centro Hospitalar Cova da Beira, EPE (506361659)","General Electric Portuguesa, S.A. (500357129)","26.797,00 €",06-11-2015,19-11-2013,15 dias,"Portugal, Castelo Branco, Covilhã","Artigo 20.º, n.º 1, alínea a) do Código dos Contratos Públicos",,,,,,Não aplicável.,Não aplicável.,FALSE
Aquisição de uma unidade de ecografia média gama  para cardiologia + estação de trabalho,Ajuste Direto Regime Geral,Aquisição de bens móveis,"33112000-8, Equipamento de imagiologia por ecos, ultra-sons e doppler","Centro Hospitalar Cova da Beira, EPE (506361659)","General Electric Portuguesa, S.A. (500357129)","51.926,00 €",06-11-2015,19-11-2013,15 dias,"Portugal, Castelo Branco, Covilhã","Artigo 20.º, n.º 1, alínea a) do Código dos Contratos Públicos",,,,,,Não aplicável.,Não aplicável.,FALSE
Aquisição uma unidade de ecografia para os serviços de Urologia e Gastroenterologia,Ajuste Direto Regime Geral,Aquisição de bens móveis,"33112000-8, Equipamento de imagiologia por ecos, ultra-sons e doppler","Centro Hospitalar Cova da Beira, EPE (506361659)","Siemens, S.A. (500247480)","50.000,00 €",06-11-2015,05-11-2013,15 dias,"Portugal, Castelo Branco, Covilhã","Artigo 20.º, n.º 1, alínea a) do Código dos Contratos Públicos",,,,,,Não aplicável.,Não aplicável.,FALSE
Aquisição de uma unidade de ecografia topo de gama para cardiologia,Ajuste Direto Regime Geral,Aquisição de bens móveis,"33112000-8, Equipamento de imagiologia por ecos, ultra-sons e doppler","Centro Hospitalar Cova da Beira, EPE (506361659)",GE Healthcare (500357129),"66.277,00 €",06-11-2015,18-11-2013,15 dias,"Portugal, Castelo Branco, Covilhã","Artigo 20.º, n.º 1, alínea a) do Código dos Contratos Públicos",,,,,,Não aplicável.,Não aplicável.,FALSE
Aquisição de serviços no âmbito do projeto de melhoria continua (gestão de contratos de alimentação e limpeza),Ajuste Direto Regime Geral,Aquisição de serviços,"79420000-4, Serviços relacionados com a gestão","Centro Hospitalar Cova da Beira, E. P. E. (506361659)",Abstract Business (508910315),"40.000,00 €",06-11-2015,20-03-2013,420 dias,"Portugal, Castelo Branco, Covilhã","Artigo 20.º, n.º 1, alínea a) do Código dos Contratos Públicos",,,,,,Não aplicável.,Não aplicável.,FALSE
Aquisição de outras analises de patologia clinica ao exterior,Ajuste Direto Regime Geral,Aquisição de serviços,"85111810-1, Serviços de análise sanguínea","Centro Hospitalar Cova da Beira, E.P.E. (506361659)",Lab. Dr. Joaquim Chaves  (500753636),"18.387,30 €",06-11-2015,18-10-2013,365 dias,"Portugal, Castelo Branco, Covilhã","Artigo 20.º, n.º 1, alínea a) do Código dos Contratos Públicos",,,,,,Não aplicável.,Não aplicável.,FALSE
Aquisição de análises de Patologia Clinica - Genetica e Rastreios ao Exterior,Ajuste Direto Regime Geral,Aquisição de serviços,"85111810-1, Serviços de análise sanguínea","Centro Hospitalar Cova da Beira, E.P.E. (506361659)","Centro de Genetica Clínica e Patologia, S.A. (501410961)","31.185,00 €",06-11-2015,28-10-2013,365 dias,"Portugal, Castelo Branco, Covilhã","Artigo 20.º, n.º 1, alínea a) do Código dos Contratos Públicos",,,,,,Não aplicável.,Não aplicável.,FALSE
Prestação de serviços de limpeza,Ajuste Direto Regime Geral,Aquisição de serviços,"90911000-6, Serviços de limpeza de alojamentos, edifícios e janelas","Centro Hospitalar Cova da Beira, E. P. E. (506361659)",Nova Serviços (502117281),"57.000,00 €",06-11-2015,13-03-2013,60 dias,"Portugal, Castelo Branco, Covilhã","Artigo 20.º, n.º 1, alínea a) do Código dos Contratos Públicos",,,,,,Não aplicável.,Não aplicável.,FALSE
Prestação de serviços de limpeza,Ajuste Direto Regime Geral,Aquisição de serviços,"90911200-8, Serviços de limpeza de edifícios","Centro Hospitalar Cova da Beira, E.P.E. (506361659)","Nova Serviços, Lda. (502117281)","57.000,00 €",06-11-2015,05-02-2013,60 dias,"Portugal, Castelo Branco, Covilhã","Artigo 20.º, n.º 1, alínea a) do Código dos Contratos Públicos",,,,,,Não aplicável.,Não aplicável.,FALSE
