Objeto do Contrato,Tipo de Procedimento,Tipo(s) de Contrato,CPVs,Entidade(s) Adjudicante(s),Entidade(s) Adjudicatária(s),Preço Contratual,Data de Publicação,Data de Celebração do Contrato,Prazo de Execução,Local de Execução,Fundamentação,Data de Fecho do Contrato,Preço Total Efetivo,Causas das Alterações ao Prazo,Causas das Alterações ao Preço,Estado,N.º registo do Acordo Quadro,Descrição do Acordo Quadro,Procedimento Centralizado
AQUISIÇÃO DE MEDICAMENTOS NO ÂMBITO DO DESPACHO 1571-B/2016-CENTRALIZAÇÃO 2018 - AGREGAÇÃO CIRCULAR INFORMATIVA CONJUNTA Nº8-2016 ACSS/INFARMED/SPMS - AD-AC-2017-139.,Ajuste Direto Regime Geral,Aquisição de bens móveis,"33600000-6, Produtos farmacêuticos","Centro Hospitalar Porto, E. P. E. (508331471)",LOGIFARMA - LOGISTICA FARMACÊUTICA (503934640),"3.342,72 €",04-07-2018,08-03-2018,365 dias,"Portugal, Porto, Porto",Artigo 258.º do Código dos Contratos Públicos,,,,,,Não aplicável.,Não aplicável.,TRUE
AQUISIÇÃO DE MEDICAMENTOS NO ÂMBITO DO DESPACHO 1571-B/2016-CENTRALIZAÇÃO 2018 - AGREGAÇÃO CIRCULAR INFORMATIVA CONJUNTA Nº8-2016 ACSS/INFARMED/SPMS - CPA 2016/18 - P259-AC-2017-195,Ao abrigo de acordo-quadro (art.º 259.º),Aquisição de bens móveis,"33600000-6, Produtos farmacêuticos","Centro Hospitalar do Porto, E.P.E. (CHP) (508331471)","SANOFI - PRODUTOS FARMACEUTICOS , LDA (500134960)","3.913,02 €",04-07-2018,10-01-2018,365 dias,"Portugal, Porto, Porto",Artigo 259.º do Código dos Contratos Públicos,,,,,,1771819,CP 2015/6 - Acordo quadro para o fornecimento de Medicamentos do Foro Oncológico,TRUE
AQUISIÇÃO DE MEDICAMENTOS NO ÂMBITO DO DESPACHO 1571-B/2016-CENTRALIZAÇÃO 2018 - AGREGAÇÃO CIRCULAR INFORMATIVA CONJUNTA Nº8-2016 ACSS/INFARMED/SPMS - CPA 2016/40 - P259-AC-2017-188,Ao abrigo de acordo-quadro (art.º 259.º),Aquisição de bens móveis,"33600000-6, Produtos farmacêuticos","Centro Hospitalar Porto, E. P. E. (508331471)","ABBVIE, LDA (510229050)","18.391,94 €",02-07-2018,10-01-2018,365 dias,"Portugal, Porto, Porto",Artigo 259.º do Código dos Contratos Públicos,,,,,,2183729,Medicamentos antirretrovíricos para o tratamento da infeção por VIH,TRUE
"AQUISIÇÃO DE MEDICAMENTOS NO ÂMBITO DO DESPACHO 1571-B/2016-CENTRALIZAÇÃO 2018 - AGREGAÇÃO CIRCULAR INFORMATIVA CONJUNTA Nº8-2016 ACSS/INFARMED/SPMS - CPA 2015/6, 2016/40 - P259-AC-2017-155",Ao abrigo de acordo-quadro (art.º 259.º),Aquisição de bens móveis,"33600000-6, Produtos farmacêuticos","Centro Hospitalar Porto, E. P. E. (508331471)",BRISTOL-MYERS SQUIB FARMAC PORTUGUESA SA (500048193),"191.665,51 €",02-07-2018,25-01-2018,365 dias,"Portugal, Porto, Porto",Artigo 259.º do Código dos Contratos Públicos,,,,,,1771819,CP 2015/6 - Acordo quadro para o fornecimento de Medicamentos do Foro Oncológico,TRUE
AQUISIÇÃO DE MEDICAMENTOS NO ÂMBITO DO DESPACHO 1571-B/2016-CENTRALIZAÇÃO 2018 - AGREGAÇÃO CIRCULAR INFORMATIVA CONJUNTA Nº8-2016 ACSS/INFARMED/SPMS - AD-AC-2017-134,Ajuste Direto Regime Geral,Aquisição de bens móveis,"33600000-6, Produtos farmacêuticos","Centro Hospitalar Porto, E. P. E. (508331471)",Eisai (507847660),"74.793,60 €",02-07-2018,25-01-2018,365 dias,"Portugal, Porto, Porto",Artigo 258.º do Código dos Contratos Públicos,,,,,,Não aplicável.,Não aplicável.,TRUE
AQUISIÇÃO DE MEDICAMENTOS NO ÂMBITO DO DESPACHO 1571-B/2016-CENTRALIZAÇÃO 2018 - AGREGAÇÃO CIRCULAR INFORMATIVA CONJUNTA Nº8-2016 ACSS/INFARMED/SPMS - AD-AC-2017-127,Ajuste Direto Regime Geral,Aquisição de bens móveis,"33600000-6, Produtos farmacêuticos","Centro Hospitalar do Porto, E.P.E. (CHP) (508331471)","SANOFI - PRODUTOS FARMACEUTICOS , LDA (500134960)","47.652,00 €",02-07-2018,24-01-2018,365 dias,"Portugal, Porto, Porto",Artigo 258.º do Código dos Contratos Públicos,,,,,,Não aplicável.,Não aplicável.,TRUE
AQUISIÇÃO DE MEDICAMENTOS NO ÂMBITO DO DESPACHO 1571-B/2016-CENTRALIZAÇÃO 2018 - AGREGAÇÃO CIRCULAR INFORMATIVA CONJUNTA Nº8-2016 ACSS/INFARMED/SPMS - AD-AC-2017-125,Ajuste Direto Regime Geral,Aquisição de bens móveis,"33600000-6, Produtos farmacêuticos","Centro Hospitalar Porto, E. P. E. (508331471)",CELGENE SOCIEDADE UNIPESSOAL LDA (507791690),"324.686,73 €",02-07-2018,18-01-2018,365 dias,"Portugal, Porto, Porto",Artigo 258.º do Código dos Contratos Públicos,,,,,,Não aplicável.,Não aplicável.,TRUE
AQUISIÇÃO DE MEDICAMENTOS NO ÂMBITO DO DESPACHO 1571-B/2016-CENTRALIZAÇÃO 2018 - AGREGAÇÃO CIRCULAR INFORMATIVA CONJUNTA Nº8-2016 ACSS/INFARMED/SPMS - CPA 2015/6 - P259-AC-2017-186,Ao abrigo de acordo-quadro (art.º 259.º),Aquisição de bens móveis,"33600000-6, Produtos farmacêuticos","Centro Hospitalar do Porto, E.P.E. (CHP) (508331471)",ROCHE FARMACEUTICA E QUIMICA (500233810),"350.100,50 €",02-07-2018,18-01-2018,365 dias,"Portugal, Porto, Porto",Artigo 259.º do Código dos Contratos Públicos,,,,,,1771819,CP 2015/6 - Acordo quadro para o fornecimento de Medicamentos do Foro Oncológico,TRUE
"AQUISIÇÃO DE MEDICAMENTOS NO ÂMBITO DO DESPACHO 1571-B/2016-CENTRALIZAÇÃO 2018 - AGREGAÇÃO CIRCULAR INFORMATIVA CONJUNTA Nº8-2016 ACSS/INFARMED/SPMS - CPA 2015/6, 2017/61,  - P259-AC-2017-189",Ao abrigo de acordo-quadro (art.º 259.º),Aquisição de bens móveis,"33600000-6, Produtos farmacêuticos","Centro Hospitalar Porto, E. P. E. (508331471)","BAXTER MEDICO - FARMACÊUTICA, LDA (503347345)","52.841,19 €",02-07-2018,16-01-2018,365 dias,"Portugal, Porto, Porto",Artigo 259.º do Código dos Contratos Públicos,,,,,,1771819,CP 2015/6 - Acordo quadro para o fornecimento de Medicamentos do Foro Oncológico,TRUE
AQUISIÇÃO DE MEDICAMENTOS NO ÂMBITO DO DESPACHO 1571-B/2016-CENTRALIZAÇÃO 2018 - AGREGAÇÃO CIRCULAR INFORMATIVA CONJUNTA Nº8-2016 ACSS/INFARMED/SPMS - AD-AC-2017-138,Ajuste Direto Regime Geral,Aquisição de bens móveis,"33600000-6, Produtos farmacêuticos","Centro Hospitalar do Porto, E.P.E. (CHP) (508331471)",PROFARIN (500223238),"15.656,88 €",02-07-2018,24-01-2018,365 dias,"Portugal, Porto, Porto",Artigo 258.º do Código dos Contratos Públicos,,,,,,Não aplicável.,Não aplicável.,TRUE
AQUISIÇÃO DE MEDICAMENTOS NO ÂMBITO DO DESPACHO 1571-B/2016-CENTRALIZAÇÃO 2018 - AGREGAÇÃO CIRCULAR INFORMATIVA CONJUNTA Nº8-2016 ACSS/INFARMED/SPMS - AD-AC-2017-128,Ajuste Direto Regime Geral,Aquisição de bens móveis,"33600000-6, Produtos farmacêuticos","Centro Hospitalar Porto, E. P. E. (508331471)",BRISTOL-MYERS SQUIB FARMAC PORTUGUESA SA (500048193),"26.775,00 €",02-07-2018,24-01-2018,365 dias,"Portugal, Porto, Porto",Artigo 258.º do Código dos Contratos Públicos,,,,,,Não aplicável.,Não aplicável.,TRUE
AQUISIÇÃO DE MEDICAMENTOS NO ÂMBITO DO DESPACHO 1571-B/2016-CENTRALIZAÇÃO 2018 - AGREGAÇÃO CIRCULAR INFORMATIVA CONJUNTA Nº8-2016 ACSS/INFARMED/SPMS - AD-AC-2017-130,Ajuste Direto Regime Geral,Aquisição de bens móveis,"33600000-6, Produtos farmacêuticos","Centro Hospitalar Porto, E. P. E. (508331471)","Janssen Cilag Farmacêutica, Lda (500189412)","469.040,64 €",02-07-2018,18-01-2018,365 dias,"Portugal, Porto, Porto",Artigo 258.º do Código dos Contratos Públicos,,,,,,Não aplicável.,Não aplicável.,TRUE
AQUISIÇÃO DE MEDICAMENTOS NO ÂMBITO DO DESPACHO 1571-B/2016-CENTRALIZAÇÃO 2018 - AGREGAÇÃO CIRCULAR INFORMATIVA CONJUNTA Nº8-2016 ACSS/INFARMED/SPMS - AD-AC-2017-121,Ajuste Direto Regime Geral,Aquisição de bens móveis,"33600000-6, Produtos farmacêuticos","Centro Hospitalar do Porto, E.P.E. (CHP) (508331471)","ACTELION PHARMACEUTICALS PORTUGAL, LDA. (507336488)","1.105.200,00 €",02-07-2018,22-02-2018,365 dias,"Portugal, Porto, Porto",Artigo 258.º do Código dos Contratos Públicos,,,,,,Não aplicável.,Não aplicável.,TRUE
