freguesia,acronym,validVotesPercentage,votes,dicofre
Bonfim,PPD/PSD.CDS-PP,31.71,2853,131202
Bonfim,PS,30.51,2745,131202
Bonfim,PCP-PEV,14.44,1299,131202
Bonfim,MPT,8.56,770,131202
Bonfim,B.E.,5.99,539,131202
Bonfim,L,3.01,271,131202
Bonfim,PAN,2.27,204,131202
Bonfim,PCTP/MRPP,1.21,109,131202
Bonfim,PPM,0.49,44,131202
Bonfim,PND,0.47,42,131202
Bonfim,PNR,0.38,34,131202
Bonfim,MAS,0.27,24,131202
Bonfim,PTP,0.27,24,131202
Bonfim,PPV,0.26,23,131202
Bonfim,PDA,0.11,10,131202
Bonfim,POUS,0.06,5,131202
