freguesia,acronym,validVotesPercentage,votes,dicofre
Anelhe,PPD/PSD,61.21,71,170302
Anelhe,PS,27.59,32,170302
Anelhe,B.E.,2.59,3,170302
Anelhe,CDS-PP,2.59,3,170302
Anelhe,PCTP/MRPP,1.72,2,170302
Anelhe,A,0.86,1,170302
Anelhe,IL,0.86,1,170302
Anelhe,MAS,0.86,1,170302
Anelhe,PAN,0.86,1,170302
Anelhe,PDR,0.86,1,170302
Anelhe,L,0,0,170302
Anelhe,NC,0,0,170302
Anelhe,PCP-PEV,0,0,170302
Anelhe,PNR,0,0,170302
Anelhe,PPM.PPV/CDC,0,0,170302
Anelhe,PTP,0,0,170302
Anelhe,PURP,0,0,170302
