Objeto do Contrato,Tipo de Procedimento,Tipo(s) de Contrato,CPVs,Entidade(s) Adjudicante(s),Entidade(s) Adjudicatária(s),Preço Contratual,Data de Publicação,Data de Celebração do Contrato,Prazo de Execução,Local de Execução,Fundamentação,Data de Fecho do Contrato,Preço Total Efetivo,Causas das Alterações ao Prazo,Causas das Alterações ao Preço,Estado,N.º registo do Acordo Quadro,Descrição do Acordo Quadro,Procedimento Centralizado
Prestação de Serviços na Área da Contabilidade,Ajuste Direto Regime Geral,Aquisição de serviços,"75000000-6, Serviços relacionados com a administração pública, a defesa e a segurança social","Instituto Nacional de Saúde Dr. Ricardo Jorge, I. P. (501427511)",Argumentos e Fórmulas (509986064),"11.880,00 €",11-12-2013,30-07-2013,365 dias,"Portugal, Lisboa, Lisboa","Artigo 20.º, n.º 1, alínea a) do Código dos Contratos Públicos",,,,,,Não aplicável.,Não aplicável.,
Detergente de limpeza,Ajuste Direto Regime Geral,Aquisição de bens móveis,"39830000-9, Produtos de limpeza","Instituto Nacional de Saúde Dr. Ricardo Jorge, I. P. (501427511)",Clinifar - Produtos químicos e farmacêuticos (503281115),"1.855,00 €",10-12-2013,15-05-2013,5 dias,"Portugal, Lisboa, Lisboa","Artigo 20.º, n.º 1, alínea a) do Código dos Contratos Públicos",,,,,,Não aplicável.,Não aplicável.,
Reagentes,Ajuste Direto Regime Geral,Aquisição de bens móveis,"33696000-5, Reagentes e meios de contraste","Instituto Nacional de Saúde Dr. Ricardo Jorge, I. P. (501427511)",Roche Sistemas de Diagnóstico Lda (504282921),"15.228,89 €",10-12-2013,17-05-2013,30 dias,"Portugal, Lisboa, Lisboa","Artigo 26.º, n.º 1, alínea a) do Código dos Contratos Públicos",,,,,,Não aplicável.,Não aplicável.,
Serviços jurídicos,Ajuste Direto Regime Geral,Aquisição de serviços,"79100000-5, Serviços jurídicos","Instituto Nacional de Saúde Dr. Ricardo Jorge, I. P. (501427511)","Bruno Dias e Maria João Mendes - Associados, Sociedade de Advogados (508966094)","14.580,00 €",10-12-2013,18-06-2013,360 dias,"Portugal, Lisboa, Lisboa","Artigo 20.º, n.º 1, alínea a) do Código dos Contratos Públicos",,,,,,Não aplicável.,Não aplicável.,
Álcool,Ajuste Direto Regime Geral,Aquisição de bens móveis,"24320000-3, Substâncias químicas orgânicas de base","Instituto Nacional de Saúde Dr. Ricardo Jorge, I. P. (501427511)",Proclínica (500222665),"2.825,00 €",10-12-2013,15-05-2013,3 dias,"Portugal, Lisboa, Lisboa","Artigo 20.º, n.º 1, alínea a) do Código dos Contratos Públicos",,,,,,Não aplicável.,Não aplicável.,
20130827 - Aquisição de reagentes no ambito do projecto ValCap,Ajuste Direto Regime Geral,Aquisição de bens móveis,"33140000-3, Material médico de consumo","Instituto Nacional de Saúde Dr. Ricardo Jorge, I. P. (501427511)","VWR Internacional Material de Laboratório, Lda (503842770)","282,10 €",09-12-2013,15-11-2013,66 dias,"Portugal, Lisboa, Lisboa","Artigo 26.º, n.º 1, alínea b) do Código dos Contratos Públicos",,,,,,Não aplicável.,Não aplicável.,
"20130615 -Aquisição de reagentes no ambito do progecto"""" Mycomix""""",Ajuste Direto Regime Geral,Aquisição de bens móveis,"33140000-3, Material médico de consumo","Instituto Nacional de Saúde Dr. Ricardo Jorge, I. P. (501427511)",Sigma-Aldrich (980148820),"2.508,00 €",09-12-2013,13-08-2013,90 dias,"Portugal, Lisboa, Lisboa","Artigo 26.º, n.º 1, alínea b) do Código dos Contratos Públicos",,,,,,Não aplicável.,Não aplicável.,
CAT (Instalações CEVDI),Ajuste Direto Regime Geral,Aquisição de serviços,"50000000-5, Serviços de reparação e manutenção","Instituto Nacional de Saúde Dr. Ricardo Jorge, I. P. (501427511)",Miguel ângelo Costa Ferreira (176247483),"8.091,00 €",09-12-2013,07-08-2013,5 dias,"Portugal, Lisboa, Lisboa","Artigo 20.º, n.º 1, alínea a) do Código dos Contratos Públicos",,,,,,Não aplicável.,Não aplicável.,
CAT (software PNAEQ),Ajuste Direto Regime Geral,Aquisição de serviços,"50000000-5, Serviços de reparação e manutenção","Instituto Nacional de Saúde Dr. Ricardo Jorge, I. P. (501427511)",Quidgest (501989978),"5.832,00 €",09-12-2013,29-04-2013,360 dias,"Portugal, Lisboa, Lisboa","Artigo 24.º, n.º 1, alínea e) do Código dos Contratos Públicos",,,,,,Não aplicável.,Não aplicável.,
Aquisição de serviços de Manutenção de Rede de Voz e Dados,Ajuste Direto Regime Geral,Aquisição de serviços,"72300000-8, Serviços relacionados com dados","Instituto Nacional de Saúde Dr. Ricardo Jorge, I. P. (501427511)","Instalfone - Infraestruturas de Comunicações Globais, Ldª (502843683)","3.000,00 €",06-12-2013,24-05-2013,180 dias,"Portugal, Lisboa, Lisboa","Artigo 20.º, n.º 1, alínea a) do Código dos Contratos Públicos",,,,,,Não aplicável.,Não aplicável.,
CAT - Geradores de gases,Ajuste Direto Regime Geral,Aquisição de serviços,"50000000-5, Serviços de reparação e manutenção","Instituto Nacional de Saúde Dr. Ricardo Jorge, I. P. (501427511)",Peak Scientific Instruments (699501784),"5.152,00 €",06-12-2013,07-08-2013,360 dias,"Portugal, Lisboa, Lisboa","Artigo 20.º, n.º 1, alínea a) do Código dos Contratos Públicos",,,,,,Não aplicável.,Não aplicável.,
Aquisição de serviços de assistência técnica e manutenção de equipamentos informaticos,Ajuste Direto Regime Geral,Aquisição de serviços,"50000000-5, Serviços de reparação e manutenção","Instituto Nacional de Saúde Dr. Ricardo Jorge, I. P. (501427511)","Total Partner- Consultadoria, Ldª (506540634)","4.900,00 €",05-12-2013,24-05-2013,180 dias,"Portugal, Lisboa, Lisboa","Artigo 20.º, n.º 1, alínea a) do Código dos Contratos Públicos",,,,,,Não aplicável.,Não aplicável.,
