Objeto do Contrato,Tipo de Procedimento,Tipo(s) de Contrato,CPVs,Entidade(s) Adjudicante(s),Entidade(s) Adjudicatária(s),Preço Contratual,Data de Publicação,Data de Celebração do Contrato,Prazo de Execução,Local de Execução,Fundamentação,Data de Fecho do Contrato,Preço Total Efetivo,Causas das Alterações ao Prazo,Causas das Alterações ao Preço,Estado,N.º registo do Acordo Quadro,Descrição do Acordo Quadro,Procedimento Centralizado
Serviços Médicos,Ajuste Direto Regime Geral,Aquisição de serviços,"85121200-5, Serviços de medicina especializada","Centro Hospitalar do Algarve, E. P. E. (510745997)",Profile - Saude e Turismo Lda  (507982126),"54.000,00 €",06-01-2014,26-07-2013,180 dias,"Portugal, Faro, Portimão","Artigo 20.º, n.º 1, alínea a) do Código dos Contratos Públicos",31-12-2013,"38.825,00 €",,Valor ajustado às necessidades reais,,Não aplicável.,Não aplicável.,FALSE
Serviços Médicos,Ajuste Direto Regime Geral,Aquisição de serviços,"85121200-5, Serviços de medicina especializada","Centro Hospitalar do Barlavento Algarvio, E.P.E. (507062540)",Profile - Saude e Turismo Lda (507982126),"60.000,00 €",15-03-2013,09-01-2013,183 dias,"Portugal, Faro, Portimão","Artigo 20.º, n.º 1, alínea a) do Código dos Contratos Públicos",30-06-2013,"49.680,00 €",,"o valor do contrato teve por base necessidades estimadas para o 1º semestre 2013, o valor final reflete as necessidades efetivas",,Não aplicável.,Não aplicável.,
