freguesia,acronym,validVotesPercentage,votes,dicofre
Ribeirinha,PPD/PSD.CDS-PP,42.42,42,470112
Ribeirinha,PS,41.41,41,470112
Ribeirinha,PCP-PEV,7.07,7,470112
Ribeirinha,B.E.,2.02,2,470112
Ribeirinha,PPM,2.02,2,470112
Ribeirinha,L,1.01,1,470112
Ribeirinha,MPT,1.01,1,470112
Ribeirinha,PAN,1.01,1,470112
Ribeirinha,PCTP/MRPP,1.01,1,470112
Ribeirinha,PND,1.01,1,470112
Ribeirinha,MAS,0,0,470112
Ribeirinha,PDA,0,0,470112
Ribeirinha,PNR,0,0,470112
Ribeirinha,POUS,0,0,470112
Ribeirinha,PPV,0,0,470112
Ribeirinha,PTP,0,0,470112
