freguesia,acronym,validVotesPercentage,votes,dicofre
Mondim de Basto,PS,37.94,357,170505
Mondim de Basto,PPD/PSD.CDS-PP,37.83,356,170505
Mondim de Basto,MPT,9.25,87,170505
Mondim de Basto,PCP-PEV,6.59,62,170505
Mondim de Basto,B.E.,2.23,21,170505
Mondim de Basto,L,1.38,13,170505
Mondim de Basto,PCTP/MRPP,1.28,12,170505
Mondim de Basto,PND,0.74,7,170505
Mondim de Basto,PPM,0.74,7,170505
Mondim de Basto,PPV,0.53,5,170505
Mondim de Basto,PAN,0.43,4,170505
Mondim de Basto,PTP,0.43,4,170505
Mondim de Basto,MAS,0.32,3,170505
Mondim de Basto,PNR,0.21,2,170505
Mondim de Basto,POUS,0.11,1,170505
Mondim de Basto,PDA,0,0,170505
