freguesia,acronym,validVotesPercentage,votes,dicofre
Boivães,PPD/PSD,70.1,68,160602
Boivães,PS,17.53,17,160602
Boivães,CDS-PP,5.15,5,160602
Boivães,B.E.,4.12,4,160602
Boivães,PAN,1.03,1,160602
Boivães,PPM.PPV/CDC,1.03,1,160602
Boivães,PTP,1.03,1,160602
Boivães,A,0,0,160602
Boivães,IL,0,0,160602
Boivães,L,0,0,160602
Boivães,MAS,0,0,160602
Boivães,NC,0,0,160602
Boivães,PCP-PEV,0,0,160602
Boivães,PCTP/MRPP,0,0,160602
Boivães,PDR,0,0,160602
Boivães,PNR,0,0,160602
Boivães,PURP,0,0,160602
