Objeto do Contrato,Tipo de Procedimento,Tipo(s) de Contrato,CPVs,Entidade(s) Adjudicante(s),Entidade(s) Adjudicatária(s),Preço Contratual,Data de Publicação,Data de Celebração do Contrato,Prazo de Execução,Local de Execução,Fundamentação,Data de Fecho do Contrato,Preço Total Efetivo,Causas das Alterações ao Prazo,Causas das Alterações ao Preço,Estado,N.º registo do Acordo Quadro,Descrição do Acordo Quadro,Procedimento Centralizado
"Aquisição de Análise Clinicas ao Exterior para a Unidade Local de Saúde do Norte Alentejano, EPE (Ano 208).",Ajuste Direto Regime Geral,Aquisição de serviços,"85148000-8, Serviços de análises clínicas","Unidade Local de Saúde do Norte Alentejano, E. P. E. (508094461)","Dr. Joaquim Chaves - Laboratório de Análises Clínicas, SA (500753636)","124.018,49 €",15-10-2018,09-08-2018,144 dias,"Portugal, Portalegre, Portalegre","Artigo 27.º, n.º 1, alínea a) do Código dos Contratos Públicos","","","","",,Não aplicável.,Não aplicável.,FALSE
"Realização de MCDT - Realização de Análises de Biologia Molecular aos Utentes do HGO, EPE",Concurso público,Aquisição de serviços,"85148000-8, Serviços de análises clínicas","Hospital Garcia de Orta, E.P.E. (506361470)","Dr. Joaquim Chaves - Laboratório de Análises Clínicas, SA (500753636)","61.843,49 €",04-10-2018,23-07-2018,243 dias,"Portugal, Setúbal, Almada","Artigo 20.º, n.º 1, alínea a) do Código dos Contratos Públicos","","","","",,Não aplicável.,Não aplicável.,FALSE
Consulta Prévia N.º 0800978 - Realização de MCDT: Análises de Serologia e Testes Confirmatórios,Consulta Prévia,Aquisição de serviços,"85148000-8, Serviços de análises clínicas","Hospital Garcia de Orta, E. P. E. (506361470)","Dr. Joaquim Chaves - Laboratório de Análises Clínicas, SA (500753636)","9.429,26 €",18-09-2018,31-07-2018,153 dias,"Portugal, Setúbal, Almada","Artigo 20.º, n.º 1, alínea c) do Código dos Contratos Públicos","","","","",,Não aplicável.,Não aplicável.,FALSE
Consulta Prévia N.º 0800918 - Aquisição de Serviços para a realização de MCDT: Análises de Bioquímica,Consulta Prévia,Aquisição de serviços,"85148000-8, Serviços de análises clínicas","Hospital Garcia de Orta, E. P. E. (506361470)","Dr. Joaquim Chaves - Laboratório de Análises Clínicas, SA (500753636)","11.090,33 €",17-09-2018,03-08-2018,150 dias,"Portugal, Setúbal, Almada","Artigo 20.º, n.º 1, alínea c) do Código dos Contratos Públicos","","","","",,Não aplicável.,Não aplicável.,FALSE
Consulta Prévia N.º 0800798 - Aquisição de Serviços de MCDT: Realização de Análises de Imunologia e Hematologia,Consulta Prévia,Aquisição de serviços,"85148000-8, Serviços de análises clínicas","Hospital Garcia de Orta, E. P. E. (506361470)","Dr. Joaquim Chaves - Laboratório de Análises Clínicas, SA (500753636)","12.824,45 €",17-09-2018,18-07-2018,166 dias,"Portugal, Setúbal, Almada","Artigo 20.º, n.º 1, alínea c) do Código dos Contratos Públicos","","","","",,Não aplicável.,Não aplicável.,FALSE
Aquisição de serviços de análises clínicas para o Centro Clínico da GNR,Consulta Prévia,Aquisição de serviços,"85145000-7, Serviços prestados por laboratórios médicos",Guarda Nacional Republicana (600008878),"Dr. Joaquim Chaves - Laboratório de Análises Clínicas, SA (500753636)","14.000,00 €",10-04-2018,12-03-2018,300 dias,"Portugal, Lisboa, Lisboa","Artigo 20.º, n.º 1, alínea c) do Código dos Contratos Públicos","","","","",,Não aplicável.,Não aplicável.,FALSE
Prestação de serviços de análises clínicas no exterior,Concurso público,Aquisição de serviços,"85148000-8, Serviços de análises clínicas","Hospital do Espírito Santo de Évora, E. P. E. (508085888)",Dr. Joaquim Chaves-Laboratório de Análises Clínicas (500753636),"37.876,83 €",05-04-2018,24-01-2018,365 dias,"Portugal, Évora, Évora","Artigo 20.º, n.º 1, alínea b) do Código dos Contratos Públicos","","","","",,Não aplicável.,Não aplicável.,FALSE
Aquisição de Serviços de Patologia Clínica,Concurso público,Aquisição de serviços,"85111800-8, Serviços de patologia","Centro Hospitalar do Médio Tejo, E.P.E. (CHMT) (506361608)",Dr. Joaquim Chaves-Laboratório de Análises Clínicas (500753636),"47.632,92 €",02-03-2018,15-02-2018,365 dias,"Portugal, Santarém, Tomar","Artigo 20.º, n.º 1, alínea b) do Código dos Contratos Públicos","","","","",,Não aplicável.,Não aplicável.,FALSE
"MCDT's aos utentes do CHS, EPE, no âmbito da Genética, para o Ano de 2018",Concurso público,Aquisição de serviços,"85111800-8, Serviços de patologia",CENTRO HOSPITALAR DE SETÚBAL E.P.E. (507606787),Dr. Joaquim Chaves-Laboratório de Análises Clínicas (500753636),"54.475,00 €",16-02-2018,24-01-2018,342 dias,"Portugal, Setúbal, Setúbal","Artigo 20.º, n.º 1, alínea b) do Código dos Contratos Públicos","","","","",,Não aplicável.,Não aplicável.,FALSE
"Aquisição de Exames ao Exterior de Medicina Nuclear para a ULSNA, EPE ",Ajuste Direto Regime Geral,Aquisição de serviços,"85100000-0, Serviços de saúde","Unidade Local de Saúde do Norte Alentejano, E. P. E. (508094461)",quadrantes (500753636),"78.035,80 €",25-10-2017,28-09-2017,181 dias,"Portugal, Portalegre","Artigo 24.º, n.º 1, alínea c) do Código dos Contratos Públicos","","","","",,Não aplicável.,Não aplicável.,FALSE
Aquisição de prestação de Serviços de Análises de Patologia Clínica,Concurso público,Aquisição de serviços,"85111800-8, Serviços de patologia","Centro Hospitalar de Entre o Douro e Vouga, E.P.E. (508878462)","Dr. Joaquim Chaves - Clínica de Análises Clínicas, S.A. (500753636)","175.195,19 €",24-07-2017,03-02-2016,1095 dias,"Portugal, Aveiro, Santa Maria da Feira","Artigo 20.º, n.º 1, alínea b) do Código dos Contratos Públicos","","","","",,Não aplicável.,Não aplicável.,FALSE
"Análises Laboratoriais, para o Ano de 2017",Ajuste Direto Regime Geral,Aquisição de serviços,"85000000-9, Serviços de saúde e acção social","Centro Hospitalar de Setúbal, E. P. E. (507606787)","Dr. Joaquim Chaves - Clínica de Análises Clínicas, S.A. (500753636)","48.383,39 €",06-06-2017,17-05-2017,229 dias,"Portugal, Lisboa, Lisboa","Artigo 20.º, n.º 1, alínea a) do Código dos Contratos Públicos","","","","",,Não aplicável.,Não aplicável.,FALSE
"Prestação de Serviços de Análises Clínicas para o HDFF, EPE",Concurso público,Aquisição de serviços,"85111800-8, Serviços de patologia","Hospital Distrital da Figueira da Foz, E. P. E. (506361527)","Dr. Joaquim Chaves - Clínica de Análises Clínicas, S.A. (500753636)","59.283,33 €",02-06-2017,29-05-2017,1095 dias,"Portugal, Coimbra, Figueira da Foz","Artigo 20.º, n.º 1, alínea b) do Código dos Contratos Públicos","","","","",,Não aplicável.,Não aplicável.,FALSE
Aquisição de serviços de análises clínicas para o Centro Clínico da GNR,Ajuste Direto Regime Geral,Aquisição de serviços,"85148000-8, Serviços de análises clínicas",Guarda Nacional Republicana (600008878),"Dr. Joaquim Chaves - Clínica de Análises Clínicas, S.A. (500753636)","9.089,21 €",02-06-2017,28-04-2017,279 dias,"Portugal, Lisboa, Lisboa","Artigo 20.º, n.º 1, alínea a) do Código dos Contratos Públicos","","","","",,Não aplicável.,Não aplicável.,FALSE
MCDT´s no Exterior - Análises Clínicas,Ajuste Direto Regime Geral,Aquisição de serviços,"85148000-8, Serviços de análises clínicas","Hospital do Espírito Santo de Évora, E. P. E. (508085888)",DR. JOAQUIM CHAVES - LAB. DE ANÁLISES CLÍNICAS (500753636),"36.348,86 €",26-04-2017,30-12-2016,365 dias,"Portugal, Évora, Évora","Artigo 20.º, n.º 1, alínea a) do Código dos Contratos Públicos","","","","",,Não aplicável.,Não aplicável.,FALSE
"Aquisição de Análises Clinicas ao Exterior para a Unidade Local de Saúde do Norte Alentejano, EPE Ano 2017",Ajuste Direto Regime Geral,Aquisição de serviços,"85000000-9, Serviços de saúde e acção social","Unidade Local de Saúde do Norte Alentejano, E. P. E. (508094461)",Joaquim Chaves (500753636),"78.383,53 €",02-02-2017,06-01-2017,365 dias,"Portugal, Portalegre","Artigo 27.º, n.º 1, alínea a) do Código dos Contratos Públicos","","","","",,Não aplicável.,Não aplicável.,FALSE
Realização de Análises Clínicas,Ajuste Direto Regime Geral,Aquisição de serviços,"85100000-0, Serviços de saúde","Centro Hospitalar do Algarve, E. P. E. (510745997)","Dr. Joaquim Chaves - Laboratório de Análises Clínicas, S.A (500753636)","7.000,00 €",02-12-2016,21-11-2016,60 dias,"Portugal, Faro, Faro","Artigo 20.º, n.º 1, alínea a) do Código dos Contratos Públicos","","","","",,Não aplicável.,Não aplicável.,FALSE
Patologia Clínica,Ajuste Direto Regime Geral,Aquisição de serviços,"85145000-7, Serviços prestados por laboratórios médicos","Centro Hospitalar do Médio Tejo, E. P. E. (506361608)","Dr. Joaquim Chaves - Laboratório de Análises Clínicas, S.A (500753636)","29.641,02 €",30-11-2016,10-11-2016,150 dias,"Portugal, Santarém, Torres Novas","Artigo 20.º, n.º 1, alínea a) do Código dos Contratos Públicos","","","","",,Não aplicável.,Não aplicável.,FALSE
Aquisição de Serviços de Patologia Clinica,Concurso público,Aquisição de serviços,"85111800-8, Serviços de patologia","Centro Hospitalar do Médio Tejo, E. P. E. (506361608)","Dr. Joaquim Chaves - Laboratório de Análises Clínicas, S.A. (500753636)","48.183,71 €",25-07-2016,12-07-2016,365 dias,"Portugal, Santarém, Torres Novas<BR/>Portugal, Santarém, Tomar<BR/>Portugal, Santarém, Abrantes","Artigo 20.º, n.º 1, alínea b) do Código dos Contratos Públicos","","","","",,Não aplicável.,Não aplicável.,FALSE
Aquisição de Serviços de Patologia Clínica,Ajuste Direto Regime Geral,Aquisição de serviços,"85111800-8, Serviços de patologia","Centro Hospitalar do Médio Tejo, E.P.E. (CHMT) (506361608)","Dr. Joaquim Chaves - Laboratório de Análises Clínicas, S.A. (500753636)","29.641,02 €",02-03-2016,25-11-2015,365 dias,"Portugal, Santarém, Tomar<BR/>Portugal, Santarém, Torres Novas<BR/>Portugal, Santarém, Abrantes","Artigo 20.º, n.º 1, alínea a) do Código dos Contratos Públicos","","","","",,Não aplicável.,Não aplicável.,FALSE
"AQUISIÇÃO DE ANALISES CLINICAS AO EXTERIOR PARA A ULSNA,EPE",Concurso público,Aquisição de serviços,"85100000-0, Serviços de saúde","Unidade Local de Saúde do Norte Alentejano, E. P. E. (508094461)","Dr Joaquim Chaves, Laboratorio de Analises Clinicas (500753636)","78.200,27 €",11-02-2016,26-01-2016,365 dias,"Portugal, Portalegre","Artigo 20.º, n.º 1, alínea b) do Código dos Contratos Públicos","","","","",,Não aplicável.,Não aplicável.,FALSE
Aquisição de Analises Clinicas,Ajuste Direto Regime Geral,Aquisição de serviços,"85140000-2, Serviços de saúde diversos","Unidade Local de Saúde do Norte Alentejano, E. P. E. (508094461)",Joaquim Chaves (500753636),"4.995,95 €",11-01-2016,25-11-2015,30 dias,"Portugal, Portalegre","Artigo 20.º, n.º 1, alínea a) do Código dos Contratos Públicos","","","","",,Não aplicável.,Não aplicável.,FALSE
Prestação de Serviços de Realização de Análises Clínicas,Ajuste Direto Regime Geral,Aquisição de serviços,"85148000-8, Serviços de análises clínicas","Centro Hospitalar do Algarve, E. P. E. (510745997)",Dr. Joaquim Chaves - Laboratório de Análises Clínicas (500753636),"15.119,56 €",06-01-2016,04-01-2016,366 dias,"Portugal, Faro, Faro","Artigo 20.º, n.º 1, alínea a) do Código dos Contratos Públicos","","","","",,Não aplicável.,Não aplicável.,FALSE
Análises laboratoriais para o ano de 2016,Ajuste Direto Regime Geral,Aquisição de serviços,"85000000-9, Serviços de saúde e acção social","Centro Hospitalar de Setúbal, E. P. E. (507606787)","Dr. Joaquim Chaves - Laboratório de Análises Clinicas, S.A. (500753636)","45.000,00 €",29-12-2015,10-12-2015,365 dias,"Portugal, Setúbal, Setúbal","Artigo 20.º, n.º 1, alínea a) do Código dos Contratos Públicos","","","","",,Não aplicável.,Não aplicável.,FALSE
MCDT´s Analises Clinicas Janeiro/Fevereiro,Ajuste Direto Regime Geral,Aquisição de serviços,"98113000-8, Serviços prestados por organizações especializadas",Centro Hospitalar do Oeste (510412009),Joaquim Chaves (500753636),"217,03 €",10-12-2015,19-02-2014,1 dias,"Portugal, Leiria, Caldas da Rainha","Artigo 20.º, n.º 1, alínea a) do Código dos Contratos Públicos",19-02-2014,"217,03 €","","",,Não aplicável.,Não aplicável.,FALSE
Aquisição de outras analises de patologia clinica ao exterior,Ajuste Direto Regime Geral,Aquisição de serviços,"85111810-1, Serviços de análise sanguínea","Centro Hospitalar Cova da Beira, E.P.E. (506361659)",Lab. Dr. Joaquim Chaves  (500753636),"18.387,30 €",06-11-2015,18-10-2013,365 dias,"Portugal, Castelo Branco, Covilhã","Artigo 20.º, n.º 1, alínea a) do Código dos Contratos Públicos","","","","",,Não aplicável.,Não aplicável.,FALSE
MCDT- GAER - Instituto Medico radiologia,Ajuste Direto Regime Geral,Aquisição de serviços,"85148000-8, Serviços de análises clínicas","Centro Hospitalar Vila Nova de Gaia - Espinho, E. P. E. (508142156)",DR. JOAQUIM CHAVES - LAB. DE ANÁLISES CLÍNICAS (500753636),"1.500,00 €",05-11-2015,23-07-2015,90 dias,"Portugal, Porto, Vila Nova de Gaia","Artigo 24.º, n.º 1, alínea c) do Código dos Contratos Públicos","","","","",,Não aplicável.,Não aplicável.,FALSE
MCDT's ao Exterior Área Patologia Clinica-1º trimestre,Ajuste Direto Regime Geral,Aquisição de serviços,"85148000-8, Serviços de análises clínicas","Centro Hospitalar Vila Nova de Gaia - Espinho, E. P. E. (508142156)",DR. JOAQUIM CHAVES - LAB. DE ANÁLISES CLÍNICAS (500753636),"1.500,00 €",09-10-2015,20-03-2015,90 dias,"Portugal, Porto, Vila Nova de Gaia","Artigo 24.º, n.º 1, alínea c) do Código dos Contratos Públicos","","","","",,Não aplicável.,Não aplicável.,FALSE
MCDT Gastroenterologia,Concurso público,Aquisição de serviços,"85121251-7, Serviços de gastroenterologia","Hospital do Espírito Santo de Évora, E. P. E. (508085888)","CDI - CLINICA DIAGNOSTICO POR IMAGEM (502830654), DR JOAQUIM CHAVES LAB ANAL CLINICAS SA (500753636)","33.035,00 €",07-08-2015,08-01-2015,365 dias,"Portugal, Évora, Évora","Artigo 20.º, n.º 1, alínea b) do Código dos Contratos Públicos","","","","",,Não aplicável.,Não aplicável.,FALSE
MCDT Análises no Exterior,Concurso público,Aquisição de serviços,"85148000-8, Serviços de análises clínicas","Hospital do Espírito Santo de Évora, E. P. E. (508085888)",DR JOAQUIM CHAVES LAB ANAL CLINICAS SA (500753636),"56.988,66 €",07-08-2015,02-01-2015,365 dias,"Portugal, Évora, Évora","Artigo 20.º, n.º 1, alínea b) do Código dos Contratos Públicos","","","","",,Não aplicável.,Não aplicável.,FALSE
AD para Aquisição de MCDT realizados Exterior na Área de Patologia Clinica 2º trimestre,Ajuste Direto Regime Geral,Aquisição de serviços,"85120000-6, Serviços de prática médica e serviços conexos","Centro Hospitalar Vila Nova de Gaia - Espinho, E. P. E. (508142156)",DR. JOAQUIM CHAVES - LAB. DE ANÁLISES CLÍNICAS (500753636),"1.500,00 €",25-05-2015,25-05-2015,90 dias,"Portugal, Porto, Vila Nova de Gaia","Artigo 24.º, n.º 1, alínea c) do Código dos Contratos Públicos","","","","",,Não aplicável.,Não aplicável.,FALSE
Aquisição de meios auxiliares de diagnóstico (análises clínica) para o Centro Clínico da GNR,Ajuste Direto Regime Geral,Aquisição de serviços,"85148000-8, Serviços de análises clínicas",Guarda Nacional Republicana (600008878),Dr. Joaquim Chaves - Laboratório Análises Clínicas SA (500753636),"9.756,10 €",27-04-2015,10-02-2015,322 dias,"Portugal, Lisboa, Lisboa","Artigo 20.º, n.º 1, alínea a) do Código dos Contratos Públicos","","","","",,Não aplicável.,Não aplicável.,FALSE
Prestação de Serviços de Realização de Análises Clínicas,Ajuste Direto Regime Geral,Aquisição de serviços,"85000000-9, Serviços de saúde e acção social","Centro Hospitalar do Algarve, E. P. E. (510745997)",Dr. Joaquim Chaves - Laboratório de Análises Clínicas (500753636),"14.750,08 €",20-03-2015,20-03-2015,286 dias,"Portugal, Faro, Portimão<BR/>Portugal, Faro, Faro<BR/>Portugal, Faro, Lagos","Artigo 20.º, n.º 1, alínea a) do Código dos Contratos Públicos","","","","",,Não aplicável.,Não aplicável.,FALSE
Prestação de Serviços de Realização de Análises Clínicas,Ajuste Direto Regime Geral,Aquisição de serviços,"85145000-7, Serviços prestados por laboratórios médicos","Centro Hospitalar do Algarve, E. P. E. (510745997)","Dr. Joaquim Chaves - Laboratório de Análises Clínicas, S.A. (500753636)","13.174,13 €",04-02-2015,08-01-2015,59 dias,"Portugal, Faro, Lagos<BR/>Portugal, Faro, Faro<BR/>Portugal, Faro, Portimão","Artigo 24.º, n.º 1, alínea c) do Código dos Contratos Públicos","","","","",,Não aplicável.,Não aplicável.,FALSE
Prestação de Serviços de Realização de Análises Clínicas,Ajuste Direto Regime Geral,Aquisição de serviços,"85145000-7, Serviços prestados por laboratórios médicos","Centro Hospitalar do Algarve, E. P. E. (510745997)","Dr. Joaquim Chaves - Laboratório de Análises Clínicas, S.A. (500753636)","13.174,13 €",06-11-2014,27-10-2014,66 dias,"Portugal, Faro, Faro","Artigo 20.º, n.º 1, alínea a) do Código dos Contratos Públicos","","","","",,Não aplicável.,Não aplicável.,FALSE
Análises Clinicas,Ajuste Direto Regime Geral,Aquisição de serviços,"85148000-8, Serviços de análises clínicas",Município da Moita (506791220),"Dr.Joaquim Chaves Laboratório de Análises Clínicas, S.A. (500753636)","28.800,00 €",27-08-2014,23-07-2014,1095 dias,"Portugal, Setúbal, Moita","Artigo 20.º, n.º 1, alínea a) do Código dos Contratos Públicos",31-07-2017,"23.939,03 €","",O serviço não foi prestado na totalidade,,Não aplicável.,Não aplicável.,FALSE
Prestação de serviços de análises para o CHLO (Externos-Outras análises) até ao final de 2014,Ajuste Direto Regime Geral,Aquisição de serviços,"85100000-0, Serviços de saúde","Centro Hospitalar de Lisboa Ocidental, EPE (CHLO) (507618319)",Laboratório de Análises Clinicas Dr. Joaquim Chaves (500753636),"14.613,14 €",30-07-2014,03-04-2014,272 dias,"Portugal, Lisboa, Lisboa<BR/>Portugal, Lisboa, Oeiras","Artigo 21.º, n.º 1, alínea a) do Código dos Contratos Públicos","","","","",,Não aplicável.,Não aplicável.,FALSE
Análises Clinicas ( 58063213 ),Ajuste Direto Regime Geral,Aquisição de serviços,"85120000-6, Serviços de prática médica e serviços conexos","Centro Hospitalar do Barlavento Algarvio, E.P.E. (507062540)",Laboratório Dr. Joaquim Chaves - Análises Clinicas  (500753636),"26.000,00 €",21-05-2013,02-01-2013,365 dias,"Portugal, Faro, Portimão","Artigo 20.º, n.º 1, alínea a) do Código dos Contratos Públicos",30-06-2013,"11.258,27 €",O CHBA cessou a atividade em 30-06-2013 no seguimento da criação do CHA EPE pelo DL 69/2013,o valor efetivo resulta das necessidades reais de acordo com os exames solicitados conforme produção/consultas no 1º semestre 2013 e da alteração do prazo de execução.,,Não aplicável.,Não aplicável.,
MCDT Patologia Clinica 2013,Ajuste Direto Regime Geral,Aquisição de serviços,"85145000-7, Serviços prestados por laboratórios médicos","Hospital do Espírito Santo de Évora, E.P.E. (508085888)",Dr. Joaquim Chaves Lab.  (500753636),"21.666,67 €",29-04-2013,01-01-2013,120 dias,"Portugal, Évora, Évora","Artigo 20.º, n.º 1, alínea a) do Código dos Contratos Públicos","","","","",,Não aplicável.,Não aplicável.,
"Aquisição e fornecimento de serviços na área de Patologia Clínica (Análises Clínicas), para apoio à atividade produtiva do Serviço de Patologia Clínica da ULSNA, EPE",Concurso público,Aquisição de serviços,"85111800-8, Serviços de patologia","Unidade Local de Saúde do Norte Alentejano, E.P.E. (508094461)","Dr Joaquim Chaves - Laboratório de Análises Clínicas, SA (500753636)","55.240,88 €",22-04-2013,22-04-2013,245 dias,"Portugal, Portalegre","Artigo 20.º, n.º 1, alínea b) do Código dos Contratos Públicos",31-12-2013,"55.240,88 €","","",,Não aplicável.,Não aplicável.,
Serviço para a realização de análises clinicas,Ajuste Direto Regime Geral,Aquisição de serviços,"85148000-8, Serviços de análises clínicas",Município da Moita (506791220),"Dr. Joaquim Chaves Laboratório de Análises Clínicas, S.A. (500753636)","8.000,00 €",11-03-2013,11-03-2013,365 dias,"Portugal, Setúbal, Moita","Artigo 20.º, n.º 1, alínea a) do Código dos Contratos Públicos",31-03-2014,"8.000,00 €","","",,Não aplicável.,Não aplicável.,
Prestação de Serviços para Colheita e Análises Laboratoriais de Amostras Biológicas,Ajuste Direto Regime Geral,Aquisição de serviços,"85148000-8, Serviços de análises clínicas","Valorsul - Valorização e Tratamento de Resíduos Sólidos das Regiões de Lisboa e do Oeste, S.A. (509479600)","Dr.Joaquim Chaves-Lab. de Análises Clínicas, Sa (500753636)","6.956,70 €",31-01-2012,24-01-2012,8 dias,"Portugal, Lisboa, Loures","Artigo 20.º, n.º 1, alínea a) do Código dos Contratos Públicos","","","","",,Não aplicável.,Não aplicável.,
Execução de MCDTs,Ajuste Direto Regime Geral,Aquisição de serviços,"85111810-1, Serviços de análise sanguínea","Hospital do Espírito Santo de Évora, E.P.E. (508085888)",DR JOAQUIM CHAVES LAB ANAL CLINICAS SA (500753636),"38.755,60 €",17-11-2011,01-09-2011,365 dias,"Portugal, Lisboa, Lisboa","Artigo 20.º, n.º 1, alínea a) do Código dos Contratos Públicos","","","","",,Não aplicável.,Não aplicável.,
Aquisição de serviço de meios auxiliares de diagnóstico (análises),Ajuste Direto Regime Geral,Aquisição de serviços,"71356200-0, Serviços de assistência técnica",Guarda Nacional Republicana (600008878),"Dr. Joaquim Chaves, Laboratório de Análises Clínicas. (500753636)","12.005,77 €",07-01-2011,09-08-2010,365 dias,Portugal,"Artigo 20.º, n.º 1, alínea a) do Código dos Contratos Públicos","","","","",,Não aplicável.,Não aplicável.,
"Aquisição implantes (análises) para Mestrado de Periodontia, Inf. 108/09",Ajuste Direto Regime Geral,Aquisição de bens móveis,"33132000-4, Implante dentário",Faculdade de Medicina Dentária da Universidade de Lisboa (503013366),"Dr. Joaquim Chaves, Laboratorio de análises (500753636)","370,95 €",23-10-2009,30-07-2009,10 dias,"Portugal, Lisboa, Lisboa","Artigo 24.º, n.º 1, alínea e) do Código dos Contratos Públicos","","","","",,Não aplicável.,Não aplicável.,
"Aquisição de análises clínicas para Periodontia, proc.s 26-B/09 e 48/09",Ajuste Direto Regime Geral,"","",Faculdade Medicina Dentária da Universidade de Lisboa (503013366),Clínica Dr. Joaquim Chaves (500753636),"355,90 €",25-05-2009,"",10 dias,"",alínea e) do n.º 1 do art.º 24º do DL 18/2008,"","","","",,Não aplicável.,Não aplicável.,
Aquisição de análises clínicas para Periodontia  proc.s 151/08 e 19/09,Ajuste Direto Regime Geral,"","",Faculdade Medicina Dentária da Universidade de Lisboa (503013366),Clínica Dr. Joaquim Chaves (500753636),"297,90 €",19-05-2009,"",10 dias,"",alínea e) do n.º 1 do art.º 24º do DL 18/2008,"","","","",,Não aplicável.,Não aplicável.,
Aquisição de serviços de meios auxiliares de diagnóstico (análises clínicas) ao exterior para o ano de 2009,Ajuste Direto Regime Geral,"","","Guarda Nacional Republicana, Centro Clínico (600008878)",CLINICA MÉDICA E DIAGNÓSTICO DR JOAQUIM CHAVES (500753636),"24.000,00 €",09-02-2009,"",340 dias,"",Não Preenchido,"","","","",,Não aplicável.,Não aplicável.,
"Aquisição de análises clínicas para Periodontia, proc.  143/08",Ajuste Direto Regime Geral,"","",Faculdade Medicina Dentária da Universidade de Lisboa (503013366),Clínica Dr. Joaquim Chaves (500753636),"100,00 €",06-01-2009,"",8 dias,"",alínea e) do n.º 1 do art.º 24º do DL 18/2008,"","","","",,Não aplicável.,Não aplicável.,
