Objeto do Contrato,Tipo de Procedimento,Tipo(s) de Contrato,CPVs,Entidade(s) Adjudicante(s),Entidade(s) Adjudicatária(s),Preço Contratual,Data de Publicação,Data de Celebração do Contrato,Prazo de Execução,Local de Execução,Fundamentação,Data de Fecho do Contrato,Preço Total Efetivo,Causas das Alterações ao Prazo,Causas das Alterações ao Preço,Estado,N.º registo do Acordo Quadro,Descrição do Acordo Quadro,Procedimento Centralizado
AD975-2018ECULUZIMAB 300 MG INJ,Ajuste Direto Regime Geral,Aquisição de bens móveis,"33600000-6, Produtos farmacêuticos","Instituto Português de Oncologia de Lisboa Francisco Gentil, E. P. E. (506361616)",ALEXION PHARMA INTERNACIONALUNLIMITED COMPANY (3191456VH),"424.138,56 €",07-06-2018,10-05-2018,245 dias,"Portugal, Lisboa, Lisboa","Artigo 24.º, n.º 1, alínea e) do Código dos Contratos Públicos",,,,,,Não aplicável.,Não aplicável.,FALSE
AD1703-2018-PRESTAÇÃO DE SERVIÇOS DE ASSESSORIA E CONSULTORIA JURIDICAS E PATROCINIO JUDICIÁRIO,Ajuste Direto Regime Geral,Aquisição de serviços,"79100000-5, Serviços jurídicos","Instituto Português de Oncologia de Lisboa Francisco Gentil, E. P. E. (506361616)","BRITO, ARTUR SILVA E ASSOCIADOS SP, RL (509100007)","14.000,00 €",07-06-2018,11-05-2018,110 dias,"Portugal, Lisboa, Lisboa","Artigo 24.º, n.º 1, alínea c) do Código dos Contratos Públicos",,,,,,Não aplicável.,Não aplicável.,FALSE
AD426-2018 DIVERSOS EQUIPAMENTOS PARA DOSE UNITÁRIA,Ajuste Direto Regime Geral,Aquisição de bens móveis,"33100000-1, Equipamento médico","Instituto Português de Oncologia de Lisboa Francisco Gentil, E. P. E. (506361616)",PARAMÉDICA-EQUIPAMENTOS MÉDICOS LDA (501393005),"24.059,40 €",07-06-2018,22-02-2018,30 dias,"Portugal, Lisboa, Lisboa","Artigo 24.º, n.º 1, alínea e) do Código dos Contratos Públicos",,,,,,Não aplicável.,Não aplicável.,FALSE
AD771-2017ARQUIVADORES METÁLICOS DE BLOCOS DE PARAFINA,Ajuste Direto Regime Geral,Aquisição de bens móveis,"33100000-1, Equipamento médico","Instituto Português de Oncologia de Lisboa Francisco Gentil, E. P. E. (506361616)",SAKURA FINITEK PORTUGAL UNIPESSOAL LDA (514225475),"10.400,00 €",05-06-2018,07-05-2018,30 dias,"Portugal, Lisboa, Lisboa","Artigo 24.º, n.º 1, alínea e) do Código dos Contratos Públicos",,,,,,Não aplicável.,Não aplicável.,FALSE
AD1815-2018 PRESTAÇÃO DE SERVIÇOS  DE SEGUROS DE ACIDENTES DE TRABALHO E DE SEGUROS MULTIRISCOS HABITAÇÃO,Ajuste Direto Regime Geral,Aquisição de serviços,"66510000-8, Serviços de seguros","Instituto Português de Oncologia de Lisboa Francisco Gentil, E. P. E. (506361616)",A WILLIS-CORRETORES DE SEGUROS S.A. (500188629),"43.634,00 €",04-06-2018,30-04-2018,365 dias,"Portugal, Lisboa, Lisboa","Artigo 24.º, n.º 1, alínea c) do Código dos Contratos Públicos",,,,,,Não aplicável.,Não aplicável.,FALSE
AD2440-2017 AQUISIÇÃO DE CAMARAS DE SEGURANÇA BIOLOGICA,Ajuste Direto Regime Geral,Aquisição de bens móveis,"33100000-1, Equipamento médico","Instituto Português de Oncologia de Lisboa Francisco Gentil, E. P. E. (506361616)","FRILABO II, LDA (507958861)","16.230,00 €",04-06-2018,11-05-2018,30 dias,"Portugal, Lisboa, Lisboa","Artigo 20.º, n.º 1, alínea a) do Código dos Contratos Públicos",,,,,,Não aplicável.,Não aplicável.,FALSE
