Objeto do Contrato,Tipo de Procedimento,Tipo(s) de Contrato,CPVs,Entidade(s) Adjudicante(s),Entidade(s) Adjudicatária(s),Preço Contratual,Data de Publicação,Data de Celebração do Contrato,Prazo de Execução,Local de Execução,Fundamentação,Data de Fecho do Contrato,Preço Total Efetivo,Causas das Alterações ao Prazo,Causas das Alterações ao Preço,Estado,N.º registo do Acordo Quadro,Descrição do Acordo Quadro,Procedimento Centralizado
AQUISIÇÃO DE 300 FRASCOS DE SOL. ALCOOLICA ETANOL+PROPANOL,Ao abrigo de acordo-quadro (art.º 258.º),Aquisição de bens móveis,"33631600-8, Anti-sépticos e desinfectantes","Instituto Nacional de Emergência Médica, IP (501356126)","AGA - ALCOOL E GENEROS ALIMENTARES, S.A. (500727457)","525,00 €",26-12-2012,22-11-2012,30 dias,"Portugal, Lisboa, Lisboa","Artigo 26.º, n.º 1, alínea e) do Código dos Contratos Públicos",,,,,,Não definido.,Não definido.,
AQUISIÇÃO DE 1500 MANTAS ISOTÉRMICAS DUPLA FACE DESCARTÁVEL,Ajuste Direto Regime Geral,Aquisição de bens móveis,"18143000-3, Equipamento (vestuário) de protecção","Instituto Nacional de Emergência Médica, IP (501356126)","SANO TÉCNICA, LDA. (500239819)","2.985,00 €",26-12-2012,18-12-2012,30 dias,"Portugal, Lisboa, Lisboa","Artigo 20.º, n.º 1, alínea a) do Código dos Contratos Públicos",,,,,,Não aplicável.,Não aplicável.,
"Fornecimento de 100 ampolas de tiopental sodico, pó p/sol. inj. 500 mg.",Ao abrigo de acordo-quadro (art.º 258.º),Aquisição de bens móveis,"33690000-3, Medicamentos vários","Instituto Nacional de Emergência Médica, IP (501356126)","B. BRAUN MEDICAL, LDA. (501506543)","304,11 €",21-12-2012,21-12-2012,30 dias,"Portugal, Lisboa, Lisboa","Artigo 26.º, n.º 1, alínea e) do Código dos Contratos Públicos",,,,,,Não definido.,Não definido.,
Fornecimento de 10 laringoscopio de fibra otica.,Ajuste Direto Regime Geral,Aquisição de bens móveis,"33140000-3, Material médico de consumo","Instituto Nacional de Emergência Médica, IP (501356126)","BACELAR & IRMÃO, LDA. (500532818)","498,00 €",21-12-2012,21-12-2012,30 dias,"Portugal, Lisboa, Lisboa","Artigo 20.º, n.º 1, alínea a) do Código dos Contratos Públicos",,,,,,Não aplicável.,Não aplicável.,
Manutenção de incubadora V-808/Fabian HFO sn 20Y0465/2000138-S.,Ajuste Direto Regime Geral,Aquisição de serviços,"50000000-5, Serviços de reparação e manutenção","Instituto Nacional de Emergência Médica, IP (501356126)","PULMOCOR-EQUIP.MÉDICO,Lª (501402578)","2.505,00 €",21-12-2012,13-12-2012,30 dias,"Portugal, Lisboa, Lisboa","Artigo 24.º, n.º 1, alínea e) do Código dos Contratos Públicos",,,,,,Não aplicável.,Não aplicável.,
Reparação de 1 ventilador Transpac sn 02470.,Ajuste Direto Regime Geral,Aquisição de serviços,"50000000-5, Serviços de reparação e manutenção","Instituto Nacional de Emergência Médica, IP (501356126)","SMITHS MEDICAL, LDA (507445937)","670,00 €",21-12-2012,17-12-2012,30 dias,"Portugal, Lisboa, Lisboa","Artigo 24.º, n.º 1, alínea e) do Código dos Contratos Públicos",,,,,,Não aplicável.,Não aplicável.,
AQUISIÇÃO DE 50 DISCOS RÍGIDOS PARA PORTÁTIL,Ajuste Direto Regime Geral,Aquisição de bens móveis,"30233132-5, Unidades de disco rígido","Instituto Nacional de Emergência Médica, IP (501356126)","COMPANHIA PORTUGUESA DE COMPUTADORES, INFORMÁTICA E SISTEMAS, S.A. (501267255)","1.922,50 €",21-12-2012,19-12-2012,30 dias,"Portugal, Lisboa, Lisboa","Artigo 20.º, n.º 1, alínea a) do Código dos Contratos Públicos",,,,,,Não aplicável.,Não aplicável.,
Fornecimento de 5 valvula expiratoria para vintilador weinmann e 5 traqueia para ventilador weinmann,Ajuste Direto Regime Geral,Aquisição de bens móveis,"33140000-3, Material médico de consumo","Instituto Nacional de Emergência Médica, IP (501356126)","FUTURVIDA, LDA. (504260510)","1.420,00 €",21-12-2012,19-12-2012,30 dias,"Portugal, Lisboa, Lisboa","Artigo 24.º, n.º 1, alínea e) do Código dos Contratos Públicos",,,,,,Não aplicável.,Não aplicável.,
Fornecimento de 4 valvulas para insuflador manual Laerdal - Adulto.,Ajuste Direto Regime Geral,Aquisição de bens móveis,"33140000-3, Material médico de consumo","Instituto Nacional de Emergência Médica, IP (501356126)","MEDICINÁLIA CORMÉDICA, LDA. (500684324)","190,00 €",21-12-2012,13-12-2012,30 dias,"Portugal, Lisboa, Lisboa","Artigo 24.º, n.º 1, alínea e) do Código dos Contratos Públicos",,,,,,Não aplicável.,Não aplicável.,
AQUISIÇÃO DE MATERIAL CLINICO,Ajuste Direto Regime Geral,Aquisição de bens móveis,"33140000-3, Material médico de consumo","Instituto Nacional de Emergência Médica, IP (501356126)","PMH-PRODUTOS MEDICO HOSP,SA (502376899)","1.273,80 €",21-12-2012,10-12-2012,30 dias,"Portugal, Lisboa, Lisboa","Artigo 20.º, n.º 1, alínea a) do Código dos Contratos Públicos",,,,,,Não aplicável.,Não aplicável.,
"Fornecimento de 80000 luva exame nitrilo n/esteril, sem pó, tamnho S; 100.000 luva exame nitrilo n/esteril, sem pó, tamanho M; 120.000 luva exame nitrilo n/esteril, sem pó tamanho L.",Ajuste Direto Regime Geral,Aquisição de bens móveis,"33140000-3, Material médico de consumo","Instituto Nacional de Emergência Médica, IP (501356126)","MEDICINÁLIA CORMÉDICA, LDA. (500684324)","9.300,00 €",21-12-2012,10-12-2012,30 dias,"Portugal, Lisboa, Lisboa","Artigo 20.º, n.º 1, alínea a) do Código dos Contratos Públicos",,,,,,Não aplicável.,Não aplicável.,
"Fornecimento de 250 seringa irrecuperavel 3 peças, bico largo de 100ml.",Ao abrigo de acordo-quadro (art.º 258.º),Aquisição de bens móveis,"33140000-3, Material médico de consumo","Instituto Nacional de Emergência Médica, IP (501356126)","PERGUT PORTUGAL, LDA. (501799729)","119,98 €",21-12-2012,12-12-2012,30 dias,"Portugal, Lisboa, Lisboa","Artigo 26.º, n.º 1, alínea e) do Código dos Contratos Públicos",,,,,,Não definido.,Não definido.,
AQUISIÇÃO DE DIVERSO MATERIAL CLINICO,Ajuste Direto Regime Geral,Aquisição de bens móveis,"33140000-3, Material médico de consumo","Instituto Nacional de Emergência Médica, IP (501356126)",INTERSURGICAL (503480045),"8.668,50 €",21-12-2012,04-12-2012,30 dias,"Portugal, Lisboa, Lisboa","Artigo 20.º, n.º 1, alínea a) do Código dos Contratos Públicos",,,,,,Não aplicável.,Não aplicável.,
Aquisição de 10 computadores portateis.,Ao abrigo de acordo-quadro (art.º 258.º),Aquisição de bens móveis,"30213100-6, Computadores portáteis","Instituto Nacional de Emergência Médica, IP (501356126)","CIL - CENTRO INFORMÁTICA, SA (500809690)","7.669,90 €",21-12-2012,03-12-2012,30 dias,"Portugal, Lisboa, Lisboa",Artigo 258.º do Código dos Contratos Públicos,,,,,,Não definido.,Não definido.,
AQUISIÇÃO DE MATERIAL CLINICO,Ajuste Direto Regime Geral,Aquisição de bens móveis,"33140000-3, Material médico de consumo","Instituto Nacional de Emergência Médica, IP (501356126)","SPACE, LDA. (507662407)","1.700,00 €",21-12-2012,10-12-2012,30 dias,"Portugal, Lisboa, Lisboa","Artigo 20.º, n.º 1, alínea a) do Código dos Contratos Públicos",,,,,,Não aplicável.,Não aplicável.,
"Fornecimento de 150 adesivo comum 5mx1,25cm, 100 ligadura elastic. algodão 4x50mm, 120 ligadura elastica 5m15cm, 200 sonda inalação d/O2 CH8 e 4200 saco recolha d7vomito.",Ajuste Direto Regime Geral,Aquisição de bens móveis,"33140000-3, Material médico de consumo","Instituto Nacional de Emergência Médica, IP (501356126)","T. M. S., LDA. (506688143)","1.545,20 €",21-12-2012,10-12-2012,30 dias,"Portugal, Lisboa, Lisboa","Artigo 20.º, n.º 1, alínea a) do Código dos Contratos Públicos",,,,,,Não aplicável.,Não aplicável.,
Fornecimento de 20000 lancetas de uso unico esteril.,Ajuste Direto Regime Geral,Aquisição de bens móveis,"33140000-3, Material médico de consumo","Instituto Nacional de Emergência Médica, IP (501356126)","IBERLAB & IMUNOREAGE, LDA. (503406694)","980,00 €",21-12-2012,10-12-2012,30 dias,"Portugal, Lisboa, Lisboa","Artigo 20.º, n.º 1, alínea a) do Código dos Contratos Públicos",,,,,,Não aplicável.,Não aplicável.,
Renovação da licença da aplicação informatica Navision.,Ao abrigo de acordo-quadro (art.º 258.º),Aquisição de serviços,"72212218-0, Serviços de desenvolvimento de software para gestão de licenças","Instituto Nacional de Emergência Médica, IP (501356126)",GLINTT-BUSINESS SOLUTIONS LDA (503502537),"39.640,00 €",21-12-2012,17-12-2012,30 dias,"Portugal, Lisboa, Lisboa",Artigo 258.º do Código dos Contratos Públicos,,,,,,Não definido.,Não definido.,
INSTALAÇÃO DE CONSOLA RADIO NO CODU DE LISBOA,Ajuste Direto Regime Geral,Aquisição de serviços,"51311000-5, Serviços de instalação de equipamento de rádio","Instituto Nacional de Emergência Médica, IP (501356126)","SIRESP, SA (506804917)","5.457,00 €",21-12-2012,15-12-2012,30 dias,"Portugal, Lisboa, Lisboa","Artigo 20.º, n.º 1, alínea a) do Código dos Contratos Públicos",,,,,,Não aplicável.,Não aplicável.,
Manutenção de Sistema Informatico - Abril 2012,Ajuste Direto Regime Geral,Aquisição de serviços,"50000000-5, Serviços de reparação e manutenção","Instituto Nacional de Emergência Médica, IP (501356126)","ATM INFORMÁTICA, SA (504062859)","4.877,99 €",21-12-2012,19-12-2012,30 dias,"Portugal, Lisboa, Lisboa","Artigo 20.º, n.º 1, alínea a) do Código dos Contratos Públicos",,,,,,Não aplicável.,Não aplicável.,
Manutenção do sistema informatico - Julho 2012,Ajuste Direto Regime Geral,Aquisição de serviços,"50000000-5, Serviços de reparação e manutenção","Instituto Nacional de Emergência Médica, IP (501356126)","ATM INFORMÁTICA, SA (504062859)","4.035,84 €",21-12-2012,19-12-2012,30 dias,"Portugal, Lisboa, Lisboa","Artigo 20.º, n.º 1, alínea a) do Código dos Contratos Públicos",,,,,,Não aplicável.,Não aplicável.,
