freguesia,acronym,validVotesPercentage,votes,dicofre
Trezói,PS,48.96,47,180809
Trezói,PPD/PSD,35.42,34,180809
Trezói,CDS-PP,5.21,5,180809
Trezói,B.E.,2.08,2,180809
Trezói,NC,2.08,2,180809
Trezói,PCP-PEV,2.08,2,180809
Trezói,L,1.04,1,180809
Trezói,PAN,1.04,1,180809
Trezói,PCTP/MRPP,1.04,1,180809
Trezói,PURP,1.04,1,180809
Trezói,A,0,0,180809
Trezói,IL,0,0,180809
Trezói,MAS,0,0,180809
Trezói,PDR,0,0,180809
Trezói,PNR,0,0,180809
Trezói,PPM.PPV/CDC,0,0,180809
Trezói,PTP,0,0,180809
