Objeto do Contrato,Tipo de Procedimento,Tipo(s) de Contrato,CPVs,Entidade(s) Adjudicante(s),Entidade(s) Adjudicatária(s),Preço Contratual,Data de Publicação,Data de Celebração do Contrato,Prazo de Execução,Local de Execução,Fundamentação,Data de Fecho do Contrato,Preço Total Efetivo,Causas das Alterações ao Prazo,Causas das Alterações ao Preço,Estado,N.º registo do Acordo Quadro,Descrição do Acordo Quadro,Procedimento Centralizado
SERINGA IRRECUPERAVEL S/ AGULHA - 10ML 2 CORPOS,Ajuste Direto Regime Geral,Outros Tipos (artº 26 al. e) nº 1),"33141310-6, Seringas","Administração Regional de Saúde de Lisboa e Vale do Tejo, I.P. (503148776)","PERGUT PORTUGAL, Lda. (501799729)","7.303,80 €",31-03-2011,25-03-2011,5 dias,"Portugal, Lisboa, Lisboa","Artigo 26.º, n.º 1, alínea e) do Código dos Contratos Públicos","","",,,,Não aplicável.,Não aplicável.,
SERINGA IRRECUPERAVEL S/ AGULHA - 2ML 2 CORPOS,Ajuste Direto Regime Geral,Outros Tipos (artº 26 al. e) nº 1),"33141310-6, Seringas","Administração Regional de Saúde de Lisboa e Vale do Tejo, I.P. (503148776)","PERGUT PORTUGAL, Lda. (501799729)","6.408,00 €",31-03-2011,25-03-2011,5 dias,"Portugal, Lisboa, Lisboa","Artigo 26.º, n.º 1, alínea e) do Código dos Contratos Públicos","","",,,,Não aplicável.,Não aplicável.,
DETERGENTE ENZIMATICO DESINCRUSTANTE - 1LT.,Ajuste Direto Regime Geral,Outros Tipos (artº 26 al. e) nº 1),"33690000-3, Medicamentos vários","Administração Regional de Saúde de Lisboa e Vale do Tejo, I.P. (503148776)","LAB. INIBSA, S.A. (500139571)","10,00 €",31-03-2011,14-03-2011,27838 dias,"Portugal, Lisboa, Lisboa","Artigo 26.º, n.º 1, alínea e) do Código dos Contratos Públicos","","",,,,Não aplicável.,Não aplicável.,
ESPONJA GELATINA 70X50X10,Ajuste Direto Regime Geral,Outros Tipos (artº 26 al. e) nº 1),"33690000-3, Medicamentos vários","Administração Regional de Saúde de Lisboa e Vale do Tejo, I.P. (503148776)","CLINIFAR, S.A. (503281115)","21.888,00 €",31-03-2011,14-03-2011,1 dias,"Portugal, Lisboa, Lisboa","Artigo 26.º, n.º 1, alínea e) do Código dos Contratos Públicos","","",,,,Não aplicável.,Não aplicável.,
"CLORETO DE Na 0,9% P/ IRRIGAÇÃO - 1000ML",Ajuste Direto Regime Geral,Outros Tipos (artº 26 al. e) ñº 1),"33690000-3, Medicamentos vários","Administração Regional de Saúde de Lisboa e Vale do Tejo, I.P. (503148776)","Overpharma, Lda. (505792362)","4.917,04 €",31-03-2011,14-03-2011,2 dias,"Portugal, Lisboa, Lisboa","Artigo 26.º, n.º 1, alínea e) do Código dos Contratos Públicos","","",,,,Não aplicável.,Não aplicável.,
TESTE DE CARGA DE ESTERILIZAÇÃO,Ajuste Direto Regime Geral,Outros Tipos (artº 26 al. e) nº 1),"33140000-3, Material médico de consumo","Administração Regional de Saúde de Lisboa e Vale do Tejo, I.P. (503148776)","DIMOR LUSITANA, Lda. (500730741)","3.213,00 €",31-03-2011,14-03-2011,5 dias,"Portugal, Lisboa, Lisboa","Artigo 26.º, n.º 1, alínea e) do Código dos Contratos Públicos","","",,,,Não aplicável.,Não aplicável.,
Aquisição de Hidrocortizona,Ajuste Direto Regime Geral,Aquisição de bens móveis,"33690000-3, Medicamentos vários","Administração Regional de Saúde de Lisboa e Vale do Tejo, I.P. (503148776)","Generis farmaceutica, SA (508107997)","13.356,00 €",31-03-2011,18-03-2011,365 dias,"Portugal, Lisboa, Loures","Artigo 26.º, n.º 1, alínea e) do Código dos Contratos Públicos","","",,,,Não aplicável.,Não aplicável.,
"Aquisição, fornecimento e instalação de 3 unidades de ar condicionado DAIKIN, para os serviços Farmeceuticos da ARSLVT,IP",Ajuste Direto Regime Geral,Aquisição de bens móveis,"98390000-3, Outros serviços","Administração Regional de Saúde de Lisboa e Vale do Tejo, I.P. (503148776)",Ventifor (501140751),"6.785,00 €",31-03-2011,24-02-2011,30 dias,"Portugal, Lisboa, Lisboa","Artigo 20.º, n.º 1, alínea a) do Código dos Contratos Públicos","","",,,,Não aplicável.,Não aplicável.,
Aquisição de manga para Esterilização - Diversas,Ajuste Direto Regime Geral,Aquisição de bens móveis,"33140000-3, Material médico de consumo","Administração Regional de Saúde de Lisboa e Vale do Tejo, I.P. (503148776)","Bastos e Viegas, SA (500042772)","98.059,00 €",31-03-2011,22-03-2011,365 dias,"Portugal, Lisboa, Lisboa","Artigo 26.º, n.º 1, alínea e) do Código dos Contratos Públicos","","",,,,Não aplicável.,Não aplicável.,
Aquisição de 300 Lentes Intraoculares,Ajuste Direto Regime Geral,Aquisição de bens móveis,"33731110-7, Lentes intraoculares","Administração Regional de Saúde de Lisboa e Vale do Tejo, I.P. (503148776)","Abbott Medical Optics Sapin, SL (980262364)","30.210,00 €",31-03-2011,17-03-2011,2 dias,"Portugal, Lisboa, Lisboa","Artigo 24.º, n.º 1, alínea e) do Código dos Contratos Públicos","","",,,,Não aplicável.,Não aplicável.,
"Aquisição de 2.005,00Kg de gás propano a granel para sistema de aquecimento central da UCSP de Torres Novas",Ajuste Direto Regime Geral,Aquisição de serviços,"09122100-1, Gás propano","Administração Regional de Saúde de Lisboa e Vale do Tejo, I.P. (503148776)","PETROGAL - Petróleos de Portugal, S.A. (500697370)","2.381,80 €",31-03-2011,07-02-2011,1 dias,"Portugal, Santarém, Torres Novas","Artigo 24.º, n.º 1, alínea e) do Código dos Contratos Públicos",07-02-2011,"2.381,80 €",,,,Não aplicável.,Não aplicável.,
Aquisição de 1/2 acesso primário ( central telefónica 15 canais ),Ajuste Direto Regime Geral,Aquisição de bens móveis,"32551200-2, Centrais telefónicas","Administração Regional de Saúde de Lisboa e Vale do Tejo, I.P. (503148776)","PT Comunicações, S.A (504615947)","740,00 €",30-03-2011,25-03-2011,2 dias,"Portugal, Lisboa, Cascais","Artigo 24.º, n.º 1, alínea e) do Código dos Contratos Públicos","","",,,,Não aplicável.,Não aplicável.,
"Aquisição de Rifanupicina, Isoniazida, Rifabutina, Pirazinamida, Etambul e Criprofloxacina",Ajuste Direto Regime Geral,Aquisição de bens móveis,"33690000-3, Medicamentos vários","Administração Regional de Saúde de Lisboa e Vale do Tejo, I.P. (503148776)",Somos Compras SPMS (508096197),"204.196,50 €",30-03-2011,29-03-2011,365 dias,"Portugal, Lisboa, Lisboa","Artigo 26.º, n.º 1, alínea e) do Código dos Contratos Públicos","","",,,,Não aplicável.,Não aplicável.,
Aquisição de Contraceptivos,Ajuste Direto Regime Geral,Aquisição de bens móveis,"33690000-3, Medicamentos vários","Administração Regional de Saúde de Lisboa e Vale do Tejo, I.P. (503148776)",Somos Compras SPMS (508096197),"3.927.827,50 €",30-03-2011,29-03-2011,365 dias,"Portugal, Lisboa, Lisboa","Artigo 26.º, n.º 1, alínea e) do Código dos Contratos Públicos","","",,,,Não aplicável.,Não aplicável.,
Reparação do elevador - Alferrarede,Ajuste Direto Regime Geral,Aquisição de serviços,"50000000-5, Serviços de reparação e manutenção","Administração Regional de Saúde de Lisboa e Vale do Tejo, I.P. (503148776)","Schindler - Ascensores e Escadas Rolantes, S.A. (502353740)","486,91 €",29-03-2011,23-02-2011,10 dias,"Portugal, Santarém, Abrantes","Artigo 24.º, n.º 1, alínea e) do Código dos Contratos Públicos","","",,,,Não aplicável.,Não aplicável.,
"Aquisição de uma solução informática para a Gestão de Transporte de pessoal (SGTP), para a ARSLVT, IP.",Ajuste Direto Regime Geral,Aquisição de bens móveis,"30200000-1, Equipamento e material informático","Administração Regional de Saúde de Lisboa e Vale do Tejo, I.P. (503148776)",Link SA (504551221),"12.000,00 €",28-03-2011,10-03-2011,1 dias,"Portugal, Lisboa, Lisboa","Artigo 27.º, n.º 1, alínea f) do Código dos Contratos Públicos","","",,,,Não aplicável.,Não aplicável.,
SACOS COLECTORES DE URINA - DIVERSOS,Ajuste Direto Regime Geral,Outros Tipos (artº 26 al. e) nº 1),"33140000-3, Material médico de consumo","Administração Regional de Saúde de Lisboa e Vale do Tejo, I.P. (503148776)","EZEQUIEL PANÃO JORGE, Lda. (501412727)","19.332,50 €",28-03-2011,21-03-2011,3 dias,"Portugal, Lisboa, Lisboa","Artigo 26.º, n.º 1, alínea e) do Código dos Contratos Públicos","","",,,,Não aplicável.,Não aplicável.,
"ATROPINA INJ 0,5MG/ML - 1ML",Ajuste Direto Regime Geral,Outros Tipos (artº 26 al. e) nº 1),"33692500-2, Soluções injectáveis","Administração Regional de Saúde de Lisboa e Vale do Tejo, I.P. (503148776)","B BRAUN MEDICAL, Lda. (501506543)","5.856,20 €",28-03-2011,21-03-2011,1 dias,"Portugal, Lisboa, Lisboa","Artigo 26.º, n.º 1, alínea e) do Código dos Contratos Públicos","","",,,,Não aplicável.,Não aplicável.,
CLORETO DE Na INJ 9MG/ML,Ajuste Direto Regime Geral,Outros Tipos (artº 26 al. e) nº 1),"33692500-2, Soluções injectáveis","Administração Regional de Saúde de Lisboa e Vale do Tejo, I.P. (503148776)","B BRAUN MEDICAL, Lda. (501506543)","18.800,00 €",28-03-2011,21-03-2011,1 dias,"Portugal, Lisboa, Lisboa","Artigo 26.º, n.º 1, alínea e) do Código dos Contratos Públicos","","",,,,Não aplicável.,Não aplicável.,
DEXAMETASONA INJ 5MG/ML - 1ML,Ajuste Direto Regime Geral,Outros Tipos (artº 26 al. e) nº 1),"33692500-2, Soluções injectáveis","Administração Regional de Saúde de Lisboa e Vale do Tejo, I.P. (503148776)","SCHERING PLOUGH FARMA, Lda. (500700907)","14.836,50 €",28-03-2011,14-03-2011,3 dias,"Portugal, Lisboa, Lisboa","Artigo 26.º, n.º 1, alínea e) do Código dos Contratos Públicos","","",,,,Não aplicável.,Não aplicável.,
PRODUTOS DIVERSOS P/ COL (ACES III),Ajuste Direto Regime Geral,Outros Tipos (artº 20 al. a) nº 1),"33662100-9, Medicamentos usados em oftalmologia","Administração Regional de Saúde de Lisboa e Vale do Tejo, I.P. (503148776)","ALCON PORTUGAL, Lda. (501251685)","5.787,30 €",28-03-2011,18-03-2011,1 dias,"Portugal, Lisboa, Lisboa","Artigo 20.º, n.º 1, alínea a) do Código dos Contratos Públicos","","",,,,Não aplicável.,Não aplicável.,
Reparação efectuada no esterilizador vertical da UCSP do Entroncamento,Ajuste Direto Regime Geral,Aquisição de serviços,"50000000-5, Serviços de reparação e manutenção","Administração Regional de Saúde de Lisboa e Vale do Tejo, I.P. (503148776)","JSM José santos Monteiro, Lda (500769680)","533,70 €",28-03-2011,07-02-2011,20 dias,"Portugal, Santarém, Entroncamento","Artigo 24.º, n.º 1, alínea e) do Código dos Contratos Públicos",07-02-2011,"533,70 €",,,,Não aplicável.,Não aplicável.,
Aquisição de mobiliário médico para a USF Eça,Ajuste Direto Regime Geral,Aquisição de bens móveis,"33192000-2, Mobiliário para fins médicos","Administração Regional de Saúde de Lisboa e Vale do Tejo, I.P. (503148776)",IFHI Lda (502264543),"4.547,00 €",28-03-2011,11-03-2011,30 dias,"Portugal, Setúbal, Barreiro","Artigo 1.º do Decreto-Lei n.º 48/2008, de 13.03","","",,,,Não aplicável.,Não aplicável.,
Aquisição de mobiliário médico para a USF Arco Iris Aces da Amadora.,Ajuste Direto Regime Geral,Aquisição de bens móveis,"33192000-2, Mobiliário para fins médicos","Administração Regional de Saúde de Lisboa e Vale do Tejo, I.P. (503148776)",Metalmédica Lda (503358991),"1.480,00 €",28-03-2011,11-03-2011,30 dias,"Portugal, Lisboa, Amadora","Artigo 1.º do Decreto-Lei n.º 48/2008, de 13.03","","",,,,Não aplicável.,Não aplicável.,
Aquisição de equipamento médico para a USF Arco Iris - ACES Amadora.,Ajuste Direto Regime Geral,Aquisição de bens móveis,"33100000-1, Equipamento médico","Administração Regional de Saúde de Lisboa e Vale do Tejo, I.P. (503148776)",Paramedica Lda (501393005),"1.500,00 €",28-03-2011,19-03-2011,15 dias,"Portugal, Lisboa, Amadora","Artigo 1.º do Decreto-Lei n.º 48/2008, de 13.03","","",,,,Não aplicável.,Não aplicável.,
Aquisição de mobiliário médico para a USF Arco Iris - ACES Amadora.,Ajuste Direto Regime Geral,Aquisição de bens móveis,"33100000-1, Equipamento médico","Administração Regional de Saúde de Lisboa e Vale do Tejo, I.P. (503148776)",Elnor SA (500094403),"8.250,30 €",28-03-2011,18-03-2011,30 dias,"Portugal, Lisboa, Amadora","Artigo 1.º do Decreto-Lei n.º 48/2008, de 13.03","","",,,,Não aplicável.,Não aplicável.,
Aquisição de equipamento médico para o ACES de Loures - SAG de Loures.<br />Regularização de facturas n.º 8792 e 8493.,Ajuste Direto Regime Geral,Aquisição de bens móveis,"33100000-1, Equipamento médico","Administração Regional de Saúde de Lisboa e Vale do Tejo, I.P. (503148776)",Speculum SA (502996323),"1.647,75 €",28-03-2011,18-02-2011,1 dias,"Portugal, Lisboa, Loures","Artigo 24.º, n.º 1, alínea c) do Código dos Contratos Públicos","","",,,,Não aplicável.,Não aplicável.,
"Contrato celebrado entre a ARSLVT e a empresa OTIS, com validade de 05 anos, ou seja válido até 31/10/2014, para efeitos de manutenção do elevador da UCSP de Fátima",Ajuste Direto Regime Geral,Aquisição de serviços,"50750000-7, Serviços de manutenção de elevadores","Administração Regional de Saúde de Lisboa e Vale do Tejo, I.P. (503148776)","OTIS- EEVADORES,LDA (500069824)","142,00 €",28-03-2011,01-11-2009,1826 dias,"Portugal, Santarém, Ourém","Artigo 24.º, n.º 1, alínea e) do Código dos Contratos Públicos","","",,,,Não aplicável.,Não aplicável.,
"FLOURETO Na COMP 0,55mg (0,25mg FLUOR)",Ajuste Direto Regime Geral,Outros Tipos (artº 26 al. e) nº 1),"33690000-3, Medicamentos vários","Administração Regional de Saúde de Lisboa e Vale do Tejo, I.P. (503148776)","NOVARTIS CONSUMER HEALTH, Lda. (500268215)","6.943,50 €",28-03-2011,21-03-2011,2 dias,"Portugal, Lisboa, Lisboa","Artigo 26.º, n.º 1, alínea e) do Código dos Contratos Públicos","","",,,,Não aplicável.,Não aplicável.,
HIDROXIZINA INJ 50MG/ML - 2 ML,Ajuste Direto Regime Geral,Outros Tipos (artº 24 al. e) nº 1),"33692500-2, Soluções injectáveis","Administração Regional de Saúde de Lisboa e Vale do Tejo, I.P. (503148776)","UCB PHARMA, Lda. (500291322)","1.950,00 €",28-03-2011,24-03-2011,7 dias,"Portugal, Lisboa, Lisboa","Artigo 24.º, n.º 1, alínea e) do Código dos Contratos Públicos","","",,,,Não aplicável.,Não aplicável.,
CICLOSERINA CAPS. 250MG,Ajuste Direto Regime Geral,Outros Tipos (artº 24 al. e) nº 1),"33690000-3, Medicamentos vários","Administração Regional de Saúde de Lisboa e Vale do Tejo, I.P. (503148776)","ETIOPHARMA, S.A. (509393357)","154.000,00 €",28-03-2011,21-03-2011,1 dias,"Portugal, Lisboa, Lisboa","Artigo 24.º, n.º 1, alínea e) do Código dos Contratos Públicos","","",,,,Não aplicável.,Não aplicável.,
Fornecimento de Telecomunicações para a Av.EUA n.º 53D (Repografia e Arquivo) para o ano de 2011,Ajuste Direto Regime Geral,Aquisição de serviços,"98390000-3, Outros serviços","Administração Regional de Saúde de Lisboa e Vale do Tejo, I.P. (503148776)","PT Comunicações, S.A. (504615947)","400,00 €",25-03-2011,22-02-2011,30 dias,"Portugal, Lisboa, Lisboa","Artigo 24.º, n.º 1, alínea e) do Código dos Contratos Públicos","","",,,,Não aplicável.,Não aplicável.,
Aquisição de osigénio para a UCSP do Entroncamento,Ajuste Direto Regime Geral,Aquisição de bens móveis,"24111900-4, Oxigénio","Administração Regional de Saúde de Lisboa e Vale do Tejo, I.P. (503148776)","Linde Sogás,Lda (500266344)","421,88 €",25-03-2011,21-02-2011,5 dias,"Portugal, Santarém, Entroncamento","Artigo 24.º, n.º 1, alínea e) do Código dos Contratos Públicos",21-02-2011,"421,88 €",,,,Não aplicável.,Não aplicável.,
Públicação de anúncio em Diário da República ref.404405285,Ajuste Direto Regime Geral,Aquisição de serviços,"98390000-3, Outros serviços","Administração Regional de Saúde de Lisboa e Vale do Tejo, I.P. (503148776)","Imprensa Nacional - Casa da Moeda, S. A (500792887)","296,51 €",23-03-2011,04-03-2011,30 dias,"Portugal, Lisboa, Lisboa","Artigo 24.º, n.º 1, alínea e) do Código dos Contratos Públicos","","",,,,Não aplicável.,Não aplicável.,
Publicação de anuncio ref.404403843,Ajuste Direto Regime Geral,Aquisição de serviços,"98390000-3, Outros serviços","Administração Regional de Saúde de Lisboa e Vale do Tejo, I.P. (503148776)","Imprensa Nacional - Casa da Moeda, S.A. (500792887)","301,82 €",23-03-2011,04-03-2011,30 dias,"Portugal, Lisboa, Lisboa","Artigo 24.º, n.º 1, alínea e) do Código dos Contratos Públicos","","",,,,Não aplicável.,Não aplicável.,
OXIBUPROCAINA COL. 4MG/ML - 10ML / OXITETRACICLINA POM. OFT. 5MG/G,Ajuste Direto Regime Geral,Outros Tipos (artº 206 al. e) nº 1),"33662100-9, Medicamentos usados em oftalmologia","Administração Regional de Saúde de Lisboa e Vale do Tejo, I.P. (503148776)","LABORATORIO EDOL, S.A. (507072642)","4.050,00 €",22-03-2011,14-03-2011,2 dias,"Portugal, Lisboa, Lisboa","Artigo 26.º, n.º 1, alínea e) do Código dos Contratos Públicos","","",,,,Não aplicável.,Não aplicável.,
METILPREDNISOLONA INJ. 125MG,Ajuste Direto Regime Geral,Outros Tipos (artº 26 al. e) nº 1),"33692500-2, Soluções injectáveis","Administração Regional de Saúde de Lisboa e Vale do Tejo, I.P. (503148776)","LABORATORIOS PFIZER, Lda. (500162166)","9.240,00 €",22-03-2011,14-03-2011,2 dias,"Portugal, Lisboa, Lisboa","Artigo 26.º, n.º 1, alínea e) do Código dos Contratos Públicos","","",,,,Não aplicável.,Não aplicável.,
CATETER VENOPUNÇÃO C/ PROTECÇÃO E RECOLHA DE AGULHA Nº 18,Ajuste Direto Regime Geral,Outros Tipos (artº 26 al. e) nº 1),"33141200-2, Cateteres","Administração Regional de Saúde de Lisboa e Vale do Tejo, I.P. (503148776)","B. BRAUN MEDICAL, Lda. (501506543)","13.600,00 €",22-03-2011,14-03-2011,1 dias,"Portugal, Lisboa, Lisboa","Artigo 26.º, n.º 1, alínea e) do Código dos Contratos Públicos","","",,,,Não aplicável.,Não aplicável.,
"Serviços de Fornecimento de Água para os Serviços Desconcentrados da ARSLVT, IP em Santarém para o ano de 2011.",Ajuste Direto Regime Geral,Aquisição de serviços,"98390000-3, Outros serviços","Administração Regional de Saúde de Lisboa e Vale do Tejo, I.P. (503148776)","A.S. Empresa das Águas de Santarém - EM, SA (508114381)","2.500,00 €",22-03-2011,22-02-2011,365 dias,"Portugal, Santarém, Santarém","Artigo 24.º, n.º 1, alínea e) do Código dos Contratos Públicos","","",,,,Não aplicável.,Não aplicável.,
IPRATROPIO SOL. INAL 250MCG/2ML - UNIDOSE,Ajuste Direto Regime Geral,Outros Tipos (artº 26 al. e) nº 1),"33690000-3, Medicamentos vários","Administração Regional de Saúde de Lisboa e Vale do Tejo, I.P. (503148776)","UNILFARMA, Lda. (500293023)","6.417,50 €",21-03-2011,14-03-2011,2 dias,"Portugal, Lisboa, Lisboa","Artigo 26.º, n.º 1, alínea e) do Código dos Contratos Públicos","","",,,,Não aplicável.,Não aplicável.,
CAPTOPRIL COMP. 25MG,Ajuste Direto Regime Geral,Outros Tipos (artº 26 al. e) nº 1),"33690000-3, Medicamentos vários","Administração Regional de Saúde de Lisboa e Vale do Tejo, I.P. (503148776)","GENERIS FARMACEUTICA, S.A. (508107997)","900,00 €",21-03-2011,14-03-2011,3 dias,"Portugal, Lisboa, Lisboa","Artigo 26.º, n.º 1, alínea e) do Código dos Contratos Públicos","","",,,,Não aplicável.,Não aplicável.,
"Apoio Jurídico para a ARSLVT,IP / Serviços de Setúbal e ACES de Setúbal. Período de 01/01/2011 até 30/09/2011.",Ajuste Direto Regime Geral,Aquisição de serviços,"98390000-3, Outros serviços","Administração Regional de Saúde de Lisboa e Vale do Tejo, I.P. (503148776)","Manuel Carvalho Costa, Maria Leonor Peres, Pedro Campos de Carvalho, Soc. Advogados (508588944)","15.300,00 €",21-03-2011,01-03-2011,270 dias,"Portugal, Setúbal, Setúbal","Artigo 20.º, n.º 1, alínea a) do Código dos Contratos Públicos","","",,,,Não aplicável.,Não aplicável.,
