﻿ano;temperatura
1999/2000;16,2
2000/2001;17
2001/2002;16,4
2002/2003;17,6
2003/2004;16
2004/2005;15,8
2005/2006;15,5
2006/2007;15,7
2007/2008;15,2
2008/2009;15,9
2009/2010;16,2
2010/2011;16,3
2011/2012;15,4
2012/2013;15,9
2013/2014;15,8
2014/2015;16,1
2015/2016;16,5