Objeto do Contrato,Tipo de Procedimento,Tipo(s) de Contrato,CPVs,Entidade(s) Adjudicante(s),Entidade(s) Adjudicatária(s),Preço Contratual,Data de Publicação,Data de Celebração do Contrato,Prazo de Execução,Local de Execução,Fundamentação,Data de Fecho do Contrato,Preço Total Efetivo,Causas das Alterações ao Prazo,Causas das Alterações ao Preço,Estado,N.º registo do Acordo Quadro,Descrição do Acordo Quadro,Procedimento Centralizado
"Aquisição de Material de Consumo Clínico """" Diversos Tubos de Laboratório""""",Ajuste Direto Regime Geral,Aquisição de bens móveis,"33140000-3, Material médico de consumo","Instituto Português do Sangue e da Transplantação, I. P. (502423943)",Vacuette Portugal  (505348470),"7.221,60 €",30-08-2013,26-08-2013,128 dias,"Portugal, Porto, Porto","Artigo 24.º, n.º 1, alínea b) do Código dos Contratos Públicos",,,,,,Não aplicável.,Não aplicável.,
"Aquisição de Material de Consumo Clínico """"Tubos de Colheita Vácuo CPT 8ML Heparina"""" para o IPST, IP, durante o ano 2013",Ajuste Direto Regime Geral,Aquisição de bens móveis,"33140000-3, Material médico de consumo","Instituto Português do Sangue e da Transplantação, I. P. (502423943)",Becton Dickinson S.A. Sucursal em Portugal (980245214),"3.060,00 €",28-08-2013,27-08-2013,217 dias,"Portugal, Porto, Porto","Artigo 24.º, n.º 1, alínea b) do Código dos Contratos Públicos",,,,,,Não aplicável.,Não aplicável.,
