freguesia,acronym,validVotesPercentage,votes,dicofre
Palme,PPD/PSD.CDS-PP,48.2,147,030255
Palme,PS,34.75,106,030255
Palme,MPT,5.9,18,030255
Palme,B.E.,1.97,6,030255
Palme,PCP-PEV,1.64,5,030255
Palme,PCTP/MRPP,1.31,4,030255
Palme,PND,1.31,4,030255
Palme,PPM,1.31,4,030255
Palme,L,0.66,2,030255
Palme,MAS,0.66,2,030255
Palme,PAN,0.66,2,030255
Palme,PNR,0.66,2,030255
Palme,POUS,0.66,2,030255
Palme,PDA,0.33,1,030255
Palme,PPV,0,0,030255
Palme,PTP,0,0,030255
