freguesia,acronym,validVotesPercentage,votes,dicofre
Aldeia do Bispo,PS,51.06,48,090703
Aldeia do Bispo,PPD/PSD.CDS-PP,24.47,23,090703
Aldeia do Bispo,PCTP/MRPP,7.45,7,090703
Aldeia do Bispo,PCP-PEV,6.38,6,090703
Aldeia do Bispo,PAN,3.19,3,090703
Aldeia do Bispo,B.E.,2.13,2,090703
Aldeia do Bispo,PPM,2.13,2,090703
Aldeia do Bispo,L,1.06,1,090703
Aldeia do Bispo,MPT,1.06,1,090703
Aldeia do Bispo,PTP,1.06,1,090703
Aldeia do Bispo,MAS,0,0,090703
Aldeia do Bispo,PDA,0,0,090703
Aldeia do Bispo,PND,0,0,090703
Aldeia do Bispo,PNR,0,0,090703
Aldeia do Bispo,POUS,0,0,090703
Aldeia do Bispo,PPV,0,0,090703
