Objeto do Contrato,Tipo de Procedimento,Tipo(s) de Contrato,CPVs,Entidade(s) Adjudicante(s),Entidade(s) Adjudicatária(s),Preço Contratual,Data de Publicação,Data de Celebração do Contrato,Prazo de Execução,Local de Execução,Fundamentação,Data de Fecho do Contrato,Preço Total Efetivo,Causas das Alterações ao Prazo,Causas das Alterações ao Preço,Estado,N.º registo do Acordo Quadro,Descrição do Acordo Quadro,Procedimento Centralizado
Aquisição de serviços para a avaliação e organização das massas documentais acumuladas da DGS,Ajuste Direto Regime Geral,Aquisição de serviços,"71621000-7, Serviços técnicos de análise ou consultoria",Direcção-Geral da Saúde (DGS) (600037100),"EAD - Empresa de Arquivo de Documentação, S.A. (507616944)","41.900,00 €",03-03-2014,01-11-2013,180 dias,"Portugal, Lisboa, Lisboa","Artigo 20.º, n.º 1, alínea a) do Código dos Contratos Públicos",29-04-2014,"41.900,00 €",,,,Não aplicável.,Não aplicável.,FALSE
Desenvolvimento da aplicação de suporte ao Sistema de Informação Nacional de Vigilância Epidemiológica (SINAVE),Ajuste Direto Regime Geral,Aquisição de serviços,"72500000-0, Serviços relacionados com a informática",Direcção-Geral da Saúde (600037100),"Deloitte Consultores, S.A. (502310090)","30.000,00 €",27-02-2014,09-12-2013,112 dias,"Portugal, Lisboa, Lisboa","Artigo 20.º, n.º 1, alínea a) do Código dos Contratos Públicos",31-03-2014,"30.000,00 €",,,,Não aplicável.,Não aplicável.,FALSE
