Objeto do Contrato,Tipo de Procedimento,Tipo(s) de Contrato,CPVs,Entidade(s) Adjudicante(s),Entidade(s) Adjudicatária(s),Preço Contratual,Data de Publicação,Data de Celebração do Contrato,Prazo de Execução,Local de Execução,Fundamentação,Data de Fecho do Contrato,Preço Total Efetivo,Causas das Alterações ao Prazo,Causas das Alterações ao Preço,Estado,N.º registo do Acordo Quadro,Descrição do Acordo Quadro,Procedimento Centralizado
Aquisição de Programas de Verificação Externa da Qualidade,Ajuste Direto Regime Geral,Aquisição de bens móveis,"33696500-0, Reagentes de laboratório","Centro Hospitalar Póvoa de Varzim - Vila do Conde, E.P.E. (508741823)","BIOGNÓSTICA - DISTRIB. PROD. E EQUIP. TÉCNICOS,LDA (504441256)","880,00 €",30-06-2014,23-06-2014,191 dias,"Portugal, Porto, Póvoa de Varzim","Artigo 20.º, n.º 1, alínea a) do Código dos Contratos Públicos",,,,,,Não aplicável.,Não aplicável.,FALSE
Aquisição de Programas de Verificação Externa da Qualidade,Ajuste Direto Regime Geral,Aquisição de bens móveis,"33696500-0, Reagentes de laboratório","Centro Hospitalar Póvoa de Varzim - Vila do Conde, E.P.E. (508741823)","BIOGNÓSTICA - DISTRIB. PROD. E EQUIP. TÉCNICOS,LDA (504441256)","210,00 €",30-06-2014,23-06-2014,191 dias,"Portugal, Porto, Póvoa de Varzim","Artigo 20.º, n.º 1, alínea a) do Código dos Contratos Públicos",,,,,,Não aplicável.,Não aplicável.,FALSE
Aquisição de Programas de Verificação Externa da Qualidade,Ajuste Direto Regime Geral,Aquisição de bens móveis,"33696500-0, Reagentes de laboratório","Centro Hospitalar Póvoa de Varzim - Vila do Conde, E.P.E. (508741823)","BIOGNÓSTICA - DISTRIB. PROD. E EQUIP. TÉCNICOS,LDA (504441256)","1.050,00 €",30-06-2014,23-06-2014,191 dias,"Portugal, Porto, Póvoa de Varzim","Artigo 20.º, n.º 1, alínea a) do Código dos Contratos Públicos",,,,,,Não aplicável.,Não aplicável.,FALSE
Aquisição de Programas de Verificação Externa da Qualidade,Ajuste Direto Regime Geral,Aquisição de bens móveis,"33696500-0, Reagentes de laboratório","Centro Hospitalar Póvoa de Varzim - Vila do Conde, E.P.E. (508741823)","BIOGNÓSTICA - DISTRIB. PROD. E EQUIP. TÉCNICOS,LDA (504441256)","610,00 €",30-06-2014,23-06-2014,191 dias,"Portugal, Porto, Póvoa de Varzim","Artigo 20.º, n.º 1, alínea a) do Código dos Contratos Públicos",,,,,,Não aplicável.,Não aplicável.,FALSE
Aquisição de Programas de Verificação Externa da Qualidade,Ajuste Direto Regime Geral,Aquisição de bens móveis,"33696500-0, Reagentes de laboratório","Centro Hospitalar Póvoa de Varzim - Vila do Conde, E.P.E. (508741823)","BIOGNÓSTICA - DISTRIB. PROD. E EQUIP. TÉCNICOS,LDA (504441256)","578,00 €",30-06-2014,23-06-2014,191 dias,"Portugal, Porto, Póvoa de Varzim","Artigo 20.º, n.º 1, alínea a) do Código dos Contratos Públicos",,,,,,Não aplicável.,Não aplicável.,FALSE
Aquisição de Programas de Verificação Externa da Qualidade,Ajuste Direto Regime Geral,Aquisição de bens móveis,"33696500-0, Reagentes de laboratório","Centro Hospitalar Póvoa de Varzim - Vila do Conde, E.P.E. (508741823)",BIO-RAD LABORATORIES LDA (501301321),"390,00 €",30-06-2014,23-06-2014,191 dias,"Portugal, Porto, Póvoa de Varzim","Artigo 20.º, n.º 1, alínea a) do Código dos Contratos Públicos",,,,,,Não aplicável.,Não aplicável.,FALSE
Aquisição de Programas de Verificação Externa da Qualidade,Ajuste Direto Regime Geral,Aquisição de bens móveis,"33696500-0, Reagentes de laboratório","Centro Hospitalar Póvoa de Varzim - Vila do Conde, E.P.E. (508741823)",BIO-RAD LABORATORIES LDA (501301321),"460,00 €",30-06-2014,23-06-2014,191 dias,"Portugal, Porto, Póvoa de Varzim","Artigo 20.º, n.º 1, alínea a) do Código dos Contratos Públicos",,,,,,Não aplicável.,Não aplicável.,FALSE
Aquisição de Programas de Verificação Externa da Qualidade,Ajuste Direto Regime Geral,Aquisição de bens móveis,"33696500-0, Reagentes de laboratório","Centro Hospitalar Póvoa de Varzim - Vila do Conde, E.P.E. (508741823)",BIO-RAD LABORATORIES LDA (501301321),"150,00 €",30-06-2014,23-06-2014,191 dias,"Portugal, Porto, Póvoa de Varzim","Artigo 20.º, n.º 1, alínea a) do Código dos Contratos Públicos",,,,,,Não aplicável.,Não aplicável.,FALSE
Aquisição de Programas de Verificação Externa da Qualidade,Ajuste Direto Regime Geral,Aquisição de bens móveis,"33696500-0, Reagentes de laboratório","Centro Hospitalar Póvoa de Varzim - Vila do Conde, E.P.E. (508741823)",BIO-RAD LABORATORIES LDA (501301321),"175,00 €",30-06-2014,23-06-2014,191 dias,"Portugal, Porto, Póvoa de Varzim","Artigo 20.º, n.º 1, alínea a) do Código dos Contratos Públicos",,,,,,Não aplicável.,Não aplicável.,FALSE
Aquisição de Programas de Verificação Externa da Qualidade,Ajuste Direto Regime Geral,Aquisição de bens móveis,"33696500-0, Reagentes de laboratório","Centro Hospitalar Póvoa de Varzim - Vila do Conde, E.P.E. (508741823)",BIO-RAD LABORATORIES LDA (501301321),"300,00 €",30-06-2014,23-06-2014,191 dias,"Portugal, Porto, Póvoa de Varzim","Artigo 20.º, n.º 1, alínea a) do Código dos Contratos Públicos",,,,,,Não aplicável.,Não aplicável.,FALSE
