Objeto do Contrato,Tipo de Procedimento,Tipo(s) de Contrato,CPVs,Entidade(s) Adjudicante(s),Entidade(s) Adjudicatária(s),Preço Contratual,Data de Publicação,Data de Celebração do Contrato,Prazo de Execução,Local de Execução,Fundamentação,Data de Fecho do Contrato,Preço Total Efetivo,Causas das Alterações ao Prazo,Causas das Alterações ao Preço,Estado,N.º registo do Acordo Quadro,Descrição do Acordo Quadro,Procedimento Centralizado
AQUISIÇÃO E MONTAGEM UNIDADE CLIMATIZAÇÃO,Ajuste Direto Regime Geral,Empreitadas de obras públicas,"45331000-6, Instalação de aquecimento, ventilação e ar condicionado","Hospital Distrital de Santarém, EPE (506361462)",TERMOTECNICA INSTALAÇÕES ESPECIAIS LDA (504013432),"96.896,50 €",11-12-2013,27-06-2013,45 dias,"Portugal, Santarém, Santarém","Artigo 19.º, alínea a) do Código dos Contratos Públicos","","96.896,50 €",,"",,Não aplicável.,Não aplicável.,
AQUISIÇÃO TUBO INSUFLAÇÃO PARA LAPAROSCOPIA,Ajuste Direto Regime Geral,Aquisição de bens móveis,"33160000-9, Técnicas cirúrgicas","Hospital Distrital de Santarém, EPE (506361462)",B.BRAUN MEDICAL LDA (501506543),"2.040,00 €",11-12-2013,01-10-2013,90 dias,"Portugal, Santarém, Santarém","Artigo 20.º, n.º 1, alínea a) do Código dos Contratos Públicos",30-12-2013,"2.040,00 €",,"",,Não aplicável.,Não aplicável.,
AQUISIÇÃO PROTESES PARCIAIS EM TITANIO P/CIRURGIA OUVIDO,Ajuste Direto Regime Geral,Aquisição de bens móveis,"33185000-0, Próteses auditivas","Hospital Distrital de Santarém, EPE (506361462)",MICROMEDICA (501904956),"900,00 €",11-12-2013,27-11-2013,30 dias,"Portugal, Santarém, Santarém","Artigo 20.º, n.º 1, alínea a) do Código dos Contratos Públicos",31-12-2013,"",,NÃO EFETUADO FORNECIMENTOS,,Não aplicável.,Não aplicável.,
AQUISIÇÃO ESPONJAS DESCARTAVEIS IMP. EM SABÃO NEUTRO,Ajuste Direto Regime Geral,Aquisição de bens móveis,"33700000-7, Produtos para cuidados pessoais","Hospital Distrital de Santarém, EPE (506361462)",PMH- PRODUTOS MEDICOS HOSPITALARES (502376899),"4.106,03 €",11-12-2013,04-12-2013,1 dias,"Portugal, Santarém, Santarém","Artigo 20.º, n.º 1, alínea a) do Código dos Contratos Públicos",23-01-2014,"775,92 €",,quantidades inferiores ao previsto,,Não aplicável.,Não aplicável.,
AQUISIÇÃO E MONTAGEM DE PLACAS CONTRA O IMPACTO,Ajuste Direto Regime Geral,Aquisição de bens móveis,"44100000-1, Materiais de construção e artigos afins","Hospital Distrital de Santarém, EPE (506361462)",INFORTIPO LDA (502964472),"4.000,00 €",11-12-2013,09-12-2013,30 dias,"Portugal, Santarém, Santarém","Artigo 20.º, n.º 1, alínea a) do Código dos Contratos Públicos",19-02-2014,"4.000,00 €",,"",,Não aplicável.,Não aplicável.,
Aquisição Mesa Operatória Ortopedia,Ajuste Direto Regime Geral,Aquisição de bens móveis,"33000000-0, Equipamento médico, medicamentos e produtos para cuidados pessoais","Hospital Distrital de Santarém, E. P. E. (506361462)",Medicinalia Cormedica Ldª. (500684324),"43.997,38 €",10-12-2013,03-09-2013,30 dias,"Portugal, Santarém, Santarém","Artigo 20.º, n.º 1, alínea a) do Código dos Contratos Públicos",30-10-2013,"43.997,38 €",,"",,Não aplicável.,Não aplicável.,
AQUISIÇÃO ECOGRAFOS,Concurso público,Aquisição de bens móveis,"33111000-1, Aparelhos para radiologia","Hospital Distrital de Santarém, E. P. E. (506361462)",SIEMENS SA (500247480),"35.970,00 €",10-12-2013,07-11-2013,20 dias,"Portugal, Santarém, Santarém","Artigo 20.º, n.º 1, alínea b) do Código dos Contratos Públicos",22-11-2013,"35.970,00 €",,"",,Não aplicável.,Não aplicável.,
FORNECIMENTO E MONTAGEM DE PORTA AUTOMATICA,Ajuste Direto Regime Geral,Empreitadas de obras públicas,"45000000-7, Construção","Hospital Distrital de Santarém, E. P. E. (506361462)",HEMER SERVIÇOS LDA (502318929),"2.850,00 €",10-12-2013,29-11-2013,15 dias,"Portugal, Santarém, Santarém","Artigo 19.º, alínea a) do Código dos Contratos Públicos","","",,"",,Não aplicável.,Não aplicável.,
AQUISIÇÃO DE EQUIPAMENTO DE FLUOROSCOPIA PARA UNIDADE DE TOMOGRAFIA COMPUTORIZADA,Ajuste Direto Regime Geral,Aquisição de bens móveis,"33000000-0, Equipamento médico, medicamentos e produtos para cuidados pessoais","Hospital Distrital de Santarém, E. P. E. (506361462)",GENERAL ELETRIC PORTUGUESA SA (500357129),"18.500,00 €",10-12-2013,23-11-2013,45 dias,"Portugal, Santarém, Santarém","Artigo 24.º, n.º 1, alínea e) do Código dos Contratos Públicos",27-11-2013,"18.500,00 €",,"",,Não aplicável.,Não aplicável.,
AQUISIÇÃO EQUIPAMENTO PARA BLOCO OPERATÓRIO,Concurso público,Aquisição de bens móveis,"33192340-7, Mobiliário para blocos operatórios excepto mesas","Hospital Distrital de Santarém, E. P. E. (506361462)","MEDICINALIA CORMEDICA, COMERCIO PROD MED LDA (500684324)","19.954,00 €",05-12-2013,29-11-2013,30 dias,"Portugal, Santarém, Santarém","Artigo 20.º, n.º 1, alínea b) do Código dos Contratos Públicos",29-11-2013,"19.954,00 €",,"",,Não aplicável.,Não aplicável.,
AQUISIÇÃO DE EQUIPAMENTO PARA BLOCO OPERATORIO,Concurso público,Aquisição de bens móveis,"33192340-7, Mobiliário para blocos operatórios excepto mesas","Hospital Distrital de Santarém, E. P. E. (506361462)",AIR LIQUIDE  MEDICINAL SA (501576436),"22.900,00 €",05-12-2013,29-11-2013,30 dias,"Portugal, Santarém, Santarém","Artigo 20.º, n.º 1, alínea b) do Código dos Contratos Públicos",29-11-2013,"22.900,00 €",,"",,Não aplicável.,Não aplicável.,
AQUISIÇÃO DE EQUIPAMENTO MEDICO CIRURGICO,Concurso público,Aquisição de bens móveis,"33100000-1, Equipamento médico","Hospital Distrital de Santarém, E. P. E. (506361462)",SMITHS MEDICAL (PORTUGAL) UNIPESSOAL LDA (507445937),"15.000,00 €",05-12-2013,15-11-2013,30 dias,"Portugal, Santarém, Santarém","Artigo 20.º, n.º 1, alínea b) do Código dos Contratos Públicos",20-11-2013,"15.000,00 €",,"",,Não aplicável.,Não aplicável.,
AQUISIÇÃO EQUIPAMENTO MEDICO CIRURGICO,Concurso público,Aquisição de bens móveis,"33100000-1, Equipamento médico","Hospital Distrital de Santarém, E. P. E. (506361462)","MEDICINALIA CORMEDICA, COMERCIO PROD MED LDA (500684324)","13.990,00 €",05-12-2013,18-11-2013,1 dias,"Portugal, Santarém, Santarém","Artigo 20.º, n.º 1, alínea b) do Código dos Contratos Públicos",25-11-2013,"13.990,00 €",,"",,Não aplicável.,Não aplicável.,
"AQUISIÇÃO DE MONITOR HEMODINAMICA, MAQUINA HIPOTERMIA E BOMBAS PCA",Concurso público,Aquisição de bens móveis,"33100000-1, Equipamento médico","Hospital Distrital de Santarém, E. P. E. (506361462)","Edwards Lifesciences, Lda. (508014832)","12.000,00 €",05-12-2013,31-10-2013,5 dias,"Portugal, Santarém, Santarém","Artigo 20.º, n.º 1, alínea b) do Código dos Contratos Públicos",21-11-2013,"12.000,00 €",,"",,Não aplicável.,Não aplicável.,
AQUISIÇÃO DE ECOGRAFO PARA IMAGIOLOGIA E ECOGRAFO PORTATIL PARA UCI,Concurso público,Aquisição de bens móveis,"33110000-4, Equipamento de imagiologia para uso médico, dentário e veterinário","Hospital Distrital de Santarém, E. P. E. (506361462)",TOSHIBA MEDICAL SYSTEM SA (980023700),"49.490,00 €",05-12-2013,11-11-2013,30 dias,"Portugal, Santarém, Santarém","Artigo 20.º, n.º 1, alínea b) do Código dos Contratos Públicos",20-11-2013,"49.490,00 €",,"",,Não aplicável.,Não aplicável.,
AQUISIÇÃO DE CANDEEIRO CIRURGICO LED E MESA OPERATORIA UNIVERSAL,Concurso público,Aquisição de bens móveis,"33100000-1, Equipamento médico","Hospital Distrital de Santarém, E. P. E. (506361462)","MEDICINÁLIA CORMEDICA, COMERCIO PROD MED.LDA (500684324)","32.977,00 €",05-12-2013,29-11-2013,30 dias,"Portugal, Santarém, Santarém","Artigo 20.º, n.º 1, alínea b) do Código dos Contratos Públicos",29-11-2013,"32.977,00 €",,"",,Não aplicável.,Não aplicável.,
AQUISIÇÃO DE CANDEEIRO LED E MESA OPERATORIA UNIVERSAL,Concurso público,Aquisição de bens móveis,"33100000-1, Equipamento médico","Hospital Distrital de Santarém, E. P. E. (506361462)","FILSAT, EQUIPAMENTOS MEDICO-CIENTIFICOS LDA (506708616)","12.360,00 €",05-12-2013,29-11-2013,30 dias,"Portugal, Santarém, Santarém","Artigo 20.º, n.º 1, alínea b) do Código dos Contratos Públicos",29-11-2013,"12.360,00 €",,"",,Não aplicável.,Não aplicável.,
