freguesia,acronym,validVotesPercentage,votes,dicofre
"União das freguesias de Veade, Gagos e Molares",PPD/PSD.CDS-PP,38.45,238,030527
"União das freguesias de Veade, Gagos e Molares",PS,33.28,206,030527
"União das freguesias de Veade, Gagos e Molares",MPT,9.05,56,030527
"União das freguesias de Veade, Gagos e Molares",PCP-PEV,6.14,38,030527
"União das freguesias de Veade, Gagos e Molares",B.E.,4.04,25,030527
"União das freguesias de Veade, Gagos e Molares",PCTP/MRPP,1.94,12,030527
"União das freguesias de Veade, Gagos e Molares",L,1.62,10,030527
"União das freguesias de Veade, Gagos e Molares",PAN,1.45,9,030527
"União das freguesias de Veade, Gagos e Molares",PND,1.29,8,030527
"União das freguesias de Veade, Gagos e Molares",PPM,0.81,5,030527
"União das freguesias de Veade, Gagos e Molares",PTP,0.81,5,030527
"União das freguesias de Veade, Gagos e Molares",PNR,0.48,3,030527
"União das freguesias de Veade, Gagos e Molares",PPV,0.48,3,030527
"União das freguesias de Veade, Gagos e Molares",POUS,0.16,1,030527
"União das freguesias de Veade, Gagos e Molares",MAS,0,0,030527
"União das freguesias de Veade, Gagos e Molares",PDA,0,0,030527
