freguesia,acronym,validVotesPercentage,votes,dicofre
União das freguesias de Alcórrego e Maranhão,PCP-PEV,79.65,180,120309
União das freguesias de Alcórrego e Maranhão,PS,10.62,24,120309
União das freguesias de Alcórrego e Maranhão,PPD/PSD.CDS-PP,5.31,12,120309
União das freguesias de Alcórrego e Maranhão,PCTP/MRPP,1.33,3,120309
União das freguesias de Alcórrego e Maranhão,MPT,0.88,2,120309
União das freguesias de Alcórrego e Maranhão,PAN,0.88,2,120309
União das freguesias de Alcórrego e Maranhão,B.E.,0.44,1,120309
União das freguesias de Alcórrego e Maranhão,PDA,0.44,1,120309
União das freguesias de Alcórrego e Maranhão,PNR,0.44,1,120309
União das freguesias de Alcórrego e Maranhão,L,0,0,120309
União das freguesias de Alcórrego e Maranhão,MAS,0,0,120309
União das freguesias de Alcórrego e Maranhão,PND,0,0,120309
União das freguesias de Alcórrego e Maranhão,POUS,0,0,120309
União das freguesias de Alcórrego e Maranhão,PPM,0,0,120309
União das freguesias de Alcórrego e Maranhão,PPV,0,0,120309
União das freguesias de Alcórrego e Maranhão,PTP,0,0,120309
