freguesia,acronym,validVotesPercentage,votes,dicofre
União das freguesias de Cebolais de Cima e Retaxo,PS,53.49,399,050226
União das freguesias de Cebolais de Cima e Retaxo,PPD/PSD.CDS-PP,17.96,134,050226
União das freguesias de Cebolais de Cima e Retaxo,PCP-PEV,13.67,102,050226
União das freguesias de Cebolais de Cima e Retaxo,MPT,5.76,43,050226
União das freguesias de Cebolais de Cima e Retaxo,PCTP/MRPP,2.82,21,050226
União das freguesias de Cebolais de Cima e Retaxo,B.E.,2.68,20,050226
União das freguesias de Cebolais de Cima e Retaxo,PAN,1.47,11,050226
União das freguesias de Cebolais de Cima e Retaxo,L,0.67,5,050226
União das freguesias de Cebolais de Cima e Retaxo,PNR,0.4,3,050226
União das freguesias de Cebolais de Cima e Retaxo,PND,0.27,2,050226
União das freguesias de Cebolais de Cima e Retaxo,PPM,0.27,2,050226
União das freguesias de Cebolais de Cima e Retaxo,PTP,0.27,2,050226
União das freguesias de Cebolais de Cima e Retaxo,MAS,0.13,1,050226
União das freguesias de Cebolais de Cima e Retaxo,PDA,0.13,1,050226
União das freguesias de Cebolais de Cima e Retaxo,POUS,0,0,050226
União das freguesias de Cebolais de Cima e Retaxo,PPV,0,0,050226
