Objeto do Contrato,Tipo de Procedimento,Tipo(s) de Contrato,CPVs,Entidade(s) Adjudicante(s),Entidade(s) Adjudicatária(s),Preço Contratual,Data de Publicação,Data de Celebração do Contrato,Prazo de Execução,Local de Execução,Fundamentação,Data de Fecho do Contrato,Preço Total Efetivo,Causas das Alterações ao Prazo,Causas das Alterações ao Preço,Estado,N.º registo do Acordo Quadro,Descrição do Acordo Quadro,Procedimento Centralizado
Aquisição e Instalação de Solução de Backup,Ajuste Direto Regime Geral,Aquisição de bens móveis,"48100000-9, Pacote de software para sectores específicos","Unidade Local de Saúde do Alto Minho, EPE (ULSAM) (508786193)","VisionWare -Sistemas de Informação,S.A. (507411072)","19.984,50 €",21-11-2016,18-11-2016,30 dias,"Portugal, Viana do Castelo","Artigo 20.º, n.º 1, alínea a) do Código dos Contratos Públicos",,,,,,Não aplicável.,Não aplicável.,FALSE
MCC - Entubação e Cânulas,Ajuste Direto Regime Geral,Aquisição de bens móveis,"33140000-3, Material médico de consumo","Unidade Local de Saúde do Alto Minho, EPE (ULSAM) (508786193)",PMH PRODUTOS MEDICO HOSPITALARES SA (502376899),"11.221,50 €",18-11-2016,26-10-2016,365 dias,"Portugal, Viana do Castelo","Artigo 20.º, n.º 1, alínea a) do Código dos Contratos Públicos",,,,,,Não aplicável.,Não aplicável.,FALSE
MCC - Entubação e Cânulas,Ajuste Direto Regime Geral,Aquisição de bens móveis,"33140000-3, Material médico de consumo","Unidade Local de Saúde do Alto Minho, EPE (ULSAM) (508786193)","SMITHS MEDICAL(PORTUGAL),LDA. (507445937)","2.272,50 €",18-11-2016,10-10-2016,365 dias,"Portugal, Viana do Castelo","Artigo 20.º, n.º 1, alínea a) do Código dos Contratos Públicos",,,,,,Não aplicável.,Não aplicável.,FALSE
MCC - Entubação e Cânulas,Ajuste Direto Regime Geral,Aquisição de bens móveis,"33140000-3, Material médico de consumo","Unidade Local de Saúde do Alto Minho, EPE (ULSAM) (508786193)","INTERSURGICAL PORTUGAL, COMÉRCIO DE PRODUTOS HOSPITALARES, LDA (503480045)","649,10 €",18-11-2016,10-10-2016,365 dias,"Portugal, Viana do Castelo","Artigo 20.º, n.º 1, alínea a) do Código dos Contratos Públicos",,,,,,Não aplicável.,Não aplicável.,FALSE
MCC - Entubação e Cânulas,Ajuste Direto Regime Geral,Aquisição de bens móveis,"33140000-3, Material médico de consumo","Unidade Local de Saúde do Alto Minho, EPE (ULSAM) (508786193)","TELEFLEX MEDICAL, S.A. (980249783)","170,86 €",18-11-2016,10-10-2016,365 dias,"Portugal, Viana do Castelo","Artigo 20.º, n.º 1, alínea a) do Código dos Contratos Públicos",,,,,,Não aplicável.,Não aplicável.,FALSE
MCC - Entubação e Cânulas,Ajuste Direto Regime Geral,Aquisição de bens móveis,"33140000-3, Material médico de consumo","Unidade Local de Saúde do Alto Minho, EPE (ULSAM) (508786193)","TELEFLEX MEDICAL, S.A. (980249783)","480,00 €",18-11-2016,10-10-2016,365 dias,"Portugal, Viana do Castelo","Artigo 20.º, n.º 1, alínea a) do Código dos Contratos Públicos",,,,,,Não aplicável.,Não aplicável.,FALSE
MCC - Entubação e Cânulas,Ajuste Direto Regime Geral,Aquisição de bens móveis,"33140000-3, Material médico de consumo","Unidade Local de Saúde do Alto Minho, EPE (ULSAM) (508786193)","TELEFLEX MEDICAL, S.A. (980249783)","1.835,50 €",18-11-2016,10-10-2016,365 dias,"Portugal, Viana do Castelo","Artigo 20.º, n.º 1, alínea a) do Código dos Contratos Públicos",,,,,,Não aplicável.,Não aplicável.,FALSE
MCC - Entubação e Cânulas,Ajuste Direto Regime Geral,Aquisição de bens móveis,"33140000-3, Material médico de consumo","Unidade Local de Saúde do Alto Minho, EPE (ULSAM) (508786193)","INTERSURGICAL PORTUGAL, COMÉRCIO DE PRODUTOS HOSPITALARES, LDA (503480045)","70,30 €",18-11-2016,10-10-2016,365 dias,"Portugal, Viana do Castelo","Artigo 20.º, n.º 1, alínea a) do Código dos Contratos Públicos",,,,,,Não aplicável.,Não aplicável.,FALSE
MCC - Entubação e Cânulas,Ajuste Direto Regime Geral,Aquisição de bens móveis,"33140000-3, Material médico de consumo","Unidade Local de Saúde do Alto Minho, EPE (ULSAM) (508786193)","TELEFLEX MEDICAL, S.A. (980249783)","1.250,00 €",18-11-2016,10-11-2016,365 dias,"Portugal, Viana do Castelo","Artigo 20.º, n.º 1, alínea a) do Código dos Contratos Públicos",,,,,,Não aplicável.,Não aplicável.,FALSE
MCC - Nebulizadores Completos,Ajuste Direto Regime Geral,Aquisição de bens móveis,"33140000-3, Material médico de consumo","Unidade Local de Saúde do Alto Minho, EPE (ULSAM) (508786193)","INTERSURGICAL PORTUGAL, COMÉRCIO DE PRODUTOS HOSPITALARES, LDA (503480045)","13.260,00 €",17-11-2016,08-11-2016,365 dias,"Portugal, Viana do Castelo","Artigo 20.º, n.º 1, alínea a) do Código dos Contratos Públicos",,,,,,Não aplicável.,Não aplicável.,FALSE
Prestação de Serviços Médicos em Cirurgia Geral para a ULSAM,Ajuste Direto Regime Geral,Aquisição de serviços,"85111100-1, Serviços hospitalares de cirurgia","Unidade Local de Saúde do Alto Minho, EPE (ULSAM) (508786193)","Randstad Clinical - Cuidados de Saúde, Lda. (505121247)","7.172,88 €",16-11-2016,10-09-2013,15 dias,"Portugal, Viana do Castelo, Viana do Castelo","Artigo 20.º, n.º 1, alínea a) do Código dos Contratos Públicos",,,,,,Não aplicável.,Não aplicável.,FALSE
"PRESTAÇÃO DE SERVIÇOS DE CONTROLO DE PRAGAS, DESBARATIZAÇÃO, DESRATIZAÇÃO, DESINFESTAÇÃO E DESFORMIGAÇÃO DA ULSAM",Ajuste Direto Regime Geral,Aquisição de serviços,"90923000-3, Serviços de desratização","Unidade Local de Saúde do Alto Minho, E. P. E. (508786193)","Luthisa-Lusitana de Tratamentos de Higiene, Lda. (506012050)","2.993,01 €",16-11-2016,30-10-2013,15 dias,"Portugal, Viana do Castelo, Viana do Castelo","Artigo 20.º, n.º 1, alínea a) do Código dos Contratos Públicos",,,,,,Não aplicável.,Não aplicável.,FALSE
MCC - Dispositivo Sling para Homem,Ajuste Direto Regime Geral,Aquisição de bens móveis,"33140000-3, Material médico de consumo","Unidade Local de Saúde do Alto Minho, EPE (ULSAM) (508786193)","BOSTON SCIENTIFIC PORTUGAL, LDA (504988964)","9.250,00 €",16-11-2016,09-11-2016,365 dias,"Portugal, Viana do Castelo","Artigo 20.º, n.º 1, alínea a) do Código dos Contratos Públicos",,,,,,Não aplicável.,Não aplicável.,FALSE
Prestação de Serviços Análises Clínicas - Imunohemoterapia,Ajuste Direto Regime Geral,Aquisição de serviços,"85100000-0, Serviços de saúde","Unidade Local de Saúde do Alto Minho, E. P. E. (508786193)","Helped Prestação de Serviços, Lda. (506069010)","8.165,73 €",14-11-2016,03-03-2014,15 dias,"Portugal, Viana do Castelo, Viana do Castelo","Artigo 20.º, n.º 1, alínea a) do Código dos Contratos Públicos",,,,,,Não aplicável.,Não aplicável.,FALSE
Atualização e Virtualização do Servidor SONHO,Ajuste Direto Regime Geral,Aquisição de serviços,"72200000-7, Serviços de consultoria e de programação de software","Unidade Local de Saúde do Alto Minho, EPE (ULSAM) (508786193)","ORAMIX SISTEMAS INFORMAÇÃO, S.A. (504448382)","18.180,00 €",14-11-2016,11-11-2016,30 dias,"Portugal, Viana do Castelo, Viana do Castelo","Artigo 20.º, n.º 1, alínea a) do Código dos Contratos Públicos",,,,,,Não aplicável.,Não aplicável.,FALSE
AQUISIÇÃO DE SERVIÇOS DE PESSOAL TÉCNICO SUPERIOR - PSICOLOGIA,Ajuste Direto Regime Geral,Aquisição de serviços,"85111000-0, Serviços hospitalares","Unidade Local de Saúde do Alto Minho, EPE (ULSAM) (508786193)",Sucesso 24 Horas SA (507328310),"7.280,00 €",14-11-2016,20-03-2014,15 dias,"Portugal, Viana do Castelo, Viana do Castelo","Artigo 20.º, n.º 1, alínea a) do Código dos Contratos Públicos",,,,,,Não aplicável.,Não aplicável.,FALSE
