Objeto do Contrato,Tipo de Procedimento,Tipo(s) de Contrato,CPVs,Entidade(s) Adjudicante(s),Entidade(s) Adjudicatária(s),Preço Contratual,Data de Publicação,Data de Celebração do Contrato,Prazo de Execução,Local de Execução,Fundamentação,Data de Fecho do Contrato,Preço Total Efetivo,Causas das Alterações ao Prazo,Causas das Alterações ao Preço,Estado,N.º registo do Acordo Quadro,Descrição do Acordo Quadro,Procedimento Centralizado
Consulta Previa n.º 182000100 - Aquisição de stents coronarios,Ao abrigo de acordo-quadro (art.º 259.º),Aquisição de bens móveis,"33111730-7, Material para angioplastia","Centro Hospitalar Lisboa Norte, E. P. E. (508481287)",Biotronik Portugal Unipessoal Lda (510726941),"1.647,30 €",21-08-2018,21-08-2018,1 dias,"Portugal, Lisboa, Lisboa",Artigo 259.º do Código dos Contratos Públicos,,,,,,2771022,CP 2017/34 - Acordo quadro para fornecimento de Stents Coronários às Instituições e Serviços do Serviço Nacional de Saúde,FALSE
Ajuste direto n.º 181G003117 - AQUISIÇÃO DE ACIDOS NUCLEICOS REAGENTE EXTRACÇÃO 48 T,Ajuste Direto Regime Geral,Aquisição de bens móveis,"33696000-5, Reagentes e meios de contraste","Centro Hospitalar Lisboa Norte, E. P. E. (508481287)",WERFEN PORTUGAL LDA. (501086110),"7.200,00 €",21-08-2018,21-08-2018,3 dias,"Portugal, Lisboa, Lisboa","Artigo 24.º, n.º 1, alínea e), subalínea iii) do Código dos Contratos Públicos",,,,,,Não aplicável.,Não aplicável.,FALSE
Consulta Previa n.º 181001459 - Aquisição de Pantoprazol solução inj 40 MG,Ao abrigo de acordo-quadro (art.º 259.º),Aquisição de bens móveis,"33610000-9, Medicamentos para o tracto digestivo e o metabolismo","Centro Hospitalar Lisboa Norte, E. P. E. (508481287)",Laboratorios Normon S.A. (505654156),"9.435,00 €",21-08-2018,21-08-2018,2 dias,"Portugal, Lisboa, Lisboa",Artigo 259.º do Código dos Contratos Públicos,,,,,,2222779,Medicamentos do aparelho digestivo,FALSE
Consulta Previa n.º 182000097 - Aquisição de stents coronários,Ao abrigo de acordo-quadro (art.º 259.º),Aquisição de bens móveis,"33111730-7, Material para angioplastia","Centro Hospitalar Lisboa Norte, E. P. E. (508481287)",B.Braun Medical Lda (501506543),"2.160,00 €",21-08-2018,21-08-2018,1 dias,"Portugal, Lisboa, Lisboa",Artigo 259.º do Código dos Contratos Públicos,,,,,,2771022,CP 2017/34 - Acordo quadro para fornecimento de Stents Coronários às Instituições e Serviços do Serviço Nacional de Saúde,FALSE
Consulta Previa n.º 187C000024  - Aquisição de 3 candeeiros cirúrgicos para o bloco de partos,Consulta Prévia,Aquisição de bens móveis,"33100000-1, Equipamento médico","Centro Hospitalar Lisboa Norte, E. P. E. (508481287)",GETINGE GROUP PORTUGAL UNIPESSOAL LDA (506819698),"12.750,00 €",21-08-2018,20-08-2018,40 dias,"Portugal, Lisboa, Lisboa","Artigo 20.º, n.º 1, alínea c) do Código dos Contratos Públicos",,,,,,Não aplicável.,Não aplicável.,FALSE
Ajuste direto n.º 181G002799 - Aquisição de Canacinumab 150 mg,Ajuste Direto Regime Geral,Aquisição de bens móveis,"33651520-9, Imunoglobulinas","Centro Hospitalar Lisboa Norte, E. P. E. (508481287)",Novartis Farma - Produtos Farmacêuticos S.A. (500063524),"31.475,40 €",21-08-2018,03-08-2018,1 dias,"Portugal, Lisboa, Lisboa","Artigo 24.º, n.º 1, alínea e), subalínea iii) do Código dos Contratos Públicos",,,,,,Não aplicável.,Não aplicável.,FALSE
Ajuste direto n.º 181G002659 - Aquisição de ABL90 FLEX cartuxo soluções,Ajuste Direto Regime Geral,Aquisição de bens móveis,"33696000-5, Reagentes e meios de contraste","Centro Hospitalar Lisboa Norte, E. P. E. (508481287)",RADIOMETER (980201667),"10.150,00 €",21-08-2018,21-08-2018,4 dias,"Portugal, Lisboa, Lisboa","Artigo 24.º, n.º 1, alínea e), subalínea ii) do Código dos Contratos Públicos",,,,,,Não aplicável.,Não aplicável.,FALSE
Ajuste direto n.º 186G000184 - Aquisição de materiais para manutenção de equipamento de monitorização Drager,Ajuste Direto Regime Geral,Aquisição de bens móveis,"33123210-3, Aparelhos para monitorização cardíaca","Centro Hospitalar Lisboa Norte, E. P. E. (508481287)","DRAEGER PORTUGAL, LDA. (508771323)","24.682,25 €",21-08-2018,16-08-2018,7 dias,"Portugal, Lisboa, Lisboa","Artigo 24.º, n.º 1, alínea e), subalínea iii) do Código dos Contratos Públicos",,,,,,Não aplicável.,Não aplicável.,FALSE
Consulta Previa n.º 182000098 - Aquisição de stents coronarios,Ao abrigo de acordo-quadro (art.º 259.º),Aquisição de bens móveis,"33111730-7, Material para angioplastia","Centro Hospitalar Lisboa Norte, E. P. E. (508481287)",Medtronic Portugal Lda (504223933),"1.734,00 €",20-08-2018,20-08-2018,1 dias,"Portugal, Lisboa, Lisboa",Artigo 259.º do Código dos Contratos Públicos,,,,,,2771022,CP 2017/34 - Acordo quadro para fornecimento de Stents Coronários às Instituições e Serviços do Serviço Nacional de Saúde,FALSE
Consulta previa n.º 181001457 - Aquisição de medicamentos diversos,Ao abrigo de acordo-quadro (art.º 259.º),Aquisição de bens móveis,"33651000-8, Anti-infecciosos gerais de uso sistémico","Centro Hospitalar Lisboa Norte, E. P. E. (508481287)",GILEAD SCIENCES LDA (503604704),"213.346,56 €",20-08-2018,20-08-2018,133 dias,"Portugal, Lisboa, Lisboa",Artigo 259.º do Código dos Contratos Públicos,,,,,,2545980,CP 2017/61 - Acordo quadro para fornecimento de Medicamentos Diversos   às Instituições e Serviços do Serviço Nacional de Saúde,FALSE
Consulta previa n.º 187C000026 - Aquisição de 210 cadeiras rodadas para os diversos serviços do CHLN,Consulta Prévia,Aquisição de bens móveis,"33193120-6, Cadeiras de rodas","Centro Hospitalar Lisboa Norte, E. P. E. (508481287)","DUEKIPA – COMÉRCIO DE EQUIPAMENTOS MÉDICOS HOSPITALARES, UNIPESSOAL LDA (508690102)","10.500,00 €",20-08-2018,16-08-2018,30 dias,"Portugal, Lisboa, Lisboa","Artigo 20.º, n.º 1, alínea c) do Código dos Contratos Públicos",,,,,,Não aplicável.,Não aplicável.,FALSE
Ajuste direto n.º 181G003072 - AQUISIÇÃO DE PIRFENIDONA 801 MG COMP,Ajuste Direto Regime Geral,Aquisição de bens móveis,"33652000-5, Antineoplásicos e imunomoduladores","Centro Hospitalar Lisboa Norte, E. P. E. (508481287)","ROCHE FARMACEUTICA QUIMICA, LDA (500233810)","38.455,20 €",20-08-2018,10-08-2018,1 dias,"Portugal, Lisboa, Lisboa","Artigo 24.º, n.º 1, alínea e), subalínea iii) do Código dos Contratos Públicos",,,,,,Não aplicável.,Não aplicável.,FALSE
Ajuste directo n.º 181G003102 - AQUSIÇÃO DE PIRFENIDONA 267 MG COMP,Ajuste Direto Regime Geral,Aquisição de bens móveis,"33652000-5, Antineoplásicos e imunomoduladores","Centro Hospitalar Lisboa Norte, E. P. E. (508481287)","ROCHE FARMACEUTICA QUIMICA, LDA (500233810)","38.455,20 €",20-08-2018,13-08-2018,1 dias,"Portugal, Lisboa, Lisboa","Artigo 24.º, n.º 1, alínea e), subalínea iii) do Código dos Contratos Públicos",,,,,,Não aplicável.,Não aplicável.,FALSE
Ajuste direto n.º 181G002800 - Aquisição de hemoculturas aerobios para sistema automatizado,Ajuste Direto Regime Geral,Aquisição de bens móveis,"33696000-5, Reagentes e meios de contraste","Centro Hospitalar Lisboa Norte, E. P. E. (508481287)",Biomerieux Portugal . Aparelhos e Reagentes de Laboratório Lda (501524177),"17.250,00 €",20-08-2018,23-07-2018,1 dias,"Portugal, Lisboa, Lisboa","Artigo 24.º, n.º 1, alínea e), subalínea ii) do Código dos Contratos Públicos",,,,,,Não aplicável.,Não aplicável.,FALSE
FACTOR VII RECOMBINANTE SOL INJ 2 MG,Ajuste Direto Regime Geral,Aquisição de bens móveis,"33690000-3, Medicamentos vários","Centro Hospitalar Lisboa Norte, E. P. E. (508481287)","NOVO NORDISK-COM.PROD.FARMACEUTICOS, LDA (501485210)","112.210,00 €",20-08-2018,12-03-2018,1 dias,"Portugal, Lisboa, Lisboa","Artigo 24.º, n.º 1, alínea e), subalínea iii) do Código dos Contratos Públicos",,,,,,Não aplicável.,Não aplicável.,FALSE
Consulta Previa n.º 181001409 - Aquisição de somatostatina solução injectavel,Ao abrigo de acordo-quadro (art.º 259.º),Aquisição de bens móveis,"33652200-7, Medicamentos usados na terapêutica endócrina","Centro Hospitalar Lisboa Norte, E. P. E. (508481287)",Overpharma - Produtos Médicos e Farmacêuticos Lda (505792362),"1.730,85 €",20-08-2018,20-08-2018,2 dias,"Portugal, Lisboa, Lisboa",Artigo 259.º do Código dos Contratos Públicos,,,,,,1415640,CP 2015/7 - ACORDO QUADRO PARA FORNECIMENTO DE HORMONAS E OUTROS MEDICAMENTOS USADOS NO TRATAMENTO DAS DOENÇAS ENDÓCRINAS ÀS INSTITUIÇÕES E SERVIÇOS DO SERVIÇO NACIONAL DE SAÚDE,FALSE
Consulta Previa n.º 181001410 - Aquisição de Vancomicina injectavel Ext 500 MG ampola,Ao abrigo de acordo-quadro (art.º 259.º),Aquisição de bens móveis,"33651000-8, Anti-infecciosos gerais de uso sistémico","Centro Hospitalar Lisboa Norte, E. P. E. (508481287)",LABESFAL - LABORATORIOS ALMIRO S.A. (501169580),"4.185,00 €",20-08-2018,20-08-2018,1 dias,"Portugal, Lisboa, Lisboa",Artigo 259.º do Código dos Contratos Públicos,,,,,,2775691,CP 2017/5 - Acordo Quadro para fornecimento de Medicamentos anti-infeciosos: exceto antivíricos e antifúngicos,FALSE
Consulta Previa n.º 181001379 - Aquisição de Formoterol capsulas inalação,Ao abrigo de acordo-quadro (art.º 259.º),Aquisição de bens móveis,"33670000-7, Medicamentos para o aparelho respiratório","Centro Hospitalar Lisboa Norte, E. P. E. (508481287)",Generis - Farmacêutica S.A. (508107997),"114,00 €",20-08-2018,20-08-2018,1 dias,"Portugal, Lisboa, Lisboa",Artigo 259.º do Código dos Contratos Públicos,,,,,,1638654,CP 2015/12 - Acordo quadro para fornecimento de Medicamentos do Aparelho Respiratório às Instituições e Serviços do Serviço Nacional de Saúde,FALSE
Consulta Previa n.º 187C000027 - Aquisição de carro de emergência para o serviço de Neurologia MCDTS - Electroencefalografia,Consulta Prévia,Aquisição de bens móveis,"33100000-1, Equipamento médico","Centro Hospitalar Lisboa Norte, E. P. E. (508481287)","BACELAR & IRMÃO, LDA (500532818)","2.072,00 €",20-08-2018,20-08-2018,5 dias,"Portugal, Lisboa, Lisboa","Artigo 20.º, n.º 1, alínea c) do Código dos Contratos Públicos",,,,,,Não aplicável.,Não aplicável.,FALSE
Ajuste direto n.º 181G002701 - Aquisição de fator VIII  recombinante 250 UI,Ajuste Direto Regime Geral,Aquisição de bens móveis,"33690000-3, Medicamentos vários","Centro Hospitalar Lisboa Norte, E. P. E. (508481287)","Shire Pharmaceuticals Portugal, Lda. (509264662)","15.579,00 €",18-08-2018,23-07-2018,1 dias,"Portugal, Lisboa, Lisboa","Artigo 24.º, n.º 1, alínea e), subalínea ii) do Código dos Contratos Públicos",,,,,,Não aplicável.,Não aplicável.,FALSE
Ajuste direto n.º 182G010079 - Aquisição de diverso material de pacing,Ajuste Direto Regime Geral,Aquisição de bens móveis,"33182000-9, Material de assistência à função cardíaca","Centro Hospitalar Lisboa Norte, E. P. E. (508481287)","Abbott Medical Portugal, Lda. (504180746)","34.065,00 €",18-08-2018,18-08-2018,1 dias,"Portugal, Lisboa, Lisboa","Artigo 24.º, n.º 1, alínea e), subalínea ii) do Código dos Contratos Públicos",,,,,,Não aplicável.,Não aplicável.,FALSE
Ajuste Direto n.º 181G002703,Ajuste Direto Regime Geral,Aquisição de bens móveis,"33690000-3, Medicamentos vários","Centro Hospitalar Lisboa Norte, E. P. E. (508481287)","CELGENE, SOCIEDADE  UNIPESSOAL, LDA (507791690)","164.055,53 €",17-08-2018,23-07-2018,4 dias,"Portugal, Lisboa, Lisboa","Artigo 24.º, n.º 1, alínea e), subalínea iii) do Código dos Contratos Públicos",,,,,,Não aplicável.,Não aplicável.,FALSE
Consulta Previa n.º 181001523 - Aquisição de Ruxolitinib 15 MG comprimidos,Ao abrigo de acordo-quadro (art.º 259.º),Aquisição de bens móveis,"33652000-5, Antineoplásicos e imunomoduladores","Centro Hospitalar Lisboa Norte, E. P. E. (508481287)",Novartis Farma - Produtos Farmacêuticos S.A. (500063524),"82.978,02 €",17-08-2018,17-08-2018,1 dias,"Portugal, Lisboa, Lisboa",Artigo 259.º do Código dos Contratos Públicos,,,,,,2969238,"CP 2017/6 - Acordo Quadro para fornecimento de Medicamentos do Foro Oncológico e Imunomoduladores, às Instituições e Serviços do Serviço Nacional de Saúde",FALSE
Ajuste direto n.º 181G003044 - Aquisição de Rituximab solução injectavel,Ajuste Direto Regime Geral,Aquisição de bens móveis,"33652000-5, Antineoplásicos e imunomoduladores","Centro Hospitalar Lisboa Norte, E. P. E. (508481287)",Roche Farmacêutica Quimica Lda (500233810),"176.861,60 €",17-08-2018,10-08-2018,1 dias,"Portugal, Lisboa, Lisboa","Artigo 24.º, n.º 1, alínea e), subalínea ii) do Código dos Contratos Públicos",,,,,,Não aplicável.,Não aplicável.,FALSE
Consulta Previa n.º 181001455 - Aquisição de Fumarato de Dimetilo 240 MG,Ao abrigo de acordo-quadro (art.º 259.º),Aquisição de bens móveis,"33690000-3, Medicamentos vários","Centro Hospitalar Lisboa Norte, E. P. E. (508481287)",Biogen Portugal - Sociedade Farmacêutica Unipessoal Lda (506415740),"124.200,30 €",17-08-2018,17-08-2018,1 dias,"Portugal, Lisboa, Lisboa",Artigo 259.º do Código dos Contratos Públicos,,,,,,2545980,CP 2017/61 - Acordo quadro para fornecimento de Medicamentos Diversos   às Instituições e Serviços do Serviço Nacional de Saúde,FALSE
Consulta Previa n.º 181001492 - Aquisição de vinorelbina  ampolas,Ao abrigo de acordo-quadro (art.º 259.º),Aquisição de bens móveis,"33652000-5, Antineoplásicos e imunomoduladores","Centro Hospitalar Lisboa Norte, E. P. E. (508481287)",Generis - Farmacêutica S.A. (508107997),"2.130,00 €",17-08-2018,17-08-2018,1 dias,"Portugal, Lisboa, Lisboa",Artigo 259.º do Código dos Contratos Públicos,,,,,,2969238,"CP 2017/6 - Acordo Quadro para fornecimento de Medicamentos do Foro Oncológico e Imunomoduladores, às Instituições e Serviços do Serviço Nacional de Saúde",FALSE
Ajuste direto n.º 182G008855 - Aquisição de diverso material de ortopedia,Ajuste Direto Regime Geral,Aquisição de bens móveis,"33140000-3, Material médico de consumo","Centro Hospitalar Lisboa Norte, E. P. E. (508481287)","JOHNSON & JOHNSON, LDA (500153370)","38.042,29 €",17-08-2018,17-08-2018,1 dias,"Portugal, Lisboa, Lisboa","Artigo 24.º, n.º 1, alínea e), subalínea ii) do Código dos Contratos Públicos",,,,,,Não aplicável.,Não aplicável.,FALSE
CPU n.º 181A000015 - Aquisição de emtricitabina 200 mg + tenofovir 245 mg - comprimidos,Concurso público,Aquisição de bens móveis,"33651400-2, Antivíricos de uso sistémico","Centro Hospitalar Lisboa Norte, E. P. E. (508481287)","Teva Pharma, Lda. (507045491)","182.100,00 €",17-08-2018,17-08-2018,30 dias,"Portugal, Lisboa, Lisboa",Artigo 155.º do Código dos Contratos Públicos,,,,,,Não aplicável.,Não aplicável.,FALSE
Ajuste directo n.º 182G010077 - Aquisição de pacemakers e CDI,Ajuste Direto Regime Geral,Aquisição de bens móveis,"33182000-9, Material de assistência à função cardíaca","Centro Hospitalar Lisboa Norte, E. P. E. (508481287)","MEDTRONIC PORTUGAL, LDA (504223933)","29.974,00 €",17-08-2018,17-08-2018,1 dias,"Portugal, Lisboa, Lisboa","Artigo 24.º, n.º 1, alínea e), subalínea ii) do Código dos Contratos Públicos",,,,,,Não aplicável.,Não aplicável.,FALSE
Ajuste direto n.º 182G010063 - Aquisição de diverso material clinico,Ajuste Direto Regime Geral,Aquisição de bens móveis,"33140000-3, Material médico de consumo","Centro Hospitalar Lisboa Norte, E. P. E. (508481287)","ABBOTT LABORATORIOS, LDA (500006148)","9.875,00 €",16-08-2018,16-08-2018,2 dias,"Portugal, Lisboa, Lisboa","Artigo 24.º, n.º 1, alínea e), subalínea ii) do Código dos Contratos Públicos",,,,,,Não aplicável.,Não aplicável.,FALSE
Ajuste direto n.º 182G009783 - Aquisição de seringas,Ajuste Direto Regime Geral,Aquisição de bens móveis,"33141310-6, Seringas","Centro Hospitalar Lisboa Norte, E. P. E. (508481287)","BECTON DICKINSON PORTUGAL UNIPESSOAL, LDA (514239743)","3.540,00 €",16-08-2018,16-08-2018,5 dias,"Portugal, Lisboa, Lisboa","Artigo 24.º, n.º 1, alínea c) do Código dos Contratos Públicos",,,,,,Não aplicável.,Não aplicável.,FALSE
Consulta Previa n.º 188C000011 - Aquisição de solução para virtualização de servidores para o CHLN,Consulta Prévia,Aquisição de bens móveis,"48600000-4, Pacote de software para bases de dados e de software operativo","Centro Hospitalar Lisboa Norte, E. P. E. (508481287)","Visualforma, S.A. (503536717)","74.950,00 €",16-08-2018,16-08-2018,15 dias,"Portugal, Lisboa, Lisboa","Artigo 20.º, n.º 1, alínea c) do Código dos Contratos Públicos",,,,,,Não aplicável.,Não aplicável.,FALSE
Ajuste direto n.º 181G003115 - AQUISIÇÃO DE CLADRIBINA 10 MG COMP,Ajuste Direto Regime Geral,Aquisição de bens móveis,"33652000-5, Antineoplásicos e imunomoduladores","Centro Hospitalar Lisboa Norte, E. P. E. (508481287)","Merck, SA (500650870)","29.883,00 €",16-08-2018,16-08-2018,5 dias,"Portugal, Lisboa, Lisboa","Artigo 24.º, n.º 1, alínea e), subalínea iii) do Código dos Contratos Públicos",,,,,,Não aplicável.,Não aplicável.,FALSE
"Consulta Previa n.º 181001475 - AQUISIÇÃO DE NICOBOXIL 2,5% NONIVAMIDA 0,4% POMADA",Ao abrigo de acordo-quadro (art.º 259.º),Aquisição de bens móveis,"33632000-9, Medicamentos para o aparelho músculo-esquelético","Centro Hospitalar Lisboa Norte, E. P. E. (508481287)",SANOFI - PRODUTOS FARMACÊUTICOS LDA (500134960),"52,00 €",16-08-2018,16-08-2018,1 dias,"Portugal, Lisboa, Lisboa",Artigo 259.º do Código dos Contratos Públicos,,,,,,1410779,CP 2015/47 - Acordo quadro para fornecimento de medicamentos do aparelho locomotor às instituições e serviços do serviço nacional de saúde,FALSE
"Consulta Previa n.º 181001384 - AQUISIÇÃO DE ILOPROST SOL INJ 50 MCG/0,5 ML",Ao abrigo de acordo-quadro (art.º 259.º),Aquisição de bens móveis,"33621000-9, Medicamentos para o sangue e para os órgãos hematopoiéticos","Centro Hospitalar Lisboa Norte, E. P. E. (508481287)",BAYER PORTUGAL LDA (500043256),"12.782,40 €",16-08-2018,16-08-2018,1 dias,"Portugal, Lisboa, Lisboa",Artigo 259.º do Código dos Contratos Públicos,,,,,,2489595,CP 2016/18 - Acordo quadro para fornecimento de Medicamentos do Grupo 4: Sangue às Instituições e Serviços do Serviço Nacional de Saúde,FALSE
Ajuste direto n.º 181G003035 - Aquisição de factor VIII recombinante,Ajuste Direto Regime Geral,Aquisição de bens móveis,"33621200-1, Anti-hemorrágicos","Centro Hospitalar Lisboa Norte, E. P. E. (508481287)",BAYER PORTUGAL LDA (500043256),"131.200,00 €",16-08-2018,10-08-2018,1 dias,"Portugal, Lisboa, Lisboa","Artigo 24.º, n.º 1, alínea e), subalínea ii) do Código dos Contratos Públicos",,,,,,Não aplicável.,Não aplicável.,FALSE
Consulta Previa n.º 181001323 - AQUISIÇÃO DE CLARITROMICINA 250 MG CAPS,Ao abrigo de acordo-quadro (art.º 259.º),Aquisição de bens móveis,"33651000-8, Anti-infecciosos gerais de uso sistémico","Centro Hospitalar Lisboa Norte, E. P. E. (508481287)",Generis - Farmacêutica S.A. (508107997),"252,00 €",16-08-2018,20-07-2018,1 dias,"Portugal, Lisboa, Lisboa",Artigo 259.º do Código dos Contratos Públicos,,,,,,2775691,CP 2017/5 - Acordo Quadro para fornecimento de Medicamentos anti-infeciosos: exceto antivíricos e antifúngicos,FALSE
Consulta Previa n.º 181001396 - AQUISIÇÃO DE VALPROATO DE SODIO SOL INJ 400 MG AMP,Ao abrigo de acordo-quadro (art.º 259.º),Aquisição de bens móveis,"33661000-1, Medicamentos para o sistema nervoso","Centro Hospitalar Lisboa Norte, E. P. E. (508481287)",GENERIS FARMACEUTICA S.A. (508107997),"4.752,00 €",16-08-2018,16-08-2018,1 dias,"Portugal, Lisboa, Lisboa",Artigo 259.º do Código dos Contratos Públicos,,,,,,2528670,"CP 2017/2 - Acordo Quadro para fornecimento de Medicamentos do Sistema Nervoso Cerebrospinal, exceto: anestésicos, relaxantes musculares, analgésicos, antipiréticos, antidepressivos e antipsicóticos  às Instituições e Serviços do Serviço Nacional de Saúde",FALSE
"Consulta previa n.º 181001345 - AQUISIÇÃO DE OLANZAPINA COMP 2,5 MG",Ao abrigo de acordo-quadro (art.º 259.º),Aquisição de bens móveis,"33690000-3, Medicamentos vários","Centro Hospitalar Lisboa Norte, E. P. E. (508481287)",GENERIS - FARMACÊUTICA S .A. (508107997),"85,68 €",16-08-2018,16-08-2018,1 dias,"Portugal, Lisboa, Lisboa",Artigo 259.º do Código dos Contratos Públicos,,,,,,2356543,CP 2016/19 - Medicamentos Antipsicóticos,FALSE
Consulta Previa n.º 181001395 - AQUISIÇÃO DE RISPERIDONA COMP 1 MG,Ao abrigo de acordo-quadro (art.º 259.º),Aquisição de bens móveis,"33690000-3, Medicamentos vários","Centro Hospitalar Lisboa Norte, E. P. E. (508481287)",GENERIS - FARMACÊUTICA S.A. (508107997),"30,60 €",16-08-2018,16-08-2018,1 dias,"Portugal, Lisboa, Lisboa",Artigo 259.º do Código dos Contratos Públicos,,,,,,2356543,CP 2016/19 - Medicamentos Antipsicóticos,FALSE
Consulta Previa n.º 181001413 - AQUISIÇÃO DE METILPREDNISOLONA SOL INJ EXT 500 MG,Ao abrigo de acordo-quadro (art.º 259.º),Aquisição de bens móveis,"33652200-7, Medicamentos usados na terapêutica endócrina","Centro Hospitalar Lisboa Norte, E. P. E. (508481287)",HIKMA FARMACÊUTICA PORTUGAL S.A. (502266791),"4.212,00 €",16-08-2018,16-08-2018,1 dias,"Portugal, Lisboa, Lisboa",Artigo 259.º do Código dos Contratos Públicos,,,,,,1415640,CP 2015/7 - ACORDO QUADRO PARA FORNECIMENTO DE HORMONAS E OUTROS MEDICAMENTOS USADOS NO TRATAMENTO DAS DOENÇAS ENDÓCRINAS ÀS INSTITUIÇÕES E SERVIÇOS DO SERVIÇO NACIONAL DE SAÚDE,FALSE
Consulta Previa n.º 181001411 - AQUISIÇÃO DE DOXORRUBICINA LIPOSSÓMICA PEG SOL INJ 2,Ao abrigo de acordo-quadro (art.º 259.º),Aquisição de bens móveis,"33690000-3, Medicamentos vários","Centro Hospitalar Lisboa Norte, E. P. E. (508481287)",Janssen - Cilag Farmacêutica Lda (500189412),"28.514,70 €",16-08-2018,16-08-2018,2 dias,"Portugal, Lisboa, Lisboa",Artigo 259.º do Código dos Contratos Públicos,,,,,,2969238,"CP 2017/6 - Acordo Quadro para fornecimento de Medicamentos do Foro Oncológico e Imunomoduladores, às Instituições e Serviços do Serviço Nacional de Saúde",FALSE
"Consulta Previa n.º 181001393 -AQUISIÇÃO DE IOMEPROL SOL INJ 714,4 MG/ML FR 200 ML",Ao abrigo de acordo-quadro (art.º 259.º),Aquisição de bens móveis,"33690000-3, Medicamentos vários","Centro Hospitalar Lisboa Norte, E. P. E. (508481287)",LABORATÓRIOS FARMACÊUTICOS ROVI S.A.  (980166705),"4.335,00 €",16-08-2018,16-08-2018,2 dias,"Portugal, Lisboa, Lisboa",Artigo 259.º do Código dos Contratos Públicos,,,,,,1473614,CP 2015/56 - Acordo quadro para fornecimento de medicamentos usados como meios de diagnóstico em Imagiologia às Instituições e Serviços do Serviço Nacional de Saúde,FALSE
Consulta Previa n.º 181001381 - AQUISIÇÃO DE HIDROPOLIMERO COMPOSTO C/PRATA E CARVÃO,Ao abrigo de acordo-quadro (art.º 259.º),Aquisição de bens móveis,"33141110-4, Pensos","Centro Hospitalar Lisboa Norte, E. P. E. (508481287)",MOLNLCKE HEALTH CARE - COMERCIALIZAÇÃO DE PRODUTOS HOSPITALARES LDA (511101066),"2.024,10 €",16-08-2018,16-08-2018,2 dias,"Portugal, Lisboa, Lisboa",Artigo 259.º do Código dos Contratos Públicos,,,,,,1315192,Acordo Quadro para fornecimento de material de penso de efeito terapêutico às Instituições e Serviços do Serviço Nacional de Saúde,FALSE
Consulta Previa n.º 181001388 - AQUISIÇÃO DE BUTILESCOPOLAMINA COMP 10 MG,Ao abrigo de acordo-quadro (art.º 259.º),Aquisição de bens móveis,"33610000-9, Medicamentos para o tracto digestivo e o metabolismo","Centro Hospitalar Lisboa Norte, E. P. E. (508481287)",SANOFI - PRODUTOS FARMACÊUTICOS LDA (500134960),"59,80 €",16-08-2018,16-08-2018,1 dias,"Portugal, Lisboa, Lisboa",Artigo 259.º do Código dos Contratos Públicos,,,,,,2222779,Medicamentos do aparelho digestivo,FALSE
Consulta Previa n.º 187C000018 - Aquisição de humidificadores para o serviço de Neonatologia  - Internamento - Unidade de Cuidados intensivos Neonatologia,Consulta Prévia,Aquisição de bens móveis,"38126300-7, Aparelhos de observação de superfície para temperatura ou humidade","Centro Hospitalar Lisboa Norte, E. P. E. (508481287)",PULMOCOR (501402578),"13.530,00 €",16-08-2018,16-08-2018,30 dias,"Portugal, Lisboa, Lisboa","Artigo 20.º, n.º 1, alínea c) do Código dos Contratos Públicos",,,,,,Não aplicável.,Não aplicável.,FALSE
Consulta Previa n.º 189C000032 - Empreitada para execução da obra de reparação de poste de iluminação no HSM,Consulta Prévia,Empreitadas de obras públicas,"45232200-4, Obras anexas relacionadas com linhas para o transporte de electricidade","Centro Hospitalar Lisboa Norte, E. P. E. (508481287)","Tojalense - Trabalhos em Construção Civil, Unipessoal, Lda (505569400)","730,00 €",16-08-2018,16-08-2018,5 dias,"Portugal, Lisboa, Lisboa","Artigo 19.º, alínea c) do Código dos Contratos Públicos",,,,,,Não aplicável.,Não aplicável.,FALSE
Ajuste direto n.º 182G010078 - Aquisição de material de pacing,Ajuste Direto Regime Geral,Aquisição de bens móveis,"33182000-9, Material de assistência à função cardíaca","Centro Hospitalar Lisboa Norte, E. P. E. (508481287)","LIVANOVA PORTUGAL, Lda (505514010)","45.750,00 €",15-08-2018,14-08-2018,1 dias,"Portugal, Lisboa, Lisboa","Artigo 24.º, n.º 1, alínea e), subalínea ii) do Código dos Contratos Públicos",,,,,,Não aplicável.,Não aplicável.,FALSE
Ajuste Direto n.º 181G002755,Ajuste Direto Regime Geral,Aquisição de bens móveis,"33690000-3, Medicamentos vários","Centro Hospitalar Lisboa Norte, E. P. E. (508481287)","Pfizer Biofarmacêutica, Soc. Unip, Lda.  (513300376)","139.138,14 €",14-08-2018,23-07-2018,2 dias,"Portugal, Lisboa, Lisboa","Artigo 24.º, n.º 1, alínea e), subalínea ii) do Código dos Contratos Públicos",,,,,,Não aplicável.,Não aplicável.,FALSE
Ajuste Directo n.º 181G003066 - AQUISIÇÃO DE VITAMINA D COBAS 8.000 CONJ DET 300 T,Ajuste Direto Regime Geral,Aquisição de bens móveis,"33616000-1, Vitaminas","Centro Hospitalar Lisboa Norte, E. P. E. (508481287)","Roche Sistemas Diagnósticos, Lda (504282921)","27.405,00 €",14-08-2018,10-08-2018,1 dias,"Portugal, Lisboa, Lisboa","Artigo 24.º, n.º 1, alínea e), subalínea iii) do Código dos Contratos Públicos",,,,,,Não aplicável.,Não aplicável.,FALSE
Ajuste direto n.º 181G003068 - Aquisição de Folatos Cobas 8000,Ajuste Direto Regime Geral,Aquisição de bens móveis,"33696000-5, Reagentes e meios de contraste","Centro Hospitalar Lisboa Norte, E. P. E. (508481287)","Roche Sistemas Diagnósticos, Lda (504282921)","12.560,40 €",14-08-2018,10-08-2018,1 dias,"Portugal, Lisboa, Lisboa","Artigo 24.º, n.º 1, alínea e), subalínea ii) do Código dos Contratos Públicos",,,,,,Não aplicável.,Não aplicável.,FALSE
Ajuste direto n.º 181G003116 - Aquisição de Hibridação DNA,Ajuste Direto Regime Geral,Aquisição de bens móveis,"33696200-7, Reagentes para análises ao sangue","Centro Hospitalar Lisboa Norte, E. P. E. (508481287)","ILC - Instrumentos de Laboratório e Científicos, Ldª (500948208)","7.408,00 €",14-08-2018,14-08-2018,2 dias,"Portugal, Lisboa, Lisboa","Artigo 24.º, n.º 1, alínea e), subalínea iii) do Código dos Contratos Públicos",,,,,,Não aplicável.,Não aplicável.,FALSE
Consulta Previa n.º 181001473 - Aquisição de Zidovudina Solução INJ 200 MG,Ao abrigo de acordo-quadro (art.º 259.º),Aquisição de bens móveis,"33651400-2, Antivíricos de uso sistémico","Centro Hospitalar Lisboa Norte, E. P. E. (508481287)",VIIVHIV HEALTHCARE UNIPESSOAL LDA (509117961),"574,08 €",14-08-2018,14-08-2018,1 dias,"Portugal, Lisboa, Lisboa",Artigo 259.º do Código dos Contratos Públicos,,,,,,2183729,Medicamentos antirretrovíricos para o tratamento da infeção por VIH,FALSE
Ajuste direto n.º 181G003047 - Aquisição de Rapid Point 500 cassete medida 750 T,Ajuste Direto Regime Geral,Aquisição de bens móveis,"33696500-0, Reagentes de laboratório","Centro Hospitalar Lisboa Norte, E. P. E. (508481287)","Siemens Healthcare, Lda (507925173)","23.758,40 €",14-08-2018,09-08-2018,2 dias,"Portugal, Lisboa, Lisboa","Artigo 24.º, n.º 1, alínea e), subalínea ii) do Código dos Contratos Públicos",,,,,,Não aplicável.,Não aplicável.,FALSE
Consulta Previa n.º 181001465 - Aquisição de Pazopanib 200 MG Comprimidos,Ao abrigo de acordo-quadro (art.º 259.º),Aquisição de bens móveis,"33652000-5, Antineoplásicos e imunomoduladores","Centro Hospitalar Lisboa Norte, E. P. E. (508481287)",NOVARTIS FARMA - PRODUTOS FARMACÊUTICOS LDA (500063524),"1.948,89 €",14-08-2018,14-08-2018,1 dias,"Portugal, Lisboa, Lisboa",Artigo 259.º do Código dos Contratos Públicos,,,,,,2969238,"CP 2017/6 - Acordo Quadro para fornecimento de Medicamentos do Foro Oncológico e Imunomoduladores, às Instituições e Serviços do Serviço Nacional de Saúde",FALSE
Consulta Previa n.º 181001468 - Aquisição de Cinacalcet comprimidos de 90 MG,Ao abrigo de acordo-quadro (art.º 259.º),Aquisição de bens móveis,"33632000-9, Medicamentos para o aparelho músculo-esquelético","Centro Hospitalar Lisboa Norte, E. P. E. (508481287)",AMGEN BIOFARMACEUTICA LDA (502942959),"8.369,55 €",14-08-2018,14-08-2018,1 dias,"Portugal, Lisboa, Lisboa",Artigo 259.º do Código dos Contratos Públicos,,,,,,1410779,CP 2015/47 - Acordo quadro para fornecimento de medicamentos do aparelho locomotor às instituições e serviços do serviço nacional de saúde,FALSE
Consulta Previa n.º 181001360 - Aquisição de Aripripazol comprimidos 10 MG,Ao abrigo de acordo-quadro (art.º 259.º),Aquisição de bens móveis,"33690000-3, Medicamentos vários","Centro Hospitalar Lisboa Norte, E. P. E. (508481287)",TECNIMEDE - SOCIEDADE TECNICO MEDICINAL S.A. (500626413),"172,48 €",14-08-2018,14-08-2018,1 dias,"Portugal, Lisboa, Lisboa",Artigo 259.º do Código dos Contratos Públicos,,,,,,2356543,CP 2016/19 - Medicamentos Antipsicóticos,FALSE
Consulta Previa n.º 181001370 - Aquisição de Olanzapina orodispersiveis 5 MG,Ao abrigo de acordo-quadro (art.º 259.º),Aquisição de bens móveis,"33690000-3, Medicamentos vários","Centro Hospitalar Lisboa Norte, E. P. E. (508481287)",OVERPHARMA PRODUTOS MÉDICOS E FARMACÊUTICOS LDA (505792362),"369,30 €",14-08-2018,14-08-2018,2 dias,"Portugal, Lisboa, Lisboa",Artigo 259.º do Código dos Contratos Públicos,,,,,,2356543,CP 2016/19 - Medicamentos Antipsicóticos,FALSE
Consulta Previa n.º 181001419 - AQUISIÇÃO DE BETAHISTINA COMP 16 MG,Ao abrigo de acordo-quadro (art.º 259.º),Aquisição de bens móveis,"33690000-3, Medicamentos vários","Centro Hospitalar Lisboa Norte, E. P. E. (508481287)",Generis - Farmacêutica S.A. (508107997),"48,96 €",14-08-2018,14-08-2018,1 dias,"Portugal, Lisboa, Lisboa",Artigo 259.º do Código dos Contratos Públicos,,,,,,2528670,"CP 2017/2 - Acordo Quadro para fornecimento de Medicamentos do Sistema Nervoso Cerebrospinal, exceto: anestésicos, relaxantes musculares, analgésicos, antipiréticos, antidepressivos e antipsicóticos  às Instituições e Serviços do Serviço Nacional de Saúde",FALSE
Consulta Previa n.º 181001414 - Aquisição de medicamentos do aparelho cardiovascular,Ao abrigo de acordo-quadro (art.º 259.º),Aquisição de bens móveis,"33622000-6, Medicamentos para o aparelho cardiovascular","Centro Hospitalar Lisboa Norte, E. P. E. (508481287)",Generis Farmaceutica SA (508107997),"303,60 €",14-08-2018,14-08-2018,1 dias,"Portugal, Lisboa, Lisboa",Artigo 259.º do Código dos Contratos Públicos,,,,,,2335591,CP 2016/01 - Acordo Quadro para fornecimento de Medicamentos do Aparelho Cardiovascular   às Instituições e Serviços do Serviço Nacional de Saúde,FALSE
Consulta Previa n.º 181001466 - Aquisição de Lapatinib comprimidos 250 MG,Ao abrigo de acordo-quadro (art.º 259.º),Aquisição de bens móveis,"33652000-5, Antineoplásicos e imunomoduladores","Centro Hospitalar Lisboa Norte, E. P. E. (508481287)",NOVARTIS FARMA - PRODUTOS FARMACÊUTICOS LDA (500063524),"7.450,52 €",13-08-2018,13-08-2018,1 dias,"Portugal, Lisboa, Lisboa",Artigo 259.º do Código dos Contratos Públicos,,,,,,2969238,"CP 2017/6 - Acordo Quadro para fornecimento de Medicamentos do Foro Oncológico e Imunomoduladores, às Instituições e Serviços do Serviço Nacional de Saúde",FALSE
Ajuste direto n.º 181G001567 - Aquisição de Imunoglobolina 100 mg/ml inj,Ajuste Direto Regime Geral,Aquisição de bens móveis,"33690000-3, Medicamentos vários","Centro Hospitalar Lisboa Norte, E. P. E. (508481287)","CSL BEHRING, LDA (503047201)","21.439,00 €",13-08-2018,20-04-2018,1 dias,"Portugal, Lisboa, Lisboa","Artigo 24.º, n.º 1, alínea e), subalínea ii) do Código dos Contratos Públicos",,,,,,Não aplicável.,Não aplicável.,FALSE
Ajuste direto n.º182G009656 - Aquisição de cateteres balão,Ajuste Direto Regime Geral,Aquisição de bens móveis,"33141210-5, Cateteres de balão","Centro Hospitalar Lisboa Norte, E. P. E. (508481287)",Endovascular - Dispositivos Médicos Lda (505537494),"26.550,00 €",13-08-2018,13-08-2018,1 dias,"Portugal, Lisboa, Lisboa","Artigo 24.º, n.º 1, alínea e), subalínea ii) do Código dos Contratos Públicos",,,,,,Não aplicável.,Não aplicável.,FALSE
Consulta Previa n.º 181001483 - Aquisição de medicamentos hepatite C,Ao abrigo de acordo-quadro (art.º 259.º),Aquisição de bens móveis,"33651400-2, Antivíricos de uso sistémico","Centro Hospitalar Lisboa Norte, E. P. E. (508481287)",GILEAD SCIENCES LDA (503604704),"59.983,83 €",13-08-2018,13-08-2018,2 dias,"Portugal, Lisboa, Lisboa",Artigo 259.º do Código dos Contratos Públicos,,,,,,3023927,CP 2017/67 - Medicamentos para a Hepatite C crónica,FALSE
Consulta Previa n.º 181001482 - AQUISIÇÃO DE TIGECICLINA INJ 50 MG,Ao abrigo de acordo-quadro (art.º 259.º),Aquisição de bens móveis,"33651000-8, Anti-infecciosos gerais de uso sistémico","Centro Hospitalar Lisboa Norte, E. P. E. (508481287)",LABORATORIOS PFIZER LDA (500162166),"69.276,00 €",13-08-2018,13-08-2018,2 dias,"Portugal, Lisboa, Lisboa",Artigo 259.º do Código dos Contratos Públicos,,,,,,2775691,CP 2017/5 - Acordo Quadro para fornecimento de Medicamentos anti-infeciosos: exceto antivíricos e antifúngicos,FALSE
Consulta Previa n.º  181001226 - AQUISIÇÃO DE MORFINA COMPRIMIDOS DE 10MG,Ao abrigo de acordo-quadro (art.º 259.º),Aquisição de bens móveis,"33690000-3, Medicamentos vários","Centro Hospitalar Lisboa Norte, E. P. E. (508481287)",Rangel Produtos Farmacêuticos S .A. (510599818),"126,36 €",13-08-2018,13-08-2018,1 dias,"Portugal, Lisboa, Lisboa",Artigo 259.º do Código dos Contratos Públicos,,,,,,461370,"CP 2012/44 - MEDICAMENTOS ANALGÉSICOS, ANTIPIRÉTICOS E ANTIDEPRESSIVOS",FALSE
Consulta Previa n.º 189000007 - Aquisição de 10 estetoscópios e 2 pedaleiras,Ao abrigo de acordo-quadro (art.º 259.º),Aquisição de bens móveis,"33100000-1, Equipamento médico","Centro Hospitalar Lisboa Norte, E. P. E. (508481287)",HR - hOSPITALAR lDA (501895558),"4,89 €",11-08-2018,11-08-2018,1 dias,"Portugal, Lisboa, Lisboa",Artigo 259.º do Código dos Contratos Públicos,,,,,,1587913,Acordo Quadro para fornecimento de Equipamentos e Dispositivos Médicos de uso comum em internamento e ambulatório - Parte I às instituições e serviços do Serviço Nacional de Saúde.,FALSE
Consulta Previa n.º 189000007 - Aquisição de 10 estetoscópios e 2 pedaleiras,Ao abrigo de acordo-quadro (art.º 259.º),Aquisição de bens móveis,"33100000-1, Equipamento médico","Centro Hospitalar Lisboa Norte, E. P. E. (508481287)",Bastos e Viegas S.A. (500042772),"49,90 €",11-08-2018,11-08-2018,142 dias,"Portugal, Lisboa, Lisboa",Artigo 259.º do Código dos Contratos Públicos,,,,,,1587913,Acordo Quadro para fornecimento de Equipamentos e Dispositivos Médicos de uso comum em internamento e ambulatório - Parte I às instituições e serviços do Serviço Nacional de Saúde.,FALSE
Consulta Previa n.º 181001452 - Aquisição de Perindopril Comprimidos de 4 mg,Ao abrigo de acordo-quadro (art.º 259.º),Aquisição de bens móveis,"33622000-6, Medicamentos para o aparelho cardiovascular","Centro Hospitalar Lisboa Norte, E. P. E. (508481287)",Tecnimede - Sociedade Tecnico - Medicinal S.A. (500626413),"236,25 €",11-08-2018,11-08-2018,1 dias,"Portugal, Lisboa, Lisboa",Artigo 259.º do Código dos Contratos Públicos,,,,,,2335591,CP 2016/01 - Acordo Quadro para fornecimento de Medicamentos do Aparelho Cardiovascular   às Instituições e Serviços do Serviço Nacional de Saúde,FALSE
Ajuste direto n.º 181G002856 - Aquisição de RITUXIMAB 500 MG/50 ML SOL INJ ( BIOSSIM,Ajuste Direto Regime Geral,Aquisição de bens móveis,"33652000-5, Antineoplásicos e imunomoduladores","Centro Hospitalar Lisboa Norte, E. P. E. (508481287)",pharmakern (507002571),"69.000,00 €",11-08-2018,11-08-2018,2 dias,"Portugal, Lisboa, Lisboa","Artigo 24.º, n.º 1, alínea e), subalínea ii) do Código dos Contratos Públicos",,,,,,Não aplicável.,Não aplicável.,FALSE
Ajuste direto n.º 181G003043 - Aquisição de Propanol + etilsulfato de mecetonio solução de 500 ml,Ajuste Direto Regime Geral,Aquisição de bens móveis,"33741300-9, Desinfectante para as mãos","Centro Hospitalar Lisboa Norte, E. P. E. (508481287)",paul hartmann (502271728),"9.360,00 €",11-08-2018,11-08-2018,2 dias,"Portugal, Lisboa, Lisboa","Artigo 24.º, n.º 1, alínea e), subalínea iii) do Código dos Contratos Públicos",,,,,,Não aplicável.,Não aplicável.,FALSE
Ajuste direto n.º 181G003046 - Aquisição de celulas Liss/Coombs 48 T,Ajuste Direto Regime Geral,Aquisição de bens móveis,"33696000-5, Reagentes e meios de contraste","Centro Hospitalar Lisboa Norte, E. P. E. (508481287)",BIO-RAD LABORATORIES (501301321),"8.000,00 €",11-08-2018,11-08-2018,3 dias,"Portugal, Lisboa, Lisboa","Artigo 24.º, n.º 1, alínea e), subalínea iii) do Código dos Contratos Públicos",,,,,,Não aplicável.,Não aplicável.,FALSE
Ajuste direto n.º 181G003073 - Aquisição de Glutationa reduzida,Ajuste Direto Regime Geral,Aquisição de bens móveis,"33690000-3, Medicamentos vários","Centro Hospitalar Lisboa Norte, E. P. E. (508481287)",INSTITUT GEORGES LOPEZ (429526973),"8.192,64 €",11-08-2018,11-08-2018,1 dias,"Portugal, Lisboa, Lisboa","Artigo 24.º, n.º 1, alínea e), subalínea iii) do Código dos Contratos Públicos",,,,,,Não aplicável.,Não aplicável.,FALSE
Ajuste direto n.º 181G003014 -Aquisição de Concentradode factor XIII,Ajuste Direto Regime Geral,Aquisição de bens móveis,"33621200-1, Anti-hemorrágicos","Centro Hospitalar Lisboa Norte, E. P. E. (508481287)","CSL BEHRING, LDA (503047201)","6.777,20 €",11-08-2018,11-08-2018,1 dias,"Portugal, Lisboa, Lisboa","Artigo 24.º, n.º 1, alínea e), subalínea iii) do Código dos Contratos Públicos",,,,,,Não aplicável.,Não aplicável.,FALSE
