Objeto do Contrato,Tipo de Procedimento,Tipo(s) de Contrato,CPVs,Entidade(s) Adjudicante(s),Entidade(s) Adjudicatária(s),Preço Contratual,Data de Publicação,Data de Celebração do Contrato,Prazo de Execução,Local de Execução,Fundamentação,Data de Fecho do Contrato,Preço Total Efetivo,Causas das Alterações ao Prazo,Causas das Alterações ao Preço,Estado,N.º registo do Acordo Quadro,Descrição do Acordo Quadro,Procedimento Centralizado
"Prestação de Serviços de Manutenção e Assistência Técnica à Rede de Incêndios Armada, Agentes extintores, Central Monóxido de Carbono e Sistemas Automáticos de Incêndios do CHLO durante o ano de 2014",Ajuste Direto Regime Geral,Aquisição de serviços,"50000000-5, Serviços de reparação e manutenção","Centro Hospitalar de Lisboa Ocidental, E. P. E. (507618319)","Previncêndio, Lda (503568333)","13.200,00 €",21-01-2014,21-01-2014,365 dias,"Portugal, Lisboa, Lisboa<BR/>Portugal, Lisboa, Oeiras","Artigo 21.º, n.º 1, alínea a) do Código dos Contratos Públicos",,,,,,Não aplicável.,Não aplicável.,FALSE
AD100284 AQUISIÇÃO DE MEDICAMENTOS EXCLUSIVOS DA EMPRESA SANOFI PARA 2014,Ajuste Direto Regime Geral,Aquisição de bens móveis,"33620000-2, Medicamentos para o sangue, para os órgãos hematopoiéticos e para o aparelho cardiovascular","Centro Hospitalar de Lisboa Ocidental, E. P. E. (507618319)",SANOFI PRODUTOS FARMACEUTICOS LDA (500134960),"187.371,71 €",17-01-2014,16-12-2013,365 dias,"Portugal, Lisboa, Lisboa","Artigo 24.º, n.º 1, alínea e) do Código dos Contratos Públicos",,,,,,Não aplicável.,Não aplicável.,FALSE
AD100314 AQUISIÇÃO DE MEDICAMENTOS EXCLUSIVOS DA EMPRESA BAXTER PARA 2014,Ajuste Direto Regime Geral,Aquisição de bens móveis,"33620000-2, Medicamentos para o sangue, para os órgãos hematopoiéticos e para o aparelho cardiovascular","Centro Hospitalar de Lisboa Ocidental, E. P. E. (507618319)","BAXTER MEDICO FARMACEUTICA, LDA (503347345)","367.556,00 €",17-01-2014,11-12-2013,365 dias,"Portugal, Lisboa, Lisboa","Artigo 24.º, n.º 1, alínea e) do Código dos Contratos Públicos",,,,,,Não aplicável.,Não aplicável.,FALSE
AQUISIÇÃO DE MEDICAMENTOS EXCLUSIVOS DA EMPRESA GILEAD PARA 2014,Ajuste Direto Regime Geral,Aquisição de bens móveis,"33650000-1, Anti-infecciosos gerais de uso sistémico, vacinas, antineoplásicos e imunomoduladores","Centro Hospitalar de Lisboa Ocidental, E. P. E. (507618319)",GILEAD SCIENCES LDA (503604704),"478.419,98 €",16-01-2014,23-12-2013,365 dias,"Portugal, Lisboa, Lisboa","Artigo 24.º, n.º 1, alínea e) do Código dos Contratos Públicos",,,,,,Não aplicável.,Não aplicável.,FALSE
Prestação serviços de aluguer de BIPAP's para uso no CHLO durante o ano de 2014,Ajuste Direto Regime Geral,Aquisição de serviços,"85000000-9, Serviços de saúde e acção social","Centro Hospitalar de Lisboa Ocidental, E. P. E. (507618319)","Linde Saúde, Lda (500125546)","10.439,00 €",16-01-2014,16-01-2014,365 dias,"Portugal, Lisboa, Oeiras<BR/>Portugal, Lisboa, Lisboa","Artigo 21.º, n.º 1, alínea a) do Código dos Contratos Públicos",,,,,,Não aplicável.,Não aplicável.,FALSE
Prestação de serviços de manutenção e assistência técnica aos equipamentos e terminais gases medicinais no CHLO durante o ano de 2014,Ajuste Direto Regime Geral,Aquisição de serviços,"50800000-3, Serviços de reparação e manutenção diversos","Centro Hospitalar de Lisboa Ocidental, EPE (CHLO) (507618319)","Vedolis, Lda (501260170)","79.596,00 €",16-01-2014,15-01-2014,365 dias,"Portugal, Lisboa, Lisboa<BR/>Portugal, Lisboa, Oeiras","Artigo 27.º, n.º 1, alínea a) do Código dos Contratos Públicos",,,,,,Não aplicável.,Não aplicável.,FALSE
"AQUISIÇÃO DE MEDICAMENTOS EXCLUSIVOS DA EMPRESA CELGENE SOCIEDADE UNIPESSOAL, LDA PARA 2014",Ajuste Direto Regime Geral,Aquisição de bens móveis,"33650000-1, Anti-infecciosos gerais de uso sistémico, vacinas, antineoplásicos e imunomoduladores","Centro Hospitalar de Lisboa Ocidental, E. P. E. (507618319)","Celgene Sociedade Unipessoal, Lda (507791690)","351.575,16 €",15-01-2014,23-12-2013,365 dias,"Portugal, Lisboa, Lisboa","Artigo 24.º, n.º 1, alínea e) do Código dos Contratos Públicos",,,,,,Não aplicável.,Não aplicável.,FALSE
"Prestação de Serviços de Manutenção às Instalações e aos equipamentos das Áreas Não Médicas, sem peças, para o CHLO no ano de 2014",Ajuste Direto Regime Geral,Aquisição de serviços,"71356200-0, Serviços de assistência técnica","Centro Hospitalar de Lisboa Ocidental, EPE (CHLO) (507618319)",SUCH (500900469),"47.812,00 €",14-01-2014,26-12-2013,365 dias,"Portugal, Lisboa, Lisboa","Artigo 27.º, n.º 1, alínea a) do Código dos Contratos Públicos",,,,,,Não aplicável.,Não aplicável.,FALSE
Aquisição de Serviços de Lavagem e Tratamento de Roupa para o CHLO no ano de 2014,Ajuste Direto Regime Geral,Aquisição de serviços,"98311000-6, Serviços de recolha de roupa por lavandarias","Centro Hospitalar de Lisboa Ocidental, EPE (CHLO) (507618319)",Lavapor (508313422),"0,42 €",14-01-2014,27-12-2013,365 dias,"Portugal, Lisboa, Lisboa","Artigo 27.º, n.º 1, alínea a) do Código dos Contratos Públicos",,,,,,Não aplicável.,Não aplicável.,FALSE
"Aquisição da Prestação de Serviços de Controlo de pragas, designadamente Desbaratização, Desratização, Desinfestação e Desformigação do CHLO em 2014",Ajuste Direto Regime Geral,Aquisição de serviços,"90921000-9, Serviços de desinfecção e exterminação","Centro Hospitalar de Lisboa Ocidental, EPE (CHLO) (507618319)","Higicontrol, Lda (503808881)","5.100,00 €",14-01-2014,14-01-2014,365 dias,"Portugal, Lisboa, Lisboa<BR/>Portugal, Lisboa, Oeiras","Artigo 21.º, n.º 1, alínea a) do Código dos Contratos Públicos",,,,,,Não aplicável.,Não aplicável.,FALSE
Prestação de Serviços de Aluguer de 4 Módulos Contentores para o Arquivo do SGD do HSFX durante o ano de 2014,Ajuste Direto Regime Geral,Aquisição de serviços,"50000000-5, Serviços de reparação e manutenção","Centro Hospitalar de Lisboa Ocidental, E. P. E. (507618319)","Algeco, SA (502721871)","9.084,85 €",13-01-2014,13-01-2014,365 dias,"Portugal, Lisboa, Lisboa","Artigo 21.º, n.º 1, alínea a) do Código dos Contratos Públicos",,,,,,Não aplicável.,Não aplicável.,FALSE
