freguesia,acronym,validVotesPercentage,votes,dicofre
União das freguesias de Póvoa de Atalaia e Atalaia do Campo,PS,44.9,110,050435
União das freguesias de Póvoa de Atalaia e Atalaia do Campo,PPD/PSD,36.33,89,050435
União das freguesias de Póvoa de Atalaia e Atalaia do Campo,B.E.,7.76,19,050435
União das freguesias de Póvoa de Atalaia e Atalaia do Campo,PCP-PEV,3.27,8,050435
União das freguesias de Póvoa de Atalaia e Atalaia do Campo,CDS-PP,2.86,7,050435
União das freguesias de Póvoa de Atalaia e Atalaia do Campo,PPM.PPV/CDC,1.63,4,050435
União das freguesias de Póvoa de Atalaia e Atalaia do Campo,PAN,1.22,3,050435
União das freguesias de Póvoa de Atalaia e Atalaia do Campo,L,0.41,1,050435
União das freguesias de Póvoa de Atalaia e Atalaia do Campo,MAS,0.41,1,050435
União das freguesias de Póvoa de Atalaia e Atalaia do Campo,PCTP/MRPP,0.41,1,050435
União das freguesias de Póvoa de Atalaia e Atalaia do Campo,PNR,0.41,1,050435
União das freguesias de Póvoa de Atalaia e Atalaia do Campo,PTP,0.41,1,050435
União das freguesias de Póvoa de Atalaia e Atalaia do Campo,A,0,0,050435
União das freguesias de Póvoa de Atalaia e Atalaia do Campo,IL,0,0,050435
União das freguesias de Póvoa de Atalaia e Atalaia do Campo,NC,0,0,050435
União das freguesias de Póvoa de Atalaia e Atalaia do Campo,PDR,0,0,050435
União das freguesias de Póvoa de Atalaia e Atalaia do Campo,PURP,0,0,050435
