Objeto do Contrato,Tipo de Procedimento,Tipo(s) de Contrato,CPVs,Entidade(s) Adjudicante(s),Entidade(s) Adjudicatária(s),Preço Contratual,Data de Publicação,Data de Celebração do Contrato,Prazo de Execução,Local de Execução,Fundamentação,Data de Fecho do Contrato,Preço Total Efetivo,Causas das Alterações ao Prazo,Causas das Alterações ao Preço,Estado,N.º registo do Acordo Quadro,Descrição do Acordo Quadro,Procedimento Centralizado
Aquisição de Consumíveis Clínicos e Consumíveis Farmacêuticos e Assistência Técnica aos Equipamentos de Hemodiálise,Ajuste Direto Regime Geral,Aquisição de bens móveis,"33181520-3, Produtos de consumo para hemodiálise renal","Centro Hospitalar Vila Nova de Gaia - Espinho, E. P. E. (508142156)","Fresenius Medical Care Portugal, S.A. (503070220)","157.138,90 €",10-04-2015,13-03-2015,270 dias,"Portugal, Porto, Vila Nova de Gaia","Artigo 24.º, n.º 1, alínea e) do Código dos Contratos Públicos",,,,,,Não aplicável.,Não aplicável.,FALSE
Aquisição de Material de Drenagem e Urologia,Concurso público,Aquisição de bens móveis,"33125000-2, Material para exploração urológica","Centro Hospitalar Vila Nova de Gaia - Espinho, E.P.E. (508142156)",AMERICAN MEDICAL SYSTEMS (980223598),"1.550,40 €",07-04-2015,18-09-2014,270 dias,"Portugal, Porto, Vila Nova de Gaia","Artigo 20.º, n.º 1, alínea b) do Código dos Contratos Públicos",,,,,,Não aplicável.,Não aplicável.,FALSE
Aquisição de Material de Drenagem e Urologia,Concurso público,Aquisição de bens móveis,"33125000-2, Material para exploração urológica","Centro Hospitalar Vila Nova de Gaia - Espinho, E.P.E. (508142156)","Coloplast Portugal - Sociedade Unipessoal, Lda. (503989037)","28.506,48 €",07-04-2015,12-02-2015,270 dias,"Portugal, Porto, Vila Nova de Gaia","Artigo 20.º, n.º 1, alínea b) do Código dos Contratos Públicos",,,,,,Não aplicável.,Não aplicável.,FALSE
Aquisição de Material de Drenagem e Urologia,Concurso público,Aquisição de bens móveis,"33125000-2, Material para exploração urológica","Centro Hospitalar Vila Nova de Gaia - Espinho, E.P.E. (508142156)","Boston Scientific Portugal – Dispositivos Médicos, Lda. (504988964)","3.893,20 €",07-04-2015,18-09-2014,270 dias,"Portugal, Porto, Vila Nova de Gaia","Artigo 20.º, n.º 1, alínea b) do Código dos Contratos Públicos",,,,,,Não aplicável.,Não aplicável.,FALSE
Aquisição de Material de Drenagem e Urologia,Concurso público,Aquisição de bens móveis,"33125000-2, Material para exploração urológica","Centro Hospitalar Vila Nova de Gaia - Espinho, E.P.E. (508142156)","Covidien Portugal - Produtos de Saúde Unipessoal, Lda. (503413410)","14.612,50 €",07-04-2015,12-02-2015,270 dias,"Portugal, Porto, Vila Nova de Gaia","Artigo 20.º, n.º 1, alínea b) do Código dos Contratos Públicos",,,,,,Não aplicável.,Não aplicável.,FALSE
Aquisição de Material de Drenagem e Urologia,Concurso público,Aquisição de bens móveis,"33125000-2, Material para exploração urológica","Centro Hospitalar Vila Nova de Gaia - Espinho, E.P.E. (508142156)","B. Braun Medical, Lda. (501506543)","661,20 €",07-04-2015,18-09-2014,270 dias,"Portugal, Porto, Vila Nova de Gaia","Artigo 20.º, n.º 1, alínea b) do Código dos Contratos Públicos",,,,,,Não aplicável.,Não aplicável.,FALSE
Aquisição de Material de Drenagem e Urologia,Concurso público,Aquisição de bens móveis,"33125000-2, Material para exploração urológica","Centro Hospitalar Vila Nova de Gaia - Espinho, E.P.E. (508142156)","Johnson & Johnson, Lda. (500153370)","35.082,50 €",07-04-2015,12-02-2015,270 dias,"Portugal, Porto, Vila Nova de Gaia","Artigo 20.º, n.º 1, alínea b) do Código dos Contratos Públicos",,,,,,Não aplicável.,Não aplicável.,FALSE
Aquisição de Material de Drenagem e Urologia,Concurso público,Aquisição de bens móveis,"33125000-2, Material para exploração urológica","Centro Hospitalar Vila Nova de Gaia - Espinho, E.P.E. (508142156)","Hospitex – Material Hospitalar, Lda. (501909842)","1.725,50 €",07-04-2015,18-09-2014,270 dias,"Portugal, Porto, Vila Nova de Gaia","Artigo 20.º, n.º 1, alínea b) do Código dos Contratos Públicos",,,,,,Não aplicável.,Não aplicável.,FALSE
Aquisição de Material de Drenagem e Urologia,Concurso público,Aquisição de bens móveis,"33125000-2, Material para exploração urológica","Centro Hospitalar Vila Nova de Gaia - Espinho, E.P.E. (508142156)","HR Hospitalar, Lda. (501895558)","1.031,32 €",07-04-2015,18-09-2014,270 dias,"Portugal, Porto, Vila Nova de Gaia","Artigo 20.º, n.º 1, alínea b) do Código dos Contratos Públicos",,,,,,Não aplicável.,Não aplicável.,FALSE
Aquisição de Brometo de Ipratrópio + Salbutamol,Ao abrigo de acordo-quadro (art.º 259.º),Aquisição de bens móveis,"33600000-6, Produtos farmacêuticos","Centro Hospitalar Vila Nova de Gaia - Espinho, E. P. E. (508142156)","Unilfarma - União Intern. de Lab. Farmacêuticos, Lda (500293023)","22.500,00 €",07-04-2015,06-03-2015,310 dias,"Portugal, Porto, Vila Nova de Gaia",Artigo 259.º do Código dos Contratos Públicos,,,,,,613816,"CONCURSO PÚBLICO PARA A CELEBRAÇÃO DE CONTRATOS PÚBLICOS DE APROVISIONAMENTO PARA A ÁREA DA SAÚDE, COM VISTA AO FORNECIMENTO DE MEDICAMENTOS DO APARELHO RESPIRATÓRIO, ÀS INSTITUIÇÕES E SERVIÇOS DO SERVIÇO NACIONAL DE SAÚDE",FALSE
Aquisição de Dispositivos Farmacêuticos Diversos,Ao abrigo de acordo-quadro (art.º 259.º),Aquisição de bens móveis,"33600000-6, Produtos farmacêuticos","Centro Hospitalar Vila Nova de Gaia - Espinho, E. P. E. (508142156)","Overpharma, Produtos Médicos e Farmacêuticos Lda. (505792362)","6.699,00 €",07-04-2015,07-04-2015,270 dias,"Portugal, Porto, Vila Nova de Gaia",Artigo 259.º do Código dos Contratos Públicos,,,,,,552526,"CONCURSO PÚBLICO PARA A CELEBRAÇÃO DE CONTRATOS PÚBLICOS DE APROVISIONAMENTO PARA A ÁREA DA SAÚDE, COM VISTA AO FORNECIMENTO DE DISPOSITIVOS MÉDICOS DIVERSOS",FALSE
Aquisição de Dispositivos Farmacêuticos Diversos,Ao abrigo de acordo-quadro (art.º 259.º),Aquisição de bens móveis,"33600000-6, Produtos farmacêuticos","Centro Hospitalar Vila Nova de Gaia - Espinho, E. P. E. (508142156)","KVTECH Portugal - Produtos Médicos Unipessoal, Lda (508671531)","20.351,30 €",07-04-2015,07-04-2015,270 dias,"Portugal, Porto, Vila Nova de Gaia",Artigo 259.º do Código dos Contratos Públicos,,,,,,552526,"CONCURSO PÚBLICO PARA A CELEBRAÇÃO DE CONTRATOS PÚBLICOS DE APROVISIONAMENTO PARA A ÁREA DA SAÚDE, COM VISTA AO FORNECIMENTO DE DISPOSITIVOS MÉDICOS DIVERSOS",FALSE
Aquisição de Dispositivos Farmacêuticos Diversos,Ao abrigo de acordo-quadro (art.º 259.º),Aquisição de bens móveis,"33600000-6, Produtos farmacêuticos","Centro Hospitalar Vila Nova de Gaia - Espinho, E. P. E. (508142156)","B Braun Medical, Lda (501506543)","2.036,40 €",07-04-2015,07-04-2015,270 dias,"Portugal, Porto, Vila Nova de Gaia",Artigo 259.º do Código dos Contratos Públicos,,,,,,552526,"CONCURSO PÚBLICO PARA A CELEBRAÇÃO DE CONTRATOS PÚBLICOS DE APROVISIONAMENTO PARA A ÁREA DA SAÚDE, COM VISTA AO FORNECIMENTO DE DISPOSITIVOS MÉDICOS DIVERSOS",FALSE
Aquisição de Material de Ventilação,Concurso público,Aquisição de bens móveis,"33140000-3, Material médico de consumo","Centro Hospitalar Vila Nova de Gaia - Espinho, E. P. E. (508142156)","Smiths Medical (Portugal),Unipessoal, Lda. (507445937)","463,65 €",07-04-2015,28-08-2014,270 dias,"Portugal, Porto, Vila Nova de Gaia","Artigo 20.º, n.º 1, alínea b) do Código dos Contratos Públicos",,,,,,Não aplicável.,Não aplicável.,FALSE
Aquisição de Material de Ventilação,Concurso público,Aquisição de bens móveis,"33140000-3, Material médico de consumo","Centro Hospitalar Vila Nova de Gaia - Espinho, E. P. E. (508142156)","Dimor Lusitana - Comércio de Produtos de Saúde e Higiene, Lda. (500730741)","1.076,60 €",07-04-2015,28-08-2014,270 dias,"Portugal, Porto, Vila Nova de Gaia","Artigo 20.º, n.º 1, alínea b) do Código dos Contratos Públicos",,,,,,Não aplicável.,Não aplicável.,FALSE
Aquisição de Material de Ventilação,Concurso público,Aquisição de bens móveis,"33140000-3, Material médico de consumo","Centro Hospitalar Vila Nova de Gaia - Espinho, E. P. E. (508142156)","Linde Saúde, Lda (500125546)","1.200,00 €",07-04-2015,28-08-2014,270 dias,"Portugal, Porto, Vila Nova de Gaia","Artigo 20.º, n.º 1, alínea b) do Código dos Contratos Públicos",,,,,,Não aplicável.,Não aplicável.,FALSE
Aquisição de Material de Ventilação,Concurso público,Aquisição de bens móveis,"33140000-3, Material médico de consumo","Centro Hospitalar Vila Nova de Gaia - Espinho, E. P. E. (508142156)","Iberdata - Equipamentos, SA. (501904921)","76,20 €",07-04-2015,28-08-2014,270 dias,"Portugal, Porto, Vila Nova de Gaia","Artigo 20.º, n.º 1, alínea b) do Código dos Contratos Públicos",,,,,,Não aplicável.,Não aplicável.,FALSE
Aquisição de Material de Ventilação,Concurso público,Aquisição de bens móveis,"33140000-3, Material médico de consumo","Centro Hospitalar Vila Nova de Gaia - Espinho, E. P. E. (508142156)","Aviquímica-Importações e Manufacturas, Lda. (500039720)","36,92 €",07-04-2015,28-08-2014,270 dias,"Portugal, Porto, Vila Nova de Gaia","Artigo 20.º, n.º 1, alínea b) do Código dos Contratos Públicos",,,,,,Não aplicável.,Não aplicável.,FALSE
Aquisição de Material de Ventilação,Concurso público,Aquisição de bens móveis,"33140000-3, Material médico de consumo","Centro Hospitalar Vila Nova de Gaia - Espinho, E. P. E. (508142156)","MBA Portugal, S.A.  (504445960)","15.925,50 €",07-04-2015,17-02-2015,270 dias,"Portugal, Porto, Vila Nova de Gaia","Artigo 20.º, n.º 1, alínea b) do Código dos Contratos Públicos",,,,,,Não aplicável.,Não aplicável.,FALSE
Aquisição de Material de Ventilação,Concurso público,Aquisição de bens móveis,"33140000-3, Material médico de consumo","Centro Hospitalar Vila Nova de Gaia - Espinho, E. P. E. (508142156)",Teleflex Medical SA-Sucursal em Portugal (980249783),"18.165,50 €",07-04-2015,17-02-2015,270 dias,"Portugal, Porto, Vila Nova de Gaia","Artigo 20.º, n.º 1, alínea b) do Código dos Contratos Públicos",,,,,,Não aplicável.,Não aplicável.,FALSE
Aquisição de Material de Ventilação,Concurso público,Aquisição de bens móveis,"33140000-3, Material médico de consumo","Centro Hospitalar Vila Nova de Gaia - Espinho, E. P. E. (508142156)","Covidien Portugal- Produtos de Saúde, Soc. Unip. Lda. (503413410)","18.785,55 €",07-04-2015,17-02-2015,270 dias,"Portugal, Porto, Vila Nova de Gaia","Artigo 20.º, n.º 1, alínea b) do Código dos Contratos Públicos",,,,,,Não aplicável.,Não aplicável.,FALSE
Aquisição de Material de Ventilação,Concurso público,Aquisição de bens móveis,"33140000-3, Material médico de consumo","Centro Hospitalar Vila Nova de Gaia - Espinho, E. P. E. (508142156)","Intersurgical Portugal-Comércio de Produtos Hospitalares, Lda. (503480045)","17.300,99 €",07-04-2015,17-02-2015,270 dias,"Portugal, Porto, Vila Nova de Gaia","Artigo 20.º, n.º 1, alínea b) do Código dos Contratos Públicos",,,,,,Não aplicável.,Não aplicável.,FALSE
"Aquisição de Dietas Entéricas, Leites e Farinhas Lácteas",Concurso público,Aquisição de bens móveis,"33692300-0, Alimentos enterais","Centro Hospitalar Vila Nova de Gaia - Espinho, E. P. E. (508142156)","Milupa Comercial, S.A. (502192828)","1.916,82 €",02-04-2015,29-01-2015,270 dias,"Portugal, Porto, Vila Nova de Gaia","Artigo 20.º, n.º 1, alínea b) do Código dos Contratos Públicos",,,,,,Não aplicável.,Não aplicável.,FALSE
"Aquisição de Dietas Entéricas, Leites e Farinhas Lácteas",Concurso público,Aquisição de bens móveis,"33692300-0, Alimentos enterais","Centro Hospitalar Vila Nova de Gaia - Espinho, E. P. E. (508142156)",Nestlé Portugal S.A. (500201307),"10.407,60 €",02-04-2015,24-02-2015,270 dias,"Portugal, Porto, Vila Nova de Gaia","Artigo 20.º, n.º 1, alínea b) do Código dos Contratos Públicos",,,,,,Não aplicável.,Não aplicável.,FALSE
"Aquisição de Dietas Entéricas, Leites e Farinhas Lácteas",Concurso público,Aquisição de bens móveis,"33692300-0, Alimentos enterais","Centro Hospitalar Vila Nova de Gaia - Espinho, E. P. E. (508142156)","Fresenius Kabi Pharma Portugal, Lda (504293753)","15.758,14 €",02-04-2015,24-02-2015,270 dias,"Portugal, Porto, Vila Nova de Gaia","Artigo 20.º, n.º 1, alínea b) do Código dos Contratos Públicos",,,,,,Não aplicável.,Não aplicável.,FALSE
"Aquisição de Dietas Entéricas, Leites e Farinhas Lácteas",Concurso público,Aquisição de bens móveis,"33692300-0, Alimentos enterais","Centro Hospitalar Vila Nova de Gaia - Espinho, E. P. E. (508142156)","Nutrícia Advance Medical Nutrition-Unipessoal,Lda. (507558286)","29.995,61 €",02-04-2015,24-02-2015,270 dias,"Portugal, Porto, Vila Nova de Gaia","Artigo 20.º, n.º 1, alínea b) do Código dos Contratos Públicos",,,,,,Não aplicável.,Não aplicável.,FALSE
"Aquisição de Dietas Entericas, Leites e Farinhas Lácteas",Concurso público,Aquisição de bens móveis,"33692300-0, Alimentos enterais","Centro Hospitalar Vila Nova de Gaia - Espinho, E. P. E. (508142156)","B. Braun Medical, Lda (501506543)","1.146,00 €",02-04-2015,29-01-2015,270 dias,"Portugal, Porto, Vila Nova de Gaia","Artigo 20.º, n.º 1, alínea b) do Código dos Contratos Públicos",,,,,,Não aplicável.,Não aplicável.,FALSE
Aquisição de Material para Medicina Reprodutiva,Concurso público,Aquisição de bens móveis,"33140000-3, Material médico de consumo","Centro Hospitalar Vila Nova de Gaia - Espinho, E. P. E. (508142156)","Sarstedt Tecnologia de Laboratório, Lda. (503019461)","108,00 €",02-04-2015,06-03-2015,300 dias,"Portugal, Porto, Vila Nova de Gaia","Artigo 20.º, n.º 1, alínea b) do Código dos Contratos Públicos",,,,,,Não aplicável.,Não aplicável.,FALSE
Aquisição de Material para Medicina Reprodutiva,Concurso público,Aquisição de bens móveis,"33140000-3, Material médico de consumo","Centro Hospitalar Vila Nova de Gaia - Espinho, E. P. E. (508142156)","Enzifarma - Diagnostica e Farmacêutica, S.A. (503636975)","216,00 €",02-04-2015,06-03-2015,300 dias,"Portugal, Porto, Vila Nova de Gaia","Artigo 20.º, n.º 1, alínea b) do Código dos Contratos Públicos",,,,,,Não aplicável.,Não aplicável.,FALSE
Aquisição de Material para Medicina Reprodutiva,Concurso público,Aquisição de bens móveis,"33140000-3, Material médico de consumo","Centro Hospitalar Vila Nova de Gaia - Espinho, E. P. E. (508142156)",Instituto de Reproducción (B60508918),"1.100,00 €",02-04-2015,06-03-2015,300 dias,"Portugal, Porto, Vila Nova de Gaia","Artigo 20.º, n.º 1, alínea b) do Código dos Contratos Públicos",,,,,,Não aplicável.,Não aplicável.,FALSE
Aquisição de Material para Medicina Reprodutiva,Concurso público,Aquisição de bens móveis,"33140000-3, Material médico de consumo","Centro Hospitalar Vila Nova de Gaia - Espinho, E. P. E. (508142156)","VWR - Internacional Material de Laboratório, Lda. (503842770)","2.430,05 €",02-04-2015,06-03-2015,300 dias,"Portugal, Porto, Vila Nova de Gaia","Artigo 20.º, n.º 1, alínea b) do Código dos Contratos Públicos",,,,,,Não aplicável.,Não aplicável.,FALSE
Aquisição de Material para Medicina Reprodutiva,Concurso público,Aquisição de bens móveis,"33140000-3, Material médico de consumo","Centro Hospitalar Vila Nova de Gaia - Espinho, E. P. E. (508142156)","Biosonda - Comércio de Material Hospitalar, Lda. (501463313)","15.939,63 €",02-04-2015,06-03-2015,300 dias,"Portugal, Porto, Vila Nova de Gaia","Artigo 20.º, n.º 1, alínea b) do Código dos Contratos Públicos",,,,,,Não aplicável.,Não aplicável.,FALSE
Aquisição de Consumíveis para o Equipamento Marca Teprel,Ajuste Direto Regime Geral,Aquisição de bens móveis,"33140000-3, Material médico de consumo","Centro Hospitalar Vila Nova de Gaia - Espinho, E. P. E. (508142156)","Teprel - Equipamentos Médicos, S.A. (502262184)","15.675,00 €",02-04-2015,13-02-2015,270 dias,"Portugal, Porto, Vila Nova de Gaia","Artigo 24.º, n.º 1, alínea e) do Código dos Contratos Públicos",,,,,,Não aplicável.,Não aplicável.,FALSE
Aquisição de Cateteres para Diálise Peritoneal,Ao abrigo de acordo-quadro (art.º 259.º),Aquisição de bens móveis,"33100000-1, Equipamento médico","Centro Hospitalar Vila Nova de Gaia - Espinho, E. P. E. (508142156)",Fresenius Medical Care Portugal SA (503070220),"5.320,00 €",01-04-2015,31-03-2015,280 dias,"Portugal, Porto, Vila Nova de Gaia",Artigo 259.º do Código dos Contratos Públicos,,,,,,601978,"CONCURSO PÚBLICO PARA A CELEBRAÇÃO DE CONTRATOS PÚBLICOS DE APROVISIONAMENTO PARA A ÁREA DA SAÚDE, COM VISTA AO FORNECIMENTO DE BENS DE DÁLISE PERITONEAL ÀS INSTITUIÇÕES E SERVIÇOS DO SERVIÇO NACIONAL DE SAÚDE",FALSE
Aquisição de Contracetivos,Ao abrigo de acordo-quadro (art.º 259.º),Aquisição de bens móveis,"33600000-6, Produtos farmacêuticos","Centro Hospitalar Vila Nova de Gaia - Espinho, E. P. E. (508142156)","Merck Sharp & Dohme, Lda (500191360)","1.265,55 €",31-03-2015,31-03-2015,280 dias,"Portugal, Porto, Vila Nova de Gaia",Artigo 259.º do Código dos Contratos Públicos,,,,,,613817,"CONCURSO PÚBLICO PARA A CELEBRAÇÃO DE CONTRATOS PÚBLICOS DE APROVISIONAMENTO PARA A ÁREA DA SAÚDE, COM VISTA AO FORNECIMENTO DE CONTRACETIVOS ORAIS, PROFILATICOS E MECANICO, ÀS INSTITUIÇÕES E SERVIÇOS DO SERVIÇO NACIONAL DE SAÚDE",FALSE
Aquisição de Contracetivos,Ao abrigo de acordo-quadro (art.º 259.º),Aquisição de bens móveis,"33600000-6, Produtos farmacêuticos","Centro Hospitalar Vila Nova de Gaia - Espinho, E. P. E. (508142156)","Laboratórios Pfizer, Lda (500162166)","338,08 €",31-03-2015,31-03-2015,280 dias,"Portugal, Porto, Vila Nova de Gaia",Artigo 259.º do Código dos Contratos Públicos,,,,,,613817,"CONCURSO PÚBLICO PARA A CELEBRAÇÃO DE CONTRATOS PÚBLICOS DE APROVISIONAMENTO PARA A ÁREA DA SAÚDE, COM VISTA AO FORNECIMENTO DE CONTRACETIVOS ORAIS, PROFILATICOS E MECANICO, ÀS INSTITUIÇÕES E SERVIÇOS DO SERVIÇO NACIONAL DE SAÚDE",FALSE
Aquisição de Contracetivos,Ao abrigo de acordo-quadro (art.º 259.º),Aquisição de bens móveis,"33600000-6, Produtos farmacêuticos","Centro Hospitalar Vila Nova de Gaia - Espinho, E. P. E. (508142156)","Generis Farmacêutica, SA (508107997)","30,06 €",31-03-2015,31-03-2015,280 dias,"Portugal, Porto, Vila Nova de Gaia",Artigo 259.º do Código dos Contratos Públicos,,,,,,613817,"CONCURSO PÚBLICO PARA A CELEBRAÇÃO DE CONTRATOS PÚBLICOS DE APROVISIONAMENTO PARA A ÁREA DA SAÚDE, COM VISTA AO FORNECIMENTO DE CONTRACETIVOS ORAIS, PROFILATICOS E MECANICO, ÀS INSTITUIÇÕES E SERVIÇOS DO SERVIÇO NACIONAL DE SAÚDE",FALSE
Aquisição de Contracetivos,Ao abrigo de acordo-quadro (art.º 259.º),Aquisição de bens móveis,"33600000-6, Produtos farmacêuticos","Centro Hospitalar Vila Nova de Gaia - Espinho, E. P. E. (508142156)","Bayer Portugal, SA (500043256)","23.431,95 €",31-03-2015,31-03-2015,280 dias,"Portugal, Porto, Vila Nova de Gaia",Artigo 259.º do Código dos Contratos Públicos,,,,,,613817,"CONCURSO PÚBLICO PARA A CELEBRAÇÃO DE CONTRATOS PÚBLICOS DE APROVISIONAMENTO PARA A ÁREA DA SAÚDE, COM VISTA AO FORNECIMENTO DE CONTRACETIVOS ORAIS, PROFILATICOS E MECANICO, ÀS INSTITUIÇÕES E SERVIÇOS DO SERVIÇO NACIONAL DE SAÚDE",FALSE
Aquisição de Filtros para Manutenção de Equipamento AVAC,Ajuste Direto Regime Geral,Aquisição de bens móveis,"42514310-8, Filtros de ar","Centro Hospitalar Vila Nova de Gaia - Espinho, E. P. E. (508142156)","Filterwin, Lda (510204023)","11.936,00 €",31-03-2015,29-01-2015,335 dias,"Portugal, Porto, Vila Nova de Gaia","Artigo 20.º, n.º 1, alínea a) do Código dos Contratos Públicos",,,,,,Não aplicável.,Não aplicável.,FALSE
Aquisição de Material para Artroplastias do Ombro,Concurso público,Aquisição de bens móveis,"33183200-8, Próteses ortopédicas","Centro Hospitalar Vila Nova de Gaia - Espinho, E. P. E. (508142156)","Lima Implantes Portugal - Sociedade Unipessoal, Lda. (508634784)","45.450,00 €",31-03-2015,26-03-2015,300 dias,"Portugal, Porto, Vila Nova de Gaia","Artigo 20.º, n.º 1, alínea b) do Código dos Contratos Públicos",,,,,,Não aplicável.,Não aplicável.,FALSE
