Objeto do Contrato,Tipo de Procedimento,Tipo(s) de Contrato,CPVs,Entidade(s) Adjudicante(s),Entidade(s) Adjudicatária(s),Preço Contratual,Data de Publicação,Data de Celebração do Contrato,Prazo de Execução,Local de Execução,Fundamentação,Data de Fecho do Contrato,Preço Total Efetivo,Causas das Alterações ao Prazo,Causas das Alterações ao Preço,Estado,N.º registo do Acordo Quadro,Descrição do Acordo Quadro,Procedimento Centralizado
"Renovação do Contrato de Manutenção e Assistência Técnica à Central Telefónica do CHSJ,EPE para o ano de 2014",Ajuste Direto Regime Geral,Aquisição de serviços,"50000000-5, Serviços de reparação e manutenção","Centro Hospitalar de São João, E. P. E. (509821197)","Dimension Data Portugal, S.A. (505134195)","13.197,00 €",01-07-2014,23-05-2014,365 dias,"Portugal, Porto, Porto","Artigo 20.º, n.º 1, alínea a) do Código dos Contratos Públicos",,,,,,Não aplicável.,Não aplicável.,FALSE
Aquisição de Reagentes Celulares e Controlos de Qualidade Internos para o Serviço de Imunohemoterapia,Ajuste Direto Regime Geral,Aquisição de bens móveis,"33696500-0, Reagentes de laboratório","Centro Hospitalar de São João, E. P. E. (509821197)","Grifols Portugal, Lda (502041285)","14.274,00 €",30-06-2014,05-02-2014,365 dias,"Portugal, Porto, Porto","Artigo 24.º, n.º 1, alínea e) do Código dos Contratos Públicos",,,,,,Não aplicável.,Não aplicável.,FALSE
Aquisição de Reagentes Celulares e Controlos de Qualidade Internos para o Serviço de Imunohemoterapia,Ajuste Direto Regime Geral,Aquisição de bens móveis,"33696500-0, Reagentes de laboratório","Centro Hospitalar de São João, E. P. E. (509821197)","Johnson & Johnson, Lda (500153370)","22.315,04 €",30-06-2014,05-02-2014,365 dias,"Portugal, Porto, Porto","Artigo 24.º, n.º 1, alínea e) do Código dos Contratos Públicos",,,,,,Não aplicável.,Não aplicável.,FALSE
"Reparação por substituição de componentes de endoscópio Olympus GIF-Q160 das Técnicas de Gastro do CHSJ, EPE",Ajuste Direto Regime Geral,Aquisição de bens móveis,"33168000-5, Aparelhos para endoscopia e endocirurgia","Centro Hospitalar de São João, E. P. E. (509821197)",Endotécnica Lda. (503818348),"6.493,50 €",27-06-2014,18-06-2014,15 dias,"Portugal, Porto, Porto","Artigo 20.º, n.º 1, alínea a) do Código dos Contratos Públicos",,,,,,Não aplicável.,Não aplicável.,FALSE
"Aquisição de Equipamento para Calibração de Pipetas pelo Método Gravimétrico para o Serviço de Certificação do CHSJ, EPE",Ajuste Direto Regime Geral,Aquisição de bens móveis,"38310000-1, Balanças de precisão","Centro Hospitalar São João, EPE (509821197)",VWR International Lda. (503842770),"22.883,00 €",27-06-2014,02-06-2014,30 dias,"Portugal, Porto, Porto","Artigo 20.º, n.º 1, alínea a) do Código dos Contratos Públicos",,,,,,Não aplicável.,Não aplicável.,FALSE
Aquisição de Efavirenz 600mg,Ajuste Direto Regime Geral,Aquisição de bens móveis,"33651000-8, Anti-infecciosos gerais de uso sistémico","Centro Hospitalar São João, EPE (509821197)","Merck Sharp & Dohme, Lda (500191360)","43.000,00 €",27-06-2014,21-05-2014,90 dias,"Portugal, Porto, Porto","Artigo 20.º, n.º 1, alínea a) do Código dos Contratos Públicos",,,,,,Não aplicável.,Não aplicável.,FALSE
"Aquisição de Quiosques Multimédia para Sistema de Gestão de Filas de Espera para o Centro Hospitalar S. João, EPE, no âmbito do Projeto ePatientCentric",Ajuste Direto Regime Geral,Aquisição de bens móveis,"30236000-2, Equipamento informático diverso","Centro Hospitalar de São João, E. P. E. (509821197)","Tecnologia Plexus, S.L. (B 15726177)","33.000,00 €",27-06-2014,03-06-2014,20 dias,"Portugal, Porto, Porto","Artigo 26.º, n.º 1, alínea a) do Código dos Contratos Públicos",,,,,,Não aplicável.,Não aplicável.,FALSE
"Aquisição de 30 impressoras térmicas para balcões de atendimento do Sistema de Gestão de Filas de Espera no CHSJ, EPE no âmbito do Projeto ePatientCentric",Ajuste Direto Regime Geral,Aquisição de bens móveis,"30232100-5, Impressoras e traçadores de gráficos","Centro Hospitalar São João, EPE (509821197)",ITEN Solutions SA (510728189),"4.709,70 €",27-06-2014,27-06-2014,15 dias,"Portugal, Porto, Porto","Artigo 20.º, n.º 1, alínea a) do Código dos Contratos Públicos",,,,,,Não aplicável.,Não aplicável.,FALSE
"Aquisição de Solução de Centro de Contactos para o CHSJ, EPE, no âmbito do Projeto ePatientCentric",Ajuste Direto Regime Geral,Aquisição de bens móveis,"48510000-6, Pacote de software para comunicações","Centro Hospitalar de São João, E. P. E. (509821197)",PT Comunicações SA (504615947),"49.982,91 €",26-06-2014,12-06-2014,30 dias,"Portugal, Porto, Porto","Artigo 20.º, n.º 1, alínea a) do Código dos Contratos Públicos",,,,,,Não aplicável.,Não aplicável.,FALSE
"Aquisição de 2 Servidores para o CHSJ, EPE, no âmbito do Projeto ePatientCentric",Ajuste Direto Regime Geral,Aquisição de bens móveis,"30230000-0, Equipamento informático","Centro Hospitalar São João, EPE (509821197)",ITEN Solutions SA (510728189),"7.411,79 €",26-06-2014,26-06-2014,7 dias,"Portugal, Porto, Porto","Artigo 20.º, n.º 1, alínea a) do Código dos Contratos Públicos",,,,,,Não aplicável.,Não aplicável.,FALSE
