freguesia,acronym,validVotesPercentage,votes,dicofre
Avis,PCP-PEV,48.43,323,120303
Avis,PS,28.49,190,120303
Avis,PPD/PSD.CDS-PP,11.54,77,120303
Avis,MPT,3.9,26,120303
Avis,B.E.,2.25,15,120303
Avis,PAN,1.5,10,120303
Avis,PCTP/MRPP,1.35,9,120303
Avis,L,0.9,6,120303
Avis,PNR,0.75,5,120303
Avis,MAS,0.3,2,120303
Avis,PPM,0.3,2,120303
Avis,PND,0.15,1,120303
Avis,POUS,0.15,1,120303
Avis,PDA,0,0,120303
Avis,PPV,0,0,120303
Avis,PTP,0,0,120303
