freguesia,acronym,validVotesPercentage,votes,dicofre
Santo Isidoro e Livração,PS,58.82,440,130735
Santo Isidoro e Livração,PPD/PSD,12.57,94,130735
Santo Isidoro e Livração,PCP-PEV,10.43,78,130735
Santo Isidoro e Livração,B.E.,7.49,56,130735
Santo Isidoro e Livração,CDS-PP,3.88,29,130735
Santo Isidoro e Livração,PAN,2.14,16,130735
Santo Isidoro e Livração,PCTP/MRPP,1.74,13,130735
Santo Isidoro e Livração,NC,0.67,5,130735
Santo Isidoro e Livração,PPM.PPV/CDC,0.67,5,130735
Santo Isidoro e Livração,L,0.4,3,130735
Santo Isidoro e Livração,PTP,0.4,3,130735
Santo Isidoro e Livração,PDR,0.27,2,130735
Santo Isidoro e Livração,PURP,0.27,2,130735
Santo Isidoro e Livração,MAS,0.13,1,130735
Santo Isidoro e Livração,PNR,0.13,1,130735
Santo Isidoro e Livração,A,0,0,130735
Santo Isidoro e Livração,IL,0,0,130735
