freguesia,acronym,validVotesPercentage,votes,dicofre
Beco,PPD/PSD.CDS-PP,45.85,105,141103
Beco,PS,36.68,84,141103
Beco,MPT,7.42,17,141103
Beco,PCP-PEV,2.62,6,141103
Beco,PAN,1.75,4,141103
Beco,L,1.31,3,141103
Beco,PCTP/MRPP,1.31,3,141103
Beco,PND,1.31,3,141103
Beco,PPM,0.87,2,141103
Beco,MAS,0.44,1,141103
Beco,PPV,0.44,1,141103
Beco,B.E.,0,0,141103
Beco,PDA,0,0,141103
Beco,PNR,0,0,141103
Beco,POUS,0,0,141103
Beco,PTP,0,0,141103
