freguesia,acronym,validVotesPercentage,votes,dicofre
Ribeiras,PPD/PSD.CDS-PP,45.29,77,460104
Ribeiras,PS,42.35,72,460104
Ribeiras,PCP-PEV,3.53,6,460104
Ribeiras,MPT,2.94,5,460104
Ribeiras,B.E.,1.76,3,460104
Ribeiras,PND,1.18,2,460104
Ribeiras,PTP,1.18,2,460104
Ribeiras,PAN,0.59,1,460104
Ribeiras,POUS,0.59,1,460104
Ribeiras,PPM,0.59,1,460104
Ribeiras,L,0,0,460104
Ribeiras,MAS,0,0,460104
Ribeiras,PCTP/MRPP,0,0,460104
Ribeiras,PDA,0,0,460104
Ribeiras,PNR,0,0,460104
Ribeiras,PPV,0,0,460104
