freguesia,acronym,validVotesPercentage,votes,dicofre
Bucelas,PS,33.2,491,110702
Bucelas,PCP-PEV,32.05,474,110702
Bucelas,PPD/PSD.CDS-PP,15.15,224,110702
Bucelas,MPT,5.41,80,110702
Bucelas,B.E.,4.87,72,110702
Bucelas,PCTP/MRPP,3.38,50,110702
Bucelas,L,1.69,25,110702
Bucelas,PAN,1.56,23,110702
Bucelas,PND,0.95,14,110702
Bucelas,PPM,0.61,9,110702
Bucelas,PNR,0.47,7,110702
Bucelas,PDA,0.2,3,110702
Bucelas,PTP,0.2,3,110702
Bucelas,MAS,0.14,2,110702
Bucelas,PPV,0.14,2,110702
Bucelas,POUS,0,0,110702
