freguesia,acronym,validVotesPercentage,votes,dicofre
Carreço,PS,28.7,155,160908
Carreço,PPD/PSD.CDS-PP,27.04,146,160908
Carreço,MPT,14.81,80,160908
Carreço,PCP-PEV,11.85,64,160908
Carreço,B.E.,7.04,38,160908
Carreço,L,2.41,13,160908
Carreço,PCTP/MRPP,2.22,12,160908
Carreço,PAN,2.04,11,160908
Carreço,PTP,1.11,6,160908
Carreço,PND,0.74,4,160908
Carreço,MAS,0.56,3,160908
Carreço,PNR,0.56,3,160908
Carreço,PPV,0.56,3,160908
Carreço,PDA,0.19,1,160908
Carreço,PPM,0.19,1,160908
Carreço,POUS,0,0,160908
