freguesia,acronym,validVotesPercentage,votes,dicofre
Alvaiázere,PPD/PSD.CDS-PP,57.77,357,100208
Alvaiázere,PS,19.58,121,100208
Alvaiázere,MPT,8.74,54,100208
Alvaiázere,PCP-PEV,3.07,19,100208
Alvaiázere,B.E.,2.91,18,100208
Alvaiázere,L,1.29,8,100208
Alvaiázere,PAN,1.13,7,100208
Alvaiázere,PND,1.13,7,100208
Alvaiázere,PCTP/MRPP,0.97,6,100208
Alvaiázere,MAS,0.65,4,100208
Alvaiázere,PNR,0.65,4,100208
Alvaiázere,PTP,0.65,4,100208
Alvaiázere,PDA,0.49,3,100208
Alvaiázere,PPM,0.49,3,100208
Alvaiázere,PPV,0.49,3,100208
Alvaiázere,POUS,0,0,100208
