freguesia,acronym,validVotesPercentage,votes,dicofre
União das freguesias de Lamelas e Guimarei,PS,49.31,250,131436
União das freguesias de Lamelas e Guimarei,PPD/PSD,22.09,112,131436
União das freguesias de Lamelas e Guimarei,B.E.,9.47,48,131436
União das freguesias de Lamelas e Guimarei,PAN,6.11,31,131436
União das freguesias de Lamelas e Guimarei,CDS-PP,4.54,23,131436
União das freguesias de Lamelas e Guimarei,PCP-PEV,2.37,12,131436
União das freguesias de Lamelas e Guimarei,NC,1.78,9,131436
União das freguesias de Lamelas e Guimarei,L,1.38,7,131436
União das freguesias de Lamelas e Guimarei,A,1.18,6,131436
União das freguesias de Lamelas e Guimarei,PPM.PPV/CDC,0.79,4,131436
União das freguesias de Lamelas e Guimarei,IL,0.2,1,131436
União das freguesias de Lamelas e Guimarei,PCTP/MRPP,0.2,1,131436
União das freguesias de Lamelas e Guimarei,PDR,0.2,1,131436
União das freguesias de Lamelas e Guimarei,PTP,0.2,1,131436
União das freguesias de Lamelas e Guimarei,PURP,0.2,1,131436
União das freguesias de Lamelas e Guimarei,MAS,0,0,131436
União das freguesias de Lamelas e Guimarei,PNR,0,0,131436
