Objeto do Contrato,Tipo de Procedimento,Tipo(s) de Contrato,CPVs,Entidade(s) Adjudicante(s),Entidade(s) Adjudicatária(s),Preço Contratual,Data de Publicação,Data de Celebração do Contrato,Prazo de Execução,Local de Execução,Fundamentação,Data de Fecho do Contrato,Preço Total Efetivo,Causas das Alterações ao Prazo,Causas das Alterações ao Preço,Estado,N.º registo do Acordo Quadro,Descrição do Acordo Quadro,Procedimento Centralizado
"Aquisição de Reagentes para Bioquímica / Imunoquímica para o HDFF, EPE",Concurso público,Aquisição de bens móveis,"33696500-0, Reagentes de laboratório","Hospital Distrital da Figueira da Foz, E. P. E. (506361527)",ROCHE SISTEMA DE DIAGNOSTICOS                      (504282921),"339.888,06 €",10-03-2017,02-03-2017,730 dias,"Portugal, Coimbra, Figueira da Foz","Artigo 20.º, n.º 1, alínea b) do Código dos Contratos Públicos",,,,,,Não aplicável.,Não aplicável.,FALSE
Aquisição de Reagentes para Coagulação,Concurso público,Aquisição de bens móveis,"33696500-0, Reagentes de laboratório","Hospital Distrital da Figueira da Foz, E. P. E. (506361527)",WERFEN PORTUGAL LDA (501086110),"82.880,00 €",03-03-2017,20-02-2017,365 dias,"Portugal, Coimbra, Figueira da Foz","Artigo 21.º, n.º 1, alínea b) do Código dos Contratos Públicos",,,,,,Não aplicável.,Não aplicável.,FALSE
