freguesia,acronym,validVotesPercentage,votes,dicofre
União das freguesias de Garvão e Santa Luzia,PS,40.39,103,021207
União das freguesias de Garvão e Santa Luzia,PCP-PEV,22.35,57,021207
União das freguesias de Garvão e Santa Luzia,PPD/PSD,19.22,49,021207
União das freguesias de Garvão e Santa Luzia,B.E.,6.67,17,021207
União das freguesias de Garvão e Santa Luzia,PAN,3.14,8,021207
União das freguesias de Garvão e Santa Luzia,CDS-PP,2.35,6,021207
União das freguesias de Garvão e Santa Luzia,PPM.PPV/CDC,1.96,5,021207
União das freguesias de Garvão e Santa Luzia,MAS,1.18,3,021207
União das freguesias de Garvão e Santa Luzia,L,0.78,2,021207
União das freguesias de Garvão e Santa Luzia,PDR,0.78,2,021207
União das freguesias de Garvão e Santa Luzia,A,0.39,1,021207
União das freguesias de Garvão e Santa Luzia,PCTP/MRPP,0.39,1,021207
União das freguesias de Garvão e Santa Luzia,PNR,0.39,1,021207
União das freguesias de Garvão e Santa Luzia,IL,0,0,021207
União das freguesias de Garvão e Santa Luzia,NC,0,0,021207
União das freguesias de Garvão e Santa Luzia,PTP,0,0,021207
União das freguesias de Garvão e Santa Luzia,PURP,0,0,021207
