freguesia,acronym,validVotesPercentage,votes,dicofre
Fridão,PS,45.31,140,130115
Fridão,PPD/PSD.CDS-PP,25.24,78,130115
Fridão,MPT,14.89,46,130115
Fridão,L,6.47,20,130115
Fridão,PCP-PEV,3.24,10,130115
Fridão,B.E.,0.97,3,130115
Fridão,PPM,0.97,3,130115
Fridão,PTP,0.97,3,130115
Fridão,PCTP/MRPP,0.65,2,130115
Fridão,PND,0.65,2,130115
Fridão,MAS,0.32,1,130115
Fridão,PNR,0.32,1,130115
Fridão,PAN,0,0,130115
Fridão,PDA,0,0,130115
Fridão,POUS,0,0,130115
Fridão,PPV,0,0,130115
