freguesia,acronym,validVotesPercentage,votes,dicofre
Sobral da Serra,PS,40,38,090744
Sobral da Serra,PPD/PSD,37.89,36,090744
Sobral da Serra,B.E.,5.26,5,090744
Sobral da Serra,CDS-PP,4.21,4,090744
Sobral da Serra,PCTP/MRPP,3.16,3,090744
Sobral da Serra,PTP,3.16,3,090744
Sobral da Serra,PAN,2.11,2,090744
Sobral da Serra,PCP-PEV,2.11,2,090744
Sobral da Serra,PNR,1.05,1,090744
Sobral da Serra,PPM.PPV/CDC,1.05,1,090744
Sobral da Serra,A,0,0,090744
Sobral da Serra,IL,0,0,090744
Sobral da Serra,L,0,0,090744
Sobral da Serra,MAS,0,0,090744
Sobral da Serra,NC,0,0,090744
Sobral da Serra,PDR,0,0,090744
Sobral da Serra,PURP,0,0,090744
