Objeto do Contrato,Tipo de Procedimento,Tipo(s) de Contrato,CPVs,Entidade(s) Adjudicante(s),Entidade(s) Adjudicatária(s),Preço Contratual,Data de Publicação,Data de Celebração do Contrato,Prazo de Execução,Local de Execução,Fundamentação,Data de Fecho do Contrato,Preço Total Efetivo,Causas das Alterações ao Prazo,Causas das Alterações ao Preço,Estado,N.º registo do Acordo Quadro,Descrição do Acordo Quadro,Procedimento Centralizado
F40011/2014 MEIOS DE DIAGNÓSTICO,Ajuste Direto Regime Geral,Aquisição de bens móveis,"33694000-1, Meios de diagnóstico","CHBM - Centro Hospital Barreiro Montijo, EPE (509186998)",THÉA PORTUGAL S.A (507978358),"882,37 €",31-03-2015,03-02-2014,365 dias,"Portugal, Setúbal, Barreiro","Artigo 20.º, n.º 1, alínea a) do Código dos Contratos Públicos",31-12-2014,"882,37 €","","",,Não aplicável.,Não aplicável.,FALSE
F40011/2014 - MEIO DIAG. - LABESFAL,Ajuste Direto Regime Geral,Aquisição de bens móveis,"33694000-1, Meios de diagnóstico","CHBM - Centro Hospital Barreiro Montijo, EPE (509186998)",MENARINI DIAGNÓSTICOS (502610069),"289,84 €",31-03-2015,03-02-2014,365 dias,"Portugal, Setúbal, Barreiro","Artigo 20.º, n.º 1, alínea a) do Código dos Contratos Públicos",31-12-2014,"289,84 €","","",,Não aplicável.,Não aplicável.,FALSE
F40011/2014 - MEIOS DIAGNÓSTICO - MENARINI,Ajuste Direto Regime Geral,Aquisição de bens móveis,"33694000-1, Meios de diagnóstico","CHBM - Centro Hospital Barreiro Montijo, EPE (509186998)","MENARINI DIAGNÓSTICOS, LDA (502610069)","375,84 €",31-03-2015,03-02-2014,365 dias,"Portugal, Setúbal, Barreiro","Artigo 20.º, n.º 1, alínea a) do Código dos Contratos Públicos",31-12-2014,"375,84 €","","",,Não aplicável.,Não aplicável.,FALSE
F40011/2014 - MEIOS DE DIAGNÓSTICO - LABESFAL,Ajuste Direto Regime Geral,Aquisição de bens móveis,"33694000-1, Meios de diagnóstico","CHBM - Centro Hospital Barreiro Montijo, EPE (509186998)","LABESFAL - LAB. ALMIRO, S.A (501169580)","6.591,20 €",31-03-2015,03-02-2014,365 dias,"Portugal, Setúbal, Barreiro","Artigo 20.º, n.º 1, alínea a) do Código dos Contratos Públicos",31-12-2014,"6.591,20 €","","",,Não aplicável.,Não aplicável.,FALSE
F40011/2014 - MEIOS DE DIAGNÓSTICOS - LAB. THEA,Ajuste Direto Regime Geral,Aquisição de bens móveis,"33000000-0, Equipamento médico, medicamentos e produtos para cuidados pessoais","CHBM - Centro Hospital Barreiro Montijo, EPE (509186998)","THÉA PORTUGAL, S.A. (507978358)","2.441,30 €",31-03-2015,03-02-2014,365 dias,"Portugal, Setúbal, Barreiro","Artigo 20.º, n.º 1, alínea a) do Código dos Contratos Públicos",31-12-2014,"2.441,30 €","","",,Não aplicável.,Não aplicável.,FALSE
F40011/2014 - MEIOS DE DIAGNÓSTICO LAB. ROVI,Ajuste Direto Regime Geral,Aquisição de bens móveis,"33000000-0, Equipamento médico, medicamentos e produtos para cuidados pessoais","CHBM - Centro Hospital Barreiro Montijo, EPE (509186998)","LAB. FARMACEUTICOS ROVI, S.A  (980166705)","1.400,00 €",31-03-2015,03-02-2014,365 dias,"Portugal, Setúbal, Barreiro","Artigo 20.º, n.º 1, alínea a) do Código dos Contratos Públicos",31-12-2014,"1.400,00 €","","",,Não aplicável.,Não aplicável.,FALSE
F40019/2014 - MED. CORRECT. VOL. ALT ELECTROLITICAS,Ajuste Direto Regime Geral,Aquisição de bens móveis,"33000000-0, Equipamento médico, medicamentos e produtos para cuidados pessoais","Centro Hospitalar Barreiro Montijo, E. P. E. (509186998)","FRESENIUS KABI PHARMA PORTUGAL, LDA (504293753)","13.504,66 €",31-03-2015,17-04-2014,365 dias,"Portugal, Setúbal, Barreiro","Artigo 20.º, n.º 1, alínea a) do Código dos Contratos Públicos",31-12-2014,"13.504,66 €","","",,Não aplicável.,Não aplicável.,FALSE
40020/2014 - Controlos de Qualidade Externo,Ajuste Direto Regime Geral,Aquisição de bens móveis,"33696000-5, Reagentes e meios de contraste","Centro Hospitalar Barreiro Montijo, E. P. E. (509186998)",Bio-Rad Laboratories (501301321),"2.715,00 €",31-03-2015,02-01-2014,365 dias,"Portugal, Setúbal, Barreiro","Artigo 20.º, n.º 1, alínea a) do Código dos Contratos Públicos",31-12-2014,"2.715,00 €","","",,Não aplicável.,Não aplicável.,FALSE
40020/2014 - Controlos de Qualidade Externo,Ajuste Direto Regime Geral,Aquisição de bens móveis,"33696000-5, Reagentes e meios de contraste","Centro Hospitalar Barreiro Montijo, E. P. E. (509186998)",Labquality Oy (FI01100791),"560,15 €",31-03-2015,02-01-2014,365 dias,"Portugal, Setúbal, Barreiro","Artigo 20.º, n.º 1, alínea a) do Código dos Contratos Públicos",31-12-2014,"560,15 €","","",,Não aplicável.,Não aplicável.,FALSE
40020/2014 - Controlos de Qualidade Externo,Ajuste Direto Regime Geral,Aquisição de bens móveis,"33696000-5, Reagentes e meios de contraste","Centro Hospitalar Barreiro Montijo, E. P. E. (509186998)",Biognostica (504441256),"7.743,00 €",31-03-2015,02-01-2014,365 dias,"Portugal, Setúbal, Barreiro","Artigo 20.º, n.º 1, alínea a) do Código dos Contratos Públicos",31-12-2014,"7.743,00 €","","",,Não aplicável.,Não aplicável.,FALSE
40020/2014 - Controlos de Qualidade Externo,Ajuste Direto Regime Geral,Aquisição de bens móveis,"33696000-5, Reagentes e meios de contraste","Centro Hospitalar Barreiro Montijo, E. P. E. (509186998)",Instituto Nacional de Saude Dr. Ricardo Jorge  (501427511),"880,00 €",31-03-2015,02-01-2014,365 dias,"Portugal, Setúbal, Barreiro","Artigo 20.º, n.º 1, alínea a) do Código dos Contratos Públicos",31-12-2014,"880,00 €","","",,Não aplicável.,Não aplicável.,FALSE
40020/2014 - Controlos de Qualidade Externo,Ajuste Direto Regime Geral,Aquisição de bens móveis,"33696000-5, Reagentes e meios de contraste","Centro Hospitalar Barreiro Montijo, E. P. E. (509186998)",Irlandox (502515619),"275,00 €",31-03-2015,02-01-2014,365 dias,"Portugal, Setúbal, Barreiro","Artigo 20.º, n.º 1, alínea a) do Código dos Contratos Públicos",31-12-2014,"275,00 €","","",,Não aplicável.,Não aplicável.,FALSE
"FEXC0001/2014 - VÁRIOS MEDICAMENTOS LAB. ATRAL, SA",Ajuste Direto Regime Geral,Aquisição de bens móveis,"33000000-0, Equipamento médico, medicamentos e produtos para cuidados pessoais","Centro Hospitalar Barreiro Montijo, E. P. E. (509186998)","LAB. ATRAL, SA (500162085)","20.781,60 €",31-03-2015,17-03-2014,365 dias,"Portugal, Setúbal, Barreiro","Artigo 24.º, n.º 1, alínea e) do Código dos Contratos Públicos",31-12-2014,"20.781,60 €","","",,Não aplicável.,Não aplicável.,FALSE
4D0486/2014 - CK MB Enzimatico,Ajuste Direto Regime Geral,Aquisição de bens móveis,"33696000-5, Reagentes e meios de contraste","Centro Hospitalar Barreiro Montijo, E. P. E. (509186998)",Abbott Laboratorios (500006148),"5.000,00 €",31-03-2015,06-05-2014,150 dias,"Portugal, Setúbal, Barreiro","Artigo 20.º, n.º 1, alínea a) do Código dos Contratos Públicos",31-12-2014,"5.000,00 €","","",,Não aplicável.,Não aplicável.,FALSE
40065/2014 - Doseamento C3;C4;IGA e IGG ,Ajuste Direto Regime Geral,Aquisição de bens móveis,"33696000-5, Reagentes e meios de contraste","Centro Hospitalar Barreiro Montijo, E. P. E. (509186998)",Abbott Laboratórios (500006148),"6.038,51 €",31-03-2015,24-11-2014,30 dias,"Portugal, Setúbal, Barreiro","Artigo 20.º, n.º 1, alínea a) do Código dos Contratos Públicos",24-11-2014,"6.038,51 €","","",,Não aplicável.,Não aplicável.,FALSE
"FEXC0005/2014 - MEDICAMENTOS ROCHE FARMACEUTICA, LDA",Ajuste Direto Regime Geral,Aquisição de bens móveis,"33000000-0, Equipamento médico, medicamentos e produtos para cuidados pessoais","Centro Hospitalar Barreiro Montijo, E. P. E. (509186998)"," LAB. ROCHE FARMACEUTICA QUIMICA, LDA (500233810)","11.569,88 €",31-03-2015,26-03-2014,365 dias,"Portugal, Setúbal, Barreiro","Artigo 24.º, n.º 1, alínea e) do Código dos Contratos Públicos",31-12-2014,"11.569,88 €","","",,Não aplicável.,Não aplicável.,FALSE
40067/2014 - Mioglobina e Ferritina,Ajuste Direto Regime Geral,Aquisição de bens móveis,"33696000-5, Reagentes e meios de contraste","Centro Hospitalar Barreiro Montijo, E. P. E. (509186998)",Abbott Laboratórios (500006148),"6.259,00 €",31-03-2015,24-11-2014,30 dias,"Portugal, Setúbal, Barreiro","Artigo 20.º, n.º 1, alínea a) do Código dos Contratos Públicos",31-12-2014,"6.259,00 €","","",,Não aplicável.,Não aplicável.,FALSE
410002/2014 - Doseamento C3;C4;IGA e IGG,Ajuste Direto Regime Geral,Aquisição de bens móveis,"33696000-5, Reagentes e meios de contraste","Centro Hospitalar Barreiro Montijo, E. P. E. (509186998)",Abbott Laboratorios (500006148),"9.300,98 €",31-03-2015,07-11-2014,30 dias,"Portugal, Setúbal, Barreiro","Artigo 20.º, n.º 1, alínea a) do Código dos Contratos Públicos",31-12-2014,"9.300,98 €","","",,Não aplicável.,Não aplicável.,FALSE
FEXC0006/2014 - MEDICAMENTOS MEDIREX PHARMA LDA,Ajuste Direto Regime Geral,Aquisição de bens móveis,"33000000-0, Equipamento médico, medicamentos e produtos para cuidados pessoais","Centro Hospitalar Barreiro Montijo, E. P. E. (509186998)",MEDIREX PHARMA LDA (507026004),"9.960,00 €",31-03-2015,21-01-2014,365 dias,"Portugal, Setúbal, Barreiro","Artigo 24.º, n.º 1, alínea e) do Código dos Contratos Públicos",31-12-2014,"9.960,00 €","","",,Não aplicável.,Não aplicável.,FALSE
FEXC0008/2014 - MEDICAMENTOS PIERRE FABRE,Ajuste Direto Regime Geral,Aquisição de bens móveis,"33000000-0, Equipamento médico, medicamentos e produtos para cuidados pessoais","Centro Hospitalar Barreiro Montijo, E. P. E. (509186998)"," PIERRE FABRE MEDICAMENT PORTUGAL, LDA (500230366)","55.935,00 €",31-03-2015,17-03-2014,365 dias,"Portugal, Setúbal, Barreiro","Artigo 24.º, n.º 1, alínea e) do Código dos Contratos Públicos",31-12-2014,"55.935,00 €","","",,Não aplicável.,Não aplicável.,FALSE
40025/2014 - Hemoglobinas e Electroforeses,Ajuste Direto Regime Geral,Aquisição de bens móveis,"33696500-0, Reagentes de laboratório","Centro Hospitalar Barreiro Montijo, E. P. E. (509186998)","Quilaban, S.A.  (500399670)","191,36 €",31-03-2015,04-02-2014,365 dias,"Portugal, Setúbal, Barreiro","Artigo 20.º, n.º 1, alínea a) do Código dos Contratos Públicos",31-12-2014,"","",Não houve necessidade de adquirir o previsto,,Não aplicável.,Não aplicável.,FALSE
40025/2014 - Hemoglobinas e Eletroforeses,Ajuste Direto Regime Geral,Aquisição de bens móveis,"33696500-0, Reagentes de laboratório","Centro Hospitalar Barreiro Montijo, E. P. E. (509186998)",Menarini Diagnosticos (502610069),"6.960,00 €",31-03-2015,04-02-2014,365 dias,"Portugal, Setúbal, Barreiro","Artigo 20.º, n.º 1, alínea a) do Código dos Contratos Públicos",31-12-2014,"5.655,00 €","",Necessidade inferior ao previsto,,Não aplicável.,Não aplicável.,FALSE
40025/2014 - Hemoglobinas e Eletroforeses,Ajuste Direto Regime Geral,Aquisição de bens móveis,"33696500-0, Reagentes de laboratório","Centro Hospitalar Barreiro Montijo, E. P. E. (509186998)",Siemens Healthcare (507925173),"960,00 €",31-03-2015,04-02-2014,365 dias,"Portugal, Setúbal, Barreiro","Artigo 20.º, n.º 1, alínea a) do Código dos Contratos Públicos",31-12-2014,"1.440,00 €","",Necessidade superior ao previsto,,Não aplicável.,Não aplicável.,FALSE
FEXC0009/2014 - MEDICAMENTOS OLYMPUS IBERIA,Ajuste Direto Regime Geral,Aquisição de bens móveis,"33000000-0, Equipamento médico, medicamentos e produtos para cuidados pessoais","Centro Hospitalar Barreiro Montijo, E. P. E. (509186998)",OLYMPUS IBERIA (980474710),"26.144,34 €",31-03-2015,17-03-2014,365 dias,"Portugal, Setúbal, Barreiro","Artigo 24.º, n.º 1, alínea e) do Código dos Contratos Públicos",31-12-2014,"26.144,34 €","","",,Não aplicável.,Não aplicável.,FALSE
40025/2014 - Hemoglobinas e Electroforeses,Ajuste Direto Regime Geral,Aquisição de bens móveis,"33696500-0, Reagentes de laboratório","Centro Hospitalar Barreiro Montijo, E. P. E. (509186998)",Grifols Portugal (502041285),"1.050,00 €",31-03-2015,04-02-2014,365 dias,"Portugal, Setúbal, Barreiro","Artigo 20.º, n.º 1, alínea a) do Código dos Contratos Públicos",31-12-2014,"560,00 €","",Necessidade inferior ao previsto,,Não aplicável.,Não aplicável.,FALSE
40025/2014 - Hemoglobinas e Electroforeses,Ajuste Direto Regime Geral,Aquisição de bens móveis,"33696500-0, Reagentes de laboratório","Centro Hospitalar Barreiro Montijo, E. P. E. (509186998)",Bioportugal Quimico Farmaceutico (502380543),"220,00 €",31-03-2015,04-02-2014,365 dias,"Portugal, Setúbal, Barreiro","Artigo 20.º, n.º 1, alínea a) do Código dos Contratos Públicos",31-12-2014,"660,00 €","",Necessidade superior ao previsto,,Não aplicável.,Não aplicável.,FALSE
40041/2014 - Subclasses e Cadeias Kappa e Lambda,Ajuste Direto Regime Geral,Aquisição de bens móveis,"33696500-0, Reagentes de laboratório","Centro Hospitalar Barreiro Montijo, E. P. E. (509186998)",Beckman Coulter (509035167),"19.924,04 €",31-03-2015,25-02-2014,365 dias,"Portugal, Setúbal, Barreiro","Artigo 20.º, n.º 1, alínea a) do Código dos Contratos Públicos",31-12-2014,"15.686,20 €","",Necessidade inferior ao previsto,,Não aplicável.,Não aplicável.,FALSE
40038/2014 - Reagentes p/ patologia Clinica,Ajuste Direto Regime Geral,Aquisição de bens móveis,"33696500-0, Reagentes de laboratório","Centro Hospitalar Barreiro Montijo, E. P. E. (509186998)",Menarini Diagnosticos (502610069),"12.528,00 €",31-03-2015,28-02-2014,365 dias,"Portugal, Setúbal, Barreiro","Artigo 20.º, n.º 1, alínea a) do Código dos Contratos Públicos",31-12-2014,"12.888,00 €","",Necessidade superior ao previsto,,Não aplicável.,Não aplicável.,FALSE
FEXC0017/2014 - MEDICAMENTOS  LAB. VITÓRIA,Ajuste Direto Regime Geral,Aquisição de bens móveis,"33000000-0, Equipamento médico, medicamentos e produtos para cuidados pessoais","Centro Hospitalar Barreiro Montijo, E. P. E. (509186998)"," LAB. VITÓRIA, S.A (500162220)","5.537,90 €",31-03-2015,21-01-2014,365 dias,"Portugal, Setúbal, Barreiro","Artigo 24.º, n.º 1, alínea e) do Código dos Contratos Públicos",31-12-2014,"5.537,90 €","","",,Não aplicável.,Não aplicável.,FALSE
40038/2014 - Reagentes p/ Patologia Clinica,Ajuste Direto Regime Geral,Aquisição de bens móveis,"33696500-0, Reagentes de laboratório","Centro Hospitalar Barreiro Montijo, E. P. E. (509186998)",Phadia Sociedade Unipessoal (506916243),"12.110,98 €",31-03-2015,28-02-2014,365 dias,"Portugal, Setúbal, Barreiro","Artigo 20.º, n.º 1, alínea a) do Código dos Contratos Públicos",31-12-2014,"12.976,05 €","",Necsssidade superior ao previsto,,Não aplicável.,Não aplicável.,FALSE
FEXC0018/2014 - VÁRIOS MEDICAMENTOS LAB. NOVARTIS FARMA,Ajuste Direto Regime Geral,Aquisição de bens móveis,"33000000-0, Equipamento médico, medicamentos e produtos para cuidados pessoais","Centro Hospitalar Barreiro Montijo, E. P. E. (509186998)",LAB. NOVARTIS FARMA (500063524),"47.206,05 €",31-03-2015,14-03-2014,365 dias,"Portugal, Setúbal, Barreiro","Artigo 24.º, n.º 1, alínea e) do Código dos Contratos Públicos",31-12-2014,"47.206,05 €","","",,Não aplicável.,Não aplicável.,FALSE
4CM0021/2014 - Reagentes p/ Imunohemoterapia,Ajuste Direto Regime Geral,Aquisição de bens móveis,"33696000-5, Reagentes e meios de contraste","Centro Hospitalar Barreiro Montijo, E. P. E. (509186998)","Diamed Portuguesa, S.A. (501675809)","28.149,17 €",31-03-2015,14-01-2014,365 dias,"Portugal, Setúbal, Barreiro","Artigo 26.º, n.º 1, alínea a) do Código dos Contratos Públicos",31-12-2014,"21.643,90 €","",Necessidade inferior ao adjudicado,,Não aplicável.,Não aplicável.,FALSE
4CM0021/2014 - Reagentes p/ Imunohemoterapia,Ajuste Direto Regime Geral,Aquisição de bens móveis,"33696000-5, Reagentes e meios de contraste","Centro Hospitalar Barreiro Montijo, E. P. E. (509186998)",Johnson e Johnson (500153370),"33.703,58 €",31-03-2015,14-01-2014,365 dias,"Portugal, Setúbal, Barreiro","Artigo 26.º, n.º 1, alínea a) do Código dos Contratos Públicos",31-12-2014,"33.875,36 €","",Necessidade superior à previsão,,Não aplicável.,Não aplicável.,FALSE
4CM0021/2014 - Reagentes p/ Imunohemoterapia,Ajuste Direto Regime Geral,Aquisição de bens móveis,"33696000-5, Reagentes e meios de contraste","Centro Hospitalar Barreiro Montijo, E. P. E. (509186998)",Menarini Diagnosticos Ldª (502610069),"2.378,28 €",31-03-2015,02-01-2014,365 dias,"Portugal, Setúbal, Barreiro","Artigo 26.º, n.º 1, alínea a) do Código dos Contratos Públicos",31-12-2014,"990,95 €","",Necessidade inferior ao previsto,,Não aplicável.,Não aplicável.,FALSE
40012-2014 MATERIAL DE PROTEÇAO,Ajuste Direto Regime Geral,Aquisição de bens móveis,"33190000-8, Dispositivos e produtos médicos variados","CHBM - Centro Hospital Barreiro Montijo, EPE (509186998)","AVIQUIMICA-IMPORT. E MANUF., L (500039720)","5.207,86 €",31-03-2015,24-02-2014,365 dias,"Portugal, Setúbal, Barreiro","Artigo 20.º, n.º 1, alínea a) do Código dos Contratos Públicos",31-12-2014,"1.505,15 €","",POR MOTIVOS TECNICOS NAO E POSSIVEL INSERIR OS OUTROS CONTRATOS,,Não aplicável.,Não aplicável.,FALSE
FEXC0019/2014 - VÁRIOS MEDICAMENTOS,Ajuste Direto Regime Geral,Aquisição de bens móveis,"33000000-0, Equipamento médico, medicamentos e produtos para cuidados pessoais","Centro Hospitalar Barreiro Montijo, E. P. E. (509186998)",ORION PHARMA (508907365),"7.453,72 €",31-03-2015,07-01-2014,365 dias,"Portugal, Setúbal, Barreiro","Artigo 24.º, n.º 1, alínea e) do Código dos Contratos Públicos",31-12-2014,"7.453,72 €","","",,Não aplicável.,Não aplicável.,FALSE
4CM0021/2014 - Reagentes p/ Imunohemoterapia,Ajuste Direto Regime Geral,Aquisição de bens móveis,"33696000-5, Reagentes e meios de contraste","Centro Hospitalar Barreiro Montijo, E. P. E. (509186998)",Izasa Portugal (501086110),"5.100,00 €",31-03-2015,02-01-2014,365 dias,"Portugal, Setúbal, Barreiro","Artigo 26.º, n.º 1, alínea a) do Código dos Contratos Públicos",31-12-2014,"3.850,00 €","",Necessidade inferior ao previsto,,Não aplicável.,Não aplicável.,FALSE
"FEXC0021/2014 - MEDICAMENTOS JABA RECORDATI, SA",Ajuste Direto Regime Geral,Aquisição de bens móveis,"33000000-0, Equipamento médico, medicamentos e produtos para cuidados pessoais","Centro Hospitalar Barreiro Montijo, E. P. E. (509186998)","JABA RECORDATI, S.A. (500492867)","8.022,48 €",31-03-2015,10-01-2014,365 dias,"Portugal, Setúbal, Barreiro","Artigo 24.º, n.º 1, alínea e) do Código dos Contratos Públicos",31-12-2014,"8.022,48 €","","",,Não aplicável.,Não aplicável.,FALSE
FEXC0023/2014 - FOSFATO DISSODICO E MONOSSODICO,Ajuste Direto Regime Geral,Aquisição de bens móveis,"33000000-0, Equipamento médico, medicamentos e produtos para cuidados pessoais","Centro Hospitalar Barreiro Montijo, E. P. E. (509186998)",LAB. CASEN (508538521),"8.400,00 €",31-03-2015,08-01-2014,365 dias,"Portugal, Setúbal, Barreiro","Artigo 24.º, n.º 1, alínea e) do Código dos Contratos Públicos",31-12-2014,"8.400,00 €","","",,Não aplicável.,Não aplicável.,FALSE
40017/2014 DM Drenagem,Ajuste Direto Regime Geral,Aquisição de bens móveis,"33141000-0, Material médico não químico descartável e produtos hematológicos","CHBM - Centro Hospital Barreiro Montijo, EPE (509186998)","B. BRAUN MEDICAL, LDA (501506543)","8.085,00 €",31-03-2015,05-03-2014,365 dias,"Portugal, Setúbal, Barreiro","Artigo 20.º, n.º 1, alínea a) do Código dos Contratos Públicos",31-12-2014,"7.100,27 €","",por motivos técnicos não é possível inserir outro contratos,,Não aplicável.,Não aplicável.,FALSE
40015-2014 DM P CITOPATOLOGIA E HISTOPATOLAGIA,Ajuste Direto Regime Geral,Aquisição de bens móveis,"33141000-0, Material médico não químico descartável e produtos hematológicos","CHBM - Centro Hospital Barreiro Montijo, EPE (509186998)",GARAL-GABIN. TECN. COMERCIAL-L (500777314),"5.436,10 €",31-03-2015,08-04-2014,365 dias,"Portugal, Setúbal, Barreiro","Artigo 20.º, n.º 1, alínea a) do Código dos Contratos Públicos",31-12-2014,"5.436,10 €","","",,Não aplicável.,Não aplicável.,FALSE
40013/2014 DM Laboratório,Ajuste Direto Regime Geral,Aquisição de bens móveis,"33190000-8, Dispositivos e produtos médicos variados","CHBM - Centro Hospital Barreiro Montijo, EPE (509186998)","SARSTEDT - TECNOLOGIA LABORATORIOS, S.A. (503019461)","16.022,85 €",31-03-2015,17-02-2014,365 dias,"Portugal, Setúbal, Barreiro","Artigo 20.º, n.º 1, alínea a) do Código dos Contratos Públicos",31-12-2014,"16.128,78 €","",por motivos técnico não é possível inserir os outros contratos,,Não aplicável.,Não aplicável.,FALSE
40008-2014 DM P ELECTROMEDICINA,Ajuste Direto Regime Geral,Aquisição de bens móveis,"33124110-9, Sistemas de diagnóstico","CHBM - Centro Hospital Barreiro Montijo, EPE (509186998)","MEDINFAR SOROLOGICO, SA (501197052)","11.395,40 €",31-03-2015,05-03-2014,365 dias,"Portugal, Setúbal, Barreiro","Artigo 20.º, n.º 1, alínea a) do Código dos Contratos Públicos",31-12-2014,"11.395,40 €","","",,Não aplicável.,Não aplicável.,FALSE
"FEXC0024/2014 - MEDICAMENTOS MERCK, S.A",Ajuste Direto Regime Geral,Aquisição de bens móveis,"33000000-0, Equipamento médico, medicamentos e produtos para cuidados pessoais","Centro Hospitalar Barreiro Montijo, E. P. E. (509186998)",MERCK S.A. (500650870),"12.112,02 €",31-03-2015,13-03-2014,365 dias,"Portugal, Setúbal, Barreiro","Artigo 24.º, n.º 1, alínea e) do Código dos Contratos Públicos",31-12-2014,"12.112,02 €","","",,Não aplicável.,Não aplicável.,FALSE
FEXC0025/2014 - MEDICAMENTOS JOHNSON & JOHNSON,Ajuste Direto Regime Geral,Aquisição de bens móveis,"33000000-0, Equipamento médico, medicamentos e produtos para cuidados pessoais","Centro Hospitalar Barreiro Montijo, E. P. E. (509186998)",JOHNSON & JOHNSON (500153370),"6.161,12 €",31-03-2015,21-01-2014,365 dias,"Portugal, Setúbal, Barreiro","Artigo 24.º, n.º 1, alínea e) do Código dos Contratos Públicos",31-12-2014,"6.161,12 €","","",,Não aplicável.,Não aplicável.,FALSE
40001/2014 - Reagentes p/ Sistemas Det. Imunocitoquímica,Ajuste Direto Regime Geral,Aquisição de bens móveis,"33696500-0, Reagentes de laboratório","Centro Hospitalar Barreiro Montijo, E. P. E. (509186998)",Roche Sistemas de Diagnosticos (504282921),"24.500,00 €",31-03-2015,22-01-2014,365 dias,"Portugal, Setúbal, Barreiro","Artigo 20.º, n.º 1, alínea a) do Código dos Contratos Públicos",31-12-2014,"35.000,00 €","",Necessidade superior à previsão,,Não aplicável.,Não aplicável.,FALSE
FEXC0026/2014 - MEDICAMENTOS LAB. PFIZER,Ajuste Direto Regime Geral,Aquisição de bens móveis,"33000000-0, Equipamento médico, medicamentos e produtos para cuidados pessoais","Centro Hospitalar Barreiro Montijo, E. P. E. (509186998)",LAB. PFIZER (500162166),"8.252,67 €",31-03-2015,09-01-2014,365 dias,"Portugal, Setúbal, Barreiro","Artigo 24.º, n.º 1, alínea e) do Código dos Contratos Públicos",31-12-2014,"8.252,67 €","","",,Não aplicável.,Não aplicável.,FALSE
40014/2014 Dispositivos médicos para Cardiologia,Ajuste Direto Regime Geral,Aquisição de bens móveis,"33141200-2, Cateteres","CHBM - Centro Hospital Barreiro Montijo, EPE (509186998)","CLINIFAR - PROD. CLINICOS E FARMACEUTICOS, S.A. (503281115)","7.635,00 €",31-03-2015,24-12-2014,365 dias,"Portugal, Setúbal, Barreiro","Artigo 20.º, n.º 1, alínea a) do Código dos Contratos Públicos",31-12-2014,"2.634,21 €","",por questões técnicas não é possível inserir outro contratos,,Não aplicável.,Não aplicável.,FALSE
40010-2014 OBSTETRICIA GINECOLOGIA,Ajuste Direto Regime Geral,Aquisição de bens móveis,"33140000-3, Material médico de consumo","CHBM - Centro Hospital Barreiro Montijo, EPE (509186998)","SPECULUM ARTIGOS MÉDICOS, LDA. (502996323)","13.487,50 €",31-03-2015,28-02-2014,365 dias,"Portugal, Setúbal, Barreiro","Artigo 20.º, n.º 1, alínea a) do Código dos Contratos Públicos",31-12-2014,"11.704,00 €","",POR  REDUÇAO DE CONSUMOS,,Não aplicável.,Não aplicável.,FALSE
4EXC0024/2014 - Diversos Soros p/ Anatomia Patológica,Ajuste Direto Regime Geral,Aquisição de bens móveis,"33696500-0, Reagentes de laboratório","Centro Hospitalar Barreiro Montijo, E. P. E. (509186998)",Roche Sistemas de Diagnosticos (504282921),"47.885,00 €",31-03-2015,20-02-2014,365 dias,"Portugal, Setúbal, Barreiro","Artigo 20.º, n.º 1, alínea a) do Código dos Contratos Públicos",31-12-2014,"47.865,00 €","",Necessidade inferior ao adjudicado,,Não aplicável.,Não aplicável.,FALSE
FEXC0027/2014 - MEDICAMENTOS LABESFAL,Ajuste Direto Regime Geral,Aquisição de bens móveis,"33000000-0, Equipamento médico, medicamentos e produtos para cuidados pessoais","Centro Hospitalar Barreiro Montijo, E. P. E. (509186998)",LABESFAL (501169580),"17.781,50 €",31-03-2015,14-03-2014,365 dias,"Portugal, Setúbal, Barreiro","Artigo 24.º, n.º 1, alínea e) do Código dos Contratos Públicos",31-12-2014,"17.781,50 €","","",,Não aplicável.,Não aplicável.,FALSE
40006/2014 Material de penso,Ajuste Direto Regime Geral,Aquisição de bens móveis,"33141126-9, Ligaduras","CHBM - Centro Hospital Barreiro Montijo, EPE (509186998)","SMITH & NEPHEW - PROD. FARMACEUTICOS, LDA. (503552461)","8.855,66 €",31-03-2015,17-02-2014,365 dias,"Portugal, Setúbal, Barreiro","Artigo 20.º, n.º 1, alínea a) do Código dos Contratos Públicos",31-12-2014,"8.855,66 €","","",,Não aplicável.,Não aplicável.,FALSE
40002-2014 CAMPOS CIRURGICOS,Ajuste Direto Regime Geral,Aquisição de bens móveis,"33140000-3, Material médico de consumo","CHBM - Centro Hospital Barreiro Montijo, EPE (509186998)","OASIPOR - IMPORT. E EXPORT., SA (502260750)","59.797,52 €",31-03-2015,24-02-2014,365 dias,"Portugal, Setúbal, Barreiro","Artigo 20.º, n.º 1, alínea a) do Código dos Contratos Públicos",31-12-2014,"22.158,55 €","",POR QUESTOES TECNICAS NAO SE CONSEGUE ANEXAR OS OUTROS CONTRATOS,,Não aplicável.,Não aplicável.,FALSE
FEXC0029/2014 - BEXAROTENO 75 MG,Ajuste Direto Regime Geral,Aquisição de bens móveis,"33000000-0, Equipamento médico, medicamentos e produtos para cuidados pessoais","Centro Hospitalar Barreiro Montijo, E. P. E. (509186998)",EISAI FARMACEUTICA (507847660),"22.831,25 €",31-03-2015,26-03-2014,365 dias,"Portugal, Setúbal, Barreiro","Artigo 24.º, n.º 1, alínea e) do Código dos Contratos Públicos",31-12-2014,"22.831,25 €","","",,Não aplicável.,Não aplicável.,FALSE
40019-2015 AGULHAS CATETERES E SERINGAS,Ajuste Direto Regime Geral,Aquisição de bens móveis,"33141000-0, Material médico não químico descartável e produtos hematológicos","CHBM - Centro Hospital Barreiro Montijo, EPE (509186998)","SMITHS MEDICAL, LDA (507445937)","17.642,50 €",31-03-2015,01-04-2014,365 dias,"Portugal, Setúbal, Barreiro","Artigo 20.º, n.º 1, alínea a) do Código dos Contratos Públicos",31-12-2014,"17.642,50 €","","",,Não aplicável.,Não aplicável.,FALSE
"40003/2014 Fornecimento de sacos de sangue ao CHBM, EPE",Ajuste Direto Regime Geral,Aquisição de bens móveis,"33000000-0, Equipamento médico, medicamentos e produtos para cuidados pessoais","CHBM - Centro Hospital Barreiro Montijo, EPE (509186998)","FRESENIUS KABI PHARMA PORTUGAL, LDA. (504293753)","50.027,76 €",31-03-2015,28-01-2014,365 dias,"Portugal, Setúbal, Barreiro","Artigo 20.º, n.º 1, alínea a) do Código dos Contratos Públicos",31-12-2014,"32.918,67 €","",redução de consumos,,Não aplicável.,Não aplicável.,FALSE
4CM0027/2014 - Reagentes p/ Microbiologia,Ajuste Direto Regime Geral,Aquisição de bens móveis,"33696000-5, Reagentes e meios de contraste","Centro Hospitalar Barreiro Montijo, E. P. E. (509186998)",Biomerieux Portugal (501524177),"49.513,69 €",31-03-2015,20-01-2014,365 dias,"Portugal, Setúbal, Barreiro","Artigo 26.º, n.º 1, alínea a) do Código dos Contratos Públicos",31-12-2014,"49.513,69 €","","",,Não aplicável.,Não aplicável.,FALSE
4CM0027/2014 - Reagentes p/ Microbiologia,Ajuste Direto Regime Geral,Aquisição de bens móveis,"33696000-5, Reagentes e meios de contraste","Centro Hospitalar Barreiro Montijo, E. P. E. (509186998)",Alere Ldª (502518863),"330,00 €",31-03-2015,20-01-2014,365 dias,"Portugal, Setúbal, Barreiro","Artigo 26.º, n.º 1, alínea a) do Código dos Contratos Públicos",31-12-2014,"330,00 €","","",,Não aplicável.,Não aplicável.,FALSE
4CM0027/2014 - Reagentes p/ Microbiologia,Ajuste Direto Regime Geral,Aquisição de bens móveis,"33696000-5, Reagentes e meios de contraste","Centro Hospitalar Barreiro Montijo, E. P. E. (509186998)",Quilaban  (500399670),"2.691,40 €",31-03-2015,20-01-2014,365 dias,"Portugal, Setúbal, Barreiro","Artigo 26.º, n.º 1, alínea a) do Código dos Contratos Públicos",31-12-2014,"2.691,40 €","","",,Não aplicável.,Não aplicável.,FALSE
4CM0027/2014 - Reagentes p/ Microbiologia,Ajuste Direto Regime Geral,Aquisição de bens móveis,"33696000-5, Reagentes e meios de contraste","Centro Hospitalar Barreiro Montijo, E. P. E. (509186998)",Biogerm Laboratórios (503265390),"3.738,25 €",31-03-2015,20-01-2014,365 dias,"Portugal, Setúbal, Barreiro","Artigo 26.º, n.º 1, alínea a) do Código dos Contratos Públicos",31-12-2014,"3.738,25 €","","",,Não aplicável.,Não aplicável.,FALSE
4CM0027/2014 - Reagentes p/ Microbiologia,Ajuste Direto Regime Geral,Aquisição de bens móveis,"33696000-5, Reagentes e meios de contraste","Centro Hospitalar Barreiro Montijo, E. P. E. (509186998)",Werfen Portugal (501086110),"99,90 €",31-03-2015,20-01-2014,365 dias,"Portugal, Setúbal, Barreiro","Artigo 26.º, n.º 1, alínea a) do Código dos Contratos Públicos",31-12-2014,"99,90 €","","",,Não aplicável.,Não aplicável.,FALSE
40007/2014 Material de entubação,Ajuste Direto Regime Geral,Aquisição de bens móveis,"33141641-5, Sondas","CHBM - Centro Hospital Barreiro Montijo, EPE (509186998)",CAREFUSION PORTUGAL 332 (503898554),"3.978,00 €",31-03-2015,15-04-2014,365 dias,"Portugal, Setúbal, Barreiro","Artigo 20.º, n.º 1, alínea a) do Código dos Contratos Públicos",31-12-2014,"3.978,00 €","",redução de consumos,,Não aplicável.,Não aplicável.,FALSE
4CM0027/2014 - Reagentes p/ Mibrobiologia,Ajuste Direto Regime Geral,Aquisição de bens móveis,"33696000-5, Reagentes e meios de contraste","Centro Hospitalar Barreiro Montijo, E. P. E. (509186998)",Bio-Rad (501301321),"7.022,60 €",31-03-2015,20-01-2014,365 dias,"Portugal, Setúbal, Barreiro","Artigo 26.º, n.º 1, alínea a) do Código dos Contratos Públicos",31-12-2014,"7.022,60 €","","",,Não aplicável.,Não aplicável.,FALSE
40005-2014 SUTURAS,Ajuste Direto Regime Geral,Aquisição de bens móveis,"33141121-4, Suturas cirúrgicas","CHBM - Centro Hospital Barreiro Montijo, EPE (509186998)","B. BRAUN MEDICAL, LDA (501506543)","23.381,40 €",31-03-2015,07-04-2014,365 dias,"Portugal, Setúbal, Barreiro","Artigo 20.º, n.º 1, alínea a) do Código dos Contratos Públicos",31-12-2014,"23.381,40 €","","",,Não aplicável.,Não aplicável.,FALSE
4CM0027/2014 - Reagentes p/ Microbiologia,Ajuste Direto Regime Geral,Aquisição de bens móveis,"33696000-5, Reagentes e meios de contraste","Centro Hospitalar Barreiro Montijo, E. P. E. (509186998)",Iberlab e Imunoreage (503406694),"1.120,37 €",31-03-2015,20-01-2014,365 dias,"Portugal, Setúbal, Barreiro","Artigo 26.º, n.º 1, alínea a) do Código dos Contratos Públicos",31-12-2014,"1.120,37 €","","",,Não aplicável.,Não aplicável.,FALSE
4CM0027/2014 - Reagentes p/ Microbiologia,Ajuste Direto Regime Geral,Aquisição de bens móveis,"33696000-5, Reagentes e meios de contraste","Centro Hospitalar Barreiro Montijo, E. P. E. (509186998)",VWR International (503842770),"816,72 €",31-03-2015,20-01-2014,365 dias,"Portugal, Setúbal, Barreiro","Artigo 26.º, n.º 1, alínea a) do Código dos Contratos Públicos",31-12-2014,"816,72 €","","",,Não aplicável.,Não aplicável.,FALSE
4CM0027/2014 - Reagentes p/ Microbiologia,Ajuste Direto Regime Geral,Aquisição de bens móveis,"33696000-5, Reagentes e meios de contraste","Centro Hospitalar Barreiro Montijo, E. P. E. (509186998)",Fisher Scientific (506429210),"11.057,61 €",31-03-2015,20-01-2014,365 dias,"Portugal, Setúbal, Barreiro","Artigo 26.º, n.º 1, alínea a) do Código dos Contratos Públicos",31-12-2014,"11.057,61 €","","",,Não aplicável.,Não aplicável.,FALSE
4CM0028/2014 - Reagentes p/ Alergologia/Infecciologia,Ajuste Direto Regime Geral,Aquisição de bens móveis,"33696000-5, Reagentes e meios de contraste","Centro Hospitalar Barreiro Montijo, E. P. E. (509186998)",Bio-Rad Laboratories (501301321),"10.573,00 €",31-03-2015,20-01-2014,365 dias,"Portugal, Setúbal, Barreiro","Artigo 26.º, n.º 1, alínea a) do Código dos Contratos Públicos",31-12-2014,"10.573,00 €","","",,Não aplicável.,Não aplicável.,FALSE
FEXC0031/2014 - MEDICAMENTOS GILEAD,Ajuste Direto Regime Geral,Aquisição de bens móveis,"33000000-0, Equipamento médico, medicamentos e produtos para cuidados pessoais","Centro Hospitalar Barreiro Montijo, E. P. E. (509186998)",GILEAD SCIENCES (503604704),"214.772,55 €",31-03-2015,10-02-2014,365 dias,"Portugal, Setúbal, Barreiro","Artigo 24.º, n.º 1, alínea e) do Código dos Contratos Públicos",31-12-2014,"214.772,55 €","","",,Não aplicável.,Não aplicável.,FALSE
4CM0028/2014 - Reagentes p/ Alergologia Infecciologia,Ajuste Direto Regime Geral,Aquisição de bens móveis,"33696000-5, Reagentes e meios de contraste","Centro Hospitalar Barreiro Montijo, E. P. E. (509186998)",Isoder Isotopos e Derivados (502241594),"26.499,84 €",31-03-2015,20-01-2014,365 dias,"Portugal, Setúbal, Barreiro","Artigo 26.º, n.º 1, alínea a) do Código dos Contratos Públicos",31-12-2014,"26.499,84 €","","",,Não aplicável.,Não aplicável.,FALSE
4CM0028/2014 - Reagentes p/ Alergologia/Infecciologia,Ajuste Direto Regime Geral,Aquisição de bens móveis,"33696000-5, Reagentes e meios de contraste","Centro Hospitalar Barreiro Montijo, E. P. E. (509186998)",Siemens Healthcare (507925173),"40.711,68 €",31-03-2015,21-01-2014,365 dias,"Portugal, Setúbal, Barreiro","Artigo 26.º, n.º 1, alínea a) do Código dos Contratos Públicos",31-12-2014,"40.711,68 €","","",,Não aplicável.,Não aplicável.,FALSE
4CM0028/2014 - Reagentes p/ Alergologia/Infecciologia,Ajuste Direto Regime Geral,Aquisição de bens móveis,"33696000-5, Reagentes e meios de contraste","Centro Hospitalar Barreiro Montijo, E. P. E. (509186998)",Abbott Laboratórios (500006148),"27.380,00 €",31-03-2015,21-01-2014,365 dias,"Portugal, Setúbal, Barreiro","Artigo 26.º, n.º 1, alínea a) do Código dos Contratos Públicos",31-12-2014,"27.380,00 €","","",,Não aplicável.,Não aplicável.,FALSE
FEXC0034/2014 - MEDICAMENTOS GAMBRO,Ajuste Direto Regime Geral,Aquisição de bens móveis,"33000000-0, Equipamento médico, medicamentos e produtos para cuidados pessoais","Centro Hospitalar Barreiro Montijo, E. P. E. (509186998)",GAMBRO (980367751),"72.772,80 €",31-03-2015,14-03-2014,365 dias,"Portugal, Setúbal, Barreiro","Artigo 24.º, n.º 1, alínea e) do Código dos Contratos Públicos",31-12-2014,"72.772,80 €","","",,Não aplicável.,Não aplicável.,FALSE
FEXC0037/2014 HIALURONATO CALCIO 15 MG + LIDOCAINA 10 MG,Ajuste Direto Regime Geral,Aquisição de bens móveis,"33000000-0, Equipamento médico, medicamentos e produtos para cuidados pessoais","Centro Hospitalar Barreiro Montijo, E. P. E. (509186998)",IMEXCLINIC - SUCURSAL PORTUGAL (980426863),"13.477,50 €",31-03-2015,27-03-2014,365 dias,"Portugal, Setúbal, Barreiro","Artigo 24.º, n.º 1, alínea e) do Código dos Contratos Públicos",31-12-2014,"13.477,50 €","","",,Não aplicável.,Não aplicável.,FALSE
Fornecimento de endoproteses ao CHBM,Ajuste Direto Regime Geral,Aquisição de bens móveis,"33000000-0, Equipamento médico, medicamentos e produtos para cuidados pessoais","Centro Hospitalar Barreiro Montijo, E. P. E. (509186998)",Endotécnica (503818348),"6.120,00 €",31-03-2015,24-06-2014,365 dias,"Portugal, Setúbal, Barreiro","Artigo 20.º, n.º 1, alínea a) do Código dos Contratos Públicos",31-12-2014,"736,70 €","",não necessidade de mais aquisições,,Não aplicável.,Não aplicável.,FALSE
40021-2014 SISTEMAS E PROLONGAMENTOS,Ajuste Direto Regime Geral,Aquisição de bens móveis,"33194120-3, Material de infusão","CHBM - Centro Hospital Barreiro Montijo, EPE (509186998)","P.M.H. - PROD. MEDICOS HOSPITALARES, LDA. (502376899)","9.453,25 €",31-03-2015,21-05-2014,365 dias,"Portugal, Setúbal, Barreiro","Artigo 20.º, n.º 1, alínea a) do Código dos Contratos Públicos",31-12-2014,"9.453,25 €","","",,Não aplicável.,Não aplicável.,FALSE
40018-2014 FILTROS E NEBULIZADORES,Ajuste Direto Regime Geral,Aquisição de bens móveis,"33157400-9, Respiradores para fins médicos","CHBM - Centro Hospital Barreiro Montijo, EPE (509186998)","TEPREL - EQUIPAMENTOS MEDICOS, LDA (502262184)","12.703,60 €",31-03-2015,23-04-2014,365 dias,"Portugal, Setúbal, Barreiro","Artigo 20.º, n.º 1, alínea a) do Código dos Contratos Públicos",31-12-2014,"12.703,60 €","","",,Não aplicável.,Não aplicável.,FALSE
Material de esterilização,Ajuste Direto Regime Geral,Aquisição de bens móveis,"33198200-6, Saquetas e invólucros de papel para esterilização","CHBM - Centro Hospital Barreiro Montijo, EPE (509186998)","BASTOS VIEGAS, S.A. (500042772)","5.076,12 €",31-03-2015,24-02-2014,365 dias,"Portugal, Setúbal, Barreiro","Artigo 20.º, n.º 1, alínea a) do Código dos Contratos Públicos",31-12-2014,"5.076,12 €","",redução de consumos,,Não aplicável.,Não aplicável.,FALSE
FEXC0038/2014 - SOL SUPERSATURADA DE FOSFATO DE,Ajuste Direto Regime Geral,Aquisição de bens móveis,"33000000-0, Equipamento médico, medicamentos e produtos para cuidados pessoais","Centro Hospitalar Barreiro Montijo, E. P. E. (509186998)",EUSA PHARMA (424347011),"18.000,00 €",30-03-2015,18-03-2014,365 dias,"Portugal, Setúbal, Barreiro","Artigo 24.º, n.º 1, alínea e) do Código dos Contratos Públicos",31-12-2014,"18.000,00 €","","",,Não aplicável.,Não aplicável.,FALSE
FEXC0039/2014 - PACLITAXEL - ALBUMINA 100 MG (5 MG/ML FRS/AMP. 20 ML) PO INJ,Ajuste Direto Regime Geral,Aquisição de bens móveis,"33000000-0, Equipamento médico, medicamentos e produtos para cuidados pessoais","Centro Hospitalar Barreiro Montijo, E. P. E. (509186998)","CELGENE, SOC.UNIPESSOAL, LDA (507791690)","76.800,00 €",30-03-2015,25-03-2014,365 dias,"Portugal, Setúbal, Barreiro","Artigo 24.º, n.º 1, alínea e) do Código dos Contratos Públicos",31-12-2014,"76.800,00 €","","",,Não aplicável.,Não aplicável.,FALSE
FEXC0041/2014  FOTEMUSTINA 200 MG ( 50 MG/ML FRS/AMP. 4 ML) PO SOL,Ajuste Direto Regime Geral,Aquisição de bens móveis,"33000000-0, Equipamento médico, medicamentos e produtos para cuidados pessoais","Centro Hospitalar Barreiro Montijo, E. P. E. (509186998)",DLA - FARMACEUTICA (503894427),"6.018,72 €",30-03-2015,07-01-2014,365 dias,"Portugal, Setúbal, Barreiro","Artigo 24.º, n.º 1, alínea e) do Código dos Contratos Públicos",31-12-2014,"6.018,72 €","","",,Não aplicável.,Não aplicável.,FALSE
FEXC0047/2015 - MEDICAMENTOS BAXTER,Ajuste Direto Regime Geral,Aquisição de bens móveis,"33000000-0, Equipamento médico, medicamentos e produtos para cuidados pessoais","Centro Hospitalar Barreiro Montijo, E. P. E. (509186998)",BAXTER MEDICO (503347345),"19.547,60 €",30-03-2015,26-03-2014,365 dias,"Portugal, Setúbal, Barreiro","Artigo 24.º, n.º 1, alínea e) do Código dos Contratos Públicos",31-12-2014,"19.547,60 €","","",,Não aplicável.,Não aplicável.,FALSE
FEXC0048/2014 - B. BRAUN MEDICAL,Ajuste Direto Regime Geral,Aquisição de bens móveis,"33000000-0, Equipamento médico, medicamentos e produtos para cuidados pessoais","Centro Hospitalar Barreiro Montijo, E. P. E. (509186998)",B.BRAUN MEDICAL (501506543),"5.256,80 €",30-03-2015,31-12-2014,365 dias,"Portugal, Setúbal, Barreiro","Artigo 24.º, n.º 1, alínea e) do Código dos Contratos Públicos",31-12-2014,"5.256,80 €","","",,Não aplicável.,Não aplicável.,FALSE
4D0016/2014 - MASCARAS LARINGEAS Nª3 E Nº 4; AGULHAS DE PLEXO,Ajuste Direto Regime Geral,Aquisição de bens móveis,"33000000-0, Equipamento médico, medicamentos e produtos para cuidados pessoais","Centro Hospitalar Barreiro Montijo, E. P. E. (509186998)",INTERSURGICAL PORTUGAL (503480045),"5.250,00 €",30-03-2015,10-01-2014,365 dias,"Portugal, Setúbal, Barreiro","Artigo 20.º, n.º 1, alínea a) do Código dos Contratos Públicos",31-12-2014,"5.250,00 €","","",,Não aplicável.,Não aplicável.,FALSE
40022-2014- DM P ADMINISTRAÇAO DE CITOSTATICOS,Ajuste Direto Regime Geral,Aquisição de bens móveis,"33194120-3, Material de infusão","CHBM - Centro Hospital Barreiro Montijo, EPE (509186998)","P.M.H. - PROD. MEDICOS HOSPITALARES, LDA. (502376899)","11.560,00 €",30-03-2015,25-03-2014,365 dias,"Portugal, Setúbal, Barreiro","Artigo 20.º, n.º 1, alínea a) do Código dos Contratos Públicos",31-12-2014,"10.060,00 €",POR REDUÇAO DE CONSUMOS,POR REDUÇAO DE CONSUMOS,,Não aplicável.,Não aplicável.,FALSE
40026-2014 MATERIAL ENDODCOPIA,Ajuste Direto Regime Geral,Aquisição de bens móveis,"33190000-8, Dispositivos e produtos médicos variados","CHBM - Centro Hospital Barreiro Montijo, EPE (509186998)","ENDOTÉCNICA - MATERIAL CIRURGICO, LDA. (503818348)","18.626,00 €",30-03-2015,27-02-2014,365 dias,"Portugal, Setúbal, Barreiro","Artigo 20.º, n.º 1, alínea a) do Código dos Contratos Públicos",31-12-2014,"18.626,00 €","","",,Não aplicável.,Não aplicável.,FALSE
FEXC0049/2014 - MEDICAMENTOS ANGELINI,Ajuste Direto Regime Geral,Aquisição de bens móveis,"33000000-0, Equipamento médico, medicamentos e produtos para cuidados pessoais","Centro Hospitalar Barreiro Montijo, E. P. E. (509186998)",ANGELINI FARMACEUTICA (500583650),"5.714,71 €",30-03-2015,08-01-2014,365 dias,"Portugal, Setúbal, Barreiro","Artigo 24.º, n.º 1, alínea e) do Código dos Contratos Públicos",31-12-2014,"5.714,71 €","","",,Não aplicável.,Não aplicável.,FALSE
4S0018/2014 Serviços de Transporte para os Doentes de Radioterapia do Hospital Vila Franca de Xira,Ajuste Direto Regime Geral,Aquisição de serviços,"85140000-2, Serviços de saúde diversos","Centro Hospitalar Barreiro Montijo, E. P. E. (509186998)","Louresmacas Ambulâncias, Unipessoal, Lda. (504027140)","45.000,00 €",30-03-2015,07-04-2014,334 dias,"Portugal, Setúbal, Barreiro","Artigo 20.º, n.º 1, alínea a) do Código dos Contratos Públicos",31-12-2014,"70.000,00 €","",Aumento de doentes recebidos em relação ao inicialmente estimado,,Não aplicável.,Não aplicável.,FALSE
Dispositivos perfusão subcutânea de insulina,Ao abrigo de acordo-quadro (art.º 259.º),Aquisição de bens móveis,"33000000-0, Equipamento médico, medicamentos e produtos para cuidados pessoais","Centro Hospitalar Barreiro Montijo, E. P. E. (509186998)","ROCHE SISTEMAS DE DIAGNOSTICO-SOC. UNIPESSOAL, Lda (504282921)","8.306,55 €",30-03-2015,23-01-2014,365 dias,"Portugal, Setúbal, Barreiro",Artigo 259.º do Código dos Contratos Públicos,31-12-2014,"14.789,88 €","",aumento de consumos,,382570,CONCURSO PÚBLICO PARA A CELEBRAÇÃO DE CONTRATOS PÚBLICOS DE APROVISIONAMENTO PARA AQUISIÇÃO BOMBAS DE PERFUSÃO SUBCUTANEA CONTINUA DE INSULINA E RESPECTIVOS CONSUMÍVEIS,FALSE
40044-2015 MATERIAL DE LABORATORIO,Ajuste Direto Regime Geral,Aquisição de bens móveis,"33000000-0, Equipamento médico, medicamentos e produtos para cuidados pessoais","CHBM - Centro Hospital Barreiro Montijo, EPE (509186998)","NORMAX-FAB VIDROS CIENTIFICOS, (500203130)","5.653,80 €",30-03-2015,08-05-2014,365 dias,"Portugal, Setúbal, Barreiro","Artigo 20.º, n.º 1, alínea a) do Código dos Contratos Públicos",31-12-2014,"5.653,80 €","","",,Não aplicável.,Não aplicável.,FALSE
4S0015/2014 Fornecimento de Serviços de Radioterapia,Ajuste Direto Regime Geral,Aquisição de serviços,"85140000-2, Serviços de saúde diversos","Centro Hospitalar Barreiro Montijo, E. P. E. (509186998)","Hospor, Hospitais Portugueses, SA (501245570)","59.921,25 €",30-03-2015,17-01-2014,90 dias,"Portugal, Setúbal, Barreiro","Artigo 20.º, n.º 1, alínea a) do Código dos Contratos Públicos",28-02-2014,"63.871,25 €","",Nº DE TRATAMENTOS REALIZADOS SUPERIORES AOS INICIALMENTE PREVISTOS,,Não aplicável.,Não aplicável.,FALSE
"FEXC0080/2014 - OCTREOTIDO 30 MG (12 MG/ML FRS/AMP 2,5 ML) PO SUSP INJ",Ajuste Direto Regime Geral,Aquisição de bens móveis,"33000000-0, Equipamento médico, medicamentos e produtos para cuidados pessoais","Centro Hospitalar Barreiro Montijo, E. P. E. (509186998)",NOVARTIS FARMACEUTICA (500063524),"12.698,04 €",30-03-2015,17-03-2014,365 dias,"Portugal, Setúbal, Barreiro","Artigo 24.º, n.º 1, alínea e) do Código dos Contratos Públicos",31-12-2014,"12.698,04 €","","",,Não aplicável.,Não aplicável.,FALSE
Papel enfitamento de comprimidos,Ajuste Direto Regime Geral,Aquisição de bens móveis,"22993200-9, Papel ou cartão termossensíveis","CHBM - Centro Hospital Barreiro Montijo, EPE (509186998)","GRIFOLS PORTUGAL - PROD. FARMAC. E HOSP., LDA. (502041285)","6.133,30 €",30-03-2015,14-01-2014,365 dias,"Portugal, Setúbal, Barreiro","Artigo 20.º, n.º 1, alínea a) do Código dos Contratos Públicos",31-12-2014,"7.359,99 €","",aumento de consumos,,Não aplicável.,Não aplicável.,FALSE
FEXC0105/2014 - DEXAMETASONA 5 MG (5 MG/ML AMP. 1 ML) SOL INJ.,Ajuste Direto Regime Geral,Aquisição de bens móveis,"33000000-0, Equipamento médico, medicamentos e produtos para cuidados pessoais","Centro Hospitalar Barreiro Montijo, E. P. E. (509186998)",BOMI PORTUGAL (504736655),"9.801,00 €",30-03-2015,20-03-2014,365 dias,"Portugal, Setúbal, Barreiro","Artigo 24.º, n.º 1, alínea e) do Código dos Contratos Públicos",31-12-2014,"9.801,00 €","","",,Não aplicável.,Não aplicável.,FALSE
S10003/2014 Serviço de Transporte de Doentes,Concurso público,Aquisição de serviços,"85143000-3, Serviços de ambulâncias","Centro Hospitalar Barreiro Montijo, E. P. E. (509186998)","Palvidas - Transporte de Doentes, Lda. (503253227)","270.000,00 €",30-03-2015,28-04-2014,304 dias,"Portugal, Setúbal, Barreiro","Artigo 20.º, n.º 1, alínea b) do Código dos Contratos Públicos",31-12-2014,"259.923,87 €","",Consumos reais inferiores aos inicialmente estimados,,Não aplicável.,Não aplicável.,FALSE
"FEXC0107/2015 - PALIPERIDONA 9 MG COMP. AP, PALIPERIDONA 6 MG COMP. AP",Ajuste Direto Regime Geral,Aquisição de bens móveis,"33000000-0, Equipamento médico, medicamentos e produtos para cuidados pessoais","Centro Hospitalar Barreiro Montijo, E. P. E. (509186998)",JANSSEN CILAG (500189412),"11.689,44 €",30-03-2015,16-04-2014,365 dias,"Portugal, Setúbal, Barreiro","Artigo 24.º, n.º 1, alínea e) do Código dos Contratos Públicos",31-12-2014,"11.689,44 €","","",,Não aplicável.,Não aplicável.,FALSE
Material prevenção e deteção HIV,Ao abrigo de acordo-quadro (art.º 259.º),Aquisição de bens móveis,"33000000-0, Equipamento médico, medicamentos e produtos para cuidados pessoais","Centro Hospitalar Barreiro Montijo, E. P. E. (509186998)","SARSTEDT - TECNOLOGIA LABORATORIOS, S.A. (503019461)","10.270,00 €",30-03-2015,17-01-2014,365 dias,"Portugal, Setúbal, Barreiro",Artigo 259.º do Código dos Contratos Públicos,31-12-2014,"8.404,00 €","",redução de consumos,,464738,"Concurso público para a celebração de contratos públicos de aprovisionamento para a área da saúde, com vista ao fornecimento de material de prevenção e deteção do HIV.",FALSE
4CPS0004/2014 Fornecimento de Serviços de Transporte de Doentes,Ajuste Direto Regime Geral,Aquisição de serviços,"85143000-3, Serviços de ambulâncias","Centro Hospitalar Barreiro Montijo, E. P. E. (509186998)","Palvidas - Transporte de Doentes, LDa. (503253227)","84.000,00 €",30-03-2015,26-12-2013,90 dias,"Portugal, Setúbal, Barreiro","Artigo 27.º, n.º 1, alínea a) do Código dos Contratos Públicos",28-02-2014,"62.408,52 €",Fez-se Ajuste directo enquanto se aguardava a conclusão do Concurso Publico,Periodo da prestação de serviços inferior ao inicialmente previsto,,Não aplicável.,Não aplicável.,FALSE
FEXC0120/2014 - IBANDRONATO 50 MG,Ajuste Direto Regime Geral,Aquisição de bens móveis,"33000000-0, Equipamento médico, medicamentos e produtos para cuidados pessoais","Centro Hospitalar Barreiro Montijo, E. P. E. (509186998)","ROCHE FARMACÊUTICA QUIMICA, LDA (500233810)","25.872,00 €",30-03-2015,23-04-2014,365 dias,"Portugal, Setúbal, Barreiro","Artigo 24.º, n.º 1, alínea e) do Código dos Contratos Públicos",31-12-2014,"25.872,00 €","","",,Não aplicável.,Não aplicável.,FALSE
4I0009-2014 SERINGAS AGULHAS E CONTENTORES,Ao abrigo de acordo-quadro (art.º 259.º),Aquisição de bens móveis,"33000000-0, Equipamento médico, medicamentos e produtos para cuidados pessoais","Centro Hospitalar Barreiro Montijo, E. P. E. (509186998)","B. BRAUN MEDICAL, LDA (501506543)","16.559,00 €",30-03-2015,11-02-2014,365 dias,"Portugal, Setúbal, Barreiro",Artigo 259.º do Código dos Contratos Públicos,31-12-2014,"16.559,00 €","","",,448705,"CONCURSO PÚBLICO PARA A CELEBRAÇÃO DE CONTRATOS PÚBLICOS DE APROVISIONAMENTO PARA A ÁREA DA SAÚDE, COM VISTA AO FORNECIMENTO DE SERINGAS, AGULHAS, CONTENTORES E SISTEMAS FECHADOS DE COLHEITA,  ÀS INSTITUIÇÕES E SERVIÇOS DO SERVIÇO NACIONAL DE SAÚDE",FALSE
4I0009-2014 SERINGAS AGULHAS E CONTENTORES,Ao abrigo de acordo-quadro (art.º 259.º),Aquisição de bens móveis,"33000000-0, Equipamento médico, medicamentos e produtos para cuidados pessoais","Centro Hospitalar Barreiro Montijo, E. P. E. (509186998)","CLINIFAR - PROD. CLINICOS E FARMACEUTICOS, S.A. (503281115)","12.107,60 €",30-03-2015,11-02-2014,365 dias,"Portugal, Setúbal, Barreiro",Artigo 259.º do Código dos Contratos Públicos,31-12-2014,"12.107,60 €","","",,448705,"CONCURSO PÚBLICO PARA A CELEBRAÇÃO DE CONTRATOS PÚBLICOS DE APROVISIONAMENTO PARA A ÁREA DA SAÚDE, COM VISTA AO FORNECIMENTO DE SERINGAS, AGULHAS, CONTENTORES E SISTEMAS FECHADOS DE COLHEITA,  ÀS INSTITUIÇÕES E SERVIÇOS DO SERVIÇO NACIONAL DE SAÚDE",FALSE
4I0009-2014 SERINGAS AGULHAS E CONTENTORES,Ao abrigo de acordo-quadro (art.º 259.º),Aquisição de bens móveis,"33000000-0, Equipamento médico, medicamentos e produtos para cuidados pessoais","Centro Hospitalar Barreiro Montijo, E. P. E. (509186998)","P.M.H. - PROD. MEDICOS HOSPITALARES, LDA. (502376899)","6.522,60 €",30-03-2015,11-03-2014,365 dias,"Portugal, Setúbal, Barreiro",Artigo 259.º do Código dos Contratos Públicos,31-12-2014,"6.522,60 €","","",,448705,"CONCURSO PÚBLICO PARA A CELEBRAÇÃO DE CONTRATOS PÚBLICOS DE APROVISIONAMENTO PARA A ÁREA DA SAÚDE, COM VISTA AO FORNECIMENTO DE SERINGAS, AGULHAS, CONTENTORES E SISTEMAS FECHADOS DE COLHEITA,  ÀS INSTITUIÇÕES E SERVIÇOS DO SERVIÇO NACIONAL DE SAÚDE",FALSE
F40023/2014 EFAVIRENZ 600 MG E EFAVIRENZ 200 MG,Ajuste Direto Regime Geral,Aquisição de bens móveis,"33000000-0, Equipamento médico, medicamentos e produtos para cuidados pessoais","Centro Hospitalar Barreiro Montijo, E. P. E. (509186998)","MERCK SHARP & DOHME, LDA (500191360)","16.038,56 €",30-03-2015,17-03-2014,365 dias,"Portugal, Setúbal, Barreiro","Artigo 20.º, n.º 1, alínea a) do Código dos Contratos Públicos",31-12-2014,"16.038,56 €","","",,Não aplicável.,Não aplicável.,FALSE
4I0009-2014 SERINGAS AGULHAS E CONTENTORES,Ao abrigo de acordo-quadro (art.º 259.º),Aquisição de bens móveis,"33000000-0, Equipamento médico, medicamentos e produtos para cuidados pessoais","Centro Hospitalar Barreiro Montijo, E. P. E. (509186998)","AMBIMED - GESTÃO AMBIENTAL, LDA (503593427)","1.050,00 €",30-03-2015,11-02-2014,365 dias,"Portugal, Setúbal, Barreiro",Artigo 259.º do Código dos Contratos Públicos,31-12-2014,"1.050,00 €","","",,448705,"CONCURSO PÚBLICO PARA A CELEBRAÇÃO DE CONTRATOS PÚBLICOS DE APROVISIONAMENTO PARA A ÁREA DA SAÚDE, COM VISTA AO FORNECIMENTO DE SERINGAS, AGULHAS, CONTENTORES E SISTEMAS FECHADOS DE COLHEITA,  ÀS INSTITUIÇÕES E SERVIÇOS DO SERVIÇO NACIONAL DE SAÚDE",FALSE
4I0009-2014 SERINGAS AGULHAS E CONTENTORES,Ao abrigo de acordo-quadro (art.º 259.º),Aquisição de bens móveis,"33000000-0, Equipamento médico, medicamentos e produtos para cuidados pessoais","Centro Hospitalar Barreiro Montijo, E. P. E. (509186998)",PERGUT PORTUGAL (501799729),"12.172,32 €",30-03-2015,11-02-2014,365 dias,"Portugal, Setúbal, Barreiro",Artigo 259.º do Código dos Contratos Públicos,31-12-2014,"12.172,32 €","","",,448705,"CONCURSO PÚBLICO PARA A CELEBRAÇÃO DE CONTRATOS PÚBLICOS DE APROVISIONAMENTO PARA A ÁREA DA SAÚDE, COM VISTA AO FORNECIMENTO DE SERINGAS, AGULHAS, CONTENTORES E SISTEMAS FECHADOS DE COLHEITA,  ÀS INSTITUIÇÕES E SERVIÇOS DO SERVIÇO NACIONAL DE SAÚDE",FALSE
Dispositivos medicos diversos,Ajuste Direto Regime Geral,Aquisição de bens móveis,"33140000-3, Material médico de consumo","CHBM - Centro Hospital Barreiro Montijo, EPE (509186998)","MEDICINALIA-CORMEDICA, LDA (500684324)","3.075,00 €",30-03-2015,18-03-2014,365 dias,"Portugal, Setúbal, Barreiro",Artigo 258.º do Código dos Contratos Públicos,31-12-2014,"3.075,00 €","","",,Não aplicável.,Não aplicável.,FALSE
4CM0026/2014 - Reagentes p/ Bioquímica - Montijo,Ajuste Direto Regime Geral,Aquisição de bens móveis,"33696000-5, Reagentes e meios de contraste","Centro Hospitalar Barreiro Montijo, E. P. E. (509186998)",Roche Sistemas de Diagnóstico (504282921),"29.094,63 €",30-03-2015,20-01-2014,365 dias,"Portugal, Setúbal, Barreiro","Artigo 26.º, n.º 1, alínea a) do Código dos Contratos Públicos",31-12-2014,"29.755,70 €","",necessidade efetiva superior à previsão,,Não aplicável.,Não aplicável.,FALSE
"F40025/2014 - PIRIDOXINA 40MG COMP.,PIRIDOXINA 300 MG COMP. E TIAMINA 100 MG (50 MG/ML AMP. 2 ML) SOL INJ",Ajuste Direto Regime Geral,Aquisição de bens móveis,"33000000-0, Equipamento médico, medicamentos e produtos para cuidados pessoais","Centro Hospitalar Barreiro Montijo, E. P. E. (509186998)",LABESFAL (501169580),"6.967,60 €",30-03-2015,11-03-2014,365 dias,"Portugal, Setúbal, Barreiro","Artigo 20.º, n.º 1, alínea a) do Código dos Contratos Públicos",31-12-2014,"6.967,60 €","","",,Não aplicável.,Não aplicável.,FALSE
F40028/2014 - HIDROCORTISONA 100 MG (50 MG/ML FRS/AMP 2 ML) SOL INJ,Ajuste Direto Regime Geral,Aquisição de bens móveis,"33000000-0, Equipamento médico, medicamentos e produtos para cuidados pessoais","Centro Hospitalar Barreiro Montijo, E. P. E. (509186998)",LAB. PFIZER (500162166),"15.180,00 €",30-03-2015,10-04-2014,365 dias,"Portugal, Setúbal, Barreiro","Artigo 20.º, n.º 1, alínea a) do Código dos Contratos Públicos",31-12-2014,"15.180,00 €","","",,Não aplicável.,Não aplicável.,FALSE
4I0006-2014 CATETERES,Ao abrigo de acordo-quadro (art.º 259.º),Aquisição de bens móveis,"33000000-0, Equipamento médico, medicamentos e produtos para cuidados pessoais","Centro Hospitalar Barreiro Montijo, E. P. E. (509186998)","P.M.H. - PROD. MEDICOS HOSPITALARES, LDA. (502376899)","19.981,95 €",30-03-2015,17-03-2014,365 dias,"Portugal, Setúbal, Barreiro",Artigo 259.º do Código dos Contratos Públicos,31-12-2014,"19.981,95 €","","",,412727,CONCURSO PÚBLICO PARA A CELEBRAÇÃO DE CONTRATOS PÚBLICOS DE APROVISIONAMENTO PARA AQUISIÇÃO DE MATERIAL CATETERES,FALSE
4I0006-2014 CATETERES,Ao abrigo de acordo-quadro (art.º 259.º),Aquisição de bens móveis,"33000000-0, Equipamento médico, medicamentos e produtos para cuidados pessoais","Centro Hospitalar Barreiro Montijo, E. P. E. (509186998)","VYGON (PORTUGAL), LDA. (503232785)","2.391,40 €",30-03-2015,17-03-2014,365 dias,"Portugal, Setúbal, Barreiro",Artigo 259.º do Código dos Contratos Públicos,31-12-2014,"2.391,40 €","","",,412727,CONCURSO PÚBLICO PARA A CELEBRAÇÃO DE CONTRATOS PÚBLICOS DE APROVISIONAMENTO PARA AQUISIÇÃO DE MATERIAL CATETERES,FALSE
4I0006-2014 CATETERES,Ao abrigo de acordo-quadro (art.º 259.º),Aquisição de bens móveis,"33000000-0, Equipamento médico, medicamentos e produtos para cuidados pessoais","Centro Hospitalar Barreiro Montijo, E. P. E. (509186998)",PERGUT PORTUGAL (501799729),"26.080,00 €",30-03-2015,17-03-2014,365 dias,"Portugal, Setúbal, Barreiro",Artigo 259.º do Código dos Contratos Públicos,31-12-2014,"26.080,00 €","","",,412727,CONCURSO PÚBLICO PARA A CELEBRAÇÃO DE CONTRATOS PÚBLICOS DE APROVISIONAMENTO PARA AQUISIÇÃO DE MATERIAL CATETERES,FALSE
4I0006-2014 CATETERES,Ao abrigo de acordo-quadro (art.º 259.º),Aquisição de bens móveis,"33000000-0, Equipamento médico, medicamentos e produtos para cuidados pessoais","Centro Hospitalar Barreiro Montijo, E. P. E. (509186998)","B. BRAUN MEDICAL, LDA (501506543)","7.873,00 €",30-03-2015,17-03-2014,365 dias,"Portugal, Setúbal, Barreiro",Artigo 259.º do Código dos Contratos Públicos,31-12-2014,"7.873,00 €","","",,412727,CONCURSO PÚBLICO PARA A CELEBRAÇÃO DE CONTRATOS PÚBLICOS DE APROVISIONAMENTO PARA AQUISIÇÃO DE MATERIAL CATETERES,FALSE
4I0006-2014 CATETERES,Ao abrigo de acordo-quadro (art.º 259.º),Aquisição de bens móveis,"33000000-0, Equipamento médico, medicamentos e produtos para cuidados pessoais","Centro Hospitalar Barreiro Montijo, E. P. E. (509186998)","SMITHS MEDICAL, LDA (507445937)","54.245,00 €",30-03-2015,17-03-2014,365 dias,"Portugal, Setúbal, Barreiro",Artigo 259.º do Código dos Contratos Públicos,31-12-2014,"54.245,00 €","","",,412727,CONCURSO PÚBLICO PARA A CELEBRAÇÃO DE CONTRATOS PÚBLICOS DE APROVISIONAMENTO PARA AQUISIÇÃO DE MATERIAL CATETERES,FALSE
F40020/2014 DEXAMETASONA 4 MG COMP,Ajuste Direto Regime Geral,Aquisição de bens móveis,"33000000-0, Equipamento médico, medicamentos e produtos para cuidados pessoais","Centro Hospitalar Barreiro Montijo, E. P. E. (509186998)",ETIOPHARMA (509393357),"13.206,60 €",30-03-2015,31-03-2014,365 dias,"Portugal, Setúbal, Barreiro","Artigo 20.º, n.º 1, alínea a) do Código dos Contratos Públicos",31-12-2014,"13.206,60 €","","",,Não aplicável.,Não aplicável.,FALSE
material incontinência,Ao abrigo de acordo-quadro (art.º 259.º),Aquisição de bens móveis,"33000000-0, Equipamento médico, medicamentos e produtos para cuidados pessoais","Centro Hospitalar Barreiro Montijo, E. P. E. (509186998)","INDAS PORTUGAL, LDA. (503505196)","22.019,70 €",30-03-2015,05-02-2014,365 dias,"Portugal, Setúbal, Barreiro",Artigo 259.º do Código dos Contratos Públicos,31-12-2014,"20.426,90 €","",redução de consumos,,1210117,"CONCURSO PÚBLICO PARA A CELEBRAÇÃO DE CONTRATOS PÚBLICOS DE APROVISIONAMENTO PARA A ÁREA DA SAÚDE, COM VISTA AO FORNECIMENTO DE MATERIAL DE INCONTINENCIA E ALIVIO DE PRESSÃO, ÀS INSTITUIÇÕES E SERVIÇOS DO SERVIÇO NACIONAL DE SAÚDE",FALSE
4CM0024/2014 - Reagentes p/ Gasimetria,Ajuste Direto Regime Geral,Aquisição de bens móveis,"33696000-5, Reagentes e meios de contraste","Centro Hospitalar Barreiro Montijo, E. P. E. (509186998)",Radiometer Ibérica (980201667),"28.499,60 €",30-03-2015,16-01-2014,365 dias,"Portugal, Setúbal, Barreiro","Artigo 26.º, n.º 1, alínea a) do Código dos Contratos Públicos",31-12-2014,"28.466,33 €","",Necessidade inferior à previsão,,Não aplicável.,Não aplicável.,FALSE
material de incontinência,Ao abrigo de acordo-quadro (art.º 259.º),Aquisição de bens móveis,"33000000-0, Equipamento médico, medicamentos e produtos para cuidados pessoais","Centro Hospitalar Barreiro Montijo, E. P. E. (509186998)",PROCTER & GAMBLE PORTUGAL - PROD. CONS.HIG.SAUDE (503037753),"106,02 €",30-03-2015,05-02-2014,365 dias,"Portugal, Setúbal, Barreiro",Artigo 259.º do Código dos Contratos Públicos,31-12-2014,"188,10 €","",tipo de embalagem,,1210117,"CONCURSO PÚBLICO PARA A CELEBRAÇÃO DE CONTRATOS PÚBLICOS DE APROVISIONAMENTO PARA A ÁREA DA SAÚDE, COM VISTA AO FORNECIMENTO DE MATERIAL DE INCONTINENCIA E ALIVIO DE PRESSÃO, ÀS INSTITUIÇÕES E SERVIÇOS DO SERVIÇO NACIONAL DE SAÚDE",FALSE
material de incontinência,Ao abrigo de acordo-quadro (art.º 259.º),Aquisição de bens móveis,"33000000-0, Equipamento médico, medicamentos e produtos para cuidados pessoais","Centro Hospitalar Barreiro Montijo, E. P. E. (509186998)","QUILABAN-QUIM LAB ANALITICA, S.A. (500399670)","40.192,40 €",30-03-2015,05-02-2014,365 dias,"Portugal, Setúbal, Barreiro",Artigo 259.º do Código dos Contratos Públicos,31-12-2014,"38.797,40 €","",redução de consumos,,1210117,"CONCURSO PÚBLICO PARA A CELEBRAÇÃO DE CONTRATOS PÚBLICOS DE APROVISIONAMENTO PARA A ÁREA DA SAÚDE, COM VISTA AO FORNECIMENTO DE MATERIAL DE INCONTINENCIA E ALIVIO DE PRESSÃO, ÀS INSTITUIÇÕES E SERVIÇOS DO SERVIÇO NACIONAL DE SAÚDE",FALSE
"F40017/2015 - ISOPRENALINA 0,2 MG SOL INJ",Ajuste Direto Regime Geral,Aquisição de bens móveis,"33000000-0, Equipamento médico, medicamentos e produtos para cuidados pessoais","Centro Hospitalar Barreiro Montijo, E. P. E. (509186998)",ETIOPHARMA (509393357),"10.640,00 €",30-03-2015,23-01-2014,365 dias,"Portugal, Setúbal, Barreiro","Artigo 20.º, n.º 1, alínea a) do Código dos Contratos Públicos",23-01-2014,"10.640,00 €","","",,Não aplicável.,Não aplicável.,FALSE
4CM0025/2014 - Reagentes para Citometria de Fluxo,Ajuste Direto Regime Geral,Aquisição de bens móveis,"33696000-5, Reagentes e meios de contraste","Centro Hospitalar Barreiro Montijo, E. P. E. (509186998)",Beckman Coulter (509035167),"73.910,00 €",30-03-2015,20-01-2014,365 dias,"Portugal, Setúbal, Barreiro","Artigo 26.º, n.º 1, alínea a) do Código dos Contratos Públicos",31-12-2014,"60.030,00 €","",Necessidade inferior à previsão,,Não aplicável.,Não aplicável.,FALSE
4CP0006/2014 - Reagentes para Biologia Molecular,Ajuste Direto Regime Geral,Aquisição de bens móveis,"33696000-5, Reagentes e meios de contraste","Centro Hospitalar Barreiro Montijo, E. P. E. (509186998)",Roche Sistemas de Diagnostico (504282921),"95.773,92 €",30-03-2015,20-01-2014,365 dias,"Portugal, Setúbal, Barreiro","Artigo 26.º, n.º 1, alínea a) do Código dos Contratos Públicos",31-12-2014,"94.959,12 €","",Necessidade inferior ao previsto,,Não aplicável.,Não aplicável.,FALSE
Material disposable Bloco Operatorio I,Ao abrigo de acordo-quadro (art.º 259.º),Aquisição de bens móveis,"33000000-0, Equipamento médico, medicamentos e produtos para cuidados pessoais","Centro Hospitalar Barreiro Montijo, E. P. E. (509186998)","ANASTACIO SALDANHA UNIPESSOAL, LDA. (505804441)","721,50 €",30-03-2015,06-02-2014,365 dias,"Portugal, Setúbal, Barreiro",Artigo 259.º do Código dos Contratos Públicos,31-12-2014,"526,98 €","",diminuição de consumos,,451780,CP 2012/24 - MATERAIL DISPOSABLE DE BLOCO OPERATORIO,FALSE
Material disposable Bloco Operatorio I,Ao abrigo de acordo-quadro (art.º 259.º),Aquisição de bens móveis,"33000000-0, Equipamento médico, medicamentos e produtos para cuidados pessoais","Centro Hospitalar Barreiro Montijo, E. P. E. (509186998)","ROCHA NEVES, LDA (500233691)","2.263,80 €",30-03-2015,06-02-2014,365 dias,"Portugal, Setúbal, Barreiro",Artigo 259.º do Código dos Contratos Públicos,31-12-2014,"","",Não fornecimento,,451780,CP 2012/24 - MATERAIL DISPOSABLE DE BLOCO OPERATORIO,FALSE
Material disposable de Bloco Operatorio I,Ao abrigo de acordo-quadro (art.º 259.º),Aquisição de bens móveis,"33000000-0, Equipamento médico, medicamentos e produtos para cuidados pessoais","Centro Hospitalar Barreiro Montijo, E. P. E. (509186998)","BASTOS VIEGAS, S.A. (500042772)","3.508,96 €",30-03-2015,06-02-2014,365 dias,"Portugal, Setúbal, Barreiro",Artigo 259.º do Código dos Contratos Públicos,31-12-2014,"3.126,35 €","",redução de consumos,,451780,CP 2012/24 - MATERAIL DISPOSABLE DE BLOCO OPERATORIO,FALSE
4SI0011/2014 Fornecimento de Energia Eléctrica,Ao abrigo de acordo-quadro (art.º 259.º),Aquisição de bens móveis,"09310000-5, Electricidade","Centro Hospitalar Barreiro Montijo, E. P. E. (509186998)","EDP Comercial - Comercialização de Energia, SA (503504564)","303.691,46 €",30-03-2015,23-01-2014,365 dias,"Portugal, Setúbal, Barreiro",Artigo 259.º do Código dos Contratos Públicos,31-12-2014,"493.359,54 €","",Os consumos reais foram superiores aos consumos inicialmente estimados,,314294,Acordo quadro para o fornecimento de electricidade em regime de mercado livre para Portugal Continental,FALSE
4CM0023/2014- Reagentes p/ Hematologia/Hemostase,Ajuste Direto Regime Geral,Aquisição de bens móveis,"33696000-5, Reagentes e meios de contraste","Centro Hospitalar Barreiro Montijo, E. P. E. (509186998)",Beckman Coulter (509035167),"91.180,00 €",30-03-2015,14-01-2014,365 dias,"Portugal, Setúbal, Barreiro","Artigo 26.º, n.º 1, alínea a) do Código dos Contratos Públicos",31-12-2014,"91.180,00 €","","",,Não aplicável.,Não aplicável.,FALSE
4CM00023 - Reagentes para Hematologia/Hemostase,Ajuste Direto Regime Geral,Aquisição de bens móveis,"33694000-1, Meios de diagnóstico","Centro Hospitalar Barreiro Montijo, E. P. E. (509186998)",Izasa Portugal (501086110),"76.907,61 €",30-03-2015,14-01-2015,365 dias,"Portugal, Setúbal, Barreiro","Artigo 26.º, n.º 1, alínea a) do Código dos Contratos Públicos",31-12-2014,"76.907,61 €","","",,Não aplicável.,Não aplicável.,FALSE
Material disposable Bloco Operatório I,Ao abrigo de acordo-quadro (art.º 259.º),Aquisição de bens móveis,"33000000-0, Equipamento médico, medicamentos e produtos para cuidados pessoais","Centro Hospitalar Barreiro Montijo, E. P. E. (509186998)","EZEQUIEL PANAO JORGE, LDA (501412727)","14.672,88 €",30-03-2015,06-02-2014,365 dias,"Portugal, Setúbal, Barreiro",Artigo 259.º do Código dos Contratos Públicos,31-12-2014,"19.487,92 €","",aumento de consumos,,451780,CP 2012/24 - MATERAIL DISPOSABLE DE BLOCO OPERATORIO,FALSE
4I0005/2014 Material disposable de Bloco Operatório I,Ao abrigo de acordo-quadro (art.º 259.º),Aquisição de bens móveis,"33000000-0, Equipamento médico, medicamentos e produtos para cuidados pessoais","Centro Hospitalar Barreiro Montijo, E. P. E. (509186998)","OASIPOR - IMPORT. E EXPORT., SA (502260750)","37.842,00 €",30-03-2015,06-02-2014,365 dias,"Portugal, Setúbal, Barreiro",Artigo 259.º do Código dos Contratos Públicos,31-12-2014,"39.519,96 €","",aumento de consumos,,451780,CP 2012/24 - MATERAIL DISPOSABLE DE BLOCO OPERATORIO,FALSE
Material disposable Bloco Operatório I,Ao abrigo de acordo-quadro (art.º 259.º),Aquisição de bens móveis,"33000000-0, Equipamento médico, medicamentos e produtos para cuidados pessoais","Centro Hospitalar Barreiro Montijo, E. P. E. (509186998)","UP MEDICAL - COMÉRCIO DISP. MED., LDA. (506921069)","67,50 €",30-03-2015,06-02-2014,365 dias,"Portugal, Setúbal, Barreiro",Artigo 259.º do Código dos Contratos Públicos,31-12-2014,"","",não necessidade,,451780,CP 2012/24 - MATERAIL DISPOSABLE DE BLOCO OPERATORIO,FALSE
F10004/2013 - IMUNOGLOBULINAS,Concurso público,Aquisição de bens móveis,"33000000-0, Equipamento médico, medicamentos e produtos para cuidados pessoais","Centro Hospitalar Barreiro Montijo, E. P. E. (509186998)",OCTAPHARMA (502820780),"23.040,00 €",30-03-2015,23-01-2013,365 dias,"Portugal, Setúbal, Barreiro","Artigo 20.º, n.º 1, alínea b) do Código dos Contratos Públicos",31-12-2013,"23.040,00 €","","",,Não aplicável.,Não aplicável.,FALSE
Material disposable de Bloco Operatorio I,Ao abrigo de acordo-quadro (art.º 259.º),Aquisição de bens móveis,"33000000-0, Equipamento médico, medicamentos e produtos para cuidados pessoais","Centro Hospitalar Barreiro Montijo, E. P. E. (509186998)","LINEAMÉDICA - DISPOSITIVOS MÉDICO-CIRÚRGICO, S.A. (505148676)","752,64 €",30-03-2015,06-02-2014,365 dias,"Portugal, Setúbal, Barreiro",Artigo 259.º do Código dos Contratos Públicos,31-12-2014,"752,64 €","","",,451780,CP 2012/24 - MATERAIL DISPOSABLE DE BLOCO OPERATORIO,FALSE
F10003/2013 - SUBST. DO PLASMA E DAS FRACÇÕES PROTEICAS,Concurso público,Aquisição de bens móveis,"33600000-6, Produtos farmacêuticos","Centro Hospitalar Barreiro Montijo, E. P. E. (509186998)","CLS BERING, UNIPESSOAL, LDA (503047201)","29.700,00 €",30-03-2015,18-01-2013,365 dias,"Portugal, Setúbal, Barreiro","Artigo 20.º, n.º 1, alínea b) do Código dos Contratos Públicos",31-12-2013,"29.700,00 €","","",,Não aplicável.,Não aplicável.,FALSE
4S0042/2014 - Fornecimento de Serviços de Enfermagem ao CHBM EPE,Ajuste Direto Regime Geral,Aquisição de serviços,"79624000-4, Serviços de fornecimento de pessoal de enfermagem","CHBM - Centro Hospital Barreiro Montijo, EPE (509186998)","Kelly Services - Healthcare, Unipessoal Lda. (510723691)","40.352,00 €",27-03-2015,12-09-2014,122 dias,"Portugal, Setúbal, Barreiro","Artigo 20.º, n.º 1, alínea a) do Código dos Contratos Públicos",31-12-2014,"23.965,06 €","",Sem necessidade de consumo do total de horas estimadas,,Não aplicável.,Não aplicável.,FALSE
4S0035/2014 CONTRATAÇÃO DE SERVIÇOS DE ENFERMAGEM,Ajuste Direto Regime Geral,Aquisição de serviços,"79624000-4, Serviços de fornecimento de pessoal de enfermagem","Centro Hospitalar Barreiro Montijo, E. P. E. (509186998)","Kelly Services - Healthcare, Unipessoal Lda. (510723691)","15.132,00 €",27-03-2015,12-06-2014,184 dias,"Portugal, Setúbal, Barreiro","Artigo 20.º, n.º 1, alínea a) do Código dos Contratos Públicos",30-09-2014,"14.805,84 €","",Consumos inferiores aos inicialmente estimados,,Não aplicável.,Não aplicável.,FALSE
4S0005/2014 Serviços de Apoio aos Serviços Gerais do CHBM,Ajuste Direto Regime Geral,Aquisição de serviços,"79610000-3, Serviços de colocação de pessoal","CHBM - Centro Hospital Barreiro Montijo, EPE (509186998)","Helped, Prestação de Serviços de Saúde, Lda. (506069010)","74.952,00 €",27-03-2015,13-01-2014,365 dias,"Portugal, Setúbal, Barreiro","Artigo 20.º, n.º 1, alínea a) do Código dos Contratos Públicos",31-12-2014,"69.587,60 €","",Consumos realizados inferiores aos estimados,,Não aplicável.,Não aplicável.,FALSE
"4S0038/2014 Prestação de Serviços para colocação de Físicos no CHBM, EPE",Ajuste Direto Regime Geral,Aquisição de serviços,"79610000-3, Serviços de colocação de pessoal","Centro Hospitalar Barreiro Montijo, E. P. E. (509186998)","Helped, Prestação de Serviços de Saúde, Lda. (506069010)","9.000,00 €",27-03-2015,14-07-2014,184 dias,"Portugal, Setúbal, Barreiro","Artigo 20.º, n.º 1, alínea a) do Código dos Contratos Públicos",31-12-2014,"8.910,00 €","",Consumos inferiores aos inicialmente estimados,,Não aplicável.,Não aplicável.,FALSE
"4S0019/2014 Prestação de Serviços para colocação de Fisicos no CHBM, EPE",Ajuste Direto Regime Geral,Aquisição de serviços,"79610000-3, Serviços de colocação de pessoal","Centro Hospitalar Barreiro Montijo, E. P. E. (509186998)","Helped, Prestação de Serviços de Saúde, Lda. (506069010)","15.280,00 €",27-03-2015,07-03-2014,149 dias,"Portugal, Setúbal, Barreiro","Artigo 20.º, n.º 1, alínea a) do Código dos Contratos Públicos",30-06-2014,"5.960,00 €","",A prestação de serviços iniciou 1 mes mais tarde,,Não aplicável.,Não aplicável.,FALSE
4S0003/2014 Serviços de Carpintaria,Ajuste Direto Regime Geral,Aquisição de serviços,"98390000-3, Outros serviços","CHBM - Centro Hospital Barreiro Montijo, EPE (509186998)","Randstad Clinical - Cuidados de Saúde, Lda. (505121247)","11.000,00 €",27-03-2015,10-01-2014,365 dias,"Portugal, Setúbal, Barreiro","Artigo 20.º, n.º 1, alínea a) do Código dos Contratos Públicos",31-12-2014,"9.851,33 €","",Consumos inferiores aos inicialmente estimados,,Não aplicável.,Não aplicável.,FALSE
"4S0024/2014 Serviços Técnicos de AVAC, Electromedicina e Engenharia Electrotécnica, incluindo GLEC e TIM 2",Ajuste Direto Regime Geral,Aquisição de serviços,"79610000-3, Serviços de colocação de pessoal","Centro Hospitalar Barreiro Montijo, E. P. E. (509186998)",SUCH - Serviço d Utilização Comum dos Hospitais (500900469),"155.000,00 €",27-03-2015,07-02-2014,365 dias,"Portugal, Setúbal, Barreiro","Artigo 20.º, n.º 1, alínea a) do Código dos Contratos Públicos",31-12-2014,"150.660,01 €","",Consumos inferiores ao inicialmente estimado,,Não aplicável.,Não aplicável.,FALSE
Luvas de uso medico,Ao abrigo de acordo-quadro (art.º 259.º),Aquisição de bens móveis,"33000000-0, Equipamento médico, medicamentos e produtos para cuidados pessoais","Centro Hospitalar Barreiro Montijo, E. P. E. (509186998)","EZEQUIEL PANAO JORGE, LDA (501412727)","2.642,00 €",27-03-2015,28-02-2014,365 dias,"Portugal, Setúbal, Barreiro",Artigo 259.º do Código dos Contratos Públicos,31-12-2014,"1,57 €","",Diminuição de consumos,,544071,"CONCURSO PÚBLICO PARA A CELEBRAÇÃO DE CONTRATOS PÚBLICOS DE APROVISIONAMENTO PARA A ÁREA DA SAÚDE, COM VISTA AO FORNECIMENTO DE LUVAS PARA USO MÉDICO, ÀS INSTITUIÇÕES E SERVIÇOS DO SERVIÇO NACIONAL DE SAÚDE",FALSE
Fornecimento de Serviços de Gestão Integrada de Resíduos Hospitalares,Ajuste Direto Regime Geral,Aquisição de serviços,"60000000-8, Serviços de transporte (excl. transporte de resíduos)","Centro Hospitalar Barreiro Montijo, E. P. E. (509186998)","Ambimed - Gestão Ambiental, Ldª (503593427)","209.242,59 €",27-03-2015,25-02-2014,365 dias,"Portugal, Setúbal, Barreiro","Artigo 27.º, n.º 1, alínea a) do Código dos Contratos Públicos",31-12-2014,"198.201,50 €","",Necessidades inferiores à previsão,,Não aplicável.,Não aplicável.,FALSE
4SI0019/2014 Serviços Médicos de Imagiologia,Ao abrigo de acordo-quadro (art.º 259.º),Aquisição de serviços,"79625000-1, Serviços de fornecimento de pessoal médico","Centro Hospitalar Barreiro Montijo, E. P. E. (509186998)","Randstad Clinical - Cuidados de Saúde, Lda. (505121247)","14.040,00 €",27-03-2015,10-07-2014,184 dias,"Portugal, Setúbal, Barreiro",Artigo 259.º do Código dos Contratos Públicos,31-12-2014,"2.385,00 €","",Consumos inferiores aos inicialmente estimados,,454020,"CONCURSO PÚBLICO PARA A CELEBRAÇÃO DE CONTRATOS PÚBLICOS DE APROVISIONAMENTO PARA A ÁREA DA SAÚDE, COM VISTA À PRESTAÇÃO DE SERVIÇOS MÉDICOS ÀS INSTITUIÇÕES E SERVIÇOS DO SERVIÇO NACIONAL DE SAÚDE",FALSE
Material de ostomia e eliminação,Ao abrigo de acordo-quadro (art.º 259.º),Aquisição de bens móveis,"33000000-0, Equipamento médico, medicamentos e produtos para cuidados pessoais","Centro Hospitalar Barreiro Montijo, E. P. E. (509186998)","KVTECH PORTUGAL - PROD. MEDICOS UNIP., LDA (508671531)","224,31 €",27-03-2015,14-02-2014,365 dias,"Portugal, Setúbal, Barreiro",Artigo 259.º do Código dos Contratos Públicos,31-12-2014,"224,31 €","","",,419168,CONCURSO PÚBLICO PARA A CELEBRAÇÃO DE CONTRATOS PÚBLICOS DE APROVISIONAMENTO PARA AQUISIÇÃO DE MATERIAL OSTOMIA DE ELIMINAÇÃO,FALSE
Material de ostomia e eliminação,Ao abrigo de acordo-quadro (art.º 259.º),Aquisição de bens móveis,"33000000-0, Equipamento médico, medicamentos e produtos para cuidados pessoais","Centro Hospitalar Barreiro Montijo, E. P. E. (509186998)","B. BRAUN MEDICAL, LDA (501506543)","300,00 €",27-03-2015,14-02-2014,365 dias,"Portugal, Setúbal, Barreiro",Artigo 259.º do Código dos Contratos Públicos,31-12-2014,"","",não necessidade do material,,419168,CONCURSO PÚBLICO PARA A CELEBRAÇÃO DE CONTRATOS PÚBLICOS DE APROVISIONAMENTO PARA AQUISIÇÃO DE MATERIAL OSTOMIA DE ELIMINAÇÃO,FALSE
"Fornecimento de Reagentes para Bioquímica/Urgência ao CHBM, EPE",Ajuste Direto Regime Geral,Aquisição de bens móveis,"33696000-5, Reagentes e meios de contraste","Centro Hospitalar Barreiro Montijo, E. P. E. (509186998)","Abbott Laboratórios, Ldª  (500006148)","340.943,17 €",27-03-2015,03-02-2014,365 dias,"Portugal, Setúbal, Barreiro","Artigo 26.º, n.º 1, alínea a) do Código dos Contratos Públicos",31-12-2014,"340.304,00 €","",Necessidade inferior à previsão,,Não aplicável.,Não aplicável.,FALSE
4SI0004/2014 Serviços Médicos de Medicina Interna,Ao abrigo de acordo-quadro (art.º 259.º),Aquisição de serviços,"79625000-1, Serviços de fornecimento de pessoal médico","Centro Hospitalar Barreiro Montijo, E. P. E. (509186998)","Kelly Services - Healthcare, Unipessoal Lda. (510723691)","224.640,00 €",27-03-2015,30-05-2014,365 dias,"Portugal, Setúbal, Barreiro",Artigo 259.º do Código dos Contratos Públicos,31-12-2014,"182.849,77 €","",Consumos inferiores aos inicialmente estimados,,454020,"CONCURSO PÚBLICO PARA A CELEBRAÇÃO DE CONTRATOS PÚBLICOS DE APROVISIONAMENTO PARA A ÁREA DA SAÚDE, COM VISTA À PRESTAÇÃO DE SERVIÇOS MÉDICOS ÀS INSTITUIÇÕES E SERVIÇOS DO SERVIÇO NACIONAL DE SAÚDE",FALSE
4SI0016/2014 Serviços Médicos de Urologia,Ao abrigo de acordo-quadro (art.º 259.º),Aquisição de serviços,"79625000-1, Serviços de fornecimento de pessoal médico","Centro Hospitalar Barreiro Montijo, E. P. E. (509186998)","Kelly Services - Healthare, Unipessoal Lda. (510723691)","12.600,00 €",27-03-2015,01-07-2014,214 dias,"Portugal, Setúbal, Barreiro",Artigo 259.º do Código dos Contratos Públicos,31-12-2014,"7.983,21 €","",Consumos inferiores aos inicialmente estimados,,454020,"CONCURSO PÚBLICO PARA A CELEBRAÇÃO DE CONTRATOS PÚBLICOS DE APROVISIONAMENTO PARA A ÁREA DA SAÚDE, COM VISTA À PRESTAÇÃO DE SERVIÇOS MÉDICOS ÀS INSTITUIÇÕES E SERVIÇOS DO SERVIÇO NACIONAL DE SAÚDE",FALSE
4SI0015/2014 Serviços Médicos de Oftalmologia,Ao abrigo de acordo-quadro (art.º 259.º),Aquisição de serviços,"79625000-1, Serviços de fornecimento de pessoal médico","Centro Hospitalar Barreiro Montijo, E. P. E. (509186998)","Randstad Clinical - Cuidados de Saúde, Lda. (505121247)","18.720,00 €",27-03-2015,10-07-2014,184 dias,"Portugal, Setúbal, Barreiro",Artigo 259.º do Código dos Contratos Públicos,31-12-2014,"14.845,25 €","",Consumos inferiores aos inicialmente estimados,,454020,"CONCURSO PÚBLICO PARA A CELEBRAÇÃO DE CONTRATOS PÚBLICOS DE APROVISIONAMENTO PARA A ÁREA DA SAÚDE, COM VISTA À PRESTAÇÃO DE SERVIÇOS MÉDICOS ÀS INSTITUIÇÕES E SERVIÇOS DO SERVIÇO NACIONAL DE SAÚDE",FALSE
4SI0012/2014 Serviços Médicos de Cardiologia,Ao abrigo de acordo-quadro (art.º 259.º),Aquisição de serviços,"79625000-1, Serviços de fornecimento de pessoal médico","Centro Hospitalar Barreiro Montijo, E. P. E. (509186998)","Randstad Clinical - Cuidados de Saúde, Lda. (505121247)","86.400,00 €",27-03-2015,10-04-2014,275 dias,"Portugal, Setúbal, Barreiro",Artigo 259.º do Código dos Contratos Públicos,31-12-2014,"41.461,66 €","",Consumos inferiores aos inicialmente estimados,,454020,"CONCURSO PÚBLICO PARA A CELEBRAÇÃO DE CONTRATOS PÚBLICOS DE APROVISIONAMENTO PARA A ÁREA DA SAÚDE, COM VISTA À PRESTAÇÃO DE SERVIÇOS MÉDICOS ÀS INSTITUIÇÕES E SERVIÇOS DO SERVIÇO NACIONAL DE SAÚDE",FALSE
Refularização de Serviços Prestados,Ajuste Direto Regime Geral,Aquisição de serviços,"79100000-5, Serviços jurídicos","Centro Hospitalar Barreiro Montijo, E. P. E. (509186998)",José Manuel de Carvalho Santana Carlos (103423893),"5.350,00 €",27-03-2015,17-11-2014,30 dias,"Portugal, Setúbal, Barreiro","Artigo 27.º, n.º 1, alínea a) do Código dos Contratos Públicos",30-11-2014,"5.350,00 €","","",,Não aplicável.,Não aplicável.,FALSE
4SI0009/2014 Serviços Médicos de Psiquiatria,Ao abrigo de acordo-quadro (art.º 259.º),Aquisição de serviços,"79625000-1, Serviços de fornecimento de pessoal médico","Centro Hospitalar Barreiro Montijo, E. P. E. (509186998)","GS24 - Healthcare Solutions, SA (507824652)","37.440,00 €",27-03-2015,05-02-2014,365 dias,"Portugal, Setúbal, Barreiro",Artigo 259.º do Código dos Contratos Públicos,31-12-2014,"13.087,64 €","",Consumos inferiores aos inicialmente estimados,,454020,"CONCURSO PÚBLICO PARA A CELEBRAÇÃO DE CONTRATOS PÚBLICOS DE APROVISIONAMENTO PARA A ÁREA DA SAÚDE, COM VISTA À PRESTAÇÃO DE SERVIÇOS MÉDICOS ÀS INSTITUIÇÕES E SERVIÇOS DO SERVIÇO NACIONAL DE SAÚDE",FALSE
Publicação de anúncios na INCM,Ajuste Direto Regime Geral,Aquisição de serviços,"65000000-3, Serviços públicos","Centro Hospitalar Barreiro Montijo, E. P. E. (509186998)",Imprensa Nacional Casa da Moeda (500792887),"5.596,78 €",27-03-2015,26-05-2014,210 dias,"Portugal, Setúbal, Barreiro","Artigo 27.º, n.º 1, alínea a) do Código dos Contratos Públicos",31-12-2014,"5.596,78 €","","",,Não aplicável.,Não aplicável.,FALSE
4SI0008/2014 Serviços Médicos de Cirurgia Geral,Ao abrigo de acordo-quadro (art.º 259.º),Aquisição de serviços,"79625000-1, Serviços de fornecimento de pessoal médico","Centro Hospitalar Barreiro Montijo, E. P. E. (509186998)","GS24 - Healthcare Solutions, SA (507824652)","87.360,00 €",27-03-2015,13-01-2014,365 dias,"Portugal, Setúbal, Barreiro",Artigo 259.º do Código dos Contratos Públicos,31-12-2014,"63.462,84 €","",Consumos inferiores aos inicialmente estimados,,454020,"CONCURSO PÚBLICO PARA A CELEBRAÇÃO DE CONTRATOS PÚBLICOS DE APROVISIONAMENTO PARA A ÁREA DA SAÚDE, COM VISTA À PRESTAÇÃO DE SERVIÇOS MÉDICOS ÀS INSTITUIÇÕES E SERVIÇOS DO SERVIÇO NACIONAL DE SAÚDE",FALSE
4I0001/2014 Material de penso tradicional ou classico,Ao abrigo de acordo-quadro (art.º 259.º),Aquisição de bens móveis,"33000000-0, Equipamento médico, medicamentos e produtos para cuidados pessoais","Centro Hospitalar Barreiro Montijo, E. P. E. (509186998)","BASTOS VIEGAS, S.A. (500042772)","24.789,06 €",27-03-2015,07-05-2014,365 dias,"Portugal, Setúbal, Barreiro",Artigo 259.º do Código dos Contratos Públicos,31-12-2014,"14,53 €","",por questões técnicas não conseguimos lançar todos os contratos,,534953,"CONCURSO PÚBLICO PARA A CELEBRAÇÃO DE CONTRATOS PÚBLICOS DE APROVISIONAMENTO PARA A ÁREA DA SAÚDE, COM VISTA AO FORNECIMENTO DE MATERIAL DE PENSO TRADICIONAL/CLASSICO - PARTE 1 - ÀS INSTITUIÇÕES E SERVIÇOS DO SERVIÇO NACIONAL DE SAÚDE  ",FALSE
4SI0007/2014 Serviços Médicos de Pediatria,Ao abrigo de acordo-quadro (art.º 259.º),Aquisição de serviços,"79625000-1, Serviços de fornecimento de pessoal médico","Centro Hospitalar Barreiro Montijo, E. P. E. (509186998)","GS24 - Healthcare Solutions, SA (507824652)","74.880,00 €",27-03-2015,21-01-2014,365 dias,"Portugal, Setúbal, Barreiro",Artigo 259.º do Código dos Contratos Públicos,31-12-2014,"3.020,60 €","",Consumos inferiores aos inicialmente estimados,,454020,"CONCURSO PÚBLICO PARA A CELEBRAÇÃO DE CONTRATOS PÚBLICOS DE APROVISIONAMENTO PARA A ÁREA DA SAÚDE, COM VISTA À PRESTAÇÃO DE SERVIÇOS MÉDICOS ÀS INSTITUIÇÕES E SERVIÇOS DO SERVIÇO NACIONAL DE SAÚDE",FALSE
"Seguro de Acidentes de Trabalho aos CIT, nos meses Janeiro e Fevereiro",Ajuste Direto Regime Geral,Aquisição de serviços,"66510000-8, Serviços de seguros","Centro Hospitalar Barreiro Montijo, E. P. E. (509186998)","Sá Pereira do Lago, Ldª (500899703)","9.342,86 €",27-03-2015,12-02-2014,60 dias,"Portugal, Setúbal, Barreiro","Artigo 27.º, n.º 1, alínea a) do Código dos Contratos Públicos",28-02-2014,"9.342,86 €","","",,Não aplicável.,Não aplicável.,FALSE
4SI0006/2014 Serviços Médicos de Ortopedia,Ao abrigo de acordo-quadro (art.º 259.º),Aquisição de serviços,"79625000-1, Serviços de fornecimento de pessoal médico","Centro Hospitalar Barreiro Montijo, E. P. E. (509186998)","GS24 - Healthcare Solutions, SA (507824652)","18.720,00 €",27-03-2015,22-01-2014,365 dias,"Portugal, Setúbal, Barreiro",Artigo 259.º do Código dos Contratos Públicos,31-12-2014,"13.023,36 €","",Consumos inferiores aos inicialmente estimados,,454020,"CONCURSO PÚBLICO PARA A CELEBRAÇÃO DE CONTRATOS PÚBLICOS DE APROVISIONAMENTO PARA A ÁREA DA SAÚDE, COM VISTA À PRESTAÇÃO DE SERVIÇOS MÉDICOS ÀS INSTITUIÇÕES E SERVIÇOS DO SERVIÇO NACIONAL DE SAÚDE",FALSE
4SI0005/2014 Serviços Médicos de Obstetricia,Ao abrigo de acordo-quadro (art.º 259.º),Aquisição de serviços,"79625000-1, Serviços de fornecimento de pessoal médico","Centro Hospitalar Barreiro Montijo, E. P. E. (509186998)","GS24 - Halthcare Solutions, SA (507824652)","224.640,00 €",27-03-2015,13-01-2014,365 dias,"Portugal, Setúbal, Barreiro",Artigo 259.º do Código dos Contratos Públicos,31-12-2014,"182.849,77 €","",Consumos inferiores ao inicialmente estimados,,454020,"CONCURSO PÚBLICO PARA A CELEBRAÇÃO DE CONTRATOS PÚBLICOS DE APROVISIONAMENTO PARA A ÁREA DA SAÚDE, COM VISTA À PRESTAÇÃO DE SERVIÇOS MÉDICOS ÀS INSTITUIÇÕES E SERVIÇOS DO SERVIÇO NACIONAL DE SAÚDE",FALSE
4SI0003/2014 Serviços Médicos de Anestesia,Ao abrigo de acordo-quadro (art.º 259.º),Aquisição de serviços,"79625000-1, Serviços de fornecimento de pessoal médico","Centro Hospitalar Barreiro Montijo, E. P. E. (509186998)","GS24 - Healthcare Solutions, SA (507824652)","219.000,00 €",27-03-2015,21-01-2014,365 dias,"Portugal, Setúbal, Barreiro",Artigo 259.º do Código dos Contratos Públicos,31-12-2014,"103.203,43 €","",Consumo inferiores aos inicialmente estimados,,454020,"CONCURSO PÚBLICO PARA A CELEBRAÇÃO DE CONTRATOS PÚBLICOS DE APROVISIONAMENTO PARA A ÁREA DA SAÚDE, COM VISTA À PRESTAÇÃO DE SERVIÇOS MÉDICOS ÀS INSTITUIÇÕES E SERVIÇOS DO SERVIÇO NACIONAL DE SAÚDE",FALSE
4SI0002/2014 Serviços Médicos de Não Especialistas para a Urgência Pediátrica do CHBM,Ao abrigo de acordo-quadro (art.º 259.º),Aquisição de serviços,"79625000-1, Serviços de fornecimento de pessoal médico","Centro Hospitalar Barreiro Montijo, E. P. E. (509186998)","Randstad Clinical - Cuidados de Saúde, Lda. (505121247)","283.400,00 €",27-03-2015,21-01-2014,365 dias,"Portugal, Setúbal, Barreiro",Artigo 259.º do Código dos Contratos Públicos,31-12-2014,"230.930,95 €","",Consumos inferiores aos inicialmente estimados,,454020,"CONCURSO PÚBLICO PARA A CELEBRAÇÃO DE CONTRATOS PÚBLICOS DE APROVISIONAMENTO PARA A ÁREA DA SAÚDE, COM VISTA À PRESTAÇÃO DE SERVIÇOS MÉDICOS ÀS INSTITUIÇÕES E SERVIÇOS DO SERVIÇO NACIONAL DE SAÚDE",FALSE
4S0010/2014 - Contrato prestação serviços impressão e cópia - 1 semestre 2014,Ajuste Direto Regime Geral,Aquisição de serviços,"50000000-5, Serviços de reparação e manutenção","Centro Hospitalar Barreiro Montijo, E. P. E. (509186998)","ITEN Solutions - Sistemas de Informação, SA (510728189)","14.172,90 €",27-03-2015,09-01-2014,181 dias,"Portugal, Setúbal, Barreiro","Artigo 20.º, n.º 1, alínea a) do Código dos Contratos Públicos",30-06-2014,"14.172,90 €","","",,Não aplicável.,Não aplicável.,FALSE
"Lavagem e Tratamento de Roupa ao CHBM, EPE",Ajuste Direto Regime Geral,Aquisição de serviços,"98311000-6, Serviços de recolha de roupa por lavandarias","Centro Hospitalar Barreiro Montijo, E. P. E. (509186998)",SUCH - Serviço de Utilização Comum dos Hospitais (500900469),"242.965,80 €",27-03-2015,06-02-2014,365 dias,"Portugal, Setúbal, Barreiro","Artigo 27.º, n.º 1, alínea a) do Código dos Contratos Públicos",31-12-2014,"255.400,26 €","",Quantidade de roupa tratada superior à previsão,,Não aplicável.,Não aplicável.,FALSE
4SI0001/2014 Serviços Médicos de Não Especialistas para a Urgência Geral do CHBM,Ao abrigo de acordo-quadro (art.º 259.º),Aquisição de serviços,"79625000-1, Serviços de fornecimento de pessoal médico","Centro Hospitalar Barreiro Montijo, E. P. E. (509186998)","Randstad Clinical - Cuidados de Saúde, Lda. (505121247)","533.000,00 €",27-03-2015,17-02-2014,365 dias,"Portugal, Setúbal, Barreiro",Artigo 259.º do Código dos Contratos Públicos,31-12-2014,"439.727,17 €","",Consumos inferiores aos inicialmente estimados,,454020,"CONCURSO PÚBLICO PARA A CELEBRAÇÃO DE CONTRATOS PÚBLICOS DE APROVISIONAMENTO PARA A ÁREA DA SAÚDE, COM VISTA À PRESTAÇÃO DE SERVIÇOS MÉDICOS ÀS INSTITUIÇÕES E SERVIÇOS DO SERVIÇO NACIONAL DE SAÚDE",FALSE
P.S. de Segurança durante o mês de janeiro de 2014,Ajuste Direto Regime Geral,Aquisição de serviços,"79710000-4, Serviços de segurança","Centro Hospitalar Barreiro Montijo, E. P. E. (509186998)","EULEN - Portugal de Segurança, S.A. (505294869)","13.023,12 €",27-03-2015,21-01-2014,30 dias,"Portugal, Setúbal, Barreiro","Artigo 24.º, n.º 1, alínea c) do Código dos Contratos Públicos",31-01-2014,"13.023,12 €","","",,Não aplicável.,Não aplicável.,FALSE
P.S. Jurídicos,Ajuste Direto Regime Geral,Aquisição de serviços,"98390000-3, Outros serviços","Centro Hospitalar Barreiro Montijo, E. P. E. (509186998)",José Manuel de Carvalho Santana Carlos (103423893),"16.602,10 €",27-03-2015,16-01-2014,365 dias,"Portugal, Setúbal, Barreiro","Artigo 24.º, n.º 1, alínea c) do Código dos Contratos Públicos",31-12-2014,"16.602,10 €","","",,Não aplicável.,Não aplicável.,FALSE
4EXC0021-2015- BOMBAS INFUSORAS,Ajuste Direto Regime Geral,Aquisição de bens móveis,"33000000-0, Equipamento médico, medicamentos e produtos para cuidados pessoais","Centro Hospitalar Barreiro Montijo, E. P. E. (509186998)","GRUPO TAPER-EQUIP. PRECISÃO CIENT., LDA (506886336)","7.000,00 €",26-03-2015,16-02-2015,90 dias,"Portugal, Setúbal, Barreiro","Artigo 24.º, n.º 1, alínea e) do Código dos Contratos Públicos",09-03-2015,"7.000,00 €","","",,Não aplicável.,Não aplicável.,FALSE
4S0014/2014 Fornecimento de Serviços - MCDT - Telemedicina/Telerradiologia,Ajuste Direto Regime Geral,Aquisição de serviços,"85150000-5, Serviços de imagiologia médica","Centro Hospitalar Barreiro Montijo, E. P. E. (509186998)","ITM - Instituto de Telemedicina, Lda (506705641)","45.435,00 €",26-03-2015,21-01-2014,89 dias,"Portugal, Setúbal, Barreiro","Artigo 27.º, n.º 1, alínea a) do Código dos Contratos Públicos",31-03-2014,"45.492,14 €","",Consumos superiores aos inicialmente estimados,,Não aplicável.,Não aplicável.,FALSE
"Prestação de Serviços de Higiene e Limpeza no CHBM, EPE",Ajuste Direto Regime Geral,Aquisição de serviços,"55130000-0, Outros serviços de hotelaria","Centro Hospitalar Barreiro Montijo, E. P. E. (509186998)",EULEN S.A. - Sucursal em Portugal (980122538),"778.204,41 €",26-03-2015,23-01-2014,365 dias,"Portugal, Setúbal, Barreiro","Artigo 27.º, n.º 1, alínea a) do Código dos Contratos Públicos",31-12-2014,"776.089,57 €","",valor dos consumíveis inferior à previsão,,Não aplicável.,Não aplicável.,FALSE
4S0034/2014 Fornecimento de Serviços - MCDT - Telemedicina/Telerradiologia,Ajuste Direto Regime Geral,Aquisição de serviços,"85150000-5, Serviços de imagiologia médica","Centro Hospitalar Barreiro Montijo, E. P. E. (509186998)","ITM - Instituto de Telemedicina, Lda. (506705641)","45.435,00 €",26-03-2015,30-04-2014,122 dias,"Portugal, Setúbal, Barreiro","Artigo 27.º, n.º 1, alínea a) do Código dos Contratos Públicos",31-08-2014,"77.768,88 €",Houve necessidade de reforçar por mais 2 meses,Houve necessidade de reforçar por mais 2 meses e consequentemente houve aumento de valores,,Não aplicável.,Não aplicável.,FALSE
40061-2014-DIVERSO MATERIAL INFORMATICA,Ajuste Direto Regime Geral,Aquisição de bens móveis,"48000000-8, Pacotes de software e sistemas de informação","Centro Hospitalar Barreiro Montijo, E. P. E. (509186998)",BASEDOIS (501333401),"55.816,00 €",26-03-2015,18-12-2014,365 dias,"Portugal, Setúbal, Barreiro",Artigo 258.º do Código dos Contratos Públicos,31-12-2014,"55.816,00 €","","",,Não aplicável.,Não aplicável.,FALSE
4S0006/2014 Fornecimento de Serviços Médicos de Cirurgia Pediátrica,Ajuste Direto Regime Geral,Aquisição de serviços,"79625000-1, Serviços de fornecimento de pessoal médico","Centro Hospitalar Barreiro Montijo, E. P. E. (509186998)","ALONBER - CONSULTA E SERVIÇOS, LDA. (503783862)","35.000,00 €",26-03-2015,15-01-2014,365 dias,"Portugal, Setúbal, Barreiro","Artigo 20.º, n.º 1, alínea a) do Código dos Contratos Públicos",31-12-2014,"32.910,00 €","",Consumos inferiores aos inicialmente estimados,,Não aplicável.,Não aplicável.,FALSE
Prestação de Serviços de Segurança,Concurso público,Aquisição de serviços,"79714000-2, Serviços de vigilância","Centro Hospitalar Barreiro Montijo, E. P. E. (509186998)",Eulen Portugal de Segurança S.A. (505294869),"156.333,15 €",26-03-2015,14-02-2014,365 dias,"Portugal, Setúbal, Barreiro","Artigo 20.º, n.º 2, alínea b), subalínea i) do Código dos Contratos Públicos",31-12-2014,"143.254,35 €","",Previsão inicial para 12 meses e a realidade corresponde apenas a 11 meses,,Não aplicável.,Não aplicável.,FALSE
"Fornecimento de Alimentação a Doentes e Funcionarios do CHBM, EPE",Concurso público,Aquisição de serviços,"55320000-9, Serviços de provimento de refeições","Centro Hospitalar Barreiro Montijo, E. P. E. (509186998)",ITAU - Instituto Técnico Alimentação Humana S.A. (500142858),"787.545,28 €",26-03-2015,05-12-2013,365 dias,"Portugal, Setúbal, Barreiro","Artigo 20.º, n.º 2, alínea b), subalínea i) do Código dos Contratos Públicos",31-12-2014,"827.902,34 €","",Quantidades fornecidas superiores à previsão,,Não aplicável.,Não aplicável.,FALSE
4S0043/2014 - Contrato prestação de serviços impressão e cópia - 2 semestre 2014,Ajuste Direto Regime Geral,Aquisição de serviços,"50000000-5, Serviços de reparação e manutenção","Centro Hospitalar Barreiro Montijo, E. P. E. (509186998)","ITEN SOLUTIONS - Sistemas de Informação, SA (510728189)","14.172,90 €",26-03-2015,20-08-2014,184 dias,"Portugal, Setúbal, Barreiro","Artigo 20.º, n.º 1, alínea a) do Código dos Contratos Públicos",31-12-2014,"14.172,90 €","","",,Não aplicável.,Não aplicável.,FALSE
4S0030/2014 - Serviços Médicos de MCDT - Ecografias Obstétricas e Ginecológicas,Ajuste Direto Regime Geral,Aquisição de serviços,"85140000-2, Serviços de saúde diversos","CHBM - Centro Hospital Barreiro Montijo, EPE (509186998)","DIMASUL, Diagnóstico pela Imagem Sul, Lda. (502654643)","13.076,50 €",26-03-2015,30-05-2014,214 dias,"Portugal, Setúbal, Barreiro","Artigo 20.º, n.º 1, alínea a) do Código dos Contratos Públicos",31-12-2014,"12.633,73 €","",Consumos inferiores aos inicialmente estimados,,Não aplicável.,Não aplicável.,FALSE
4CPS0001/2014 Fornecimento de Serviços de Gastrenterologia - MCDT,Ajuste Direto Regime Geral,Aquisição de serviços,"79625000-1, Serviços de fornecimento de pessoal médico","Centro Hospitalar Barreiro Montijo, E. P. E. (509186998)","Foco Positivo - Actividades Médicas, Lda. (509620426)","32.330,80 €",26-03-2015,14-01-2014,365 dias,"Portugal, Setúbal, Barreiro","Artigo 27.º, n.º 1, alínea a) do Código dos Contratos Públicos",31-12-2014,"29.607,35 €","",Consumos inferiores ao inicialmente estimado,,Não aplicável.,Não aplicável.,FALSE
40040-2014 DIVERSO MATERIAL DE INFORMATICA,Ajuste Direto Regime Geral,Aquisição de bens móveis,"48000000-8, Pacotes de software e sistemas de informação","Centro Hospitalar Barreiro Montijo, E. P. E. (509186998)",EL CORTE INGLES (980079569),"42.885,02 €",26-03-2015,04-04-2014,365 dias,Espanha,Artigo 258.º do Código dos Contratos Públicos,04-04-2014,"42.885,02 €","","",,Não aplicável.,Não aplicável.,FALSE
4S0004/2014 Fornecimento de Serviços - MCDT - Electromiogramas e Electroencefalogramas,Ajuste Direto Regime Geral,Aquisição de serviços,"79625000-1, Serviços de fornecimento de pessoal médico","Centro Hospitalar Barreiro Montijo, E. P. E. (509186998)","Clinica Check-Up, Lda. (500782474)","27.075,00 €",26-03-2015,14-01-2014,365 dias,"Portugal, Setúbal, Barreiro","Artigo 20.º, n.º 1, alínea a) do Código dos Contratos Públicos",31-12-2014,"22.243,37 €","",Consumos inferiores ao inicialmente estimado,,Não aplicável.,Não aplicável.,FALSE
"S10007/2015 Fornecimento de Serviços de Telerradiologia aos Doentes dos CHBM EPE, CHS EPE e HGO EPE",Concurso público,Aquisição de serviços,"85150000-5, Serviços de imagiologia médica","Centro Hospitalar de Setúbal, E. P. E. (507606787), Centro Hospitalar Barreiro Montijo, E. P. E. (509186998), Hospital Garcia de Orta, EPE (506361470)","ITM - Instituto de Telemedicina, Lda (506705641)","74.732,63 €",26-03-2015,11-09-2014,122 dias,"Portugal, Setúbal, Barreiro","Artigo 20.º, n.º 1, alínea b) do Código dos Contratos Públicos",31-12-2014,"34.984,50 €","","O procedimento foi realizado para 3 entidades (valor do preço base), sendo apenas uma parte adjudicada ao CHBM.",,Não aplicável.,Não aplicável.,TRUE
4S0033/2014 - Reforço do alimentador elétrico e substituição de equipamentos de corte e protecção,Ajuste Direto Regime Geral,Aquisição de serviços,"50000000-5, Serviços de reparação e manutenção","Centro Hospitalar Barreiro Montijo, E. P. E. (509186998)","Hepafiltra, Ar condicionado e filtragem de ar, Lda. (503615072)","24.159,00 €",26-03-2015,23-04-2014,365 dias,"Portugal, Setúbal, Barreiro","Artigo 20.º, n.º 1, alínea a) do Código dos Contratos Públicos",30-12-2014,"24.159,00 €","","",,Não aplicável.,Não aplicável.,FALSE
