Objeto do Contrato,Tipo de Procedimento,Tipo(s) de Contrato,CPVs,Entidade(s) Adjudicante(s),Entidade(s) Adjudicatária(s),Preço Contratual,Data de Publicação,Data de Celebração do Contrato,Prazo de Execução,Local de Execução,Fundamentação,Data de Fecho do Contrato,Preço Total Efetivo,Causas das Alterações ao Prazo,Causas das Alterações ao Preço,Estado,N.º registo do Acordo Quadro,Descrição do Acordo Quadro,Procedimento Centralizado
"Prestação de Serviços Médicos na Especialidade de Anestesiologia, na ULSNA, EPE (Maio e Junho/2017)",Ajuste Direto Regime Geral,Aquisição de serviços,"85100000-0, Serviços de saúde","Unidade Local de Saúde do Norte Alentejano, E. P. E. (508094461)",Ciclipolis Serviços Médicos Lda (508320526),"197.580,00 €",21-07-2017,20-07-2017,184 dias,"Portugal, Portalegre, Portalegre","Artigo 24.º, n.º 1, alínea c) do Código dos Contratos Públicos",20-07-2017,"197.580,00 €",,"",,Não aplicável.,Não aplicável.,FALSE
"Prestação de Serviços Médicos na Especialidade de Anestesiologia, na ULSNA, EPE (Maio e Junho/2017)",Ajuste Direto Regime Geral,Aquisição de serviços,"85100000-0, Serviços de saúde","Unidade Local de Saúde do Norte Alentejano, E. P. E. (508094461)",Ciclipolis Serviços Médicos Lda (508320526),"99.805,00 €",21-07-2017,20-07-2017,61 dias,"Portugal, Portalegre, Portalegre","Artigo 24.º, n.º 1, alínea c) do Código dos Contratos Públicos",20-07-2017,"99.805,00 €",,"",,Não aplicável.,Não aplicável.,FALSE
"Prestação de Serviços Médicos na Especialidade de Anestesiologia, na ULSNA, EPE (Abril 2017)",Ajuste Direto Regime Geral,Aquisição de serviços,"85100000-0, Serviços de saúde","Unidade Local de Saúde do Norte Alentejano, E. P. E. (508094461)",Ciclipolis Serviços Médicos Lda (508320526),"51.965,00 €",21-07-2017,22-05-2017,30 dias,"Portugal, Portalegre, Portalegre","Artigo 24.º, n.º 1, alínea c) do Código dos Contratos Públicos",22-05-2017,"51.965,00 €",,"",,Não aplicável.,Não aplicável.,FALSE
"Prestação de Serviços Médicos na Especialidade de Psiquiatria na ULSNA, EPE (Junho a Dezembro de 2017)",Ajuste Direto Regime Geral,Aquisição de serviços,"85100000-0, Serviços de saúde","Unidade Local de Saúde do Norte Alentejano, E. P. E. (508094461)",Clinica de Psiquiatria e Saúde Ocupacional Ilda Vieira Murta (506201902),"8.853,55 €",20-07-2017,08-06-2017,214 dias,"Portugal, Portalegre, Portalegre","Artigo 24.º, n.º 1, alínea b) do Código dos Contratos Públicos",08-06-2017,"8.853,55 €",,"",,Não aplicável.,Não aplicável.,FALSE
"Prestação Serviços Médicos, na Especialidade de Medicina Interna, na ULSNA, EPE (Abril de 2017)",Ajuste Direto Regime Geral,Aquisição de serviços,"85100000-0, Serviços de saúde","Unidade Local de Saúde do Norte Alentejano, E. P. E. (508094461)",MEDIPEOPLE- LDA (508543436),"22.360,00 €",20-07-2017,29-05-2017,30 dias,"Portugal, Portalegre, Portalegre","Artigo 20.º, n.º 1, alínea a) do Código dos Contratos Públicos",29-05-2017,"22.360,00 €",,"",,Não aplicável.,Não aplicável.,FALSE
"Prestação Serviços Médicos, na UCI, na ULSNA, EPE (Abril a Dezembro de 2017)",Ajuste Direto Regime Geral,Aquisição de serviços,"85100000-0, Serviços de saúde","Unidade Local de Saúde do Norte Alentejano, E. P. E. (508094461)","Honorismédica, Lda (509799191)","32.760,00 €",20-07-2017,29-05-2017,275 dias,"Portugal, Portalegre, Portalegre","Artigo 24.º, n.º 1, alínea c) do Código dos Contratos Públicos",29-05-2017,"32.760,00 €",,"",,Não aplicável.,Não aplicável.,FALSE
"Prestação Serviços Médicos, na UCI, na ULSNA, EPE (Abril a Dezembro de 2017)",Ajuste Direto Regime Geral,Aquisição de serviços,"85100000-0, Serviços de saúde","Unidade Local de Saúde do Norte Alentejano, E. P. E. (508094461)","Begin Future, Lda (508738300)","15.120,00 €",20-07-2017,29-05-2017,275 dias,"Portugal, Portalegre, Portalegre","Artigo 24.º, n.º 1, alínea c) do Código dos Contratos Públicos",29-05-2017,"15.120,00 €",,"",,Não aplicável.,Não aplicável.,FALSE
"Prestação Serviços Médicos, na UCI, na ULSNA, EPE (Abril a Dezembro de 2017)",Ajuste Direto Regime Geral,Aquisição de serviços,"85100000-0, Serviços de saúde","Unidade Local de Saúde do Norte Alentejano, E. P. E. (508094461)","Jorge Vila, Lda (504227190)","87.570,00 €",20-07-2017,29-05-2017,275 dias,"Portugal, Portalegre, Portalegre","Artigo 24.º, n.º 1, alínea c) do Código dos Contratos Públicos",29-05-2017,"87.570,00 €",,"",,Não aplicável.,Não aplicável.,FALSE
"Aquisição de Máquinas Sutura, extractores Agrafes e Conjuntos de Fleboextracção, ULSNA 2017",Ajuste Direto Regime Geral,Aquisição de bens móveis,"33140000-3, Material médico de consumo","Unidade Local de Saúde do Norte Alentejano, E. P. E. (508094461)",Eurocasmédica (503322105),"705,60 €",11-07-2017,02-06-2017,210 dias,"Portugal, Portalegre","Artigo 20.º, n.º 1, alínea a) do Código dos Contratos Públicos",11-07-2017,"705,60 €",,"",,Não aplicável.,Não aplicável.,FALSE
"Prestação de Serviços de Manutenção de Dispositivos Médicos (designadamente sete ventiladores do Serviço de UCI e um ventilador do Serviço de Urgência), da Unidade Local de Saúde do Norte Alentejano, EPE.",Ajuste Direto Regime Geral,Aquisição de serviços,"50000000-5, Serviços de reparação e manutenção","Unidade Local de Saúde do Norte Alentejano, E. P. E. (508094461)",PULMOCOR (501402578),"8.040,96 €",11-07-2017,04-05-2017,365 dias,"Portugal, Portalegre, Portalegre","Artigo 24.º, n.º 1, alínea e) do Código dos Contratos Públicos",04-05-2017,"8.040,96 €",,"",,Não aplicável.,Não aplicável.,FALSE
"Fornecimento de Suturas Cirurgicas, para a ULSNA, EPE - 2017 - AQ 28/2015 SPMS",Ao abrigo de acordo-quadro (art.º 259.º),Aquisição de bens móveis,"33600000-6, Produtos farmacêuticos","Unidade Local de Saúde do N. Alentejano,EPE(ULSNA) (508094461)","MEDTRONIC PORTUGAL, LDA. (504223933)","463,68 €",11-07-2017,22-06-2017,180 dias,"Portugal, Portalegre",Artigo 259.º do Código dos Contratos Públicos,31-12-2017,"203,04 €",,Não foram adquiridas todas as quantidades estimadas.,,1830807,Acordo quadro para fornecimento de Suturas Cirúrgicas - Parte I   às Instituições e Serviços do Serviço Nacional de Saúde,FALSE
"Fornecimento de Suturas Cirurgicas, para a ULSNA, EPE - 2017 - AQ 28/2015 SPMS",Ao abrigo de acordo-quadro (art.º 259.º),Aquisição de bens móveis,"33600000-6, Produtos farmacêuticos","Unidade Local de Saúde do N. Alentejano,EPE(ULSNA) (508094461)","B BRAUN MEDICAL, LDA (501506543)","707,40 €",11-07-2017,22-06-2017,180 dias,"Portugal, Portalegre",Artigo 259.º do Código dos Contratos Públicos,31-12-2017,"549,36 €",,Não foram adquiridas todas as quantidades estimadas.,,1830807,Acordo quadro para fornecimento de Suturas Cirúrgicas - Parte I   às Instituições e Serviços do Serviço Nacional de Saúde,FALSE
