Objeto do Contrato,Tipo de Procedimento,Tipo(s) de Contrato,CPVs,Entidade(s) Adjudicante(s),Entidade(s) Adjudicatária(s),Preço Contratual,Data de Publicação,Data de Celebração do Contrato,Prazo de Execução,Local de Execução,Fundamentação,Data de Fecho do Contrato,Preço Total Efetivo,Causas das Alterações ao Prazo,Causas das Alterações ao Preço,Estado,N.º registo do Acordo Quadro,Descrição do Acordo Quadro,Procedimento Centralizado
"Aquisição de 148 frascos de Interferom Beta 1A, 6.000.000UI, seringa.",Ajuste Direto Regime Geral,Aquisição de bens móveis,"33000000-0, Equipamento médico, medicamentos e produtos para cuidados pessoais",Centro Hospitalar de Lisboa Central E.P.E. (508080142),"Biogen Idec Portugal, Lda. (506415740)","28.672,41 €",10-12-2012,03-12-2012,21 dias,"Portugal, Lisboa, Lisboa","Artigo 24.º, n.º 1, alínea e) do Código dos Contratos Públicos",,,,,,Não aplicável.,Não aplicável.,
Aquisição de 60 frascos de Imunoglobulina Humana 100mg/ml fr. 100ml (10g) e 60 frascos de Imunoglobulina Humana 100mg/ml fr. 50ml IV (5g).,Ajuste Direto Regime Geral,Aquisição de bens móveis,"33000000-0, Equipamento médico, medicamentos e produtos para cuidados pessoais",Centro Hospitalar de Lisboa Central E.P.E. (508080142),"CSL Behring, Lda. (503047201)","38.520,00 €",08-12-2012,03-12-2012,26 dias,"Portugal, Lisboa, Lisboa","Artigo 24.º, n.º 1, alínea e) do Código dos Contratos Públicos",,,,,,Não aplicável.,Não aplicável.,
"Aquisição de 800 embalagens de Factor Anti-Hemofilico (VIII), 1000UI.",Ajuste Direto Regime Geral,Aquisição de bens móveis,"33000000-0, Equipamento médico, medicamentos e produtos para cuidados pessoais",Centro Hospitalar de Lisboa Central E.P.E. (508080142),"Octapharma-Produtos Farmacêuticos, Lda. (502820780)","320.000,00 €",08-12-2012,05-12-2012,26 dias,"Portugal, Lisboa, Lisboa","Artigo 24.º, n.º 1, alínea e) do Código dos Contratos Públicos",,,,,,Não aplicável.,Não aplicável.,
"Aquisição de 350 ampolas de Anfotericina B Liposomica, 50mg, fr/amp.",Ajuste Direto Regime Geral,Aquisição de bens móveis,"33000000-0, Equipamento médico, medicamentos e produtos para cuidados pessoais",Centro Hospitalar de Lisboa Central E.P.E. (508080142),"Gilead Sciences, Lda. (503604704)","63.917,00 €",07-12-2012,07-12-2012,24 dias,"Portugal, Lisboa, Lisboa","Artigo 24.º, n.º 1, alínea e) do Código dos Contratos Públicos",,,,,,Não aplicável.,Não aplicável.,
"Aquisição de Darbepoietina alfa 500mcg, seringa",Ajuste Direto Regime Geral,Aquisição de bens móveis,"33000000-0, Equipamento médico, medicamentos e produtos para cuidados pessoais",Centro Hospitalar de Lisboa Central E.P.E. (508080142),"Amgen - Biofarmacêutica, Lda. (502942959)","49.572,00 €",06-12-2012,29-11-2012,30 dias,"Portugal, Lisboa, Lisboa","Artigo 24.º, n.º 1, alínea e) do Código dos Contratos Públicos",,,,,,Não aplicável.,Não aplicável.,
"Obras para Reparação da Extremidade da Laje de Cobertura do Edifício da MFR /Imagiologia do CHLC, EPE - Hospital São José",Ajuste Direto Regime Geral,Empreitadas de obras públicas,"45000000-7, Construção",Centro Hospitalar de Lisboa Central E.P.E. (508080142),OMEP (502022469),"7.464,47 €",06-12-2012,13-11-2012,25 dias,"Portugal, Lisboa, Lisboa","Artigo 19.º, alínea a) do Código dos Contratos Públicos",,,,,,Não aplicável.,Não aplicável.,
"Aquisição de Abciximab, 10mg, fr/amp 5ml",Ajuste Direto Regime Geral,Aquisição de bens móveis,"33000000-0, Equipamento médico, medicamentos e produtos para cuidados pessoais",Centro Hospitalar de Lisboa Central E.P.E. (508080142),"Lilly Portugal - Produtos Farmacêuticos, Lda. (500165602)","20.577,90 €",06-12-2012,05-12-2012,30 dias,"Portugal, Lisboa, Lisboa","Artigo 24.º, n.º 1, alínea e) do Código dos Contratos Públicos",,,,,,Não aplicável.,Não aplicável.,
"Prestação de Serviços para Reparação no Ascensor nº7 da CPR/Queimados do CHLC, EPE - Hospital São José",Ajuste Direto Regime Geral,Aquisição de serviços,"50800000-3, Serviços de reparação e manutenção diversos",Centro Hospitalar de Lisboa Central E.P.E. (508080142),SUCH-DALKIA (503718289),"5.538,84 €",06-12-2012,23-11-2012,8 dias,"Portugal, Lisboa, Lisboa","Artigo 24.º, n.º 1, alínea c) do Código dos Contratos Públicos",,,,,,Não aplicável.,Não aplicável.,
Carga Viral CMV e HCV,Ajuste Direto Regime Geral,Aquisição de bens móveis,"33696000-5, Reagentes e meios de contraste",Centro Hospitalar de Lisboa Central E.P.E. (508080142),"Roche Sistemas de Diagnosticos, Lda (504282921)","7.416,00 €",05-12-2012,29-11-2012,60 dias,"Portugal, Lisboa, Lisboa","Artigo 20.º, n.º 1, alínea a) do Código dos Contratos Públicos",,,,,,Não aplicável.,Não aplicável.,
"Aquisição de 1000 embalagens de Plasma Humano Inactivado, saco 200ml.",Ajuste Direto Regime Geral,Aquisição de bens móveis,"33000000-0, Equipamento médico, medicamentos e produtos para cuidados pessoais",Centro Hospitalar de Lisboa Central E.P.E. (508080142),"Octapharma-Produtos Farmacêuticos, Lda. (502820780)","90.000,00 €",05-12-2012,20-11-2012,26 dias,"Portugal, Lisboa, Lisboa","Artigo 24.º, n.º 1, alínea e) do Código dos Contratos Públicos",,,,,,Não aplicável.,Não aplicável.,
Aquisição de 40 embalagens de Cola de Fibrina (Sol. Est.) 4ml.,Ajuste Direto Regime Geral,Aquisição de bens móveis,"33000000-0, Equipamento médico, medicamentos e produtos para cuidados pessoais",Centro Hospitalar de Lisboa Central E.P.E. (508080142),"Baxter Medico Farmacêutica, Lda. (503347345)","8.400,00 €",05-12-2012,04-12-2012,26 dias,"Portugal, Lisboa, Lisboa","Artigo 24.º, n.º 1, alínea e) do Código dos Contratos Públicos",,,,,,Não aplicável.,Não aplicável.,
"Aquisição de 100 embalagens de Facotr VIII Recomb. s/ Albumina, 1000UI.",Ajuste Direto Regime Geral,Aquisição de bens móveis,"33000000-0, Equipamento médico, medicamentos e produtos para cuidados pessoais",Centro Hospitalar de Lisboa Central E.P.E. (508080142),"Laboratórios Pfizer, Lda. (500162166)","68.999,00 €",05-12-2012,23-11-2012,26 dias,"Portugal, Lisboa, Lisboa","Artigo 24.º, n.º 1, alínea e) do Código dos Contratos Públicos",,,,,,Não aplicável.,Não aplicável.,
Diveros material de osteossintese e próteses de anca e de joelho,Ajuste Direto Regime Geral,Aquisição de bens móveis,"33184100-4, Implantes cirúrgicos",Centro Hospitalar de Lisboa Central E.P.E. (508080142),Biomet Portugal Unipessoal (500254990),"33.820,30 €",03-12-2012,30-10-2012,30 dias,"Portugal, Lisboa, Lisboa","Artigo 24.º, n.º 1, alínea e) do Código dos Contratos Públicos",,,,,,Não aplicável.,Não aplicável.,
"Barras, parafusos e outros",Ajuste Direto Regime Geral,Aquisição de bens móveis,"33184100-4, Implantes cirúrgicos",Centro Hospitalar de Lisboa Central E.P.E. (508080142),"Zimmer, SA (980151716)","22.442,00 €",03-12-2012,29-10-2012,30 dias,"Portugal, Lisboa, Lisboa","Artigo 24.º, n.º 1, alínea e) do Código dos Contratos Públicos",,,,,,Não aplicável.,Não aplicável.,
Placas e parafusos de 1.5mm e 2.0mm e outros,Ajuste Direto Regime Geral,Aquisição de bens móveis,"33184100-4, Implantes cirúrgicos",Centro Hospitalar de Lisboa Central E.P.E. (508080142),Biomet Portugal Unipessoal (500254990),"6.336,50 €",03-12-2012,30-10-2012,30 dias,"Portugal, Lisboa, Lisboa","Artigo 24.º, n.º 1, alínea e) do Código dos Contratos Públicos",,,,,,Não aplicável.,Não aplicável.,
Barras 40mm e parafusos 6.5mm,Ajuste Direto Regime Geral,Aquisição de bens móveis,"33184100-4, Implantes cirúrgicos",Centro Hospitalar de Lisboa Central E.P.E. (508080142),Medtronic Portugal (504223933),"7.070,00 €",03-12-2012,22-10-2012,30 dias,"Portugal, Lisboa, Lisboa","Artigo 24.º, n.º 1, alínea e) do Código dos Contratos Públicos",,,,,,Não aplicável.,Não aplicável.,
Discos cervicais e outros,Ajuste Direto Regime Geral,Aquisição de bens móveis,"33184100-4, Implantes cirúrgicos",Centro Hospitalar de Lisboa Central E.P.E. (508080142),Medtronic Portugal (504223933),"7.050,00 €",03-12-2012,17-10-2012,30 dias,"Portugal, Lisboa, Lisboa","Artigo 24.º, n.º 1, alínea e) do Código dos Contratos Públicos",,,,,,Não aplicável.,Não aplicável.,
Consumíveis de osteossintese externa,Ajuste Direto Regime Geral,Aquisição de bens móveis,"33184100-4, Implantes cirúrgicos",Centro Hospitalar de Lisboa Central E.P.E. (508080142),"MBA Portugal, SA (504445960)","6.193,31 €",03-12-2012,10-10-2012,30 dias,"Portugal, Lisboa, Lisboa","Artigo 24.º, n.º 1, alínea e) do Código dos Contratos Públicos",,,,,,Não aplicável.,Não aplicável.,
Prótese de joelho,Ajuste Direto Regime Geral,Aquisição de bens móveis,"33184100-4, Implantes cirúrgicos",Centro Hospitalar de Lisboa Central E.P.E. (508080142),"MBA Portugal, SA (504445960)","14.731,00 €",03-12-2012,24-10-2012,30 dias,"Portugal, Lisboa, Lisboa","Artigo 24.º, n.º 1, alínea c) do Código dos Contratos Públicos",,,,,,Não aplicável.,Não aplicável.,
Diveros material de osteossintese e próteses de anca e de joelho,Ajuste Direto Regime Geral,Aquisição de bens móveis,"33184100-4, Implantes cirúrgicos",Centro Hospitalar de Lisboa Central E.P.E. (508080142),Biomet Portugal Unipessoal (500254990),"37.619,70 €",03-12-2012,26-09-2012,30 dias,"Portugal, Lisboa, Lisboa","Artigo 24.º, n.º 1, alínea e) do Código dos Contratos Públicos",,,,,,Não aplicável.,Não aplicável.,
Material de osteossintese para coluna lombar,Ajuste Direto Regime Geral,Aquisição de bens móveis,"33184100-4, Implantes cirúrgicos",Centro Hospitalar de Lisboa Central E.P.E. (508080142),"Zimmer, SA (980151716)","21.027,00 €",03-12-2012,26-09-2012,30 dias,"Portugal, Lisboa, Lisboa","Artigo 24.º, n.º 1, alínea e) do Código dos Contratos Públicos",,,,,,Não aplicável.,Não aplicável.,
Placas e parafusos 2.0mm e outros,Ajuste Direto Regime Geral,Aquisição de bens móveis,"33184100-4, Implantes cirúrgicos",Centro Hospitalar de Lisboa Central E.P.E. (508080142),Biomet Portugal Unipessoal (500254990),"5.724,50 €",03-12-2012,04-10-2012,30 dias,"Portugal, Lisboa, Lisboa","Artigo 24.º, n.º 1, alínea e) do Código dos Contratos Públicos",,,,,,Não aplicável.,Não aplicável.,
