Objeto do Contrato,Tipo de Procedimento,Tipo(s) de Contrato,CPVs,Entidade(s) Adjudicante(s),Entidade(s) Adjudicatária(s),Preço Contratual,Data de Publicação,Data de Celebração do Contrato,Prazo de Execução,Local de Execução,Fundamentação,Data de Fecho do Contrato,Preço Total Efetivo,Causas das Alterações ao Prazo,Causas das Alterações ao Preço,Estado,N.º registo do Acordo Quadro,Descrição do Acordo Quadro,Procedimento Centralizado
"Transferência de 16.000 pastas de documentação das instalações da ADSE,I.P. sita na Praça de Alvalade nº 8 Lisboa, com recolha, transporte, carga, descarga e arrumação ordenada das pastas de arquivo no armazém de Benfica.",Ajuste Direto Regime Geral,Aquisição de serviços,"60000000-8, Serviços de transporte (excl. transporte de resíduos)","Instituto de Proteção e Assistência na Doença, I. P. (514247517)","Transportadora Central do Campo de Santana, Lda. (500287414)","9.850,00 €",08-01-2018,17-02-2017,22 dias,"Portugal, Lisboa, Lisboa","Artigo 20.º, n.º 1, alínea a) do Código dos Contratos Públicos",21-03-2017,"9.850,00 €",,,,Não aplicável.,Não aplicável.,FALSE
"Prestação de higiene e limpeza para a ADSE, I.P.",Ajuste Direto Regime Geral,Aquisição de serviços,"90911200-8, Serviços de limpeza de edifícios","Instituto de Proteção e Assistência na Doença, I. P. (514247517)","SAMSIC Portugal - Facility Services, ,SA (504839748)","8.700,00 €",08-01-2018,24-02-2017,28 dias,"Portugal, Lisboa, Lisboa","Artigo 20.º, n.º 1, alínea a) do Código dos Contratos Públicos",28-02-2017,"8.700,00 €",,,,Não aplicável.,Não aplicável.,FALSE
Aquisição de Serviços de Catering,Ajuste Direto Regime Geral,Aquisição de serviços,"55520000-1, Serviços de fornecimento de refeições (catering)","Instituto de Proteção e Assistência na Doença, I. P. (514247517)",Pátio Velho - Restaurantes & Catering (507065450),"5.000,00 €",08-01-2018,20-12-2017,1 dias,"Portugal, Lisboa, Lisboa","Artigo 20.º, n.º 1, alínea a) do Código dos Contratos Públicos",22-12-2017,"5.000,00 €",,,,Não aplicável.,Não aplicável.,FALSE
Serviços de manutenção de hardware,Ajuste Direto Regime Geral,Aquisição de serviços,"50312610-4, Manutenção de equipamento para as tecnologias da informação","Instituto de Proteção e Assistência na Doença, I. P. (514247517)","Documática - Sistemas de Processamento de Meios de Pagamento e Imagem, Lda (503311111)","9.766,14 €",04-01-2018,08-11-2017,365 dias,"Portugal, Lisboa, Lisboa","Artigo 20.º, n.º 1, alínea a) do Código dos Contratos Públicos",09-11-2017,"9.766,14 €",,,,Não aplicável.,Não aplicável.,FALSE
