freguesia,acronym,validVotesPercentage,votes,dicofre
Caveira,PS,29.03,9,480201
Caveira,PCP-PEV,22.58,7,480201
Caveira,A,9.68,3,480201
Caveira,B.E.,9.68,3,480201
Caveira,CDS-PP,9.68,3,480201
Caveira,PPD/PSD,9.68,3,480201
Caveira,IL,3.23,1,480201
Caveira,PCTP/MRPP,3.23,1,480201
Caveira,PPM.PPV/CDC,3.23,1,480201
Caveira,L,0,0,480201
Caveira,MAS,0,0,480201
Caveira,NC,0,0,480201
Caveira,PAN,0,0,480201
Caveira,PDR,0,0,480201
Caveira,PNR,0,0,480201
Caveira,PTP,0,0,480201
Caveira,PURP,0,0,480201
