freguesia,acronym,validVotesPercentage,votes,dicofre
Marco,PS,41.4,1199,130736
Marco,PPD/PSD.CDS-PP,24.31,704,130736
Marco,MPT,13.6,394,130736
Marco,PCP-PEV,7.11,206,130736
Marco,B.E.,5.04,146,130736
Marco,PCTP/MRPP,1.93,56,130736
Marco,L,1.69,49,130736
Marco,PAN,1.31,38,130736
Marco,PND,0.73,21,130736
Marco,PPM,0.62,18,130736
Marco,PNR,0.59,17,130736
Marco,PTP,0.59,17,130736
Marco,MAS,0.55,16,130736
Marco,PPV,0.24,7,130736
Marco,POUS,0.17,5,130736
Marco,PDA,0.1,3,130736
