freguesia,acronym,validVotesPercentage,votes,dicofre
Ribeira Seca,PS,51.2,64,420606
Ribeira Seca,PPD/PSD.CDS-PP,28.8,36,420606
Ribeira Seca,MPT,4,5,420606
Ribeira Seca,PCP-PEV,4,5,420606
Ribeira Seca,B.E.,3.2,4,420606
Ribeira Seca,L,2.4,3,420606
Ribeira Seca,PAN,1.6,2,420606
Ribeira Seca,PPM,1.6,2,420606
Ribeira Seca,PTP,1.6,2,420606
Ribeira Seca,PCTP/MRPP,0.8,1,420606
Ribeira Seca,POUS,0.8,1,420606
Ribeira Seca,MAS,0,0,420606
Ribeira Seca,PDA,0,0,420606
Ribeira Seca,PND,0,0,420606
Ribeira Seca,PNR,0,0,420606
Ribeira Seca,PPV,0,0,420606
