Objeto do Contrato,Tipo de Procedimento,Tipo(s) de Contrato,CPVs,Entidade(s) Adjudicante(s),Entidade(s) Adjudicatária(s),Preço Contratual,Data de Publicação,Data de Celebração do Contrato,Prazo de Execução,Local de Execução,Fundamentação,Data de Fecho do Contrato,Preço Total Efetivo,Causas das Alterações ao Prazo,Causas das Alterações ao Preço,Estado,N.º registo do Acordo Quadro,Descrição do Acordo Quadro,Procedimento Centralizado
"Contratação de serviços em matéria de farmacovigilância no âmbito do SNF, para cobertura da totalidade das regiões de Saúde existentes em Portugal Continental – Unidade de Lisboa (NPD n.º 5493001157) ",Ajuste Direto Regime Geral,Aquisição de serviços,"85140000-2, Serviços de saúde diversos","INFARMED - Autoridade Nacional do Medicamento e Produtos de Saúde, I. P. (600037002)",AIDFM - Assoc. para a Investigação e Desenvolvimento da Faculdade de Medicina de Lisboa. (503218111),"50.000,00 €",07-03-2017,03-03-2017,360 dias,Portugal,"Artigo 20.º, n.º 1, alínea a) do Código dos Contratos Públicos",,,,,,Não aplicável.,Não aplicável.,FALSE
"Contratação de serviços em matéria de farmacovigilância no âmbito do SNF, para cobertura da totalidade das regiões de Saúde existentes em Portugal Continental – Unidade do Porto (NPD n.º 5493001153) ",Ajuste Direto Regime Geral,Aquisição de serviços,"85140000-2, Serviços de saúde diversos","INFARMED - Autoridade Nacional do Medicamento e Produtos de Saúde, I. P. (600037002)",Faculdade de Medicina da Universidade do Porto (501413197),"50.000,00 €",07-03-2017,03-03-2017,360 dias,Portugal,"Artigo 20.º, n.º 1, alínea a) do Código dos Contratos Públicos",,,,,,Não aplicável.,Não aplicável.,FALSE
"Contratação de serviços em matéria de farmacovigilância no âmbito do SNF, para cobertura da totalidade das regiões de Saúde existentes em Portugal Continental – Unidade de Setúbal e Santarém  (NPD n.º 5493001158) ",Ajuste Direto Regime Geral,Aquisição de serviços,"85140000-2, Serviços de saúde diversos","INFARMED - Autoridade Nacional do Medicamento e Produtos de Saúde, I. P. (600037002)",Faculdade de Farmacia da Universidade de Lisboa (502659807),"50.000,00 €",07-03-2017,07-02-2017,360 dias,Portugal,"Artigo 20.º, n.º 1, alínea a) do Código dos Contratos Públicos",,,,,,Não aplicável.,Não aplicável.,FALSE
"Contratação de serviços em matéria de farmacovigilância no âmbito do SNF, para cobertura da totalidade das regiões de Saúde existentes em Portugal Continental – Unidade de Coimbra (NPD n.º 5493001155) ",Ajuste Direto Regime Geral,Aquisição de serviços,"85140000-2, Serviços de saúde diversos","INFARMED - Autoridade Nacional do Medicamento e Produtos de Saúde, I. P. (600037002)",AIBILI-ASSOCIAÇÃO PARA INVESTIGAÇÃO BIOMEDICA E INOVAÇÃO EM LUZ E IMAGEM (502288957),"50.000,00 €",06-03-2017,03-03-2017,360 dias,Portugal,"Artigo 20.º, n.º 1, alínea a) do Código dos Contratos Públicos",,,,,,Não aplicável.,Não aplicável.,FALSE
Aquisição de serviços para manutenção preventiva e verificação do desempenho de 10 Cromatógrafos Líquidos de Alta Eficiência_NPD5493000478.,Ajuste Direto Regime Geral,Aquisição de serviços,"50430000-8, Serviços de reparação e manutenção de equipamento de precisão","INFARMED - Autoridade Nacional do Medicamento e Produtos de Saúde, I. P. (600037002)","WATERS TECHNOLOGIES LC-MS PORTUGAL, UNIPESSOAL, LDA. (510433669)","24.889,87 €",06-03-2017,01-03-2017,360 dias,Portugal,"Artigo 24.º, n.º 1, alínea e) do Código dos Contratos Públicos",,,,,,Não aplicável.,Não aplicável.,FALSE
"Aquisição de software analítico, serviços de instalação e manutenção para cromatografia líquida ¿EMPOWER 3¿_NPD5493000100.",Ajuste Direto Regime Geral,Locação de bens móveis,"38000000-5, Equipamento laboratorial, óptico e de precisão (exc. óculos)","INFARMED - Autoridade Nacional do Medicamento e Produtos de Saúde, I. P. (600037002)","WATERS TECHNOLOGIES LC-MS PORTUGAL, UNIPESSOAL, LDA. (510433669)","90.565,90 €",06-03-2017,01-03-2017,1080 dias,Portugal,"Artigo 24.º, n.º 1, alínea e) do Código dos Contratos Públicos",,,,,,Não aplicável.,Não aplicável.,FALSE
