Objeto do Contrato,Tipo de Procedimento,Tipo(s) de Contrato,CPVs,Entidade(s) Adjudicante(s),Entidade(s) Adjudicatária(s),Preço Contratual,Data de Publicação,Data de Celebração do Contrato,Prazo de Execução,Local de Execução,Fundamentação,Data de Fecho do Contrato,Preço Total Efetivo,Causas das Alterações ao Prazo,Causas das Alterações ao Preço,Estado,N.º registo do Acordo Quadro,Descrição do Acordo Quadro,Procedimento Centralizado
AU/0040/2015 - EMPREITADA DE SUBSTITUIÇÃO DAS CAIXILHARIAS DA FACHADA SUL DO SERVIÇO DE CARDIOLOGIA,Ajuste Direto Regime Geral,Empreitadas de obras públicas,"45200000-9, Obras de construção total ou parcial e de engenharia civil","Centro Hospitalar do Porto, E.P.E. (CHP) (508331471)","LUIS GONZAGA, LDA (500610533)","18.794,68 €",08-10-2015,09-06-2015,15 dias,"Portugal, Porto, Porto","Artigo 19.º, alínea a) do Código dos Contratos Públicos","","18.794,68 €",Não aplicavel,,,Não aplicável.,Não aplicável.,FALSE
AU/0128/2014 - FORNECIMENTO E MONTAGEM DE BALCAO DE ATENDIMENTO NO CICA,Ajuste Direto Regime Geral,Empreitadas de obras públicas,"45200000-9, Obras de construção total ou parcial e de engenharia civil","Centro Hospitalar do Porto, E.P.E. (CHP) (508331471)","JOFILHOS, LDA (500854386)","11.832,70 €",08-10-2015,09-09-2015,9 dias,"Portugal, Porto, Porto","Artigo 19.º, alínea a) do Código dos Contratos Públicos","","11.832,70 €",Sem alterações,,,Não aplicável.,Não aplicável.,FALSE
AU/0076/2013 - AQUISIÇÃO DE PERIMETROS COMPUTORIZADOS PARA A CONSULTA DE OFTALMOLOGIA,Ajuste Direto Regime Geral,Aquisição de bens móveis,"33122000-1, Equipamento oftalmológico","Centro Hospitalar do Porto, E.P.E. (CHP) (508331471)","GRUPO TAPER, LDA (506886336)","59.900,00 €",08-10-2015,14-07-2014,24 dias,"Portugal, Porto, Porto","Artigo 20.º, n.º 1, alínea a) do Código dos Contratos Públicos",31-12-2014,"59.900,00 €","",,,Não aplicável.,Não aplicável.,FALSE
AU/2096/2013 - AQUISIÇÃO DE IMPLANTES OSTEOINTEGRADOS PARA ORL PEDIATRICO,Ajuste Direto Regime Geral,Aquisição de bens móveis,"33140000-3, Material médico de consumo","Centro Hospitalar Porto, E. P. E. (508331471)","WIDEX, LDA (501882766)","82.500,00 €",08-10-2015,28-08-2014,3 dias,"Portugal, Porto, Porto","Artigo 24.º, n.º 1, alínea e) do Código dos Contratos Públicos","","","",,,Não aplicável.,Não aplicável.,FALSE
"CL/0051/2012 - FORNECIMENTO DE ALIMENTAÇÃO A DOENTES E PESSOAL DO CHP, EPE",Concurso limitado por prévia qualificação,Aquisição de serviços,"55100000-1, Serviços de hotelaria","Centro Hospitalar Porto, E. P. E. (508331471)","ITAU, SA (500142858)","5.130.443,28 €",08-10-2015,28-01-2015,1095 dias,"Portugal, Porto, Porto","Artigo 20.º, n.º 1, alínea b) do Código dos Contratos Públicos","","","",,,Não aplicável.,Não aplicável.,FALSE
