Objeto do Contrato,Tipo de Procedimento,Tipo(s) de Contrato,CPVs,Entidade(s) Adjudicante(s),Entidade(s) Adjudicatária(s),Preço Contratual,Data de Publicação,Data de Celebração do Contrato,Prazo de Execução,Local de Execução,Fundamentação,Data de Fecho do Contrato,Preço Total Efetivo,Causas das Alterações ao Prazo,Causas das Alterações ao Preço,Estado,N.º registo do Acordo Quadro,Descrição do Acordo Quadro,Procedimento Centralizado
MCDT`S ao exterior no mês de Setembro,Ajuste Direto Regime Geral,Aquisição de serviços,"85140000-2, Serviços de saúde diversos",Centro Hospitalar do Oeste (510412009),"ATOMEDICAL-LABORATÓRIO DE MEDICINA NUCLEAR, S.A. (501916148)","5.462,00 €",29-10-2018,30-09-2017,1 dias,"Portugal, Leiria, Caldas da Rainha","Artigo 20.º, n.º 1, alínea a) do Código dos Contratos Públicos",30-09-2017,"5.462,00 €",,,,Não aplicável.,Não aplicável.,FALSE
MCDT´S ao exterior no mês de Julho,Ajuste Direto Regime Geral,Aquisição de serviços,"85140000-2, Serviços de saúde diversos",Centro Hospitalar do Oeste (510412009),"ATOMEDICAL-LABORATÓRIO DE MEDICINA NUCLEAR, S.A. (501916148)","8.588,00 €",26-10-2018,31-07-2017,1 dias,"Portugal, Leiria, Caldas da Rainha","Artigo 20.º, n.º 1, alínea a) do Código dos Contratos Públicos",31-07-2017,"8.588,00 €",,,,Não aplicável.,Não aplicável.,FALSE
MCDT´S ao exterior no mês de Junho,Ajuste Direto Regime Geral,Aquisição de serviços,"85140000-2, Serviços de saúde diversos",Centro Hospitalar do Oeste (510412009),"ATOMEDICAL-LABORATÓRIO DE MEDICINA NUCLEAR, S.A. (501916148)","7.133,00 €",26-10-2018,30-06-2017,1 dias,"Portugal, Leiria, Caldas da Rainha","Artigo 20.º, n.º 1, alínea a) do Código dos Contratos Públicos",30-06-2017,"7.133,00 €",,,,Não aplicável.,Não aplicável.,FALSE
MCDT´S ao exterior no mês de Fevereiro e Março,Ajuste Direto Regime Geral,Aquisição de serviços,"85140000-2, Serviços de saúde diversos",Centro Hospitalar do Oeste (510412009),"Hospital da CUF Infante Santos, S.A (500142742)","8.366,00 €",26-10-2018,07-02-2017,1 dias,"Portugal, Leiria, Caldas da Rainha","Artigo 20.º, n.º 1, alínea a) do Código dos Contratos Públicos",07-02-2017,"8.366,00 €",,,,Não aplicável.,Não aplicável.,FALSE
MCDT´S ao exterior no mês de Março,Ajuste Direto Regime Geral,Aquisição de serviços,"85140000-2, Serviços de saúde diversos",Centro Hospitalar do Oeste (510412009),"Hospital da CUF Infante Santos, S.A (500142742)","8.902,00 €",26-10-2018,23-03-2017,1 dias,"Portugal, Leiria, Caldas da Rainha","Artigo 20.º, n.º 1, alínea a) do Código dos Contratos Públicos",23-03-2017,"8.902,00 €",,,,Não aplicável.,Não aplicável.,FALSE
MCDT´S ao exterior no mês de Abril,Ajuste Direto Regime Geral,Aquisição de serviços,"85140000-2, Serviços de saúde diversos",Centro Hospitalar do Oeste (510412009),"ULTRASONO RADIOLOGIA, LDA (502818093)","8.117,69 €",26-10-2018,30-04-2017,1 dias,"Portugal, Leiria, Caldas da Rainha","Artigo 20.º, n.º 1, alínea a) do Código dos Contratos Públicos",30-04-2017,"8.117,69 €",,,,Não aplicável.,Não aplicável.,FALSE
MCDT´S ao exterior no mês de Março,Ajuste Direto Regime Geral,Aquisição de serviços,"85140000-2, Serviços de saúde diversos",Centro Hospitalar do Oeste (510412009),"Lusiadas, SA (505962403)","7.500,00 €",26-10-2018,28-03-2017,1 dias,"Portugal, Leiria, Caldas da Rainha","Artigo 20.º, n.º 1, alínea a) do Código dos Contratos Públicos",28-03-2017,"7.500,00 €",,,,Não aplicável.,Não aplicável.,FALSE
MCDT´S ao exterior no mês de Maio,Ajuste Direto Regime Geral,Aquisição de serviços,"85140000-2, Serviços de saúde diversos",Centro Hospitalar do Oeste (510412009),"ULTRASONO RADIOLOGIA, LDA (502818093)","7.832,62 €",26-10-2018,31-05-2017,1 dias,"Portugal, Leiria, Caldas da Rainha","Artigo 20.º, n.º 1, alínea a) do Código dos Contratos Públicos",31-05-2017,"7.832,62 €",,,,Não aplicável.,Não aplicável.,FALSE
MCDT´S ao exterior no mês de Maio,Ajuste Direto Regime Geral,Aquisição de serviços,"85140000-2, Serviços de saúde diversos",Centro Hospitalar do Oeste (510412009),"ATOMEDICAL-LABORATÓRIO DE MEDICINA NUCLEAR, S.A. (501916148)","8.520,00 €",26-10-2018,31-05-2017,1 dias,"Portugal, Leiria, Caldas da Rainha","Artigo 20.º, n.º 1, alínea a) do Código dos Contratos Públicos",31-05-2017,"8.520,00 €",,,,Não aplicável.,Não aplicável.,FALSE
MCDT´S ao exterior no mês de Fevereiro,Ajuste Direto Regime Geral,Aquisição de serviços,"85140000-2, Serviços de saúde diversos",Centro Hospitalar do Oeste (510412009),"ULTRASONO RADIOLOGIA, LDA (502818093)","5.854,81 €",26-10-2018,28-02-2017,1 dias,"Portugal, Leiria, Caldas da Rainha","Artigo 20.º, n.º 1, alínea a) do Código dos Contratos Públicos",28-02-2017,"5.854,81 €",,,,Não aplicável.,Não aplicável.,FALSE
MCDT´S ao exterior no mês de Dezembro,Ajuste Direto Regime Geral,Aquisição de serviços,"85140000-2, Serviços de saúde diversos",Centro Hospitalar do Oeste (510412009),HOSPITAL SOERAD (500982201),"7.012,95 €",26-10-2018,31-12-2017,1 dias,"Portugal, Leiria, Caldas da Rainha","Artigo 20.º, n.º 1, alínea a) do Código dos Contratos Públicos",31-12-2017,"7.012,95 €",,,,Não aplicável.,Não aplicável.,FALSE
MCDT´S ao exterior no mês de Julho,Ajuste Direto Regime Geral,Aquisição de serviços,"85140000-2, Serviços de saúde diversos",Centro Hospitalar do Oeste (510412009),"DR.RODRIGUES PEREIRA - LABORATORIO ANATOMIA PATOLOGICA,S.A. (504218514)","6.782,50 €",26-10-2018,31-07-2017,1 dias,"Portugal, Leiria, Caldas da Rainha","Artigo 20.º, n.º 1, alínea a) do Código dos Contratos Públicos",31-07-2017,"6.782,50 €",,,,Não aplicável.,Não aplicável.,FALSE
MCDT´S ao exterior no mês de Outubro,Ajuste Direto Regime Geral,Aquisição de serviços,"85140000-2, Serviços de saúde diversos",Centro Hospitalar do Oeste (510412009),"DR.RODRIGUES PEREIRA - LABORATORIO ANATOMIA PATOLOGICA,S.A. (504218514)","5.562,50 €",26-10-2018,31-10-2017,1 dias,"Portugal, Leiria, Caldas da Rainha","Artigo 20.º, n.º 1, alínea a) do Código dos Contratos Públicos",31-10-2017,"5.562,50 €",,,,Não aplicável.,Não aplicável.,FALSE
Aquisição de computadores portáteis ultraleve/tabblets - AJ/AQ 59003717,Ao abrigo de acordo-quadro (art.º 259.º),Aquisição de bens móveis,"30200000-1, Equipamento e material informático",Centro Hospitalar do Oeste (510412009),"BASEDOIS - Informática e Telecomunicações, Lda. (501333401)","28.014,00 €",24-10-2018,19-10-2017,30 dias,"Portugal, Leiria, Caldas da Rainha",Artigo 259.º do Código dos Contratos Públicos,17-11-2017,"28.014,00 €",,,,1196657,Acordo Quadro para aquisição e aluguer operacional de equipamento informático,FALSE
