Objeto do Contrato,Tipo de Procedimento,Tipo(s) de Contrato,CPVs,Entidade(s) Adjudicante(s),Entidade(s) Adjudicatária(s),Preço Contratual,Data de Publicação,Data de Celebração do Contrato,Prazo de Execução,Local de Execução,Fundamentação,Data de Fecho do Contrato,Preço Total Efetivo,Causas das Alterações ao Prazo,Causas das Alterações ao Preço,Estado,N.º registo do Acordo Quadro,Descrição do Acordo Quadro,Procedimento Centralizado
Aquisição de reagentes imunologia - AjD 80015216,Ajuste Direto Regime Geral,Aquisição de bens móveis,"33696500-0, Reagentes de laboratório",Centro Hospitalar do Oeste (510412009),Abbott Laboratorios (500006148),"13.254,73 €",24-05-2016,07-03-2016,1 dias,"Portugal, Leiria, Caldas da Rainha","Artigo 20.º, n.º 1, alínea a) do Código dos Contratos Públicos",07-03-2016,"13.254,73 €",,,,Não aplicável.,Não aplicável.,FALSE
Aquisição de reagentes de bioquimica - AjD 80016916,Ajuste Direto Regime Geral,Aquisição de bens móveis,"33696500-0, Reagentes de laboratório",Centro Hospitalar do Oeste (510412009),Siemens Healthcare (507925173),"10.901,66 €",24-05-2016,14-03-2016,1 dias,"Portugal, Leiria, Caldas da Rainha","Artigo 20.º, n.º 1, alínea a) do Código dos Contratos Públicos",14-03-2016,"10.901,66 €",,,,Não aplicável.,Não aplicável.,FALSE
