freguesia,acronym,validVotesPercentage,votes,dicofre
União das freguesias de Ferreira do Alentejo e Canhestros,PS,39.77,618,020808
União das freguesias de Ferreira do Alentejo e Canhestros,PCP-PEV,34.62,538,020808
União das freguesias de Ferreira do Alentejo e Canhestros,PPD/PSD.CDS-PP,10.75,167,020808
União das freguesias de Ferreira do Alentejo e Canhestros,MPT,3.67,57,020808
União das freguesias de Ferreira do Alentejo e Canhestros,B.E.,3.28,51,020808
União das freguesias de Ferreira do Alentejo e Canhestros,PCTP/MRPP,2.12,33,020808
União das freguesias de Ferreira do Alentejo e Canhestros,PAN,1.74,27,020808
União das freguesias de Ferreira do Alentejo e Canhestros,L,1.54,24,020808
União das freguesias de Ferreira do Alentejo e Canhestros,MAS,0.51,8,020808
União das freguesias de Ferreira do Alentejo e Canhestros,PND,0.51,8,020808
União das freguesias de Ferreira do Alentejo e Canhestros,PNR,0.45,7,020808
União das freguesias de Ferreira do Alentejo e Canhestros,PTP,0.45,7,020808
União das freguesias de Ferreira do Alentejo e Canhestros,PDA,0.26,4,020808
União das freguesias de Ferreira do Alentejo e Canhestros,PPM,0.19,3,020808
União das freguesias de Ferreira do Alentejo e Canhestros,POUS,0.06,1,020808
União das freguesias de Ferreira do Alentejo e Canhestros,PPV,0.06,1,020808
