freguesia,acronym,validVotesPercentage,votes,dicofre
Avô,PPD/PSD.CDS-PP,43.67,69,061103
Avô,PS,41.77,66,061103
Avô,MPT,7.59,12,061103
Avô,B.E.,1.9,3,061103
Avô,PCP-PEV,1.9,3,061103
Avô,PTP,1.27,2,061103
Avô,PDA,0.63,1,061103
Avô,PNR,0.63,1,061103
Avô,PPM,0.63,1,061103
Avô,L,0,0,061103
Avô,MAS,0,0,061103
Avô,PAN,0,0,061103
Avô,PCTP/MRPP,0,0,061103
Avô,PND,0,0,061103
Avô,POUS,0,0,061103
Avô,PPV,0,0,061103
