Objeto do Contrato,Tipo de Procedimento,Tipo(s) de Contrato,CPVs,Entidade(s) Adjudicante(s),Entidade(s) Adjudicatária(s),Preço Contratual,Data de Publicação,Data de Celebração do Contrato,Prazo de Execução,Local de Execução,Fundamentação,Data de Fecho do Contrato,Preço Total Efetivo,Causas das Alterações ao Prazo,Causas das Alterações ao Preço,Estado,N.º registo do Acordo Quadro,Descrição do Acordo Quadro,Procedimento Centralizado
procedimento n.º 040000042016 - reagentes unidade laboratorial hematologia - HG - vwr,Ajuste Direto Regime Geral,Aquisição de bens móveis,"33696500-0, Reagentes de laboratório","Centro Hospitalar e Universitário de Coimbra, E.P. (510103448)","VWR International - Material de Laboratório, Lda (503842770)","3.631,10 €",08-09-2017,13-01-2016,365 dias,"Portugal, Coimbra, Coimbra","Artigo 26.º, n.º 1, alínea a) do Código dos Contratos Públicos",30-12-2016,"4.390,90 €",,"",,Não aplicável.,Não aplicável.,FALSE
procedimento n.º 040000032016 - reagentes - serviço urgência - polo HG,Ajuste Direto Regime Geral,Aquisição de bens móveis,"33696500-0, Reagentes de laboratório","Centro Hospitalar e Universitário de Coimbra, E.P. (510103448)","werfen Portugal, Lda (501086110)","36.480,00 €",08-09-2017,10-02-2016,365 dias,"Portugal, Coimbra, Coimbra","Artigo 26.º, n.º 1, alínea a) do Código dos Contratos Públicos",30-12-2016,"36.480,00 €",,"",,Não aplicável.,Não aplicável.,FALSE
STENTS,Ajuste Direto Regime Geral,Aquisição de bens móveis,"33000000-0, Equipamento médico, medicamentos e produtos para cuidados pessoais","Centro Hospitalar e Universitário de Coimbra, E. P. E. (510103448)",Socime Medical (504453939),"15.120,00 €",07-09-2017,31-08-2017,2 dias,"Portugal, Coimbra, Coimbra","Artigo 24.º, n.º 1, alínea e) do Código dos Contratos Públicos","","",,"",,Não aplicável.,Não aplicável.,FALSE
Economato,Ao abrigo de acordo-quadro (art.º 258.º),Aquisição de bens móveis,"30000000-9, Máquinas, equipamento e material de escritório e de informática, excepto mobiliário e pacotes de programas (software)","Centro Hospitalar e Universitário de Coimbra, E. P. E. (510103448)","OHMTécnica - Representações de Marcas, Lda. (504059521), Olmar - Artigos de Papelaria, Lda. (508831989)","14.793,94 €",07-09-2017,28-07-2017,180 dias,"Portugal, Coimbra, Coimbra",Artigo 258.º do Código dos Contratos Públicos,31-12-2017,"3.365,28 €",,A execução do procedimento iniciou-se a 28/07/2017,,1351201,Acordo quadro de fornecimento de papel e economato,FALSE
"Aquisição por """"Repair Exchange"""" 1 Sonda p/ Ecografo Acuson S2000-CExt.Reumatologia",Ajuste Direto Regime Geral,Aquisição de bens móveis,"33000000-0, Equipamento médico, medicamentos e produtos para cuidados pessoais","Centro Hospitalar e Universitário de Coimbra, E. P. E. (510103448)",Siemens Healthcare (507925173),"7.620,00 €",07-09-2017,29-08-2017,30 dias,"Portugal, Coimbra, Coimbra","Artigo 24.º, n.º 1, alínea e) do Código dos Contratos Públicos","","",,"",,Não aplicável.,Não aplicável.,FALSE
"Aquisição por""""Repair Exchange""""monitor sinais vitais Delta XL-S.BO.UCPA",Ajuste Direto Regime Geral,Aquisição de bens móveis,"33000000-0, Equipamento médico, medicamentos e produtos para cuidados pessoais","Centro Hospitalar e Universitário de Coimbra, E. P. E. (510103448)","Drager Portugal, Lda (508771323)","5.600,00 €",07-09-2017,29-08-2017,30 dias,"Portugal, Coimbra, Coimbra","Artigo 24.º, n.º 1, alínea e) do Código dos Contratos Públicos","","",,"",,Não aplicável.,Não aplicável.,FALSE
Integração ClinidataXXI / SiiMA-Rastreio Colo Retal,Ajuste Direto Regime Geral,Aquisição de serviços,"72000000-5, Serviços de TI: consultoria, desenvolvimento de software, Internet e apoio","Centro Hospitalar e Universitário de Coimbra, E. P. E. (510103448)",First Solutions (505345978),"7.315,00 €",07-09-2017,05-09-2017,12 dias,"Portugal, Coimbra, Coimbra","Artigo 24.º, n.º 1, alínea e) do Código dos Contratos Públicos","","",,"",,Não aplicável.,Não aplicável.,FALSE
Integração ClinidataXXI / SiiMA-Rastreio Colo Retal,Ajuste Direto Regime Geral,Aquisição de serviços,"72000000-5, Serviços de TI: consultoria, desenvolvimento de software, Internet e apoio","Centro Hospitalar e Universitário de Coimbra, E. P. E. (510103448)",Maxdata (502250259),"9.963,00 €",07-09-2017,05-09-2017,22 dias,"Portugal, Coimbra, Coimbra","Artigo 24.º, n.º 1, alínea e) do Código dos Contratos Públicos","","",,"",,Não aplicável.,Não aplicável.,FALSE
Papel para fotocópia e impressão,Ao abrigo de acordo-quadro (art.º 258.º),Aquisição de bens móveis,"30000000-9, Máquinas, equipamento e material de escritório e de informática, excepto mobiliário e pacotes de programas (software)","Centro Hospitalar e Universitário de Coimbra, E. P. E. (510103448)","OHMTécnica - Representações de Marcas, Lda. (504059521), Maxone - Material de Escritório, Lda. (507052609)","87.326,00 €",07-09-2017,28-07-2017,180 dias,"Portugal, Coimbra, Coimbra",Artigo 258.º do Código dos Contratos Públicos,31-12-2017,"26.352,90 €",,A execução do procedimento iniciou-se a 28/07/2017.,,1351201,Acordo quadro de fornecimento de papel e economato,FALSE
Aquisição de clamps intestinais e clamps vasculares para cirurgia pediátrica,Ajuste Direto Regime Geral,Aquisição de bens móveis,"33000000-0, Equipamento médico, medicamentos e produtos para cuidados pessoais","Centro Hospitalar e Universitário de Coimbra, E. P. E. (510103448)","B. Braun Medical, Lda. (501506543)","1.798,02 €",04-09-2017,29-08-2017,2 dias,"Portugal, Coimbra, Coimbra","Artigo 20.º, n.º 1, alínea a) do Código dos Contratos Públicos","","",,"",,Não aplicável.,Não aplicável.,FALSE
Aquisição de uma Máquina de lavar loiça industrial,Ajuste Direto Regime Geral,Aquisição de bens móveis,"42000000-6, Máquinas industriais","Centro Hospitalar e Universitário de Coimbra, E. P. E. (510103448)",PR`HOTEL (503757241),"1.570,00 €",04-09-2017,04-09-2017,2 dias,"Portugal, Coimbra, Coimbra","Artigo 20.º, n.º 1, alínea a) do Código dos Contratos Públicos","","",,"",,Não aplicável.,Não aplicável.,FALSE
Aquisição de um Monitor de Sinais Vitais,Ajuste Direto Regime Geral,Aquisição de bens móveis,"33000000-0, Equipamento médico, medicamentos e produtos para cuidados pessoais","Centro Hospitalar e Universitário de Coimbra, E. P. E. (510103448)","PHILIPS PORTUGUESA, SA. (500216843)","3.400,00 €",04-09-2017,04-09-2017,30 dias,"Portugal, Coimbra, Coimbra","Artigo 20.º, n.º 1, alínea a) do Código dos Contratos Públicos","","",,"",,Não aplicável.,Não aplicável.,FALSE
Aquisição de oito cadeiras de secretária,Ajuste Direto Regime Geral,Aquisição de bens móveis,"39000000-2, Mobiliário (incl. de escritório), acessórios, aparelhos domésticos (excl. iluminação) e produtos de limpeza","Centro Hospitalar e Universitário de Coimbra, E. P. E. (510103448)",Seixas & Simões (503620106),"696,00 €",31-08-2017,29-08-2017,30 dias,"Portugal, Coimbra, Coimbra","Artigo 20.º, n.º 1, alínea a) do Código dos Contratos Públicos","","",,"",,Não aplicável.,Não aplicável.,FALSE
