Objeto do Contrato,Tipo de Procedimento,Tipo(s) de Contrato,CPVs,Entidade(s) Adjudicante(s),Entidade(s) Adjudicatária(s),Preço Contratual,Data de Publicação,Data de Celebração do Contrato,Prazo de Execução,Local de Execução,Fundamentação,Data de Fecho do Contrato,Preço Total Efetivo,Causas das Alterações ao Prazo,Causas das Alterações ao Preço,Estado,N.º registo do Acordo Quadro,Descrição do Acordo Quadro,Procedimento Centralizado
040219322016 - OSTEOSSINTESE,Ajuste Direto Regime Geral,Aquisição de bens móveis,"33000000-0, Equipamento médico, medicamentos e produtos para cuidados pessoais","Centro Hospitalar e Universitário de Coimbra, E. P. E. (510103448)",OSTEOPLAC (9600049),"7.749,44 €",21-10-2016,28-06-2016,2 dias,"Portugal, Coimbra, Coimbra","Artigo 24.º, n.º 1, alínea e) do Código dos Contratos Públicos","","","","",,Não aplicável.,Não aplicável.,FALSE
040219922016 - OUTRO MATERIAL DE CONSUMO,Ajuste Direto Regime Geral,Aquisição de bens móveis,"33000000-0, Equipamento médico, medicamentos e produtos para cuidados pessoais","Centro Hospitalar e Universitário de Coimbra, E. P. E. (510103448)",INTERSURGICAL (503480045),"9.986,40 €",21-10-2016,29-06-2016,20 dias,"Portugal, Coimbra, Coimbra","Artigo 24.º, n.º 1, alínea e) do Código dos Contratos Públicos","","","","",,Não aplicável.,Não aplicável.,FALSE
040219932016 - outro material de consumo,Ajuste Direto Regime Geral,Aquisição de bens móveis,"33000000-0, Equipamento médico, medicamentos e produtos para cuidados pessoais","Centro Hospitalar e Universitário de Coimbra, E. P. E. (510103448)",INDAS (503505196),"9.526,80 €",21-10-2016,01-07-2016,20 dias,"Portugal, Coimbra, Coimbra","Artigo 24.º, n.º 1, alínea e) do Código dos Contratos Públicos","","","","",,Não aplicável.,Não aplicável.,FALSE
040202402016 - OUTRO MATERIAL DE CONSUMO,Ajuste Direto Regime Geral,Aquisição de bens móveis,"33000000-0, Equipamento médico, medicamentos e produtos para cuidados pessoais","Centro Hospitalar e Universitário de Coimbra, E. P. E. (510103448)",MOLNLYCKE (511101066),"8.775,00 €",21-10-2016,08-02-2016,10 dias,"Portugal, Coimbra, Coimbra","Artigo 24.º, n.º 1, alínea e) do Código dos Contratos Públicos","","","","",,Não aplicável.,Não aplicável.,FALSE
040202412016 - OUTRO MATERIAL DE CONSUMO,Ajuste Direto Regime Geral,Aquisição de bens móveis,"33000000-0, Equipamento médico, medicamentos e produtos para cuidados pessoais","Centro Hospitalar e Universitário de Coimbra, E. P. E. (510103448)",OVERPHARMA (505792362),"9.680,00 €",21-10-2016,17-02-2016,20 dias,"Portugal, Coimbra, Coimbra","Artigo 24.º, n.º 1, alínea e) do Código dos Contratos Públicos","","","","",,Não aplicável.,Não aplicável.,FALSE
040202422016 - OUTRO MATERIAL DE CONSUMO,Ajuste Direto Regime Geral,Aquisição de bens móveis,"33000000-0, Equipamento médico, medicamentos e produtos para cuidados pessoais","Centro Hospitalar e Universitário de Coimbra, E. P. E. (510103448)",PULMOCOR (501402578),"6.700,00 €",21-10-2016,17-02-2016,10 dias,"Portugal, Coimbra, Coimbra","Artigo 24.º, n.º 1, alínea e) do Código dos Contratos Públicos","","","","",,Não aplicável.,Não aplicável.,FALSE
040202712016 - OUTRO MATERIAL DE CONSUMO,Ajuste Direto Regime Geral,Aquisição de bens móveis,"33000000-0, Equipamento médico, medicamentos e produtos para cuidados pessoais","Centro Hospitalar e Universitário de Coimbra, E. P. E. (510103448)",EXPOMEDICA (501886621),"8.700,00 €",21-10-2016,02-03-2016,10 dias,"Portugal, Coimbra, Coimbra","Artigo 24.º, n.º 1, alínea e) do Código dos Contratos Públicos","","","","",,Não aplicável.,Não aplicável.,FALSE
040202792016 - OUTRO MATERIAL DE CONSUMO,Ajuste Direto Regime Geral,Aquisição de bens móveis,"33000000-0, Equipamento médico, medicamentos e produtos para cuidados pessoais","Centro Hospitalar e Universitário de Coimbra, E. P. E. (510103448)",H R (501895558),"6.600,00 €",21-10-2016,03-02-2016,10 dias,"Portugal, Coimbra, Coimbra","Artigo 24.º, n.º 1, alínea e) do Código dos Contratos Públicos","","","","",,Não aplicável.,Não aplicável.,FALSE
040203132016 - OSTEOSSINTESE,Ajuste Direto Regime Geral,Aquisição de bens móveis,"33000000-0, Equipamento médico, medicamentos e produtos para cuidados pessoais","Centro Hospitalar e Universitário de Coimbra, E. P. E. (510103448)",JOHNSON (500153370),"17.562,54 €",21-10-2016,03-03-2016,20 dias,"Portugal, Coimbra, Coimbra","Artigo 24.º, n.º 1, alínea e) do Código dos Contratos Públicos","","","","",,Não aplicável.,Não aplicável.,FALSE
040203142016 - OUTRO MATERIAL DE CONSUMO,Ajuste Direto Regime Geral,Aquisição de bens móveis,"33000000-0, Equipamento médico, medicamentos e produtos para cuidados pessoais","Centro Hospitalar e Universitário de Coimbra, E. P. E. (510103448)",CAREFUSION (503898554),"9.500,00 €",21-10-2016,17-02-2016,10 dias,"Portugal, Coimbra, Coimbra","Artigo 24.º, n.º 1, alínea e) do Código dos Contratos Públicos","","","","",,Não aplicável.,Não aplicável.,FALSE
040203142016 - OUTRO MATERIAL DE CONSUMO,Ajuste Direto Regime Geral,Aquisição de bens móveis,"33000000-0, Equipamento médico, medicamentos e produtos para cuidados pessoais","Centro Hospitalar e Universitário de Coimbra, E. P. E. (510103448)",CAREFUSION (503898554),"9.500,00 €",21-10-2016,17-02-2016,10 dias,"Portugal, Coimbra, Coimbra","Artigo 24.º, n.º 1, alínea e) do Código dos Contratos Públicos","","","","",,Não aplicável.,Não aplicável.,FALSE
INTRODUTOR RADIAL CURTO,Ajuste Direto Regime Geral,Aquisição de bens móveis,"33000000-0, Equipamento médico, medicamentos e produtos para cuidados pessoais","Centro Hospitalar e Universitário de Coimbra, E. P. E. (510103448)",TERUMO EUROPE ESPANHA SL (DELEGAÇAO PORTUGAL) (980472024),"6.300,00 €",21-10-2016,19-10-2016,120 dias,"Portugal, Coimbra, Coimbra","Artigo 24.º, n.º 1, alínea e) do Código dos Contratos Públicos",30-12-2016,"6.300,00 €","","",,Não aplicável.,Não aplicável.,FALSE
040203172016 - OUTRO MATERIAL DE CONSUMO,Ajuste Direto Regime Geral,Aquisição de bens móveis,"33000000-0, Equipamento médico, medicamentos e produtos para cuidados pessoais","Centro Hospitalar e Universitário de Coimbra, E. P. E. (510103448)","SANUSCONCEPT, LDA (509682880)","9.750,00 €",21-10-2016,17-02-2016,10 dias,"Portugal, Coimbra, Coimbra","Artigo 24.º, n.º 1, alínea e) do Código dos Contratos Públicos","","","","",,Não aplicável.,Não aplicável.,FALSE
SERINGA 2 PEÇAS,Ajuste Direto Regime Geral,Aquisição de bens móveis,"33000000-0, Equipamento médico, medicamentos e produtos para cuidados pessoais","Centro Hospitalar e Universitário de Coimbra, E. P. E. (510103448)","B BRAUN MEDICAL, LDA (501506543)","7.484,13 €",21-10-2016,19-10-2016,120 dias,"Portugal, Coimbra, Coimbra","Artigo 24.º, n.º 1, alínea e) do Código dos Contratos Públicos",30-12-2016,"7.155,00 €","",AQUISIÇAO PARCIAL,,Não aplicável.,Não aplicável.,FALSE
SISTEMA P/ BOMBA INFUSORA,Ajuste Direto Regime Geral,Aquisição de bens móveis,"33000000-0, Equipamento médico, medicamentos e produtos para cuidados pessoais","Centro Hospitalar e Universitário de Coimbra, E. P. E. (510103448)","B BRAUN MEDICAL, LDA (501506543)","8.918,00 €",21-10-2016,19-10-2016,120 dias,"Portugal, Coimbra, Coimbra","Artigo 24.º, n.º 1, alínea e) do Código dos Contratos Públicos",30-12-2016,"8.918,00 €","","",,Não aplicável.,Não aplicável.,FALSE
040203192016 - OUTRO MATERIAL DE CONSUMO,Ajuste Direto Regime Geral,Aquisição de bens móveis,"33000000-0, Equipamento médico, medicamentos e produtos para cuidados pessoais","Centro Hospitalar e Universitário de Coimbra, E. P. E. (510103448)",DIMOR (500730741),"9.000,00 €",21-10-2016,17-02-2016,20 dias,"Portugal, Coimbra, Coimbra","Artigo 24.º, n.º 1, alínea e) do Código dos Contratos Públicos","","","","",,Não aplicável.,Não aplicável.,FALSE
040203212016 - OUTRO MATERIAL DE CONSUMO,Ajuste Direto Regime Geral,Aquisição de bens móveis,"33000000-0, Equipamento médico, medicamentos e produtos para cuidados pessoais","Centro Hospitalar e Universitário de Coimbra, E. P. E. (510103448)",COVIDIEN (503413410),"9.660,00 €",21-10-2016,17-02-2016,20 dias,"Portugal, Coimbra, Coimbra","Artigo 24.º, n.º 1, alínea e) do Código dos Contratos Públicos","","","","",,Não aplicável.,Não aplicável.,FALSE
040203222016 - OUTRO MATERIAL DE CONSUMO,Ajuste Direto Regime Geral,Aquisição de bens móveis,"33000000-0, Equipamento médico, medicamentos e produtos para cuidados pessoais","Centro Hospitalar e Universitário de Coimbra, E. P. E. (510103448)",DRAGER (508771323),"8.750,00 €",21-10-2016,14-03-2016,20 dias,"Portugal, Coimbra, Coimbra","Artigo 24.º, n.º 1, alínea e) do Código dos Contratos Públicos","","","","",,Não aplicável.,Não aplicável.,FALSE
040203262016 - OUTRO MATERIAL DE CONSUMO,Ajuste Direto Regime Geral,Aquisição de bens móveis,"33000000-0, Equipamento médico, medicamentos e produtos para cuidados pessoais","Centro Hospitalar e Universitário de Coimbra, E. P. E. (510103448)",EPJMEDICA (506820513),"7.782,00 €",21-10-2016,15-03-2016,20 dias,"Portugal, Coimbra, Coimbra","Artigo 24.º, n.º 1, alínea e) do Código dos Contratos Públicos","","","","",,Não aplicável.,Não aplicável.,FALSE
040203252016 - OUTRO MATERIAL DE CONSUMO,Ajuste Direto Regime Geral,Aquisição de bens móveis,"33000000-0, Equipamento médico, medicamentos e produtos para cuidados pessoais","Centro Hospitalar e Universitário de Coimbra, E. P. E. (510103448)",EPJ (506820513),"9.936,50 €",21-10-2016,17-02-2016,10 dias,"Portugal, Coimbra, Coimbra","Artigo 24.º, n.º 1, alínea e) do Código dos Contratos Públicos","","","","",,Não aplicável.,Não aplicável.,FALSE
040203642016  - OSTEOSSINTESE,Ajuste Direto Regime Geral,Aquisição de bens móveis,"33000000-0, Equipamento médico, medicamentos e produtos para cuidados pessoais","Centro Hospitalar e Universitário de Coimbra, E. P. E. (510103448)",JOHNSON (500153370),"15.972,92 €",21-10-2016,17-02-2016,10 dias,"Portugal, Coimbra, Coimbra","Artigo 24.º, n.º 1, alínea e) do Código dos Contratos Públicos","","","","",,Não aplicável.,Não aplicável.,FALSE
040203662016 - fios,Ajuste Direto Regime Geral,Aquisição de bens móveis,"33000000-0, Equipamento médico, medicamentos e produtos para cuidados pessoais","Centro Hospitalar e Universitário de Coimbra, E. P. E. (510103448)",expomedica (501886621),"5.767,00 €",21-10-2016,17-02-2016,10 dias,"Portugal, Coimbra, Coimbra","Artigo 24.º, n.º 1, alínea e) do Código dos Contratos Públicos","","","","",,Não aplicável.,Não aplicável.,FALSE
040203732016 - outro material de consumo,Ajuste Direto Regime Geral,Aquisição de bens móveis,"33000000-0, Equipamento médico, medicamentos e produtos para cuidados pessoais","Centro Hospitalar e Universitário de Coimbra, E. P. E. (510103448)","SPECULUM - ARTIGOS MÉDICOS,LDA (502996323)","9.686,00 €",21-10-2016,17-02-2016,20 dias,"Portugal, Coimbra, Coimbra","Artigo 24.º, n.º 1, alínea e) do Código dos Contratos Públicos","","","","",,Não aplicável.,Não aplicável.,FALSE
040203742016 - OUTRO MATERIAL DE CONSUMO,Ajuste Direto Regime Geral,Aquisição de bens móveis,"33000000-0, Equipamento médico, medicamentos e produtos para cuidados pessoais","Centro Hospitalar e Universitário de Coimbra, E. P. E. (510103448)",INTERSURGICAL (503480045),"9.131,40 €",21-10-2016,15-02-2016,20 dias,"Portugal, Coimbra, Coimbra","Artigo 24.º, n.º 1, alínea e) do Código dos Contratos Públicos","","","","",,Não aplicável.,Não aplicável.,FALSE
040203772016 - OUTRO MATERIAL DE CONSUMO,Ajuste Direto Regime Geral,Aquisição de bens móveis,"33000000-0, Equipamento médico, medicamentos e produtos para cuidados pessoais","Centro Hospitalar e Universitário de Coimbra, E. P. E. (510103448)",MOLNLYCKE (511101066),"7.250,00 €",21-10-2016,19-02-2016,20 dias,"Portugal, Coimbra, Coimbra","Artigo 24.º, n.º 1, alínea e) do Código dos Contratos Públicos","","","","",,Não aplicável.,Não aplicável.,FALSE
040203782016 - OUTRO MATERIAL DE CONSUMO,Ajuste Direto Regime Geral,Aquisição de bens móveis,"33000000-0, Equipamento médico, medicamentos e produtos para cuidados pessoais","Centro Hospitalar e Universitário de Coimbra, E. P. E. (510103448)",IBERDATA (501904921),"9.040,00 €",21-10-2016,26-02-2016,20 dias,"Portugal, Coimbra, Coimbra","Artigo 24.º, n.º 1, alínea e) do Código dos Contratos Públicos","","","","",,Não aplicável.,Não aplicável.,FALSE
040203792016 - OUTRO MATERIAL DE CONSUMO,Ajuste Direto Regime Geral,Aquisição de bens móveis,"33000000-0, Equipamento médico, medicamentos e produtos para cuidados pessoais","Centro Hospitalar e Universitário de Coimbra, E. P. E. (510103448)",BACELAR (500532818),"9.960,00 €",21-10-2016,17-02-2016,20 dias,"Portugal, Coimbra, Coimbra","Artigo 24.º, n.º 1, alínea e) do Código dos Contratos Públicos","","","","",,Não aplicável.,Não aplicável.,FALSE
Sistema de estimulação transcateter camara unica,Ajuste Direto Regime Geral,Aquisição de bens móveis,"33182200-1, Aparelhos para estimulação cardíaca","Centro Hospitalar e Universitário de Coimbra, E. P. E. (510103448)","Medtronic Portugal - Comércio e Distribuição de Aparelhos Médicos, Lda (504223933)","8.333,00 €",21-10-2016,06-10-2016,30 dias,"Portugal, Coimbra, Coimbra","Artigo 24.º, n.º 1, alínea e) do Código dos Contratos Públicos","","","","",,Não aplicável.,Não aplicável.,FALSE
040203842016 - OUTRO MATERIAL DE CONSUMO,Ajuste Direto Regime Geral,Aquisição de bens móveis,"33000000-0, Equipamento médico, medicamentos e produtos para cuidados pessoais","Centro Hospitalar e Universitário de Coimbra, E. P. E. (510103448)",EZEQUIEL PANAO JORGE (501412727),"9.820,00 €",21-10-2016,19-02-2016,20 dias,"Portugal, Coimbra, Coimbra","Artigo 24.º, n.º 1, alínea e) do Código dos Contratos Públicos","","","","",,Não aplicável.,Não aplicável.,FALSE
0402268982016 - OUTRO MATERIAL DE CONSUMO,Ajuste Direto Regime Geral,Aquisição de bens móveis,"33000000-0, Equipamento médico, medicamentos e produtos para cuidados pessoais","Centro Hospitalar e Universitário de Coimbra, E. P. E. (510103448)",OVERPHARMA (505792362),"9.945,00 €",21-10-2016,04-10-2016,20 dias,"Portugal, Coimbra, Coimbra","Artigo 24.º, n.º 1, alínea e) do Código dos Contratos Públicos","","","","",,Não aplicável.,Não aplicável.,FALSE
040226802016 - papel,Ajuste Direto Regime Geral,Aquisição de bens móveis,"33000000-0, Equipamento médico, medicamentos e produtos para cuidados pessoais","Centro Hospitalar e Universitário de Coimbra, E. P. E. (510103448)",3M Portugal (500193940),"9.328,00 €",21-10-2016,04-10-2016,20 dias,"Portugal, Coimbra, Coimbra","Artigo 24.º, n.º 1, alínea e) do Código dos Contratos Públicos","","","","",,Não aplicável.,Não aplicável.,FALSE
040227622016 - OSTEOSSINTESE,Ajuste Direto Regime Geral,Aquisição de bens móveis,"33000000-0, Equipamento médico, medicamentos e produtos para cuidados pessoais","Centro Hospitalar e Universitário de Coimbra, E.P. (510103448)",JOHNSON (500153370),"16.820,55 €",20-10-2016,20-10-2016,10 dias,"Portugal, Coimbra, Coimbra","Artigo 24.º, n.º 1, alínea e) do Código dos Contratos Públicos","","","","",,Não aplicável.,Não aplicável.,FALSE
040225002016 - OSTEOSSINTESE,Ajuste Direto Regime Geral,Aquisição de bens móveis,"33000000-0, Equipamento médico, medicamentos e produtos para cuidados pessoais","Centro Hospitalar e Universitário de Coimbra, E. P. E. (510103448)",JOHNSON (500153370),"19.498,14 €",20-10-2016,13-10-2016,15 dias,"Portugal, Coimbra, Coimbra","Artigo 24.º, n.º 1, alínea e) do Código dos Contratos Públicos","","","","",,Não aplicável.,Não aplicável.,FALSE
"Atropina 5 mg/0,5 ml col sol",Ajuste Direto Regime Geral,Aquisição de bens móveis,"33698000-9, Produtos para fins clínicos","Centro Hospitalar e Universitário de Coimbra, E. P. E. (510103448)","BAUSCH & LOMB, SA (980218764)","65,00 €",20-10-2016,16-02-2015,365 dias,"Portugal, Coimbra, Coimbra","Artigo 24.º, n.º 1, alínea e) do Código dos Contratos Públicos",31-12-2015,"65,00 €","","",,Não aplicável.,Não aplicável.,FALSE
Hidrofibras c/ AG 10x10 cm apótiso,Ajuste Direto Regime Geral,Aquisição de bens móveis,"33698000-9, Produtos para fins clínicos","Centro Hospitalar e Universitário de Coimbra, E. P. E. (510103448)","KVTECH PORTUGAL - PROD. MEDICOS UNIPESSOAL, LDA (508671531)","57.177,60 €",20-10-2016,06-02-2015,365 dias,"Portugal, Coimbra, Coimbra","Artigo 24.º, n.º 1, alínea e) do Código dos Contratos Públicos",31-12-2015,"57.177,60 €","","",,Não aplicável.,Não aplicável.,FALSE
040220252016 - OSTEOSSINTESE,Ajuste Direto Regime Geral,Aquisição de bens móveis,"33000000-0, Equipamento médico, medicamentos e produtos para cuidados pessoais","Centro Hospitalar e Universitário de Coimbra, E. P. E. (510103448)",JOHNSON (500153370),"37.088,03 €",20-10-2016,18-10-2016,10 dias,"Portugal, Coimbra, Coimbra","Artigo 24.º, n.º 1, alínea e) do Código dos Contratos Públicos","","","","",,Não aplicável.,Não aplicável.,FALSE
Gaze c/ clorohexidina 10x10 cm apósito,Ajuste Direto Regime Geral,Aquisição de bens móveis,"33698000-9, Produtos para fins clínicos","Centro Hospitalar e Universitário de Coimbra, E. P. E. (510103448)","SMITH & NEPHEW, LDA (503552461)","710,50 €",20-10-2016,27-01-2015,365 dias,"Portugal, Coimbra, Coimbra","Artigo 24.º, n.º 1, alínea e) do Código dos Contratos Públicos",31-12-2015,"710,50 €","","",,Não aplicável.,Não aplicável.,FALSE
Gaze celulose oxidada regenerada apósito,Ajuste Direto Regime Geral,Aquisição de bens móveis,"33698000-9, Produtos para fins clínicos","Centro Hospitalar e Universitário de Coimbra, E. P. E. (510103448)","JOHNSON & JOHNSON, LDA (500153370)","13.810,00 €",20-10-2016,04-02-2015,365 dias,"Portugal, Coimbra, Coimbra","Artigo 24.º, n.º 1, alínea e) do Código dos Contratos Públicos",31-12-2015,"21.520,00 €","","",,Não aplicável.,Não aplicável.,FALSE
Hidrocoloide para ostomia pó emb 28 g,Ajuste Direto Regime Geral,Aquisição de bens móveis,"33698000-9, Produtos para fins clínicos","Centro Hospitalar e Universitário de Coimbra, E. P. E. (510103448)","MEDICINALIA CORMEDICA - COMER. PROD. MED. HOSP.,LD (500684324)","36,27 €",20-10-2016,26-01-2015,365 dias,"Portugal, Coimbra, Coimbra","Artigo 24.º, n.º 1, alínea e) do Código dos Contratos Públicos",31-12-2015,"36,27 €","","",,Não aplicável.,Não aplicável.,FALSE
Antimoniato de meglumina 300 mg/ml sol inj,Ajuste Direto Regime Geral,Aquisição de bens móveis,"33698000-9, Produtos para fins clínicos","Centro Hospitalar e Universitário de Coimbra, E. P. E. (510103448)","SANOFI-AVENTIS  - PRODUTOS FARMACEUTICOS , LDA (500134960)","145,80 €",20-10-2016,02-03-2015,365 dias,"Portugal, Coimbra, Coimbra","Artigo 24.º, n.º 1, alínea e) do Código dos Contratos Públicos",31-12-2015,"145,80 €","","",,Não aplicável.,Não aplicável.,FALSE
Anticorpos antidigoxina 38 mg pó sol inj,Ajuste Direto Regime Geral,Aquisição de bens móveis,"33698000-9, Produtos para fins clínicos","Centro Hospitalar e Universitário de Coimbra, E. P. E. (510103448)",WEP CLINICAL (WE PHARMA) (GB944893866),"22.000,00 €",20-10-2016,30-03-2015,365 dias,"Portugal, Coimbra, Coimbra","Artigo 24.º, n.º 1, alínea e) do Código dos Contratos Públicos",31-12-2015,"22.000,00 €","","",,Não aplicável.,Não aplicável.,FALSE
040227562016 - OUTRO MATERIAL DE CONSUMO,Ajuste Direto Regime Geral,Aquisição de bens móveis,"33000000-0, Equipamento médico, medicamentos e produtos para cuidados pessoais","Centro Hospitalar e Universitário de Coimbra, E. P. E. (510103448)",INTERSURGICAL (503480045),"9.695,70 €",20-10-2016,12-10-2016,10 dias,"Portugal, Coimbra, Coimbra","Artigo 24.º, n.º 1, alínea e) do Código dos Contratos Públicos","","","","",,Não aplicável.,Não aplicável.,FALSE
SISTEMAS (P/POOL) PLAQUETAS,Ajuste Direto Regime Geral,Aquisição de bens móveis,"33000000-0, Equipamento médico, medicamentos e produtos para cuidados pessoais","Centro Hospitalar e Universitário de Coimbra, E. P. E. (510103448)",TERUMO BCT PORTUGAL UNIPESSOAL LDA (510627048),"13.770,00 €",20-10-2016,19-10-2016,120 dias,"Portugal, Coimbra, Coimbra","Artigo 24.º, n.º 1, alínea e) do Código dos Contratos Públicos",30-12-2016,"13.770,00 €","","",,Não aplicável.,Não aplicável.,FALSE
040226842016 - outro material de consumo,Ajuste Direto Regime Geral,Aquisição de bens móveis,"33000000-0, Equipamento médico, medicamentos e produtos para cuidados pessoais","Centro Hospitalar e Universitário de Coimbra, E. P. E. (510103448)",medtronic (504223933),"8.608,80 €",20-10-2016,11-10-2016,20 dias,"Portugal, Coimbra, Coimbra","Artigo 24.º, n.º 1, alínea e) do Código dos Contratos Públicos","","","","",,Não aplicável.,Não aplicável.,FALSE
040217782016 - OSTEOSSINTESE,Ajuste Direto Regime Geral,Aquisição de bens móveis,"33000000-0, Equipamento médico, medicamentos e produtos para cuidados pessoais","Centro Hospitalar e Universitário de Coimbra, E. P. E. (510103448)",ZIMMER BIOMET (500254990),"7.755,00 €",20-10-2016,06-10-2016,10 dias,"Portugal, Coimbra, Coimbra","Artigo 24.º, n.º 1, alínea e) do Código dos Contratos Públicos","","","","",,Não aplicável.,Não aplicável.,FALSE
Argatrobano 100 mg/ml sol inj,Ajuste Direto Regime Geral,Aquisição de bens móveis,"33698000-9, Produtos para fins clínicos","Centro Hospitalar e Universitário de Coimbra, E. P. E. (510103448)",WEP CLINICAL (WE PHARMA) (GB944893866),"24.900,00 €",20-10-2016,30-03-2015,365 dias,"Portugal, Coimbra, Coimbra","Artigo 24.º, n.º 1, alínea e) do Código dos Contratos Públicos",31-12-2015,"24.900,00 €","","",,Não aplicável.,Não aplicável.,FALSE
Ácido tranexâmico 100 mg/ml sol inj,Ajuste Direto Regime Geral,Aquisição de bens móveis,"33698000-9, Produtos para fins clínicos","Centro Hospitalar e Universitário de Coimbra, E. P. E. (510103448)","SANOFI-AVENTIS  - PRODUTOS FARMACEUTICOS , LDA (500134960)","339,00 €",20-10-2016,30-12-2015,365 dias,"Portugal, Coimbra, Coimbra","Artigo 24.º, n.º 1, alínea e) do Código dos Contratos Públicos",31-12-2015,"339,00 €","","",,Não aplicável.,Não aplicável.,FALSE
Carmustina 100 mg pó sol inj,Ajuste Direto Regime Geral,Aquisição de bens móveis,"33698000-9, Produtos para fins clínicos","Centro Hospitalar e Universitário de Coimbra, E. P. E. (510103448)",WEP CLINICAL (WE PHARMA) (GB944893866),"62.000,00 €",20-10-2016,30-03-2015,365 dias,"Portugal, Coimbra, Coimbra","Artigo 24.º, n.º 1, alínea e) do Código dos Contratos Públicos",31-12-2015,"62.000,00 €","","",,Não aplicável.,Não aplicável.,FALSE
Acetilcisteína 600 mg comp eferv,Ajuste Direto Regime Geral,Aquisição de bens móveis,"33698000-9, Produtos para fins clínicos","Centro Hospitalar e Universitário de Coimbra, E. P. E. (510103448)","ZAMBON - PRODUTOS FARMACEUTICOS, LDA (502155930)","6.554,73 €",20-10-2016,13-02-2015,365 dias,"Portugal, Coimbra, Coimbra","Artigo 24.º, n.º 1, alínea e) do Código dos Contratos Públicos",31-12-2015,"6.554,73 €","","",,Não aplicável.,Não aplicável.,FALSE
040117352015 - OXIGÉNIO 100 % GÁS INAL RECIP CRIOGEN 10000 L INALATÓRIA,Ajuste Direto Regime Geral,Aquisição de bens móveis,"24100000-5, Gases","Centro Hospitalar e Universitário de Coimbra, E. P. E. (510103448)","Gasoxmed - Gases Medicinais, SA (506568806)","43.500,00 €",20-10-2016,07-12-2015,365 dias,"Portugal, Coimbra, Coimbra","Artigo 26.º, n.º 1, alínea a) do Código dos Contratos Públicos",31-12-2015,"43.500,00 €","","",,Não aplicável.,Não aplicável.,FALSE
Oxitocina 5 U.I./1 ml sol inj fr 1 ml IM IV,Ajuste Direto Regime Geral,Aquisição de bens móveis,"33698000-9, Produtos para fins clínicos","Centro Hospitalar e Universitário de Coimbra, E. P. E. (510103448)",ALLOGA PORTUGAL - ARMAZ. E DISTRIB. FARMAC. (504507230),"9.707,50 €",20-10-2016,22-04-2015,365 dias,"Portugal, Coimbra, Coimbra","Artigo 24.º, n.º 1, alínea e) do Código dos Contratos Públicos",31-12-2015,"9.707,50 €","","",,Não aplicável.,Não aplicável.,FALSE
Citicolina 500 mg/5 ml sol inj fr 5 ml IM IV,Ajuste Direto Regime Geral,Aquisição de bens móveis,"33698000-9, Produtos para fins clínicos","Centro Hospitalar e Universitário de Coimbra, E. P. E. (510103448)","FERRER HOSPITALAR, S.A. (504507680)","174,44 €",20-10-2016,27-01-2015,365 dias,"Portugal, Coimbra, Coimbra","Artigo 24.º, n.º 1, alínea e) do Código dos Contratos Públicos",31-12-2015,"174,44 €","","",,Não aplicável.,Não aplicável.,FALSE
"Lisinopril 20 mg + hidroclorotiazida 12,5 mg comp",Ajuste Direto Regime Geral,Aquisição de bens móveis,"33698000-9, Produtos para fins clínicos","Centro Hospitalar e Universitário de Coimbra, E. P. E. (510103448)","LABORATORIOS ATRAL, SA (500162085)","171,60 €",20-10-2016,22-01-2015,365 dias,"Portugal, Coimbra, Coimbra","Artigo 20.º, n.º 1, alínea a) do Código dos Contratos Públicos",31-12-2015,"171,60 €","","",,Não aplicável.,Não aplicável.,FALSE
Isoniazida 300 mg comp,Ajuste Direto Regime Geral,Aquisição de bens móveis,"33698000-9, Produtos para fins clínicos","Centro Hospitalar e Universitário de Coimbra, E. P. E. (510103448)",LABORATORIO MILITAR PROD. QUIMICOS FARMACEUTICOS (600019675),"504,00 €",20-10-2016,03-03-2015,365 dias,"Portugal, Coimbra, Coimbra","Artigo 20.º, n.º 1, alínea a) do Código dos Contratos Públicos",31-12-2015,"504,00 €","","",,Não aplicável.,Não aplicável.,FALSE
Risperidona comp,Ajuste Direto Regime Geral,Aquisição de bens móveis,"33698000-9, Produtos para fins clínicos","Centro Hospitalar e Universitário de Coimbra, E. P. E. (510103448)","JANSSEN CILAG FARMACEUTICA, LDA (500189412)","7.383,75 €",20-10-2016,23-01-2015,365 dias,"Portugal, Coimbra, Coimbra","Artigo 24.º, n.º 1, alínea e) do Código dos Contratos Públicos",31-12-2015,"7.383,75 €","","",,Não aplicável.,Não aplicável.,FALSE
Sinvastatina 10 mg comp,Ajuste Direto Regime Geral,Aquisição de bens móveis,"33698000-9, Produtos para fins clínicos","Centro Hospitalar e Universitário de Coimbra, E. P. E. (510103448)","GENERIS FARMACEUTICA, SA (508107997)","34,68 €",20-10-2016,29-01-2015,365 dias,"Portugal, Coimbra, Coimbra","Artigo 26.º, n.º 1, alínea a) do Código dos Contratos Públicos",31-12-2015,"34,68 €","","",,Não aplicável.,Não aplicável.,FALSE
Anfotericina B50 mg pó sol inj fr IV,Ajuste Direto Regime Geral,Aquisição de bens móveis,"33698000-9, Produtos para fins clínicos","Centro Hospitalar e Universitário de Coimbra, E. P. E. (510103448)","DUXPHARMA UNIPESSOAL, LDA (510803679)","1.150,00 €",20-10-2016,25-02-2015,365 dias,"Portugal, Coimbra, Coimbra","Artigo 24.º, n.º 1, alínea e) do Código dos Contratos Públicos",31-12-2015,"1.150,00 €","","",,Não aplicável.,Não aplicável.,FALSE
Clorometina 10 mg pó sol inj,Ajuste Direto Regime Geral,Aquisição de bens móveis,"33698000-9, Produtos para fins clínicos","Centro Hospitalar e Universitário de Coimbra, E. P. E. (510103448)","ORPHAN EUROPE PORTUGAL, SOCIDADE UNIPESSOAL, LDA (507966953)","10.000,00 €",20-10-2016,16-01-2015,365 dias,"Portugal, Coimbra, Coimbra","Artigo 24.º, n.º 1, alínea e) do Código dos Contratos Públicos",31-12-2015,"10.000,00 €","","",,Não aplicável.,Não aplicável.,FALSE
Ibuprofeno 10 mg/ml sol inj fr 2 ml IV,Ajuste Direto Regime Geral,Aquisição de bens móveis,"33698000-9, Produtos para fins clínicos","Centro Hospitalar e Universitário de Coimbra, E. P. E. (510103448)","ORPHAN EUROPE PORTUGAL, SOCIDADE UNIPESSOAL, LDA (507966953)","4.033,19 €",20-10-2016,18-03-2015,365 dias,"Portugal, Coimbra, Coimbra","Artigo 20.º, n.º 1, alínea a) do Código dos Contratos Públicos",31-12-2015,"4.033,19 €","","",,Não aplicável.,Não aplicável.,FALSE
Silibinina 350 mg pó sol inj fr IV,Ajuste Direto Regime Geral,Aquisição de bens móveis,"33698000-9, Produtos para fins clínicos","Centro Hospitalar e Universitário de Coimbra, E. P. E. (510103448)","OVERPHARMA-PRODUTOS MÉDICOS E FARMACÉUTICOS,LDA (505792362)","4.691,75 €",20-10-2016,27-01-2015,365 dias,"Portugal, Coimbra, Coimbra","Artigo 24.º, n.º 1, alínea e) do Código dos Contratos Públicos",31-12-2015,"4.691,75 €","","",,Não aplicável.,Não aplicável.,FALSE
Cetrimida 150 mg/ml + cloro-hexidina 15 mg/ml sol cut fr 500 ml,Ajuste Direto Regime Geral,Aquisição de bens móveis,"33698000-9, Produtos para fins clínicos","Centro Hospitalar e Universitário de Coimbra, E. P. E. (510103448)","PROCLINICA EQUIPAMENTOS E PRODUTOS  CLINICOS, LDA (500222665)","2.544,78 €",20-10-2016,03-03-2015,365 dias,"Portugal, Coimbra, Coimbra","Artigo 20.º, n.º 1, alínea a) do Código dos Contratos Públicos",31-12-2015,"2.544,78 €","","",,Não aplicável.,Não aplicável.,FALSE
Azatioprina 50 mg pó sol inj,Ajuste Direto Regime Geral,Aquisição de bens móveis,"33698000-9, Produtos para fins clínicos","Centro Hospitalar e Universitário de Coimbra, E. P. E. (510103448)","DUXPHARMA UNIPESSOAL, LDA (510803679)","987,50 €",20-10-2016,25-02-2015,365 dias,"Portugal, Coimbra, Coimbra","Artigo 24.º, n.º 1, alínea e) do Código dos Contratos Públicos",31-12-2015,"987,50 €","","",,Não aplicável.,Não aplicável.,FALSE
040119142015 - AZOTO LIQUIDO,Ajuste Direto Regime Geral,Aquisição de bens móveis,"24100000-5, Gases","Centro Hospitalar e Universitário de Coimbra, E. P. E. (510103448)","LINDE PORTUGAL , LDA (500266344)","8.458,93 €",19-10-2016,30-12-2015,365 dias,"Portugal, Coimbra, Coimbra","Artigo 26.º, n.º 1, alínea a) do Código dos Contratos Públicos",31-12-2015,"8.458,93 €","","",,Não aplicável.,Não aplicável.,FALSE
Oleo para banho 200 ml frs,Ajuste Direto Regime Geral,Aquisição de bens móveis,"33698000-9, Produtos para fins clínicos","Centro Hospitalar e Universitário de Coimbra, E.P. (510103448)","LABORATORIO MEDINFAR, SA (500384045)","6.025,00 €",19-10-2016,27-01-2015,365 dias,"Portugal, Coimbra, Coimbra","Artigo 20.º, n.º 1, alínea a) do Código dos Contratos Públicos",31-12-2015,"7.275,00 €","","",,Não aplicável.,Não aplicável.,FALSE
Gaze celulose oxidada regenerada fibrilhar penso - Lote 2,Ajuste Direto Regime Geral,Aquisição de bens móveis,"33698000-9, Produtos para fins clínicos","Centro Hospitalar e Universitário de Coimbra, E.P. (510103448)","JOHNSON & JOHNSON, LDA (500153370)","22.550,00 €",19-10-2016,07-07-2015,365 dias,"Portugal, Coimbra, Coimbra","Artigo 20.º, n.º 1, alínea a) do Código dos Contratos Públicos",31-12-2015,"22.550,00 €","","",,Não aplicável.,Não aplicável.,FALSE
Gaze celulose oxidada regenerada fibrilhar penso,Ajuste Direto Regime Geral,Aquisição de bens móveis,"33698000-9, Produtos para fins clínicos","Centro Hospitalar e Universitário de Coimbra, E.P. (510103448)","JOHNSON & JOHNSON, LDA (500153370)","3.321,50 €",19-10-2016,07-07-2015,365 dias,"Portugal, Coimbra, Coimbra","Artigo 20.º, n.º 1, alínea a) do Código dos Contratos Públicos",31-12-2015,"3.321,50 €","","",,Não aplicável.,Não aplicável.,FALSE
Paricalcitol 5 ug/ml sol inj fr 1 ml IV,Ajuste Direto Regime Geral,Aquisição de bens móveis,"33698000-9, Produtos para fins clínicos","Centro Hospitalar e Universitário de Coimbra, E. P. E. (510103448)","FRESENIUS MEDICAL CARE, SA (503070220)","8.291,00 €",19-10-2016,17-03-2015,365 dias,"Portugal, Coimbra, Coimbra","Artigo 20.º, n.º 1, alínea a) do Código dos Contratos Públicos",31-12-2015,"8.291,00 €","","",,Não aplicável.,Não aplicável.,FALSE
040116012015 - GASES MEDICINAIS,Ajuste Direto Regime Geral,Aquisição de bens móveis,"24100000-5, Gases","Centro Hospitalar e Universitário de Coimbra, E. P. E. (510103448)","LINDE PORTUGAL , LDA (500266344)","48.501,25 €",19-10-2016,29-09-2015,365 dias,"Portugal, Coimbra, Coimbra","Artigo 20.º, n.º 1, alínea a) do Código dos Contratos Públicos",31-12-2015,"48.501,25 €","","",,Não aplicável.,Não aplicável.,FALSE
Piroxicam 20 mg/1 ml sol inj fr 1 ml IM,Ajuste Direto Regime Geral,Aquisição de bens móveis,"33698000-9, Produtos para fins clínicos","Centro Hospitalar e Universitário de Coimbra, E. P. E. (510103448)","LABORATORIOS PFIZER, LDA (500162166)","81,75 €",19-10-2016,03-03-2015,365 dias,"Portugal, Coimbra, Coimbra","Artigo 20.º, n.º 1, alínea a) do Código dos Contratos Públicos",31-12-2015,"81,75 €","","",,Não aplicável.,Não aplicável.,FALSE
Dexametasona 700 ug impl intravitreo aplic intravitreo,Ajuste Direto Regime Geral,Aquisição de bens móveis,"33698000-9, Produtos para fins clínicos","Centro Hospitalar e Universitário de Coimbra, E. P. E. (510103448)","PROFARIN, LDA (500223238)","14.250,00 €",19-10-2016,12-02-2015,365 dias,"Portugal, Coimbra, Coimbra","Artigo 24.º, n.º 1, alínea e) do Código dos Contratos Públicos",31-12-2015,"14.250,00 €","","",,Não aplicável.,Não aplicável.,FALSE
Bosutinib 500 mg comp,Ajuste Direto Regime Geral,Aquisição de bens móveis,"33698000-9, Produtos para fins clínicos","Centro Hospitalar e Universitário de Coimbra, E.P. (510103448)","LABORATORIOS PFIZER, LDA (500162166)","34.785,48 €",19-10-2016,05-03-2015,365 dias,"Portugal, Coimbra, Coimbra","Artigo 24.º, n.º 1, alínea e) do Código dos Contratos Públicos",31-12-2015,"34.785,48 €","","",,Não aplicável.,Não aplicável.,FALSE
Budesonida 400 ug pó inal cáps blist,Ajuste Direto Regime Geral,Aquisição de bens móveis,"33698000-9, Produtos para fins clínicos","Centro Hospitalar e Universitário de Coimbra, E.P. (510103448)","NOVARTIS FARMA - PROD. FARMACEUTICOS,  SA. (500063524)","188,90 €",19-10-2016,23-01-2015,365 dias,"Portugal, Coimbra, Coimbra","Artigo 24.º, n.º 1, alínea e) do Código dos Contratos Públicos",31-12-2015,"188,90 €","","",,Não aplicável.,Não aplicável.,FALSE
Oleo Lonrenzo 500 ml frs,Ajuste Direto Regime Geral,Aquisição de bens móveis,"33698000-9, Produtos para fins clínicos","Centro Hospitalar e Universitário de Coimbra, E.P. (510103448)","LILLY PORTUGAL PRODUTOS FARMACEUTICOS, LDA (500165602)","3.844,68 €",19-10-2016,22-01-2015,365 dias,"Portugal, Coimbra, Coimbra","Artigo 20.º, n.º 1, alínea a) do Código dos Contratos Públicos",31-12-2015,"3.844,68 €","","",,Não aplicável.,Não aplicável.,FALSE
Tadalafil 20 mg comp,Ajuste Direto Regime Geral,Aquisição de bens móveis,"33698000-9, Produtos para fins clínicos","Centro Hospitalar e Universitário de Coimbra, E. P. E. (510103448)","LILLY PORTUGAL PRODUTOS FARMACEUTICOS, LDA (500165602)","7.128,64 €",19-10-2016,21-04-2015,365 dias,"Portugal, Coimbra, Coimbra","Artigo 24.º, n.º 1, alínea e) do Código dos Contratos Públicos",31-12-2015,"7.556,36 €",Rectificação preço unitário,Rectificação preço unitário,,Não aplicável.,Não aplicável.,FALSE
Atorvastatina comp,Ajuste Direto Regime Geral,Aquisição de bens móveis,"33698000-9, Produtos para fins clínicos","Centro Hospitalar e Universitário de Coimbra, E. P. E. (510103448)","LABORATORIOS PFIZER, LDA (500162166)","19.035,13 €",19-10-2016,26-03-2015,365 dias,"Portugal, Coimbra, Coimbra","Artigo 20.º, n.º 1, alínea a) do Código dos Contratos Públicos",31-12-2015,"19.035,13 €","","",,Não aplicável.,Não aplicável.,FALSE
040117222015 - OXIGÉNIO 100 % GÁS INAL RECIP CRIOGEN 16000 L INALATÓRIA,Ajuste Direto Regime Geral,Aquisição de bens móveis,"24100000-5, Gases","Centro Hospitalar e Universitário de Coimbra, E. P. E. (510103448)","LINDE PORTUGAL , LDA (500266344)","29.339,52 €",19-10-2016,25-11-2015,365 dias,"Portugal, Coimbra, Coimbra","Artigo 26.º, n.º 1, alínea a) do Código dos Contratos Públicos",31-12-2015,"29.339,52 €","","",,Não aplicável.,Não aplicável.,FALSE
Vismodegib 150 mg cáps,Ajuste Direto Regime Geral,Aquisição de bens móveis,"33698000-9, Produtos para fins clínicos","Centro Hospitalar e Universitário de Coimbra, E. P. E. (510103448)","ROCHE FARMACEUTICA QUIMICA, LDA (500233810)","144.392,85 €",19-10-2016,24-04-2015,365 dias,"Portugal, Coimbra, Coimbra","Artigo 24.º, n.º 1, alínea e) do Código dos Contratos Públicos",31-12-2015,"144.392,85 €","","",,Não aplicável.,Não aplicável.,FALSE
"Rituximab 120 mg/ml sol inj fr 11,7 ml SC",Ajuste Direto Regime Geral,Aquisição de bens móveis,"33698000-9, Produtos para fins clínicos","Centro Hospitalar e Universitário de Coimbra, E. P. E. (510103448)","ROCHE FARMACEUTICA QUIMICA, LDA (500233810)","44.332,80 €",19-10-2016,23-04-2015,365 dias,"Portugal, Coimbra, Coimbra","Artigo 24.º, n.º 1, alínea e) do Código dos Contratos Públicos",31-12-2015,"44.332,80 €","","",,Não aplicável.,Não aplicável.,FALSE
Ácido carglúmico 200 mg comp disp,Ajuste Direto Regime Geral,Aquisição de bens móveis,"33698000-9, Produtos para fins clínicos","Centro Hospitalar e Universitário de Coimbra, E. P. E. (510103448)","ORPHAN EUROPE PORTUGAL, SOCIDADE UNIPESSOAL, LDA (507966953)","9.137,38 €",19-10-2016,20-05-2015,365 dias,"Portugal, Coimbra, Coimbra","Artigo 24.º, n.º 1, alínea e) do Código dos Contratos Públicos",31-12-2015,"9.137,38 €","","",,Não aplicável.,Não aplicável.,FALSE
"Sol acida HD K 2MEQ/L + glucose 1 g/l + CA 3,5 MEQ/L saco 4,7 l",Ajuste Direto Regime Geral,Aquisição de bens móveis,"33698000-9, Produtos para fins clínicos","Centro Hospitalar e Universitário de Coimbra, E. P. E. (510103448)","FRESENIUS MEDICAL CARE, SA (503070220)","2.438,00 €",19-10-2016,20-02-2015,365 dias,"Portugal, Coimbra, Coimbra","Artigo 20.º, n.º 1, alínea a) do Código dos Contratos Públicos",31-12-2015,"2.438,00 €","","",,Não aplicável.,Não aplicável.,FALSE
040113922015 - GASES MEDICINAIS,Ajuste Direto Regime Geral,Aquisição de bens móveis,"24100000-5, Gases","Centro Hospitalar e Universitário de Coimbra, E. P. E. (510103448)","LINDE PORTUGAL , LDA (500266344)","37.050,10 €",19-10-2016,31-07-2015,365 dias,"Portugal, Coimbra, Coimbra","Artigo 20.º, n.º 1, alínea a) do Código dos Contratos Públicos",31-12-2015,"37.050,10 €","","",,Não aplicável.,Não aplicável.,FALSE
Metildopa 500 mg comp,Ajuste Direto Regime Geral,Aquisição de bens móveis,"33698000-9, Produtos para fins clínicos","Centro Hospitalar e Universitário de Coimbra, E. P. E. (510103448)","ANGELINI FARMACEUTICA, LDA (500583650)","72,27 €",19-10-2016,23-04-2015,365 dias,"Portugal, Coimbra, Coimbra","Artigo 24.º, n.º 1, alínea e) do Código dos Contratos Públicos",31-12-2015,"72,27 €","","",,Não aplicável.,Não aplicável.,FALSE
Benzilpenicilina sódica 1 M.U.I. pó sol inj fr IM IV,Ajuste Direto Regime Geral,Aquisição de bens móveis,"33698000-9, Produtos para fins clínicos","Centro Hospitalar e Universitário de Coimbra, E. P. E. (510103448)","LABORATORIOS ATRAL, SA (500162085)","307,96 €",19-10-2016,23-04-2015,365 dias,"Portugal, Coimbra, Coimbra","Artigo 24.º, n.º 1, alínea e) do Código dos Contratos Públicos",31-12-2015,"307,96 €","","",,Não aplicável.,Não aplicável.,FALSE
Aquisição de Material de Consumo Clinico,Ajuste Direto Regime Geral,Aquisição de bens móveis,"33000000-0, Equipamento médico, medicamentos e produtos para cuidados pessoais","Centro Hospitalar e Universitário de Coimbra, E. P. E. (510103448)","MEDICINALIA CORMEDICA - COMER. PROD. MED. HOSP.,LD (500684324)","171,00 €",19-10-2016,10-10-2016,20 dias,"Portugal, Coimbra, Coimbra","Artigo 24.º, n.º 1, alínea e) do Código dos Contratos Públicos","","","","",,Não aplicável.,Não aplicável.,FALSE
Ceftarolina fosamilo 600 mg pó conc sol inj fr IV,Ajuste Direto Regime Geral,Aquisição de bens móveis,"33698000-9, Produtos para fins clínicos","Centro Hospitalar e Universitário de Coimbra, E. P. E. (510103448)","ASTRAZENECA PRODUTOS FARMACÊUTICOS, LDA (502942240)","2.835,00 €",19-10-2016,16-02-2015,365 dias,"Portugal, Coimbra, Coimbra","Artigo 24.º, n.º 1, alínea e) do Código dos Contratos Públicos",31-12-2015,"2.835,00 €","","",,Não aplicável.,Não aplicável.,FALSE
Elvitegravir 150 mg + Cobicistite 150 mg + Emtricitabina 200 mg + Tenofovir 245 mg comp,Ajuste Direto Regime Geral,Aquisição de bens móveis,"33698000-9, Produtos para fins clínicos","Centro Hospitalar e Universitário de Coimbra, E. P. E. (510103448)","GILEAD SCIENCES, LDA (503604704)","12.890,88 €",19-10-2016,09-02-2015,365 dias,"Portugal, Coimbra, Coimbra","Artigo 24.º, n.º 1, alínea e) do Código dos Contratos Públicos",31-12-2015,"12.890,88 €","","",,Não aplicável.,Não aplicável.,FALSE
Aquisição de Material de Consumo Clinico,Ajuste Direto Regime Geral,Aquisição de bens móveis,"33000000-0, Equipamento médico, medicamentos e produtos para cuidados pessoais","Centro Hospitalar e Universitário de Coimbra, E. P. E. (510103448)","MEDTRONIC PORTUGAL, LDA (504223933)","23.069,40 €",19-10-2016,27-09-2016,20 dias,"Portugal, Coimbra, Coimbra","Artigo 24.º, n.º 1, alínea e) do Código dos Contratos Públicos","","","","",,Não aplicável.,Não aplicável.,FALSE
Aquisição de Material de Consumo Clinico,Ajuste Direto Regime Geral,Aquisição de bens móveis,"33000000-0, Equipamento médico, medicamentos e produtos para cuidados pessoais","Centro Hospitalar e Universitário de Coimbra, E. P. E. (510103448)","JOHNSON & JOHNSON, LDA (500153370)","37.762,50 €",19-10-2016,22-09-2016,20 dias,"Portugal, Coimbra, Coimbra","Artigo 24.º, n.º 1, alínea e) do Código dos Contratos Públicos","","","","",,Não aplicável.,Não aplicável.,FALSE
040113912015 - OXIGÉNIO 100 % GÁS INAL RECIP CRIOGEN 10000 L INALATÓRIA,Ajuste Direto Regime Geral,Aquisição de bens móveis,"24100000-5, Gases","Centro Hospitalar e Universitário de Coimbra, E. P. E. (510103448)","Gasoxmed - Gases Medicinais, SA (506568806)","43.500,00 €",19-10-2016,21-07-2015,365 dias,"Portugal, Coimbra, Coimbra","Artigo 26.º, n.º 1, alínea a) do Código dos Contratos Públicos",31-12-2015,"43.500,00 €","","",,Não aplicável.,Não aplicável.,FALSE
Fosfato (32P) de sódio 185 MBQ sol inj fr IV,Ajuste Direto Regime Geral,Aquisição de bens móveis,"33698000-9, Produtos para fins clínicos","Centro Hospitalar e Universitário de Coimbra, E. P. E. (510103448)","ISODER ISOTOPOS E DERIVADOS, SA (502241594)","3.875,00 €",19-10-2016,20-01-2015,365 dias,"Portugal, Coimbra, Coimbra","Artigo 24.º, n.º 1, alínea e) do Código dos Contratos Públicos",31-12-2015,"3.875,00 €","","",,Não aplicável.,Não aplicável.,FALSE
Aquisição de Material de Consumo Clinico,Ajuste Direto Regime Geral,Aquisição de bens móveis,"33000000-0, Equipamento médico, medicamentos e produtos para cuidados pessoais","Centro Hospitalar e Universitário de Coimbra, E. P. E. (510103448)","JOHNSON & JOHNSON, LDA (500153370)","11.996,52 €",19-10-2016,07-10-2016,20 dias,"Portugal, Coimbra, Coimbra","Artigo 24.º, n.º 1, alínea e) do Código dos Contratos Públicos","","","","",,Não aplicável.,Não aplicável.,FALSE
"Epoprostenol 1,5 mg pó sol inj fr IV",Ajuste Direto Regime Geral,Aquisição de bens móveis,"33698000-9, Produtos para fins clínicos","Centro Hospitalar e Universitário de Coimbra, E. P. E. (510103448)","ACTELION PHARMACEUTICALS PORTUGAL, LDA. (507336488)","38.403,00 €",19-10-2016,07-04-2015,365 dias,"Portugal, Coimbra, Coimbra","Artigo 24.º, n.º 1, alínea e) do Código dos Contratos Públicos",31-12-2015,"38.403,00 €","","",,Não aplicável.,Não aplicável.,FALSE
Aquisição de Material de Consumo Clinico,Ajuste Direto Regime Geral,Aquisição de bens móveis,"33000000-0, Equipamento médico, medicamentos e produtos para cuidados pessoais","Centro Hospitalar e Universitário de Coimbra, E. P. E. (510103448)","MEDTRONIC PORTUGAL, LDA (504223933)","30.000,00 €",19-10-2016,07-10-2016,20 dias,"Portugal, Coimbra, Coimbra","Artigo 24.º, n.º 1, alínea e) do Código dos Contratos Públicos","","","","",,Não aplicável.,Não aplicável.,FALSE
040115922015 - OXIGÉNIO 100 % GÁS INAL RECIP CRIOGEN 10000 L INALATÓRIA,Ajuste Direto Regime Geral,Aquisição de bens móveis,"24100000-5, Gases","Centro Hospitalar e Universitário de Coimbra, E. P. E. (510103448)","Gasoxmed - Gases Medicinais, SA (506568806)","43.500,00 €",19-10-2016,29-09-2015,365 dias,"Portugal, Coimbra, Coimbra","Artigo 26.º, n.º 1, alínea a) do Código dos Contratos Públicos",31-12-2015,"43.500,00 €","","",,Não aplicável.,Não aplicável.,FALSE
040108772015-ÓXIDO DE ETILENO PARA ESTERILIZADOR STERIGAS 8XL,Ajuste Direto Regime Geral,Aquisição de bens móveis,"24100000-5, Gases","Centro Hospitalar e Universitário de Coimbra, E. P. E. (510103448)",3M Portugal Lda (500193940),"1.200,00 €",18-10-2016,06-04-2015,365 dias,"Portugal, Coimbra, Coimbra","Artigo 26.º, n.º 1, alínea a) do Código dos Contratos Públicos",31-12-2015,"1.200,00 €","","",,Não aplicável.,Não aplicável.,FALSE
040110072015-OXIGÉNIO 100 % GÁS INAL RECIP CRIOGEN 10000 L INALATÓRIA,Ajuste Direto Regime Geral,Aquisição de bens móveis,"24100000-5, Gases","Centro Hospitalar e Universitário de Coimbra, E. P. E. (510103448)","Gasoxmed - Gases Medicinais, SA (506568806)","64.960,00 €",18-10-2016,15-05-2015,365 dias,"Portugal, Coimbra, Coimbra","Artigo 26.º, n.º 1, alínea a) do Código dos Contratos Públicos",31-12-2015,"64.960,00 €","","",,Não aplicável.,Não aplicável.,FALSE
Sulfadiazina prata 10 mg/g cr bisn 50 g,Ajuste Direto Regime Geral,Aquisição de bens móveis,"33698000-9, Produtos para fins clínicos","Centro Hospitalar e Universitário de Coimbra, E. P. E. (510103448)","EXPOMEDICA SOC. EXPORTAÇAO IMPORT.MAT. MEDIC., LDA (501886621)","5.724,16 €",18-10-2016,31-12-2014,365 dias,"Portugal, Coimbra, Coimbra","Artigo 24.º, n.º 1, alínea e) do Código dos Contratos Públicos",31-12-2015,"5.724,16 €","","",,Não aplicável.,Não aplicável.,FALSE
Clorambucilo 2 mg comp,Ajuste Direto Regime Geral,Aquisição de bens móveis,"33698000-9, Produtos para fins clínicos","Centro Hospitalar e Universitário de Coimbra, E. P. E. (510103448)","PHARMIS BIOFARMACÊUTICA, LDº (502595442)","6.345,00 €",18-10-2016,27-01-2015,365 dias,"Portugal, Coimbra, Coimbra","Artigo 24.º, n.º 1, alínea e) do Código dos Contratos Públicos",31-12-2015,"7.965,00 €","","",,Não aplicável.,Não aplicável.,FALSE
"Trolamina 6,7 mg/g emul cut bisn 100 ml",Ajuste Direto Regime Geral,Aquisição de bens móveis,"33698000-9, Produtos para fins clínicos","Centro Hospitalar e Universitário de Coimbra, E. P. E. (510103448)","JOHNSON & JOHNSON, LDA (500153370)","6.733,40 €",18-10-2016,01-10-2015,365 dias,"Portugal, Coimbra, Coimbra","Artigo 24.º, n.º 1, alínea e) do Código dos Contratos Públicos",31-12-2015,"12.901,40 €","","",,Não aplicável.,Não aplicável.,FALSE
Alcool etilico absoluto (PA),Ajuste Direto Regime Geral,Aquisição de bens móveis,"33698000-9, Produtos para fins clínicos","Centro Hospitalar e Universitário de Coimbra, E. P. E. (510103448)","VWR INTERNATIONAL MATERIAL DE  LABORATORIO, LDA (503842770)","96,00 €",18-10-2016,31-12-2014,365 dias,"Portugal, Coimbra, Coimbra","Artigo 20.º, n.º 1, alínea a) do Código dos Contratos Públicos",31-12-2015,"96,00 €","","",,Não aplicável.,Não aplicável.,FALSE
Mercaptamina 150 mg cáps,Ajuste Direto Regime Geral,Aquisição de bens móveis,"33698000-9, Produtos para fins clínicos","Centro Hospitalar e Universitário de Coimbra, E. P. E. (510103448)","ORPHAN EUROPE PORTUGAL, SOCIDADE UNIPESSOAL, LDA (507966953)","1.387,56 €",18-10-2016,31-12-2014,365 dias,"Portugal, Coimbra, Coimbra","Artigo 24.º, n.º 1, alínea e) do Código dos Contratos Públicos",31-12-2015,"1.387,56 €","","",,Não aplicável.,Não aplicável.,FALSE
Rifaximina 200 mg comp,Ajuste Direto Regime Geral,Aquisição de bens móveis,"33698000-9, Produtos para fins clínicos","Centro Hospitalar e Universitário de Coimbra, E. P. E. (510103448)",ALFA WASSERMANN (502857722),"1.354,08 €",18-10-2016,31-12-2014,365 dias,"Portugal, Coimbra, Coimbra","Artigo 24.º, n.º 1, alínea e) do Código dos Contratos Públicos",31-12-2015,"1.354,08 €","","",,Não aplicável.,Não aplicável.,FALSE
Tramadol comp LP - Lote 3,Ajuste Direto Regime Geral,Aquisição de bens móveis,"33698000-9, Produtos para fins clínicos","Centro Hospitalar e Universitário de Coimbra, E.P. (510103448)","GRUNENTHAL, SA (500101965)","420,48 €",18-10-2016,27-01-2015,365 dias,"Portugal, Coimbra, Coimbra","Artigo 20.º, n.º 1, alínea a) do Código dos Contratos Públicos",31-12-2015,"420,48 €","","",,Não aplicável.,Não aplicável.,FALSE
Tramadol comp LP - Lote 2,Ajuste Direto Regime Geral,Aquisição de bens móveis,"33698000-9, Produtos para fins clínicos","Centro Hospitalar e Universitário de Coimbra, E.P. (510103448)","GRUNENTHAL, SA (500101965)","773,61 €",18-10-2016,27-01-2015,365 dias,"Portugal, Coimbra, Coimbra","Artigo 20.º, n.º 1, alínea a) do Código dos Contratos Públicos",31-12-2015,"773,61 €","","",,Não aplicável.,Não aplicável.,FALSE
Tramadol comp LP,Ajuste Direto Regime Geral,Aquisição de bens móveis,"33698000-9, Produtos para fins clínicos","Centro Hospitalar e Universitário de Coimbra, E.P. (510103448)","GRUNENTHAL, SA (500101965)","2.117,88 €",18-10-2016,27-01-2015,365 dias,"Portugal, Coimbra, Coimbra","Artigo 20.º, n.º 1, alínea a) do Código dos Contratos Públicos",31-12-2015,"2.117,88 €","","",,Não aplicável.,Não aplicável.,FALSE
Fornecimento de serviços de alimentação-poloMBB-Ago2016,Ajuste Direto Regime Geral,Aquisição de serviços,"55500000-5, Serviços de cantinas e de fornecimento de refeições (catering)","Centro Hospitalar e Universitário de Coimbra, E. P. E. (510103448)",Eurest Portugal (500347506),"23.000,00 €",18-10-2016,09-08-2016,31 dias,"Portugal, Coimbra, Coimbra","Artigo 20.º, n.º 1, alínea a) do Código dos Contratos Públicos","","","","",,Não aplicável.,Não aplicável.,FALSE
Fornecimento de serviços de alimentação-poloHP-Ago2016,Ajuste Direto Regime Geral,Aquisição de serviços,"55500000-5, Serviços de cantinas e de fornecimento de refeições (catering)","Centro Hospitalar e Universitário de Coimbra, E. P. E. (510103448)",Eurest Portugal (500347506),"35.000,00 €",18-10-2016,09-08-2016,31 dias,"Portugal, Coimbra, Coimbra","Artigo 20.º, n.º 1, alínea a) do Código dos Contratos Públicos","","","","",,Não aplicável.,Não aplicável.,FALSE
Fornecimento de serviços de alimentação-poloHG-Ago2016,Ajuste Direto Regime Geral,Aquisição de serviços,"55500000-5, Serviços de cantinas e de fornecimento de refeições (catering)","Centro Hospitalar e Universitário de Coimbra, E. P. E. (510103448)",Eurest Portugal (500347506),"65.000,00 €",18-10-2016,09-08-2016,31 dias,"Portugal, Coimbra, Coimbra","Artigo 20.º, n.º 1, alínea a) do Código dos Contratos Públicos","","","","",,Não aplicável.,Não aplicável.,FALSE
Fornecimento de serviços de alimentação-poloMBB-Jul2016,Ajuste Direto Regime Geral,Aquisição de serviços,"55500000-5, Serviços de cantinas e de fornecimento de refeições (catering)","Centro Hospitalar e Universitário de Coimbra, E. P. E. (510103448)",Eurest Portugal (500347506),"23.000,00 €",18-10-2016,03-08-2016,31 dias,"Portugal, Coimbra, Coimbra","Artigo 20.º, n.º 1, alínea a) do Código dos Contratos Públicos","","","","",,Não aplicável.,Não aplicável.,FALSE
Fornecimento de serviços de alimentação-poloHP-Jul2016,Ajuste Direto Regime Geral,Aquisição de serviços,"55500000-5, Serviços de cantinas e de fornecimento de refeições (catering)","Centro Hospitalar e Universitário de Coimbra, E. P. E. (510103448)",Eurest Portugal (500347506),"35.000,00 €",18-10-2016,03-08-2016,31 dias,"Portugal, Coimbra, Coimbra","Artigo 20.º, n.º 1, alínea a) do Código dos Contratos Públicos","","","","",,Não aplicável.,Não aplicável.,FALSE
Fornecimento de serviços de alimentação-poloHG-Jul2016,Ajuste Direto Regime Geral,Aquisição de serviços,"55500000-5, Serviços de cantinas e de fornecimento de refeições (catering)","Centro Hospitalar e Universitário de Coimbra, E. P. E. (510103448)",Eurest Portugal (500347506),"65.000,00 €",18-10-2016,03-08-2016,31 dias,"Portugal, Coimbra, Coimbra","Artigo 20.º, n.º 1, alínea a) do Código dos Contratos Públicos","","","","",,Não aplicável.,Não aplicável.,FALSE
Serviços-Gestão integrada residuos hospitalares-polos HG/HP/MBB-Set.Out.2016,Ajuste Direto Regime Geral,Aquisição de serviços,"90510000-5, Tratamento e eliminação de resíduos","Centro Hospitalar e Universitário de Coimbra, E. P. E. (510103448)",Ambimed (503593427),"62.000,00 €",18-10-2016,13-09-2016,61 dias,"Portugal, Coimbra, Coimbra","Artigo 20.º, n.º 1, alínea a) do Código dos Contratos Públicos","","","","",,Não aplicável.,Não aplicável.,FALSE
Serviços-Projeto de execução de reorganização do S.Oftalmologia,Ajuste Direto Regime Geral,Aquisição de serviços,"71000000-8, Serviços de arquitectura, construção, engenharia e inspecção","Centro Hospitalar e Universitário de Coimbra, E. P. E. (510103448)",Afonso Marques Engenharia (507611519),"15.000,00 €",18-10-2016,13-10-2016,30 dias,"Portugal, Coimbra, Coimbra","Artigo 24.º, n.º 1, alínea c) do Código dos Contratos Públicos","","","","",,Não aplicável.,Não aplicável.,FALSE
040108432015 - Ledipasvir 90mg+Sofosbuvir 400mg,Ajuste Direto Regime Geral,Aquisição de bens móveis,"33698000-9, Produtos para fins clínicos","Centro Hospitalar e Universitário de Coimbra, E. P. E. (510103448)",gilead Sciences Lda (503604704),"92.367,66 €",18-10-2016,25-03-2015,360 dias,"Portugal, Coimbra, Coimbra","Artigo 24.º, n.º 1, alínea e) do Código dos Contratos Públicos",31-12-2015,"92.367,66 €","","",,Não aplicável.,Não aplicável.,FALSE
Ajuste Directo nº040002232015-Reagentes para o Serviço de Sangue e Medicina Transfusional,Ajuste Direto Regime Geral,Aquisição de bens móveis,"33696500-0, Reagentes de laboratório","Centro Hospitalar e Universitário de Coimbra, E. P. E. (510103448)","Diagnostica Longwood (980475554), Biomerieux Portugal Lda (501524177)","12.237,55 €",18-10-2016,18-02-2015,365 dias,"Portugal, Coimbra, Coimbra","Artigo 26.º, n.º 1, alínea a) do Código dos Contratos Públicos",31-12-2015,"12.237,55 €","","",,Não aplicável.,Não aplicável.,FALSE
"cianocobalamina 0,2 mg + Piridoxina 200 mg + Tiamina 100 mg comp",Ajuste Direto Regime Geral,Aquisição de bens móveis,"33698000-9, Produtos para fins clínicos","Centro Hospitalar e Universitário de Coimbra, E. P. E. (510103448)",MERCK S.A. (500650870),"2.082,49 €",18-10-2016,23-01-2015,365 dias,"Portugal, Coimbra, Coimbra","Artigo 24.º, n.º 1, alínea e) do Código dos Contratos Públicos",31-12-2015,"2.082,49 €","","",,Não aplicável.,Não aplicável.,FALSE
Hidroxizina 25 mg comp,Ajuste Direto Regime Geral,Aquisição de bens móveis,"33698000-9, Produtos para fins clínicos","Centro Hospitalar e Universitário de Coimbra, E. P. E. (510103448)","UCB PHARMA (PRODUTOS FARMACEUTICOS), LDA (500291322)","2.119,64 €",18-10-2016,31-12-2014,365 dias,"Portugal, Coimbra, Coimbra","Artigo 24.º, n.º 1, alínea e) do Código dos Contratos Públicos",31-12-2015,"2.119,64 €","","",,Não aplicável.,Não aplicável.,FALSE
040108422015 - Ledipasvir 90mg+Sofosbuvir 400mg,Ajuste Direto Regime Geral,Aquisição de bens móveis,"33698000-9, Produtos para fins clínicos","Centro Hospitalar e Universitário de Coimbra, E. P. E. (510103448)",Gilead Sciences Lda (503604704),"46.183,83 €",18-10-2016,25-03-2015,360 dias,"Portugal, Coimbra, Coimbra","Artigo 24.º, n.º 1, alínea e) do Código dos Contratos Públicos",31-12-2015,"46.183,83 €","","",,Não aplicável.,Não aplicável.,FALSE
"Fluoresceína 2,5 mg/ml + Oxibuprocaína 4 mg/ml col sol fr 3 ml",Ajuste Direto Regime Geral,Aquisição de bens móveis,"33698000-9, Produtos para fins clínicos","Centro Hospitalar e Universitário de Coimbra, E. P. E. (510103448)",ALCON PORTUGAL-PROD.EQUIP.OFTALMOLOGICOS (501251685),"2.343,66 €",18-10-2016,31-12-2014,365 dias,"Portugal, Coimbra, Coimbra","Artigo 24.º, n.º 1, alínea e) do Código dos Contratos Públicos",31-12-2015,"3.147,66 €","","",,Não aplicável.,Não aplicável.,FALSE
"Fenilefrina 5 mg/ml got nas, sol fr 15 ml",Ajuste Direto Regime Geral,Aquisição de bens móveis,"33698000-9, Produtos para fins clínicos","Centro Hospitalar e Universitário de Coimbra, E. P. E. (510103448)",OMEGA PHARMA PORTUGUESA LDA (506112233),"3.427,60 €",18-10-2016,31-12-2014,365 dias,"Portugal, Coimbra, Coimbra","Artigo 24.º, n.º 1, alínea e) do Código dos Contratos Públicos",31-12-2015,"3.427,60 €","","",,Não aplicável.,Não aplicável.,FALSE
040108412015 - Ledipasvir 90mg+Sofosbuvir 400mg,Ajuste Direto Regime Geral,Aquisição de bens móveis,"33698000-9, Produtos para fins clínicos","Centro Hospitalar e Universitário de Coimbra, E. P. E. (510103448)",Gilead Sciences Lda (503604704),"46.183,83 €",17-10-2016,25-03-2015,360 dias,"Portugal, Coimbra, Coimbra","Artigo 24.º, n.º 1, alínea e) do Código dos Contratos Públicos",31-12-2015,"46.183,83 €","","",,Não aplicável.,Não aplicável.,FALSE
Eritromicina 100 mg pó solinj fr IV,Ajuste Direto Regime Geral,Aquisição de bens móveis,"33698000-9, Produtos para fins clínicos","Centro Hospitalar e Universitário de Coimbra, E. P. E. (510103448)","LABESFAL LABORATORIO ALMIRO, SA (501169580)","4.062,50 €",17-10-2016,16-01-2015,365 dias,"Portugal, Coimbra, Coimbra","Artigo 24.º, n.º 1, alínea e) do Código dos Contratos Públicos",19-01-2015,"4.062,50 €","","",,Não aplicável.,Não aplicável.,FALSE
Fenilburitato de sódio 940 mg/g gran fr 266 g,Ajuste Direto Regime Geral,Aquisição de bens móveis,"33698000-9, Produtos para fins clínicos","Centro Hospitalar e Universitário de Coimbra, E. P. E. (510103448)",SWEDISH ORPHAN BIOVITRUM (B84710623),"4.599,44 €",17-10-2016,31-12-2014,365 dias,"Portugal, Coimbra, Coimbra","Artigo 24.º, n.º 1, alínea e) do Código dos Contratos Públicos",31-12-2014,"4.599,44 €","","",,Não aplicável.,Não aplicável.,FALSE
Implantes Cocleares Bilaterais com Kit Pediátrico,Ajuste Direto Regime Geral,Aquisição de bens móveis,"33000000-0, Equipamento médico, medicamentos e produtos para cuidados pessoais","Centro Hospitalar e Universitário de Coimbra, E. P. E. (510103448)",MED-EL PORTUGAL (980362539),"32.294,00 €",17-10-2016,06-10-2016,20 dias,"Portugal, Coimbra","Artigo 24.º, n.º 1, alínea e) do Código dos Contratos Públicos","","","","",,Não aplicável.,Não aplicável.,FALSE
CATETER ECO  INTRACORONARIO,Ajuste Direto Regime Geral,Aquisição de bens móveis,"33000000-0, Equipamento médico, medicamentos e produtos para cuidados pessoais","Centro Hospitalar e Universitário de Coimbra, E. P. E. (510103448)",VOLCANO EUROPE (BE59842345),"9.900,00 €",17-10-2016,23-09-2016,120 dias,"Portugal, Coimbra, Coimbra","Artigo 24.º, n.º 1, alínea e) do Código dos Contratos Públicos",30-12-2016,"9.900,00 €","","",,Não aplicável.,Não aplicável.,FALSE
040108392015 - Ledipasvir 90mg+Sofosbuvir 400mg,Ajuste Direto Regime Geral,Aquisição de bens móveis,"33698000-9, Produtos para fins clínicos","Centro Hospitalar e Universitário de Coimbra, E. P. E. (510103448)",Gilead Sciences Lda (503604704),"46.183,83 €",17-10-2016,25-03-2015,360 dias,"Portugal, Coimbra, Coimbra","Artigo 24.º, n.º 1, alínea e) do Código dos Contratos Públicos",31-12-2015,"46.183,83 €","","",,Não aplicável.,Não aplicável.,FALSE
Pancreatina comp. c/ rev ent 10000 U Lipase +8000 U amilase+600 U proteases,Ajuste Direto Regime Geral,Aquisição de bens móveis,"33698000-9, Produtos para fins clínicos","Centro Hospitalar e Universitário de Coimbra, E. P. E. (510103448)","ABBOTT LABORATORIOS, LDA (500006148)","5.549,71 €",17-10-2016,16-01-2015,365 dias,"Portugal, Coimbra, Coimbra","Artigo 24.º, n.º 1, alínea e) do Código dos Contratos Públicos",31-12-2015,"5.549,71 €","","",,Não aplicável.,Não aplicável.,FALSE
Nitroprussiato de sódio 50 mg pó sol inj,Ajuste Direto Regime Geral,Aquisição de bens móveis,"33698000-9, Produtos para fins clínicos","Centro Hospitalar e Universitário de Coimbra, E. P. E. (510103448)","IDIS THE WORLD MEDICINES, LMTD (700513982)","8.760,00 €",17-10-2016,27-02-2015,365 dias,"Portugal, Coimbra, Coimbra","Artigo 24.º, n.º 1, alínea e) do Código dos Contratos Públicos",31-12-2015,"8.760,00 €","","",,Não aplicável.,Não aplicável.,FALSE
040108392015 - Ledipasvir 90mg+Sofosbuvir 400mg,Ajuste Direto Regime Geral,Aquisição de bens móveis,"33698000-9, Produtos para fins clínicos","Centro Hospitalar e Universitário de Coimbra, E. P. E. (510103448)",Gilead Sciences Lda (503604704),"46.183,83 €",17-10-2016,25-03-2015,360 dias,"Portugal, Coimbra, Coimbra","Artigo 24.º, n.º 1, alínea e) do Código dos Contratos Públicos",31-12-2015,"46.183,83 €","","",,Não aplicável.,Não aplicável.,FALSE
Morfina s/conserv 40 mg/2 ml sol inj fr 2 ml IM IV SC,Ajuste Direto Regime Geral,Aquisição de bens móveis,"33698000-9, Produtos para fins clínicos","Centro Hospitalar e Universitário de Coimbra, E. P. E. (510103448)","LABESFAL LABORATORIO ALMIRO, SA (501169580)","2.000,00 €",17-10-2016,16-01-2015,365 dias,"Portugal, Coimbra, Coimbra","Artigo 20.º, n.º 1, alínea a) do Código dos Contratos Públicos",31-12-2015,"2.000,00 €","","",,Não aplicável.,Não aplicável.,FALSE
040108382015 - Ledipasvir 90mg+Sofosbuvir 400mg,Ajuste Direto Regime Geral,Aquisição de bens móveis,"33698000-9, Produtos para fins clínicos","Centro Hospitalar e Universitário de Coimbra, E. P. E. (510103448)",Gilead Sciences Lda (503604704),"46.183,83 €",17-10-2016,25-03-2015,360 dias,"Portugal, Coimbra, Coimbra","Artigo 24.º, n.º 1, alínea e) do Código dos Contratos Públicos",31-12-2015,"46.183,83 €","","",,Não aplicável.,Não aplicável.,FALSE
"Sol dial acida conc K4,4g/l+CA2,3g/l+MG0,55g/l+CL173,9g/l+Glucose...",Ajuste Direto Regime Geral,Aquisição de bens móveis,"33698000-9, Produtos para fins clínicos","Centro Hospitalar e Universitário de Coimbra, E. P. E. (510103448)","BAXTER MEDICO - FARMACEUTICO, LDA (503347345)","400,14 €",17-10-2016,22-01-2015,365 dias,"Portugal, Coimbra, Coimbra","Artigo 20.º, n.º 1, alínea a) do Código dos Contratos Públicos",31-12-2015,"400,14 €","","",,Não aplicável.,Não aplicável.,FALSE
Senosido A + Senosido B 12 mg comp,Ajuste Direto Regime Geral,Aquisição de bens móveis,"33698000-9, Produtos para fins clínicos","Centro Hospitalar e Universitário de Coimbra, E. P. E. (510103448)","NOVARTIS CONSUMER HEALTH, LDA (PASSOU P/ GLAXO) (500268215)","373,80 €",17-10-2016,23-12-2014,365 dias,"Portugal, Coimbra, Coimbra","Artigo 24.º, n.º 1, alínea e) do Código dos Contratos Públicos",31-12-2015,"373,80 €","","",,Não aplicável.,Não aplicável.,FALSE
Tecnecio (99MTC) mebrofenina pó sol inj fr IV,Ajuste Direto Regime Geral,Aquisição de bens móveis,"33698000-9, Produtos para fins clínicos","Centro Hospitalar e Universitário de Coimbra, E. P. E. (510103448)","ADVANCED ACCELERATOR APPLICATIONS UNIPESSOAL, LDA (509917267)","1.928,00 €",17-10-2016,27-01-2015,365 dias,"Portugal, Coimbra, Coimbra","Artigo 24.º, n.º 1, alínea e) do Código dos Contratos Públicos",31-12-2015,"1.928,00 €","","",,Não aplicável.,Não aplicável.,FALSE
040108372015 - Sofosbuvir 400mg,Ajuste Direto Regime Geral,Aquisição de bens móveis,"33698000-9, Produtos para fins clínicos","Centro Hospitalar e Universitário de Coimbra, E. P. E. (510103448)",Gilead Sciences Lda (503604704),"82.329,66 €",17-10-2016,25-03-2015,360 dias,"Portugal, Coimbra, Coimbra","Artigo 24.º, n.º 1, alínea e) do Código dos Contratos Públicos",31-12-2015,"82.329,66 €","","",,Não aplicável.,Não aplicável.,FALSE
Iobenguano (123I) sol inj,Ajuste Direto Regime Geral,Aquisição de bens móveis,"33698000-9, Produtos para fins clínicos","Centro Hospitalar e Universitário de Coimbra, E. P. E. (510103448)","SATIS RADIOSOTOPOS P.C.SOBRELECTRICAS, LDA (500098140)","26.136,00 €",17-10-2016,05-02-2015,365 dias,"Portugal, Coimbra, Coimbra","Artigo 24.º, n.º 1, alínea e) do Código dos Contratos Públicos",31-12-2015,"26.136,00 €","","",,Não aplicável.,Não aplicável.,FALSE
Cromato (51CR) de sódio 37 MBq prec radiof fr IV,Ajuste Direto Regime Geral,Aquisição de bens móveis,"33698000-9, Produtos para fins clínicos","Centro Hospitalar e Universitário de Coimbra, E. P. E. (510103448)","SATIS RADIOSOTOPOS P.C.SOBRELECTRICAS, LDA (500098140)","4.650,00 €",17-10-2016,22-01-2015,365 dias,"Portugal, Coimbra, Coimbra","Artigo 24.º, n.º 1, alínea e) do Código dos Contratos Públicos",31-12-2015,"4.650,00 €","","",,Não aplicável.,Não aplicável.,FALSE
040108362015 - Ledipasvir 90mg+Sofosbuvir 400mg,Ajuste Direto Regime Geral,Aquisição de bens móveis,"33698000-9, Produtos para fins clínicos","Centro Hospitalar e Universitário de Coimbra, E. P. E. (510103448)",Gilead Sciences Lda (503604704),"92.367,66 €",17-10-2016,25-03-2015,360 dias,"Portugal, Coimbra, Coimbra","Artigo 24.º, n.º 1, alínea e) do Código dos Contratos Públicos",31-12-2015,"92.367,66 €","","",,Não aplicável.,Não aplicável.,FALSE
Tiamina 100 mg comp,Ajuste Direto Regime Geral,Aquisição de bens móveis,"33698000-9, Produtos para fins clínicos","Centro Hospitalar e Universitário de Coimbra, E. P. E. (510103448)","LABESFAL LABORATORIO ALMIRO, SA (501169580)","148,20 €",17-10-2016,21-04-2015,365 dias,"Portugal, Coimbra, Coimbra","Artigo 24.º, n.º 1, alínea e) do Código dos Contratos Públicos",31-12-2015,"148,20 €","","",,Não aplicável.,Não aplicável.,FALSE
Dimetindeno 1 mg/g gel bisn 30 g,Ajuste Direto Regime Geral,Aquisição de bens móveis,"33698000-9, Produtos para fins clínicos","Centro Hospitalar e Universitário de Coimbra, E. P. E. (510103448)","NOVARTIS CONSUMER HEALTH, LDA (PASSOU P/ GLAXO) (500268215)","1.646,72 €",17-10-2016,23-01-2015,365 dias,"Portugal, Coimbra, Coimbra","Artigo 24.º, n.º 1, alínea e) do Código dos Contratos Públicos",31-12-2015,"2.886,72 €","","",,Não aplicável.,Não aplicável.,FALSE
SISTEMA DRENAGEM MISTO,Ajuste Direto Regime Geral,Aquisição de bens móveis,"33000000-0, Equipamento médico, medicamentos e produtos para cuidados pessoais","Centro Hospitalar e Universitário de Coimbra, E. P. E. (510103448)","BIOSONDA - COMERCIO MAT. HOSPITALAR, LDA (501463313)","20.400,00 €",17-10-2016,30-06-2016,365 dias,"Portugal, Coimbra, Coimbra","Artigo 24.º, n.º 1, alínea e) do Código dos Contratos Públicos",30-12-2016,"18.480,00 €","",AQUISIÇAO PARCIAL,,Não aplicável.,Não aplicável.,FALSE
BALAO INTRA GASTRICA,Ajuste Direto Regime Geral,Aquisição de bens móveis,"33000000-0, Equipamento médico, medicamentos e produtos para cuidados pessoais","Centro Hospitalar e Universitário de Coimbra, E. P. E. (510103448)","BOSTON SCIENTIFIC PORTUGAL, LDA (504988964)","8.000,00 €",17-10-2016,12-07-2016,365 dias,"Portugal, Coimbra, Coimbra","Artigo 24.º, n.º 1, alínea e) do Código dos Contratos Públicos",30-12-2016,"7.400,00 €","",AQUISIÇAO PARCIAL,,Não aplicável.,Não aplicável.,FALSE
Irbesartan comp,Ajuste Direto Regime Geral,Aquisição de bens móveis,"33698000-9, Produtos para fins clínicos","Centro Hospitalar e Universitário de Coimbra, E. P. E. (510103448)","SANOFI-AVENTIS  - PRODUTOS FARMACEUTICOS , LDA (500134960)","321,73 €",17-10-2016,20-01-2015,365 dias,"Portugal, Coimbra, Coimbra","Artigo 26.º, n.º 1, alínea a) do Código dos Contratos Públicos",31-12-2015,"321,73 €","","",,Não aplicável.,Não aplicável.,FALSE
040108352015 - Ledipasvir 90mg+Sofosbuvir 400mg,Ajuste Direto Regime Geral,Aquisição de bens móveis,"33698000-9, Produtos para fins clínicos","Centro Hospitalar e Universitário de Coimbra, E. P. E. (510103448)",Gilead Sciences Lda (503604704),"92.367,66 €",17-10-2016,25-03-2015,360 dias,"Portugal, Coimbra, Coimbra","Artigo 24.º, n.º 1, alínea e) do Código dos Contratos Públicos",31-12-2015,"92.367,66 €","","",,Não aplicável.,Não aplicável.,FALSE
"Losartan 50 mg + hidroclorotiazida 12,5 mg comp",Ajuste Direto Regime Geral,Aquisição de bens móveis,"33698000-9, Produtos para fins clínicos","Centro Hospitalar e Universitário de Coimbra, E. P. E. (510103448)","SANOFI-AVENTIS  - PRODUTOS FARMACEUTICOS , LDA (500134960)","299,04 €",17-10-2016,20-01-2015,365 dias,"Portugal, Coimbra, Coimbra","Artigo 26.º, n.º 1, alínea a) do Código dos Contratos Públicos",31-12-2015,"299,04 €","","",,Não aplicável.,Não aplicável.,FALSE
Pravastatina 20 mg comp,Ajuste Direto Regime Geral,Aquisição de bens móveis,"33698000-9, Produtos para fins clínicos","Centro Hospitalar e Universitário de Coimbra, E. P. E. (510103448)","DAIICHI SANKYO PORTUGAL, LDA (501509860)","451,29 €",17-10-2016,20-02-2015,365 dias,"Portugal, Coimbra, Coimbra","Artigo 26.º, n.º 1, alínea a) do Código dos Contratos Públicos",31-12-2015,"451,29 €","","",,Não aplicável.,Não aplicável.,FALSE
040108342015 - Ledipasvir 90mg+Sofosbuvir 400mg,Ajuste Direto Regime Geral,Aquisição de bens móveis,"33698000-9, Produtos para fins clínicos","Centro Hospitalar e Universitário de Coimbra, E. P. E. (510103448)",Gilead Sciences Lda (503604704),"92.367,66 €",17-10-2016,25-03-2015,360 dias,"Portugal, Coimbra, Coimbra","Artigo 24.º, n.º 1, alínea e) do Código dos Contratos Públicos",31-12-2015,"92.367,66 €","","",,Não aplicável.,Não aplicável.,FALSE
Valsartan comp,Ajuste Direto Regime Geral,Aquisição de bens móveis,"33698000-9, Produtos para fins clínicos","Centro Hospitalar e Universitário de Coimbra, E. P. E. (510103448)","NOVARTIS FARMA - PROD. FARMACEUTICOS,  SA. (500063524)","1.690,99 €",17-10-2016,20-01-2015,365 dias,"Portugal, Coimbra, Coimbra","Artigo 26.º, n.º 1, alínea a) do Código dos Contratos Públicos",31-12-2015,"2.141,53 €","","",,Não aplicável.,Não aplicável.,FALSE
Pomalidomida 4 mg cáps,Ajuste Direto Regime Geral,Aquisição de bens móveis,"33698000-9, Produtos para fins clínicos","Centro Hospitalar e Universitário de Coimbra, E.P. (510103448)","Celgene, Sociedade Unipessoal, Ld.º (507791690)","114.744,00 €",17-10-2016,08-04-2015,365 dias,"Portugal, Coimbra, Coimbra","Artigo 24.º, n.º 1, alínea e) do Código dos Contratos Públicos",31-12-2015,"114.744,00 €","","",,Não aplicável.,Não aplicável.,FALSE
Piracetam 1200 mg comp,Ajuste Direto Regime Geral,Aquisição de bens móveis,"33698000-9, Produtos para fins clínicos","Centro Hospitalar e Universitário de Coimbra, E. P. E. (510103448)","LABESFAL LABORATORIO ALMIRO, SA (501169580)","145,08 €",17-10-2016,20-01-2015,365 dias,"Portugal, Coimbra, Coimbra","Artigo 26.º, n.º 1, alínea a) do Código dos Contratos Públicos",31-12-2015,"238,68 €","","",,Não aplicável.,Não aplicável.,FALSE
Topiramato 25 mg comp,Ajuste Direto Regime Geral,Aquisição de bens móveis,"33698000-9, Produtos para fins clínicos","Centro Hospitalar e Universitário de Coimbra, E. P. E. (510103448)","FARMOZ SOC. TECNICO MEDICINAL, SA (501505334)","324,00 €",17-10-2016,31-12-2014,365 dias,"Portugal, Coimbra, Coimbra","Artigo 26.º, n.º 1, alínea a) do Código dos Contratos Públicos",31-12-2015,"324,00 €","","",,Não aplicável.,Não aplicável.,FALSE
SISTEMA SOROS INFUSOMAT,Ajuste Direto Regime Geral,Aquisição de bens móveis,"33000000-0, Equipamento médico, medicamentos e produtos para cuidados pessoais","Centro Hospitalar e Universitário de Coimbra, E. P. E. (510103448)","B BRAUN MEDICAL, LDA (501506543)","9.828,00 €",17-10-2016,01-07-2016,365 dias,"Portugal, Coimbra, Coimbra","Artigo 24.º, n.º 1, alínea e) do Código dos Contratos Públicos",30-12-2016,"9.828,00 €","","",,Não aplicável.,Não aplicável.,FALSE
Naproxeno 250 mg comp,Ajuste Direto Regime Geral,Aquisição de bens móveis,"33698000-9, Produtos para fins clínicos","Centro Hospitalar e Universitário de Coimbra, E. P. E. (510103448)","ROCHE FARMACEUTICA QUIMICA, LDA (500233810)","618,80 €",17-10-2016,20-01-2015,365 dias,"Portugal, Coimbra, Coimbra","Artigo 26.º, n.º 1, alínea a) do Código dos Contratos Públicos",31-12-2015,"924,80 €","","",,Não aplicável.,Não aplicável.,FALSE
Amlodipina 10 mg comp,Ajuste Direto Regime Geral,Aquisição de bens móveis,"33698000-9, Produtos para fins clínicos","Centro Hospitalar e Universitário de Coimbra, E. P. E. (510103448)","LABORATORIOS PFIZER, LDA (500162166)","1.288,44 €",17-10-2016,31-12-2014,365 dias,"Portugal, Coimbra, Coimbra","Artigo 26.º, n.º 1, alínea a) do Código dos Contratos Públicos",31-12-2015,"1.524,65 €","","",,Não aplicável.,Não aplicável.,FALSE
"Candesartan 16 mg + hidroclorotiazida 12,5 mg comp",Ajuste Direto Regime Geral,Aquisição de bens móveis,"33698000-9, Produtos para fins clínicos","Centro Hospitalar e Universitário de Coimbra, E. P. E. (510103448)",LUSO MEDICAMENTA - SOC. TÉCN. FARMACÊUTICA (507150473),"667,84 €",17-10-2016,31-12-2014,365 dias,"Portugal, Coimbra, Coimbra","Artigo 26.º, n.º 1, alínea a) do Código dos Contratos Públicos",31-12-2015,"667,84 €","","",,Não aplicável.,Não aplicável.,FALSE
Levofloxacina 500 mg comp,Ajuste Direto Regime Geral,Aquisição de bens móveis,"33698000-9, Produtos para fins clínicos","Centro Hospitalar e Universitário de Coimbra, E. P. E. (510103448)","SANOFI-AVENTIS  - PRODUTOS FARMACEUTICOS , LDA (500134960)","11.294,38 €",17-10-2016,23-01-2015,365 dias,"Portugal, Coimbra, Coimbra","Artigo 26.º, n.º 1, alínea a) do Código dos Contratos Públicos",31-12-2015,"11.294,38 €","","",,Não aplicável.,Não aplicável.,FALSE
GUIA PRESSAO,Ajuste Direto Regime Geral,Aquisição de bens móveis,"33000000-0, Equipamento médico, medicamentos e produtos para cuidados pessoais","Centro Hospitalar e Universitário de Coimbra, E. P. E. (510103448)",VOLCANO EUROPE (BE59842345),"9.945,00 €",17-10-2016,28-06-2016,365 dias,"Portugal, Coimbra, Coimbra","Artigo 24.º, n.º 1, alínea e) do Código dos Contratos Públicos","","","","",,Não aplicável.,Não aplicável.,FALSE
MATERIAL HEMODIALISE,Ajuste Direto Regime Geral,Aquisição de bens móveis,"33000000-0, Equipamento médico, medicamentos e produtos para cuidados pessoais","Centro Hospitalar e Universitário de Coimbra, E. P. E. (510103448)","FRESENIUS MEDICAL CARE, SA (503070220)","5.100,00 €",17-10-2016,14-07-2016,365 dias,"Portugal, Coimbra, Coimbra","Artigo 24.º, n.º 1, alínea e) do Código dos Contratos Públicos",30-12-2016,"636,00 €","",AQUISIÇAO PARCIAL,,Não aplicável.,Não aplicável.,FALSE
Azacitidina 100 mg pó susp inj fr SC,Ajuste Direto Regime Geral,Aquisição de bens móveis,"33698000-9, Produtos para fins clínicos","Centro Hospitalar e Universitário de Coimbra, E.P. (510103448)","CELGENE, SOCIEDADE  UNIPESSOAL, LDA (507791690)","187.620,00 €",17-10-2016,13-02-2015,365 dias,"Portugal, Coimbra, Coimbra","Artigo 24.º, n.º 1, alínea e) do Código dos Contratos Públicos",31-12-2015,"187.620,00 €","","",,Não aplicável.,Não aplicável.,FALSE
040108322015 - Ledipasvir 90mg+Sofosbuvir 400mg,Ajuste Direto Regime Geral,Aquisição de bens móveis,"33698000-9, Produtos para fins clínicos","Centro Hospitalar e Universitário de Coimbra, E. P. E. (510103448)",Gilead  Sciences Lda (503604704),"92.367,66 €",14-10-2016,25-03-2015,360 dias,"Portugal, Coimbra, Coimbra","Artigo 24.º, n.º 1, alínea e) do Código dos Contratos Públicos",31-12-2015,"92.367,66 €","","",,Não aplicável.,Não aplicável.,FALSE
040108202015 - Sofosbuvir 400mg,Ajuste Direto Regime Geral,Aquisição de bens móveis,"33698000-9, Produtos para fins clínicos","Centro Hospitalar e Universitário de Coimbra, E. P. E. (510103448)",gilead Sciences Lda (503604704),"82.329,66 €",14-10-2016,25-03-2015,360 dias,"Portugal, Coimbra, Coimbra","Artigo 24.º, n.º 1, alínea e) do Código dos Contratos Públicos",31-12-2015,"82.329,66 €","","",,Não aplicável.,Não aplicável.,FALSE
040108192015 - Ledipasvir 90mg+Sofosbuvir 400mg,Ajuste Direto Regime Geral,Aquisição de bens móveis,"33698000-9, Produtos para fins clínicos","Centro Hospitalar e Universitário de Coimbra, E. P. E. (510103448)",Gilead Sciences Lda (503604704),"92.367,66 €",14-10-2016,25-03-2015,360 dias,"Portugal, Coimbra, Coimbra","Artigo 24.º, n.º 1, alínea e) do Código dos Contratos Públicos",31-12-2015,"92.367,66 €","","",,Não aplicável.,Não aplicável.,FALSE
SISTEMAS E FILTRO,Ajuste Direto Regime Geral,Aquisição de bens móveis,"33000000-0, Equipamento médico, medicamentos e produtos para cuidados pessoais","Centro Hospitalar e Universitário de Coimbra, E. P. E. (510103448)","INTERSURGICAL PORTUGAL, LDA (503480045)","8.846,50 €",14-10-2016,12-10-2016,120 dias,"Portugal, Coimbra, Coimbra","Artigo 24.º, n.º 1, alínea e) do Código dos Contratos Públicos",30-12-2016,"8.846,50 €","","",,Não aplicável.,Não aplicável.,FALSE
SISTEMA ENCERRAMENTO ARTERIAL,Ajuste Direto Regime Geral,Aquisição de bens móveis,"33000000-0, Equipamento médico, medicamentos e produtos para cuidados pessoais","Centro Hospitalar e Universitário de Coimbra, E. P. E. (510103448)",ST. JUDE MEDICAL PORTUGAL (504180746),"8.000,00 €",14-10-2016,10-10-2016,120 dias,"Portugal, Coimbra, Coimbra","Artigo 24.º, n.º 1, alínea e) do Código dos Contratos Públicos",30-12-2016,"8.000,00 €","","",,Não aplicável.,Não aplicável.,FALSE
SISTEMA ALIMENTAÇÃO ENTERICA,Ajuste Direto Regime Geral,Aquisição de bens móveis,"33000000-0, Equipamento médico, medicamentos e produtos para cuidados pessoais","Centro Hospitalar e Universitário de Coimbra, E. P. E. (510103448)","MEDTRONIC PORTUGAL, LDA (504223933)","9.000,00 €",14-10-2016,06-10-2016,120 dias,"Portugal, Coimbra, Coimbra","Artigo 24.º, n.º 1, alínea e) do Código dos Contratos Públicos",30-12-2016,"5.310,00 €","",Aquisição parcial,,Não aplicável.,Não aplicável.,FALSE
FIO GUIA PROTEGIDO,Ajuste Direto Regime Geral,Aquisição de bens móveis,"33000000-0, Equipamento médico, medicamentos e produtos para cuidados pessoais","Centro Hospitalar e Universitário de Coimbra, E. P. E. (510103448)","BOSTON SCIENTIFIC PORTUGAL, LDA (504988964)","8.960,00 €",14-10-2016,12-10-2016,120 dias,"Portugal, Coimbra, Coimbra","Artigo 24.º, n.º 1, alínea e) do Código dos Contratos Públicos",30-12-2016,"4.480,00 €","",AQUISIÇÃO PARCIAL,,Não aplicável.,Não aplicável.,FALSE
GUIA PRESSAO,Ajuste Direto Regime Geral,Aquisição de bens móveis,"33000000-0, Equipamento médico, medicamentos e produtos para cuidados pessoais","Centro Hospitalar e Universitário de Coimbra, E. P. E. (510103448)",VOLCANO EUROPE (BE59842345),"7.650,00 €",14-10-2016,12-10-2016,120 dias,"Portugal, Coimbra, Coimbra","Artigo 24.º, n.º 1, alínea e) do Código dos Contratos Públicos",30-12-2016,"","",PEDIDO DE COMPRA DO SERVIÇO ALTERADO PARA 2017,,Não aplicável.,Não aplicável.,FALSE
GUIA PRESSAO,Ajuste Direto Regime Geral,Aquisição de bens móveis,"33000000-0, Equipamento médico, medicamentos e produtos para cuidados pessoais","Centro Hospitalar e Universitário de Coimbra, E. P. E. (510103448)",VOLCANO EUROPE (BE59842345),"9.945,00 €",14-10-2016,03-10-2016,120 dias,"Portugal, Coimbra, Coimbra","Artigo 24.º, n.º 1, alínea e) do Código dos Contratos Públicos",30-12-2016,"6.885,00 €","",AQUISIÇAO PARCIAL,,Não aplicável.,Não aplicável.,FALSE
GUIA PRESSAO,Ajuste Direto Regime Geral,Aquisição de bens móveis,"33000000-0, Equipamento médico, medicamentos e produtos para cuidados pessoais","Centro Hospitalar e Universitário de Coimbra, E. P. E. (510103448)",VOLCANO EUROPE (BE59842345),"9.945,00 €",14-10-2016,23-09-2016,120 dias,"Portugal, Coimbra, Coimbra","Artigo 24.º, n.º 1, alínea e) do Código dos Contratos Públicos",30-12-2016,"9.945,00 €","","",,Não aplicável.,Não aplicável.,FALSE
"Aquisição de equipamento informático para a fase arranque logística-Fase 2, para diversos serviços",Ajuste Direto Regime Geral,Aquisição de bens móveis,"30000000-9, Máquinas, equipamento e material de escritório e de informática, excepto mobiliário e pacotes de programas (software)","Centro Hospitalar e Universitário de Coimbra, E. P. E. (510103448)","BUROTICA, SA (501178503)","9.491,00 €",13-10-2016,04-10-2016,30 dias,"Portugal, Coimbra, Coimbra","Artigo 20.º, n.º 1, alínea a) do Código dos Contratos Públicos","","","","",,Não aplicável.,Não aplicável.,FALSE
040108182015 - Ledispavir 90mg+Sofosbuvir 400mg,Ajuste Direto Regime Geral,Aquisição de bens móveis,"33698000-9, Produtos para fins clínicos","Centro Hospitalar e Universitário de Coimbra, E. P. E. (510103448)",Gilead Sciences Lda (503604704),"46.183,83 €",13-10-2016,25-03-2015,360 dias,"Portugal, Coimbra, Coimbra","Artigo 24.º, n.º 1, alínea e) do Código dos Contratos Públicos",31-12-2015,"46.183,83 €","","",,Não aplicável.,Não aplicável.,FALSE
040108172015 - Ledispavir 90mg+Sofosbuvir 400mg,Ajuste Direto Regime Geral,Aquisição de bens móveis,"33698000-9, Produtos para fins clínicos","Centro Hospitalar e Universitário de Coimbra, E. P. E. (510103448)",Gilead Sciences Lda (503604704),"92.367,66 €",13-10-2016,25-03-2015,360 dias,"Portugal, Coimbra, Coimbra","Artigo 24.º, n.º 1, alínea e) do Código dos Contratos Públicos",31-12-2015,"92.367,66 €","","",,Não aplicável.,Não aplicável.,FALSE
Aquisição de um videoprojetor para o serviço de Ortopedia,Ajuste Direto Regime Geral,Aquisição de bens móveis,"30000000-9, Máquinas, equipamento e material de escritório e de informática, excepto mobiliário e pacotes de programas (software)","Centro Hospitalar e Universitário de Coimbra, E. P. E. (510103448)",CCSI-SOLUÇÕES INFORMATICAS (503133329),"360,00 €",13-10-2016,10-10-2016,20 dias,"Portugal, Coimbra, Coimbra","Artigo 20.º, n.º 1, alínea a) do Código dos Contratos Públicos","","","","",,Não aplicável.,Não aplicável.,FALSE
040108162015 - Ledispavir 90mg+Sofosbuvir 400mg,Ajuste Direto Regime Geral,Aquisição de bens móveis,"33698000-9, Produtos para fins clínicos","Centro Hospitalar e Universitário de Coimbra, E. P. E. (510103448)",Gilead Sciences Lda (503604704),"46.183,83 €",13-10-2016,25-03-2015,360 dias,"Portugal, Coimbra, Coimbra","Artigo 24.º, n.º 1, alínea e) do Código dos Contratos Públicos",31-12-2015,"46.183,83 €","","",,Não aplicável.,Não aplicável.,FALSE
Aquisição de equipamentos de ar condicionado,Ajuste Direto Regime Geral,Aquisição de bens móveis,"31000000-6, Maquinaria, aparelhagem, equipamento e consumíveis eléctricos; iluminação","Centro Hospitalar e Universitário de Coimbra, E. P. E. (510103448)",ELETROCLIMA (500916837),"3.700,00 €",13-10-2016,04-10-2016,30 dias,"Portugal, Coimbra, Coimbra","Artigo 20.º, n.º 1, alínea a) do Código dos Contratos Públicos","","","","",,Não aplicável.,Não aplicável.,FALSE
Fornecimento de estantes metálicas de encaixe,Ajuste Direto Regime Geral,Aquisição de bens móveis,"39000000-2, Mobiliário (incl. de escritório), acessórios, aparelhos domésticos (excl. iluminação) e produtos de limpeza","Centro Hospitalar e Universitário de Coimbra, E. P. E. (510103448)","Haworth Portugal - Mobiliário de Escritório, S.A. (500077622)","3.549,96 €",13-10-2016,10-10-2016,20 dias,"Portugal, Coimbra, Coimbra","Artigo 20.º, n.º 1, alínea a) do Código dos Contratos Públicos","","","","",,Não aplicável.,Não aplicável.,FALSE
"Entecavir 0,5 mg comp",Ajuste Direto Regime Geral,Aquisição de bens móveis,"33698000-9, Produtos para fins clínicos","Centro Hospitalar e Universitário de Coimbra, E.P. (510103448)","BRISTOL MYERS SQUIBB FARM.PORTUGUESA, SA (500048193)","186.555,72 €",13-10-2016,19-02-2015,365 dias,"Portugal, Coimbra, Coimbra","Artigo 24.º, n.º 1, alínea e) do Código dos Contratos Públicos",31-12-2015,"186.555,72 €","","",,Não aplicável.,Não aplicável.,FALSE
Acarbose comp,Ajuste Direto Regime Geral,Aquisição de bens móveis,"33698000-9, Produtos para fins clínicos","Centro Hospitalar e Universitário de Coimbra, E. P. E. (510103448)","BAYER PORTUGAL, LDA (500043256)","155,24 €",13-10-2016,31-12-2014,365 dias,"Portugal, Coimbra, Coimbra","Artigo 26.º, n.º 1, alínea a) do Código dos Contratos Públicos",31-12-2015,"155,24 €","","",,Não aplicável.,Não aplicável.,FALSE
Deflazacorte comp,Ajuste Direto Regime Geral,Aquisição de bens móveis,"33698000-9, Produtos para fins clínicos","Centro Hospitalar e Universitário de Coimbra, E. P. E. (510103448)","LABORATORIOS VITORIA, SA (500162220)","1.303,60 €",13-10-2016,20-01-2015,365 dias,"Portugal, Coimbra, Coimbra","Artigo 26.º, n.º 1, alínea a) do Código dos Contratos Públicos",31-12-2015,"1.303,60 €","","",,Não aplicável.,Não aplicável.,FALSE
Ranitidina 150 mg comp,Ajuste Direto Regime Geral,Aquisição de bens móveis,"33698000-9, Produtos para fins clínicos","Centro Hospitalar e Universitário de Coimbra, E. P. E. (510103448)","LABESFAL LABORATORIO ALMIRO, SA (501169580)","288,46 €",13-10-2016,31-12-2014,365 dias,"Portugal, Coimbra, Coimbra","Artigo 26.º, n.º 1, alínea a) do Código dos Contratos Públicos",31-12-2015,"288,46 €","","",,Não aplicável.,Não aplicável.,FALSE
Buspirona 10 mg comp,Ajuste Direto Regime Geral,Aquisição de bens móveis,"33698000-9, Produtos para fins clínicos","Centro Hospitalar e Universitário de Coimbra, E. P. E. (510103448)","AUROVITAS UNIPESSOAL, LDA (513053239)","28,80 €",13-10-2016,16-01-2015,365 dias,"Portugal, Coimbra, Coimbra","Artigo 26.º, n.º 1, alínea a) do Código dos Contratos Públicos",31-12-2015,"28,80 €","","",,Não aplicável.,Não aplicável.,FALSE
Bosentano 125 mg comp,Ajuste Direto Regime Geral,Aquisição de bens móveis,"33698000-9, Produtos para fins clínicos","Centro Hospitalar e Universitário de Coimbra, E.P. (510103448)","ACTELION PHARMACEUTICALS PORTUGAL, LDA. (507336488)","181.973,85 €",13-10-2016,09-02-2015,365 dias,"Portugal, Coimbra, Coimbra","Artigo 24.º, n.º 1, alínea e) do Código dos Contratos Públicos",31-12-2015,"181.973,85 €","","",,Não aplicável.,Não aplicável.,FALSE
Eculizumab 300 mg sol inj fr 30 ml IV,Ajuste Direto Regime Geral,Aquisição de bens móveis,"33698000-9, Produtos para fins clínicos","Centro Hospitalar e Universitário de Coimbra, E. P. E. (510103448)",ALEXION PHARMA INTERNATIONAL TRADING (DE815460271),"189.000,00 €",13-10-2016,29-01-2015,365 dias,"Portugal, Coimbra, Coimbra","Artigo 24.º, n.º 1, alínea e) do Código dos Contratos Públicos",31-12-2015,"189.000,00 €","","",,Não aplicável.,Não aplicável.,FALSE
Serviços de Recolha/tratamento resíduos urbanos dos polos HG/HP/MBB/CHPC-2ºSemestre,Ajuste Direto Regime Geral,Aquisição de serviços,"90510000-5, Tratamento e eliminação de resíduos","Centro Hospitalar e Universitário de Coimbra, E. P. E. (510103448)",Camara Municipal de Coimbra (506415082),"45.619,20 €",13-10-2016,07-10-2016,233 dias,"Portugal, Coimbra, Coimbra","Artigo 20.º, n.º 1, alínea a) do Código dos Contratos Públicos","","","","",,Não aplicável.,Não aplicável.,FALSE
Aquisição de carros e armários rodados para o Serviço de Medicina Intensiva do CHUC,Ajuste Direto Regime Geral,Aquisição de bens móveis,"39000000-2, Mobiliário (incl. de escritório), acessórios, aparelhos domésticos (excl. iluminação) e produtos de limpeza","Centro Hospitalar e Universitário de Coimbra, E. P. E. (510103448)","Bacelar & Irmão, Lda. (500532818)","19.097,32 €",13-10-2016,12-09-2016,30 dias,"Portugal, Coimbra, Coimbra","Artigo 20.º, n.º 1, alínea a) do Código dos Contratos Públicos","","","","",,Não aplicável.,Não aplicável.,FALSE
Implantes Cocleares completos Kit Adulto,Ajuste Direto Regime Geral,Aquisição de bens móveis,"33000000-0, Equipamento médico, medicamentos e produtos para cuidados pessoais","Centro Hospitalar e Universitário de Coimbra, E. P. E. (510103448)","COSELGI PORTUGAL, SA (509230598)","81.085,50 €",12-10-2016,23-09-2016,20 dias,"Portugal, Coimbra, Coimbra","Artigo 24.º, n.º 1, alínea e) do Código dos Contratos Públicos","","","","",,Não aplicável.,Não aplicável.,FALSE
Lenalidomida 25 mg cáps,Ajuste Direto Regime Geral,Aquisição de bens móveis,"33698000-9, Produtos para fins clínicos","Centro Hospitalar e Universitário de Coimbra, E.P. (510103448)","CELGENE, SOCIEDADE  UNIPESSOAL, LDA (507791690)","184.182,73 €",12-10-2016,03-03-2015,365 dias,"Portugal, Coimbra, Coimbra","Artigo 24.º, n.º 1, alínea e) do Código dos Contratos Públicos",31-12-2015,"184.182,73 €","","",,Não aplicável.,Não aplicável.,FALSE
Iopromida 769 mg/ml sol inj fr 500 ml IA,Ajuste Direto Regime Geral,Aquisição de bens móveis,"33698000-9, Produtos para fins clínicos","Centro Hospitalar e Universitário de Coimbra, E.P. (510103448)","BAYER PORTUGAL, LDA (500043256)","184.159,80 €",12-10-2016,23-01-2015,365 dias,"Portugal, Coimbra, Coimbra","Artigo 24.º, n.º 1, alínea e) do Código dos Contratos Públicos",31-12-2015,"184.159,80 €","","",,Não aplicável.,Não aplicável.,FALSE
Lenalidomida 15 mg cáps,Ajuste Direto Regime Geral,Aquisição de bens móveis,"33698000-9, Produtos para fins clínicos","Centro Hospitalar e Universitário de Coimbra, E.P. (510103448)","CELGENE, SOCIEDADE  UNIPESSOAL, LDA (507791690)","187.137,46 €",12-10-2016,24-02-2015,365 dias,"Portugal, Coimbra, Coimbra","Artigo 24.º, n.º 1, alínea e) do Código dos Contratos Públicos",31-12-2015,"187.137,46 €","","",,Não aplicável.,Não aplicável.,FALSE
Tenofovir 245 mg comp,Ajuste Direto Regime Geral,Aquisição de bens móveis,"33698000-9, Produtos para fins clínicos","Centro Hospitalar e Universitário de Coimbra, E.P. (510103448)","GILEAD SCIENCES, LDA (503604704)","187.590,93 €",12-10-2016,13-02-2015,365 dias,"Portugal, Coimbra, Coimbra","Artigo 24.º, n.º 1, alínea e) do Código dos Contratos Públicos",31-12-2015,"187.590,93 €","","",,Não aplicável.,Não aplicável.,FALSE
Azitromicina 500 mg comp,Ajuste Direto Regime Geral,Aquisição de bens móveis,"33698000-9, Produtos para fins clínicos","Centro Hospitalar e Universitário de Coimbra, E. P. E. (510103448)","LABORATORIOS PFIZER, LDA (500162166)","8.204,58 €",12-10-2016,31-12-2014,365 dias,"Portugal, Coimbra, Coimbra","Artigo 26.º, n.º 1, alínea a) do Código dos Contratos Públicos",31-12-2015,"8.204,58 €","","",,Não aplicável.,Não aplicável.,FALSE
Ioflupano (123I) 185 MBQ sol inj fr IV,Ajuste Direto Regime Geral,Aquisição de bens móveis,"33698000-9, Produtos para fins clínicos","Centro Hospitalar e Universitário de Coimbra, E.P. (510103448)","SATIS RADIOSOTOPOS P.C.SOBRELECTRICAS, LDA (500098140)","112.000,00 €",12-10-2016,23-03-2015,365 dias,"Portugal, Coimbra, Coimbra","Artigo 24.º, n.º 1, alínea e) do Código dos Contratos Públicos",31-12-2015,"112.000,00 €","","",,Não aplicável.,Não aplicável.,FALSE
Iodeto (131I) de sódio 1.11 MBQ cáps,Ajuste Direto Regime Geral,Aquisição de bens móveis,"33698000-9, Produtos para fins clínicos","Centro Hospitalar e Universitário de Coimbra, E. P. E. (510103448)","SATIS RADIOSOTOPOS P.C.SOBRELECTRICAS, LDA (500098140)","3.117,50 €",12-10-2016,23-12-2014,365 dias,"Portugal, Coimbra, Coimbra","Artigo 24.º, n.º 1, alínea e) do Código dos Contratos Públicos",31-12-2015,"3.117,50 €","","",,Não aplicável.,Não aplicável.,FALSE
Lactulose 10 g/15 ml xar saq 15 ml,Ajuste Direto Regime Geral,Aquisição de bens móveis,"33698000-9, Produtos para fins clínicos","Centro Hospitalar e Universitário de Coimbra, E. P. E. (510103448)","FERRAZ, LYNCE, SA (500113270)","34.245,19 €",12-10-2016,19-02-2015,365 dias,"Portugal, Coimbra, Coimbra","Artigo 20.º, n.º 1, alínea a) do Código dos Contratos Públicos",31-12-2015,"34.245,19 €","","",,Não aplicável.,Não aplicável.,FALSE
Radiofármacos tecneciados,Ajuste Direto Regime Geral,Aquisição de bens móveis,"33698000-9, Produtos para fins clínicos","Centro Hospitalar e Universitário de Coimbra, E. P. E. (510103448)","SATIS RADIOSOTOPOS P.C.SOBRELECTRICAS, LDA (500098140), ISODER ISOTOPOS E DERIVADOS, SA (502241594), ADVANCED ACCELERATOR APPLICATIONS UNIPESSOAL, LDA (509917267)","59.800,00 €",12-10-2016,24-02-2015,365 dias,"Portugal, Coimbra, Coimbra","Artigo 20.º, n.º 1, alínea a) do Código dos Contratos Públicos",31-12-2015,"59.800,00 €","","",,Não aplicável.,Não aplicável.,FALSE
Ticlopidina 250 mg comp,Ajuste Direto Regime Geral,Aquisição de bens móveis,"33698000-9, Produtos para fins clínicos","Centro Hospitalar e Universitário de Coimbra, E. P. E. (510103448)","LABORATORIOS VITORIA, SA (500162220)","87,00 €",11-10-2016,23-06-2015,365 dias,"Portugal, Coimbra, Coimbra","Artigo 20.º, n.º 1, alínea a) do Código dos Contratos Públicos",31-12-2015,"87,00 €","","",,Não aplicável.,Não aplicável.,FALSE
Fumarato de dimetilo cáps gr,Ajuste Direto Regime Geral,Aquisição de bens móveis,"33698000-9, Produtos para fins clínicos","Centro Hospitalar e Universitário de Coimbra, E. P. E. (510103448)","BIOGEN IDEC PORTUGAL, SOC FARMACÊUTICA, UNIPESSOAL (506415740)","32.313,14 €",11-10-2016,03-08-2015,365 dias,"Portugal, Coimbra, Coimbra","Artigo 24.º, n.º 1, alínea e) do Código dos Contratos Públicos",31-12-2015,"32.313,14 €","","",,Não aplicável.,Não aplicável.,FALSE
Prednisolona 10 mg/ml col susp fr 5 ml,Ajuste Direto Regime Geral,Aquisição de bens móveis,"33698000-9, Produtos para fins clínicos","Centro Hospitalar e Universitário de Coimbra, E. P. E. (510103448)","PROFARIN, LDA (500223238)","107,18 €",11-10-2016,23-01-2015,365 dias,"Portugal, Coimbra, Coimbra","Artigo 24.º, n.º 1, alínea e) do Código dos Contratos Públicos",31-12-2015,"107,18 €","","",,Não aplicável.,Não aplicável.,FALSE
Hidroxizina 2 mg/ml xar fr 200 ml,Ajuste Direto Regime Geral,Aquisição de bens móveis,"33698000-9, Produtos para fins clínicos","Centro Hospitalar e Universitário de Coimbra, E. P. E. (510103448)","UCB PHARMA (PRODUTOS FARMACEUTICOS), LDA (500291322)","98,55 €",11-10-2016,15-01-2015,365 dias,"Portugal, Coimbra, Coimbra","Artigo 24.º, n.º 1, alínea e) do Código dos Contratos Públicos",31-12-2015,"98,55 €","","",,Não aplicável.,Não aplicável.,FALSE
Hidrocoloide p/ ostomia pasta tira,Ajuste Direto Regime Geral,Aquisição de bens móveis,"33698000-9, Produtos para fins clínicos","Centro Hospitalar e Universitário de Coimbra, E. P. E. (510103448)","SPCARE ESPECIALIDADES FARMACÊUTICAS, LDA (508284872)","93,47 €",11-10-2016,13-02-2015,365 dias,"Portugal, Coimbra, Coimbra","Artigo 20.º, n.º 1, alínea a) do Código dos Contratos Públicos",31-12-2015,"93,47 €","","",,Não aplicável.,Não aplicável.,FALSE
Fumarato de dimetilo cáps gr,Ajuste Direto Regime Geral,Aquisição de bens móveis,"33698000-9, Produtos para fins clínicos","Centro Hospitalar e Universitário de Coimbra, E. P. E. (510103448)","BIOGEN IDEC PORTUGAL, SOC FARMACÊUTICA, UNIPESSOAL (506415740)","18.796,37 €",11-10-2016,03-08-2015,365 dias,"Portugal, Coimbra, Coimbra","Artigo 24.º, n.º 1, alínea e) do Código dos Contratos Públicos",31-12-2015,"18.796,37 €","","",,Não aplicável.,Não aplicável.,FALSE
"Loperamida 0,2 mg/ml sol oral fr 100 ml",Ajuste Direto Regime Geral,Aquisição de bens móveis,"33698000-9, Produtos para fins clínicos","Centro Hospitalar e Universitário de Coimbra, E. P. E. (510103448)","JOHNSON & JOHNSON, LDA (500153370)","97,44 €",11-10-2016,15-01-2015,365 dias,"Portugal, Coimbra, Coimbra","Artigo 24.º, n.º 1, alínea e) do Código dos Contratos Públicos",31-12-2015,"97,44 €","","",,Não aplicável.,Não aplicável.,FALSE
Azatioprina 25 mg comp,Ajuste Direto Regime Geral,Aquisição de bens móveis,"33698000-9, Produtos para fins clínicos","Centro Hospitalar e Universitário de Coimbra, E. P. E. (510103448)","ORIONFIN UNIPESSOAL, LDA (508907365)","59,52 €",11-10-2016,06-04-2015,365 dias,"Portugal, Coimbra, Coimbra","Artigo 24.º, n.º 1, alínea e) do Código dos Contratos Públicos",31-12-2015,"59,52 €","","",,Não aplicável.,Não aplicável.,FALSE
Metronidazol 500 mg óvulo,Ajuste Direto Regime Geral,Aquisição de bens móveis,"33698000-9, Produtos para fins clínicos","Centro Hospitalar e Universitário de Coimbra, E. P. E. (510103448)","LABORATORIOS VITORIA, SA (500162220)","41,86 €",11-10-2016,05-05-2015,365 dias,"Portugal, Coimbra, Coimbra","Artigo 24.º, n.º 1, alínea e) do Código dos Contratos Públicos",31-12-2015,"41,86 €","","",,Não aplicável.,Não aplicável.,FALSE
Mebeverina 200 mg cáps LP,Ajuste Direto Regime Geral,Aquisição de bens móveis,"33698000-9, Produtos para fins clínicos","Centro Hospitalar e Universitário de Coimbra, E. P. E. (510103448)","ABBOTT LABORATORIOS, LDA (500006148)","74,84 €",11-10-2016,22-12-2014,365 dias,"Portugal, Coimbra, Coimbra","Artigo 24.º, n.º 1, alínea e) do Código dos Contratos Públicos",31-12-2015,"74,84 €","","",,Não aplicável.,Não aplicável.,FALSE
Didrogesterona 5 mg + estradiol 1 mg comp,Ajuste Direto Regime Geral,Aquisição de bens móveis,"33698000-9, Produtos para fins clínicos","Centro Hospitalar e Universitário de Coimbra, E. P. E. (510103448)","ABBOTT LABORATORIOS, LDA (500006148)","80,26 €",11-10-2016,22-12-2014,365 dias,"Portugal, Coimbra, Coimbra","Artigo 24.º, n.º 1, alínea e) do Código dos Contratos Públicos",31-12-2015,"80,26 €","","",,Não aplicável.,Não aplicável.,FALSE
Simeticone 105 mg/ml emul oral fr 25 ml,Ajuste Direto Regime Geral,Aquisição de bens móveis,"33698000-9, Produtos para fins clínicos","Centro Hospitalar e Universitário de Coimbra, E. P. E. (510103448)",OM PHARMA S.A. (500207410),"288,00 €",11-10-2016,13-02-2015,365 dias,"Portugal, Coimbra, Coimbra","Artigo 24.º, n.º 1, alínea e) do Código dos Contratos Públicos",31-12-2015,"288,00 €","","",,Não aplicável.,Não aplicável.,FALSE
Ajuste Directo nº040001202015-Reagentes p/o Serviço de Hematologia -Laboratório de Citogenética,Ajuste Direto Regime Geral,Aquisição de bens móveis,"33696500-0, Reagentes de laboratório","Centro Hospitalar e Universitário de Coimbra, E. P. E. (510103448)","VWR International (503842770), Alfagene (503387398), Vacuette Portugal (505348470), Bioportugal (502380543), Reagente 5 (501194053)","16.717,14 €",11-10-2016,10-03-2015,365 dias,"Portugal, Coimbra, Coimbra","Artigo 20.º, n.º 1, alínea a) do Código dos Contratos Públicos",31-12-2015,"16.717,14 €","","",,Não aplicável.,Não aplicável.,FALSE
Gel lubrificante ky bisn 5g,Ajuste Direto Regime Geral,Aquisição de bens móveis,"33698000-9, Produtos para fins clínicos","Centro Hospitalar e Universitário de Coimbra, E. P. E. (510103448)","CLINIFAR PRODUTOS  CLINICOS E FARMACEUTICOS, SA (503281115)","468,00 €",11-10-2016,07-04-2015,365 dias,"Portugal, Coimbra, Coimbra","Artigo 20.º, n.º 1, alínea a) do Código dos Contratos Públicos",31-12-2015,"468,00 €","","",,Não aplicável.,Não aplicável.,FALSE
Metoclopramida 1 mg/ml sol oral fr 200 ml,Ajuste Direto Regime Geral,Aquisição de bens móveis,"33698000-9, Produtos para fins clínicos","Centro Hospitalar e Universitário de Coimbra, E. P. E. (510103448)","SANOFI-AVENTIS  - PRODUTOS FARMACEUTICOS , LDA (500134960)","173,25 €",11-10-2016,23-12-2014,365 dias,"Portugal, Coimbra, Coimbra","Artigo 24.º, n.º 1, alínea e) do Código dos Contratos Públicos",31-12-2015,"173,25 €","","",,Não aplicável.,Não aplicável.,FALSE
Codeína 30 mg + feniltoloxamina 10 mg cáps,Ajuste Direto Regime Geral,Aquisição de bens móveis,"33698000-9, Produtos para fins clínicos","Centro Hospitalar e Universitário de Coimbra, E. P. E. (510103448)","FERRAZ, LYNCE, SA (500113270)","146,20 €",11-10-2016,23-12-2014,365 dias,"Portugal, Coimbra, Coimbra","Artigo 24.º, n.º 1, alínea e) do Código dos Contratos Públicos",31-12-2015,"146,20 €","","",,Não aplicável.,Não aplicável.,FALSE
Multivitaminas+sais mineraois sol oral+pó sol oral fr 200 ml,Ajuste Direto Regime Geral,Aquisição de bens móveis,"33698000-9, Produtos para fins clínicos","Centro Hospitalar e Universitário de Coimbra, E. P. E. (510103448)","LABORATORIOS ATRAL, SA (500162085)","390,98 €",11-10-2016,02-03-2015,365 dias,"Portugal, Coimbra, Coimbra","Artigo 24.º, n.º 1, alínea e) do Código dos Contratos Públicos",31-12-2015,"390,98 €","","",,Não aplicável.,Não aplicável.,FALSE
"Dexametasona+Neomicina+Polimixina B got aur sol fr 10,5 ml",Ajuste Direto Regime Geral,Aquisição de bens móveis,"33698000-9, Produtos para fins clínicos","Centro Hospitalar e Universitário de Coimbra, E. P. E. (510103448)","OVERPHARMA-PRODUTOS MÉDICOS E FARMACÉUTICOS,LDA (505792362)","396,09 €",11-10-2016,23-04-2015,365 dias,"Portugal, Coimbra, Coimbra","Artigo 24.º, n.º 1, alínea e) do Código dos Contratos Públicos",31-12-2015,"396,09 €","","",,Não aplicável.,Não aplicável.,FALSE
Multivitaminas sol oral fr 15 ml,Ajuste Direto Regime Geral,Aquisição de bens móveis,"33698000-9, Produtos para fins clínicos","Centro Hospitalar e Universitário de Coimbra, E. P. E. (510103448)","BAYER PORTUGAL, LDA (500043256)","310,08 €",11-10-2016,23-04-2015,365 dias,"Portugal, Coimbra, Coimbra","Artigo 24.º, n.º 1, alínea e) do Código dos Contratos Públicos",31-12-2015,"310,08 €","","",,Não aplicável.,Não aplicável.,FALSE
CATETER GUIA ACTP,Ajuste Direto Regime Geral,Aquisição de bens móveis,"33000000-0, Equipamento médico, medicamentos e produtos para cuidados pessoais","Centro Hospitalar e Universitário de Coimbra, E. P. E. (510103448)","CARDINAL HEALTH PORTUGAL 513 UNIPESSOAL, LDA (513620834)","7.410,00 €",11-10-2016,06-10-2016,120 dias,"Portugal, Coimbra, Coimbra","Artigo 24.º, n.º 1, alínea e) do Código dos Contratos Públicos",30-12-2016,"7.410,00 €","","",,Não aplicável.,Não aplicável.,FALSE
Revisão e Inspeção Gerador Vapor n.º 1 da Central Térmica do H.S.Cid,Ajuste Direto Regime Geral,Aquisição de serviços,"50000000-5, Serviços de reparação e manutenção","Centro Hospitalar e Universitário de Coimbra, E. P. E. (510103448)","Inducentro, Lda. (502476176)","1.028,00 €",11-10-2016,04-10-2016,3 dias,"Portugal, Coimbra, Coimbra","Artigo 20.º, n.º 1, alínea a) do Código dos Contratos Públicos","","","","",,Não aplicável.,Não aplicável.,FALSE
