bd_hospitais.Instituição,bd_hospitais..Localização.Geográfica.,nif
"Centro Hospitalar Barreiro/Montijo, EPE","38.6554005, -9.0592392",509186998
"Centro Hospitalar Cova da Beira, EPE","40.2804158, -7.4922407",506361659
"Centro Hospitalar de Leiria, EPE","39.7414812, -8.7982706",509822932
"Centro Hospitalar de Setúbal, EPE","38.5283754, -8.8818638",507606787
"Centro Hospitalar do Oeste, EPE","39.4054629, -9.1258493",514993871
"Centro Hospitalar e Universitário de Coimbra, EPE","40.2191523, -8.4098211",510103448
"Centro Hospitalar Entre Douro e Vouga, EPE","40.9293884, -8.5458794",508878462
"Centro Hospitalar Lisboa Central, EPE","38.7166948, -9.1371248",508080142
"Centro Hospitalar Lisboa Norte, EPE","38.7500861, -9.1616116",508481287
"Centro Hospitalar Lisboa Ocidental, EPE","38.708454, -9.216985",507618319
"Centro Hospitalar Médio Ave, EPE","41.3423984, -8.4802503",508093937
"Centro Hospitalar Médio Tejo, EPE","39.478072, -8.5404429",506361608
"Centro Hospitalar Póvoa de Varzim/Vila do Conde, EPE","41.3828711, -8.7589945",508741823
"Centro Hospitalar Tâmega e Sousa, EPE","41.2494561, -8.264901",508318262
"Centro Hospitalar Tondela-Viseu, EPE","40.516364, -8.0827433",509822940
"Centro Hospitalar Trás-os-Montes e Alto Douro, EPE","41.3031784, -7.7515252",508100496
"Centro Hospitalar Universitário de São João, EPE","41.1831056, -8.6010558",509821197
"Centro Hospitalar Universitário do Algarve, EPE","37.0238973, -7.9281554",510745997
"Centro Hospitalar Universitário do Porto, EPE","41.1472498, -8.6172617",508331471
"Centro Hospitalar Vila Nova de Gaia/Espinho, EPE","41.1094138, -8.5972617",508142156
"Hospital da Senhora da Oliveira, Guimarães, EPE","41.4387173, -8.3086907",506361551
"Hospital de Magalhães Lemos, EPE","41.1764649, -8.6649823",502828790
"Hospital Distrital de Santarém, EPE","39.2410946, -8.6937515",506361462
"Hospital Distrital Figueira da Foz, EPE","40.117897, -8.8586755",506361527
"Hospital Espírito Santo de Évora, EPE","38.5684861, -7.9032848",508085888
"Hospital Garcia de Orta, EPE","38.6658713, -9.1822554",506361470
"Hospital Professor Doutor Fernando Fonseca, EPE","38.7422257, -9.2264834",503035416
"Hospital Santa Maria Maior, EPE","41.5324234, -8.6171561",506361381
"Instituto Português Oncologia de Coimbra, EPE","40.2162514, -8.4103814",506361438
"Instituto Português Oncologia de Lisboa, EPE","38.7396768, -9.1634516",506361616
"Instituto Português Oncologia do Porto, EPE","41.1785642, -8.6062881",506362299
"Unidade Local de Saúde da Guarda, EPE","40.5309916, -7.2734793",508752000
"Unidade Local de Saúde de Castelo Branco, EPE","39.8212263, -7.4981271",509309844
"Unidade Local de Saúde de Matosinhos, EPE","41.1794456, -8.6745115",506361390
"Unidade Local de Saúde do Alto Minho, EPE","41.7056054, -8.8252713",508786193
"Unidade Local de Saúde do Baixo Alentejo, EPE","38.014123, -7.8721227",508754275
"Unidade Local de Saúde do Litoral Alentejano, EPE","38.0162314, -8.6956768",510445152
"Unidade Local de Saúde do Nordeste, EPE","41.8056532, -6.7888197",509932584
"Unidade Local de Saúde do Norte Alentejano, EPE","39.3003425, -7.4263845",508094461
"Centro Hospitalar do Baixo Vouga, EPE",,510123210
Secretaria-Geral do Ministério da Saúde,,600080684
Inspeção-Geral das Atividades em Saúde (IGAS) - ,,600018857
Direção-Geral da Saúde (DGS) ,,600037100
"Serviço de Intervenção nos Comportamentos Aditivos e nas Dependências (SICAD), I.P - ",,600084884
"ADSE – Instituto de Proteção e Assistência na Doença, IP",,514247517
"Administração Central do Sistema de Saúde (ACSS), I.P",,508188423
"Autoridade Nacional do Medicamento e Produtos de Saúde (INFARMED), I.P",,600037002
"Instituto Nacional de Emergência Médica (INEM), I.P",,501356126
"Instituto Português do Sangue e Transplantação (IPST), I.P",,502423943
"Instituto Nacional de Saúde Dr. Ricardo Jorge (INSA), IP",,501427511
Administração Regional de Saúde do Norte,,503135593
Administração Regional de Saúde do Centro,,503122165
Administração Regional de Saúde de Lisboa e Vale do Tejo,,503148776
Administração Regional de Saúde do Alentejo,,503148768
Administração Regional de Saúde do Algarve,,503148709
Entidade Reguladora da Saúde (ERS),,507021266
Serviços Partilhados do Ministério da Saúde (SPMS),,509540716
Serviço de Utilização Comum dos Hospitais (SUCH),,500900469
Centro Hospitalar Psiquiátrico de Lisboa,,508338476
Centro de Medicina de Reabilitação da Região Centro - Rovisco Pais,,503767336
Hospital Arcebispo João Crisóstomo – Cantanhede,,501626123
Hospital Dr. Francisco Zagalo – Ovar,,501510150
Instituto de Oftalmologia Dr. Gama Pinto,,600000052
Hospital de Cascais Dr. José de Almeida,,506024989
"HOSPITAL SENHORA DA OLIVEIRA - GUIMARÃES. EPE",,508080827
"Centro Hospitalar do Oeste, EPE",,510412009
Hospital de Cascais Dr. José de Almeida,,505201380