Objeto do Contrato,Tipo de Procedimento,Tipo(s) de Contrato,CPVs,Entidade(s) Adjudicante(s),Entidade(s) Adjudicatária(s),Preço Contratual,Data de Publicação,Data de Celebração do Contrato,Prazo de Execução,Local de Execução,Fundamentação,Data de Fecho do Contrato,Preço Total Efetivo,Causas das Alterações ao Prazo,Causas das Alterações ao Preço,Estado,N.º registo do Acordo Quadro,Descrição do Acordo Quadro,Procedimento Centralizado
manutenção corretiva e evolutiva dos sistemas clinidata,Ajuste Direto Regime Geral,Aquisição de serviços,"50000000-5, Serviços de reparação e manutenção","Hospital da Senhora da Oliveira Guimarães, E. P. E. (508080827)",Maxdata Software SA  (502250259),"28.873,00 €",20-04-2017,10-03-2017,365 dias,"Portugal, Braga, Guimarães","Artigo 24.º, n.º 1, alínea e) do Código dos Contratos Públicos",,,,,,Não aplicável.,Não aplicável.,FALSE
Manutenção do software PACS,Ajuste Direto Regime Geral,Aquisição de serviços,"50000000-5, Serviços de reparação e manutenção","Hospital da Senhora da Oliveira Guimarães, E. P. E. (508080827)",ART CES Unipessoal Lda  (513270396),"37.243,00 €",20-04-2017,20-03-2017,365 dias,"Portugal, Braga, Guimarães","Artigo 24.º, n.º 1, alínea e) do Código dos Contratos Públicos",,,,,,Não aplicável.,Não aplicável.,FALSE
Manutenção do software GHAF e PREL,Ajuste Direto Regime Geral,Aquisição de serviços,"50000000-5, Serviços de reparação e manutenção","Hospital da Senhora da Oliveira Guimarães, E. P. E. (508080827)",St+i Serviços Tecnicos de Informatica Unipessoal Lda  (502246995),"27.842,00 €",20-04-2017,20-03-2017,365 dias,"Portugal, Braga, Guimarães","Artigo 24.º, n.º 1, alínea e) do Código dos Contratos Públicos",,,,,,Não aplicável.,Não aplicável.,FALSE
Fornecimento de Controlos de Qualidade Externos ( Imunohemoterapia e Patologia Clínica ),Concurso público,Aquisição de bens móveis,"33696200-7, Reagentes para análises ao sangue","Hospital da Senhora da Oliveira Guimarães, E. P. E. (508080827)","BIO-RAD LABORATORIES, LDA. (501301321)","1.260,00 €",19-04-2017,10-02-2017,365 dias,"Portugal, Braga, Guimarães","Artigo 20.º, n.º 1, alínea b) do Código dos Contratos Públicos",,,,,,Não aplicável.,Não aplicável.,FALSE
Fornecimento de Controlos de Qualidade Externos ( Imunohemoterapia e Patologia Clínica ),Concurso público,Aquisição de bens móveis,"33696200-7, Reagentes para análises ao sangue","Hospital da Senhora da Oliveira Guimarães, E. P. E. (508080827)","BIOPORTUGAL, LDA. (502380543)","2.205,00 €",19-04-2017,10-02-2017,365 dias,"Portugal, Braga, Guimarães","Artigo 20.º, n.º 1, alínea b) do Código dos Contratos Públicos",,,,,,Não aplicável.,Não aplicável.,FALSE
Fornecimento de Controlos de Qualidade Externos ( Imunohemoterapia e Patologia Clínica ),Concurso público,Aquisição de bens móveis,"33696200-7, Reagentes para análises ao sangue","Hospital da Senhora da Oliveira Guimarães, E. P. E. (508080827)","IRLANDOX, LDA. (502515619)","3.900,76 €",19-04-2017,10-02-2017,365 dias,"Portugal, Braga, Guimarães","Artigo 20.º, n.º 1, alínea b) do Código dos Contratos Públicos",,,,,,Não aplicável.,Não aplicável.,FALSE
Fornecimento de Controlos de Qualidade Externos ( Imunohemoterapia e Patologia Clínica ),Concurso público,Aquisição de bens móveis,"33696200-7, Reagentes para análises ao sangue","Hospital da Senhora da Oliveira Guimarães, E. P. E. (508080827)","BIOGNÓSTICA, LDA. (504441256)","19.043,00 €",19-04-2017,29-03-2017,365 dias,"Portugal, Braga, Guimarães","Artigo 20.º, n.º 1, alínea b) do Código dos Contratos Públicos",,,,,,Não aplicável.,Não aplicável.,FALSE
Fornecimento de reagentes para o Serviço de Imunohemoterapia - Serologia Transfusional,Concurso público,Aquisição de bens móveis,"33696200-7, Reagentes para análises ao sangue","Hospital da Senhora da Oliveira Guimarães, E. P. E. (508080827)","CSP SAUDE - Centro de Serviços Partilhados, S.A. (508440246)","172,93 €",19-04-2017,10-02-2017,365 dias,"Portugal, Braga, Guimarães","Artigo 20.º, n.º 1, alínea b) do Código dos Contratos Públicos",,,,,,Não aplicável.,Não aplicável.,FALSE
Fornecimento de reagentes para o Serviço de Imunohemoterapia - Serologia Transfusional,Concurso público,Aquisição de bens móveis,"33696200-7, Reagentes para análises ao sangue","Hospital da Senhora da Oliveira Guimarães, E. P. E. (508080827)","IMMUCOR (PORTUGAL) Diagnósticos Médicos, LDA. (503007358)","224,20 €",19-04-2017,10-02-2017,365 dias,"Portugal, Braga, Guimarães","Artigo 20.º, n.º 1, alínea b) do Código dos Contratos Públicos",,,,,,Não aplicável.,Não aplicável.,FALSE
Fornecimento de reagentes para o Serviço de Imunohemoterapia - Serologia Transfusional,Concurso público,Aquisição de bens móveis,"33696200-7, Reagentes para análises ao sangue","Hospital da Senhora da Oliveira Guimarães, E. P. E. (508080827)","BIO-RAD Laboratories, LDA. (501301321)","47.289,98 €",19-04-2017,07-03-2017,365 dias,"Portugal, Braga, Guimarães","Artigo 20.º, n.º 1, alínea b) do Código dos Contratos Públicos",,,,,,Não aplicável.,Não aplicável.,FALSE
Prestação de serviços de lavandaria e tratamento de roupa,Ajuste Direto Regime Geral,Aquisição de serviços,"98310000-9, Serviços de lavagem e de limpeza a seco","Hospital da Senhora da Oliveira Guimarães, E. P. E. (508080827)","SNL Iberica - Sociedade de Lavandarias, Lda  (509235689)","367.116,00 €",19-04-2017,18-01-2017,347 dias,"Portugal, Braga, Guimarães","Artigo 24.º, n.º 1, alínea b) do Código dos Contratos Públicos",,,,,,Não aplicável.,Não aplicável.,FALSE
Fornecimento de reagentes para o Serviço de Imunohemoterapia - Coagulação,Concurso público,Aquisição de bens móveis,"33696200-7, Reagentes para análises ao sangue","Hospital da Senhora da Oliveira Guimarães, E. P. E. (508080827)","SIEMENS HEALTHCARE, LDA. (507925173)","1.000,00 €",19-04-2017,09-02-2017,365 dias,"Portugal, Braga, Guimarães","Artigo 20.º, n.º 1, alínea b) do Código dos Contratos Públicos",,,,,,Não aplicável.,Não aplicável.,FALSE
Fornecimento de reagentes para o Laboratório de Patologia Clínica - Serologia e Serologia Infecciosa,Concurso público,Aquisição de bens móveis,"33696200-7, Reagentes para análises ao sangue","Hospital da Senhora da Oliveira Guimarães, E. P. E. (508080827)","Roche Sistemas de Diagnósticos, LDA. (504282921)","8.925,00 €",13-04-2017,13-02-2017,365 dias,"Portugal, Braga, Guimarães","Artigo 20.º, n.º 1, alínea b) do Código dos Contratos Públicos",,,,,,Não aplicável.,Não aplicável.,FALSE
Fornecimento de reagentes para o Laboratório de Patologia Clínica - Serologia e Serologia Infecciosa,Concurso público,Aquisição de bens móveis,"33696200-7, Reagentes para análises ao sangue","Hospital da Senhora da Oliveira Guimarães, E. P. E. (508080827)","Diasorin Ibéria, S.A. (980379563)","35.000,00 €",13-04-2017,08-03-2017,365 dias,"Portugal, Braga, Guimarães","Artigo 20.º, n.º 1, alínea b) do Código dos Contratos Públicos",,,,,,Não aplicável.,Não aplicável.,FALSE
Fornecimento de reagentes para o Laboratório de Patologia Clínica - Serologia e Serologia Infecciosa,Concurso público,Aquisição de bens móveis,"33696200-7, Reagentes para análises ao sangue","Hospital da Senhora da Oliveira Guimarães, E. P. E. (508080827)","Baptista Marques, LDA. (501439110)","168,00 €",13-04-2017,13-02-2017,365 dias,"Portugal, Braga, Guimarães","Artigo 20.º, n.º 1, alínea b) do Código dos Contratos Públicos",,,,,,Não aplicável.,Não aplicável.,FALSE
Fornecimento de reagentes para o Laboratório de Patologia Clínica - Serologia e Serologia Infecciosa,Concurso público,Aquisição de bens móveis,"33696200-7, Reagentes para análises ao sangue","Hospital da Senhora da Oliveira Guimarães, E. P. E. (508080827)","ARIUM, LDA. (502501880)","512,00 €",13-04-2017,13-02-2017,365 dias,"Portugal, Braga, Guimarães","Artigo 20.º, n.º 1, alínea b) do Código dos Contratos Públicos",,,,,,Não aplicável.,Não aplicável.,FALSE
Fornecimento de reagentes para o Laboratório de Patologia Clínica - Serologia e Serologia Infecciosa,Concurso público,Aquisição de bens móveis,"33696200-7, Reagentes para análises ao sangue","Hospital da Senhora da Oliveira Guimarães, E. P. E. (508080827)","QUILABAN, S.A. (500399670)","148,19 €",13-04-2017,13-02-2017,365 dias,"Portugal, Braga, Guimarães","Artigo 20.º, n.º 1, alínea b) do Código dos Contratos Públicos",,,,,,Não aplicável.,Não aplicável.,FALSE
Fornecimento de reagentes para o Laboratório de Patologia Clínica - Serologia e Serologia Infecciosa,Concurso público,Aquisição de bens móveis,"33696200-7, Reagentes para análises ao sangue","Hospital da Senhora da Oliveira Guimarães, E. P. E. (508080827)","Iberlab & Imunoreage, LDA. (503406694)","228,80 €",13-04-2017,13-02-2017,365 dias,"Portugal, Braga, Guimarães","Artigo 20.º, n.º 1, alínea b) do Código dos Contratos Públicos",,,,,,Não aplicável.,Não aplicável.,FALSE
Fornecimento de reagentes para o Laboratório de Patologia Clínica - Serologia e Serologia Infecciosa,Concurso público,Aquisição de bens móveis,"33696200-7, Reagentes para análises ao sangue","Hospital da Senhora da Oliveira Guimarães, E. P. E. (508080827)","Alere, Lda. (502518863)","969,30 €",13-04-2017,13-02-2017,365 dias,"Portugal, Braga, Guimarães","Artigo 20.º, n.º 1, alínea b) do Código dos Contratos Públicos",,,,,,Não aplicável.,Não aplicável.,FALSE
"Fornecimento de reagentes para o Laboratório de Patologia Clínica - Microbiologia (Gram, Auramina / Rodamina, Streptococcus e Legionella)",Concurso público,Aquisição de bens móveis,"33696200-7, Reagentes para análises ao sangue","Hospital da Senhora da Oliveira Guimarães, E. P. E. (508080827)","Alere, LDA. (502518863)","6.380,00 €",13-04-2017,13-02-2017,365 dias,"Portugal, Braga, Guimarães","Artigo 20.º, n.º 1, alínea b) do Código dos Contratos Públicos",,,,,,Não aplicável.,Não aplicável.,FALSE
"Fornecimento de reagentes para o Laboratório de Patologia Clínica - Microbiologia (Gram, Auramina / Rodamina, Streptococcus e Legionella)",Concurso público,Aquisição de bens móveis,"33696200-7, Reagentes para análises ao sangue","Hospital da Senhora da Oliveira Guimarães, E. P. E. (508080827)","Bioportugal, LDA. (502380543)","33.086,00 €",13-04-2017,22-02-2017,365 dias,"Portugal, Braga, Guimarães","Artigo 20.º, n.º 1, alínea b) do Código dos Contratos Públicos",,,,,,Não aplicável.,Não aplicável.,FALSE
Fornecimento de reagentes para o Serviço de Imunohemoterapia - Virologia,Concurso público,Aquisição de bens móveis,"33696200-7, Reagentes para análises ao sangue","Hospital da Senhora da Oliveira Guimarães, E. P. E. (508080827)","ABBOTT LABORATÓRIOS, LDA. (500006148)","147.612,00 €",12-04-2017,23-02-2017,365 dias,"Portugal, Braga, Guimarães","Artigo 20.º, n.º 1, alínea b) do Código dos Contratos Públicos",,,,,,Não aplicável.,Não aplicável.,FALSE
