Objeto do Contrato,Tipo de Procedimento,Tipo(s) de Contrato,CPVs,Entidade(s) Adjudicante(s),Entidade(s) Adjudicatária(s),Preço Contratual,Data de Publicação,Data de Celebração do Contrato,Prazo de Execução,Local de Execução,Fundamentação,Data de Fecho do Contrato,Preço Total Efetivo,Causas das Alterações ao Prazo,Causas das Alterações ao Preço,Estado,N.º registo do Acordo Quadro,Descrição do Acordo Quadro,Procedimento Centralizado
Serviços de Vigilancia e Segurança Humana,Concurso público,Aquisição de serviços,"79710000-4, Serviços de segurança","Unidade Local de Saúde do Alto Minho, E.P.E. (508786193)","VIGIEXPERT - Prev. e Vigilancia Privada, Lda. (506807266)","235.104,00 €",11-09-2013,07-05-2013,365 dias,"Portugal, Viana do Castelo","Artigo 20.º, n.º 1, alínea b) do Código dos Contratos Públicos",,,,,,Não aplicável.,Não aplicável.,
Prestação de Serviços Seguros - Ramo Automóvel,Ajuste Direto Regime Geral,Aquisição de serviços,"66510000-8, Serviços de seguros","Unidade Local de Saúde do Alto Minho, EPE (ULSAM) (508786193)","Entreparentes - Soc. Mediação Seguros, Lda. (508688086)","12.004,95 €",11-09-2013,01-08-2013,365 dias,"Portugal, Viana do Castelo","Artigo 20.º, n.º 1, alínea a) do Código dos Contratos Públicos",,,,,,Não aplicável.,Não aplicável.,
