freguesia,acronym,validVotesPercentage,votes,dicofre
"União das freguesias de Póvoa de Varzim, Beiriz e Argivai",PPD/PSD.CDS-PP,37.65,3394,131315
"União das freguesias de Póvoa de Varzim, Beiriz e Argivai",PS,28.31,2552,131315
"União das freguesias de Póvoa de Varzim, Beiriz e Argivai",MPT,10.46,943,131315
"União das freguesias de Póvoa de Varzim, Beiriz e Argivai",PCP-PEV,9.69,874,131315
"União das freguesias de Póvoa de Varzim, Beiriz e Argivai",B.E.,4.89,441,131315
"União das freguesias de Póvoa de Varzim, Beiriz e Argivai",L,2.52,227,131315
"União das freguesias de Póvoa de Varzim, Beiriz e Argivai",PAN,2.23,201,131315
"União das freguesias de Póvoa de Varzim, Beiriz e Argivai",PCTP/MRPP,1.3,117,131315
"União das freguesias de Póvoa de Varzim, Beiriz e Argivai",PND,0.65,59,131315
"União das freguesias de Póvoa de Varzim, Beiriz e Argivai",PPM,0.41,37,131315
"União das freguesias de Póvoa de Varzim, Beiriz e Argivai",PTP,0.41,37,131315
"União das freguesias de Póvoa de Varzim, Beiriz e Argivai",PNR,0.39,35,131315
"União das freguesias de Póvoa de Varzim, Beiriz e Argivai",PPV,0.38,34,131315
"União das freguesias de Póvoa de Varzim, Beiriz e Argivai",MAS,0.33,30,131315
"União das freguesias de Póvoa de Varzim, Beiriz e Argivai",PDA,0.21,19,131315
"União das freguesias de Póvoa de Varzim, Beiriz e Argivai",POUS,0.17,15,131315
