freguesia,acronym,validVotesPercentage,votes,dicofre
Mioma,PPD/PSD.CDS-PP,52.7,117,181706
Mioma,PS,31.08,69,181706
Mioma,MPT,8.56,19,181706
Mioma,B.E.,1.8,4,181706
Mioma,L,1.8,4,181706
Mioma,PAN,1.35,3,181706
Mioma,PCP-PEV,0.9,2,181706
Mioma,PND,0.9,2,181706
Mioma,PPM,0.9,2,181706
Mioma,MAS,0,0,181706
Mioma,PCTP/MRPP,0,0,181706
Mioma,PDA,0,0,181706
Mioma,PNR,0,0,181706
Mioma,POUS,0,0,181706
Mioma,PPV,0,0,181706
Mioma,PTP,0,0,181706
