freguesia,acronym,validVotesPercentage,votes,dicofre
Rebordosa,PPD/PSD.CDS-PP,42.96,1126,131018
Rebordosa,PS,33.88,888,131018
Rebordosa,MPT,8.39,220,131018
Rebordosa,PCP-PEV,3.89,102,131018
Rebordosa,B.E.,3.43,90,131018
Rebordosa,L,1.49,39,131018
Rebordosa,PCTP/MRPP,1.22,32,131018
Rebordosa,PAN,0.99,26,131018
Rebordosa,PND,0.88,23,131018
Rebordosa,PTP,0.76,20,131018
Rebordosa,PPM,0.57,15,131018
Rebordosa,PDA,0.46,12,131018
Rebordosa,PPV,0.34,9,131018
Rebordosa,MAS,0.27,7,131018
Rebordosa,PNR,0.23,6,131018
Rebordosa,POUS,0.23,6,131018
