Objeto do Contrato,Tipo de Procedimento,Tipo(s) de Contrato,CPVs,Entidade(s) Adjudicante(s),Entidade(s) Adjudicatária(s),Preço Contratual,Data de Publicação,Data de Celebração do Contrato,Prazo de Execução,Local de Execução,Fundamentação,Data de Fecho do Contrato,Preço Total Efetivo,Causas das Alterações ao Prazo,Causas das Alterações ao Preço,Estado,N.º registo do Acordo Quadro,Descrição do Acordo Quadro,Procedimento Centralizado
Imiglucerase 400 U Pó conc sol inj Fr IV,Ao abrigo de acordo-quadro (art.º 259.º),Aquisição de bens móveis,"33690000-3, Medicamentos vários",Hospital Dr. Francisco Zagalo (501510150),Sanofi (500134960),"45.603,36 €",08-02-2017,18-01-2017,180 dias,"Portugal, Aveiro, Ovar",Artigo 259.º do Código dos Contratos Públicos,26-06-2017,"91.206,72 €","",O valor da previsão inferior ao necessario,,1338581,"Acordo quadro para fornecimento de Medicação antialérgica, medicamentos usados no tratamento de intoxicações, vitaminas e sais minerais e grupo 20.9 - outros produtos às instituições e serviços do serviço nacional de saúde",FALSE
REAGENTES,Ajuste Direto Regime Geral,Aquisição de bens móveis,"33696500-0, Reagentes de laboratório",Hospital Dr. Francisco Zagalo (501510150),"EMÍLIO AZEVEDO CAMPOS, S.A. (500094853)","1.824,00 €",08-02-2017,25-01-2017,365 dias,"Portugal, Aveiro, Ovar","Artigo 24.º, n.º 1, alínea e) do Código dos Contratos Públicos",27-11-2017,"1.824,00 €","","",,Não aplicável.,Não aplicável.,FALSE
REAGENTES,Ajuste Direto Regime Geral,Aquisição de bens móveis,"33696500-0, Reagentes de laboratório",Hospital Dr. Francisco Zagalo (501510150),"THERMO FISHER DIAGNOSTICS, SOCIEDADE UNIPESSOAL, LDA (506916243)","10.692,52 €",08-02-2017,11-01-2017,365 dias,"Portugal, Aveiro, Ovar","Artigo 24.º, n.º 1, alínea e) do Código dos Contratos Públicos",29-12-2017,"10.180,77 €","",VALOR DA PREVISÃO SUPERIOR AS NECESSIDADES,,Não aplicável.,Não aplicável.,FALSE
REAGENTES,Ajuste Direto Regime Geral,Aquisição de bens móveis,"33696500-0, Reagentes de laboratório",Hospital Dr. Francisco Zagalo (501510150),"Beckman Coulter Portugal Uni., Lda (509035167)","1.889,09 €",08-02-2017,11-01-2017,365 dias,"Portugal, Aveiro, Ovar","Artigo 24.º, n.º 1, alínea e) do Código dos Contratos Públicos",29-12-2017,"4.169,00 €","",O VALOR SUPERIOR AS PREVISÕES,,Não aplicável.,Não aplicável.,FALSE
REAGENTES,Ajuste Direto Regime Geral,Aquisição de bens móveis,"33696500-0, Reagentes de laboratório",Hospital Dr. Francisco Zagalo (501510150),WERFEN PORTUGAL LDA (501086110),"11.724,09 €",08-02-2017,11-01-2017,365 dias,"Portugal, Aveiro, Ovar","Artigo 24.º, n.º 1, alínea e) do Código dos Contratos Públicos",29-12-2017,"11.519,89 €","",valor da previsão superior as necessidades,,Não aplicável.,Não aplicável.,FALSE
REAGENTES,Ajuste Direto Regime Geral,Aquisição de bens móveis,"33696500-0, Reagentes de laboratório",Hospital Dr. Francisco Zagalo (501510150),"Beckman Coulter Portugal Uni., Lda (509035167)","11.142,06 €",08-02-2017,12-01-2017,365 dias,"Portugal, Aveiro, Ovar","Artigo 24.º, n.º 1, alínea e) do Código dos Contratos Públicos",17-10-2017,"10.883,80 €",Alteração não previsível do nº de unidades consumidas. Superior às previsões efetuadas com base no histórico de consumos.,Alteração não previsível do nº de unidades consumidas. Superior às previsões efetuadas com base no histórico de consumos. Motivo do encerramento do procedimento antes da data prevista de execução final.,,Não aplicável.,Não aplicável.,FALSE
REAGENTES,Ajuste Direto Regime Geral,Aquisição de bens móveis,"33696500-0, Reagentes de laboratório",Hospital Dr. Francisco Zagalo (501510150),Biomerieux Portuguesa (501524177),"26.907,91 €",08-02-2017,11-01-2017,365 dias,"Portugal, Aveiro, Ovar","Artigo 24.º, n.º 1, alínea e) do Código dos Contratos Públicos",20-12-2017,"26.759,17 €","",Valor da previsão superior a necessidade,,Não aplicável.,Não aplicável.,FALSE
Reagentes,Ajuste Direto Regime Geral,Aquisição de bens móveis,"33696500-0, Reagentes de laboratório",Hospital Dr. Francisco Zagalo (501510150),"A. Menarini Diagnósticos, Lda. (502610069)","4.500,00 €",08-02-2017,11-01-2017,365 dias,"Portugal, Aveiro, Ovar","Artigo 24.º, n.º 1, alínea e) do Código dos Contratos Públicos",31-10-2017,"3.910,00 €","",Previsão superior as necessidades,,Não aplicável.,Não aplicável.,FALSE
REAGENTES,Ajuste Direto Regime Geral,Aquisição de bens móveis,"33696500-0, Reagentes de laboratório",Hospital Dr. Francisco Zagalo (501510150),"EMÍLIO AZEVEDO CAMPOS, S.A. (500094853)","5.670,00 €",08-02-2017,11-01-2017,365 dias,"Portugal, Aveiro, Ovar","Artigo 24.º, n.º 1, alínea e) do Código dos Contratos Públicos",29-12-2017,"5.545,00 €","",valor da previsão superior as necessidades,,Não aplicável.,Não aplicável.,FALSE
REAGENTES,Ajuste Direto Regime Geral,Aquisição de bens móveis,"33696500-0, Reagentes de laboratório",Hospital Dr. Francisco Zagalo (501510150),WERFEN PORTUGAL LDA (501086110),"5.350,00 €",08-02-2017,02-01-2017,365 dias,"Portugal, Aveiro, Ovar","Artigo 24.º, n.º 1, alínea e) do Código dos Contratos Públicos",29-12-2017,"4.700,00 €","",valor da previsão superior as necessidades,,Não aplicável.,Não aplicável.,FALSE
AQUISIÇÃO DE DIETAS E SUPLEMENTOS,Ajuste Direto Regime Geral,Aquisição de bens móveis,"33600000-6, Produtos farmacêuticos",Hospital Dr. Francisco Zagalo (501510150),"NUTRICIA ADV. MED. NUTRITION UNIP., LDA. (507558286)","764,16 €",08-02-2017,11-01-2017,30 dias,"Portugal, Aveiro, Ovar","Artigo 20.º, n.º 1, alínea a) do Código dos Contratos Públicos",03-02-2017,"764,16 €","","",,Não aplicável.,Não aplicável.,FALSE
AQUISIÇÃO DE REAGENTES,Ajuste Direto Regime Geral,Aquisição de bens móveis,"33696500-0, Reagentes de laboratório",Hospital Dr. Francisco Zagalo (501510150),BIO-RAD LABORATORIES LDA (501301321),"36,00 €",08-02-2017,11-01-2017,10 dias,"Portugal, Aveiro, Ovar","Artigo 20.º, n.º 1, alínea a) do Código dos Contratos Públicos",07-02-2017,"36,00 €","","",,Não aplicável.,Não aplicável.,FALSE
