freguesia,acronym,validVotesPercentage,votes,dicofre
Sé,PPD/PSD.CDS-PP,39.11,341,310310
Sé,PS,21.22,185,310310
Sé,MPT,11.35,99,310310
Sé,B.E.,5.73,50,310310
Sé,PTP,4.13,36,310310
Sé,PAN,3.78,33,310310
Sé,PCP-PEV,3.78,33,310310
Sé,PND,3.67,32,310310
Sé,L,2.87,25,310310
Sé,PPM,1.49,13,310310
Sé,PCTP/MRPP,1.15,10,310310
Sé,PDA,0.57,5,310310
Sé,PPV,0.57,5,310310
Sé,PNR,0.34,3,310310
Sé,MAS,0.23,2,310310
Sé,POUS,0,0,310310
