freguesia,acronym,validVotesPercentage,votes,dicofre
Modivas,PS,46.63,277,131617
Modivas,PPD/PSD,24.24,144,131617
Modivas,B.E.,7.74,46,131617
Modivas,CDS-PP,5.22,31,131617
Modivas,PAN,3.87,23,131617
Modivas,A,2.53,15,131617
Modivas,PCP-PEV,2.53,15,131617
Modivas,L,1.18,7,131617
Modivas,IL,1.01,6,131617
Modivas,PDR,1.01,6,131617
Modivas,PPM.PPV/CDC,1.01,6,131617
Modivas,PCTP/MRPP,0.84,5,131617
Modivas,NC,0.67,4,131617
Modivas,MAS,0.51,3,131617
Modivas,PURP,0.51,3,131617
Modivas,PTP,0.34,2,131617
Modivas,PNR,0.17,1,131617
