Objeto do Contrato,Tipo de Procedimento,Tipo(s) de Contrato,CPVs,Entidade(s) Adjudicante(s),Entidade(s) Adjudicatária(s),Preço Contratual,Data de Publicação,Data de Celebração do Contrato,Prazo de Execução,Local de Execução,Fundamentação,Data de Fecho do Contrato,Preço Total Efetivo,Causas das Alterações ao Prazo,Causas das Alterações ao Preço,Estado,N.º registo do Acordo Quadro,Descrição do Acordo Quadro,Procedimento Centralizado
CP 12-2016 (Plurianual) - CAT ás câmaras de segurança biológica,Concurso público,Aquisição de serviços,"50610000-4, Serviços de reparação e manutenção de equipamento de segurança","Instituto Nacional de Saúde Doutor Ricardo Jorge, I. P. (501427511)",TRADELABOR (503069442),"58.464,00 €",08-02-2019,27-09-2016,1095 dias,"Portugal, Lisboa, Lisboa","Artigo 20.º, n.º 1, alínea b) do Código dos Contratos Públicos",03-12-2018,"58.464,00 €",,,,Não aplicável.,Não aplicável.,FALSE
20190001 - Aquisição de serviços de reparação e manutenção automóvel para 2019,Consulta Prévia,Aquisição de serviços,"50112000-3, Serviços de reparação e manutenção de automóveis","Instituto Nacional de Saúde Doutor Ricardo Jorge, I. P. (501427511)","B.C.L.CAR AUTOMOVEIS,LDA   (503639494)","3.250,00 €",07-02-2019,07-02-2019,327 dias,"Portugal, Lisboa, Lisboa","Artigo 20.º, n.º 1, alínea c) do Código dos Contratos Públicos","","",,,,Não aplicável.,Não aplicável.,FALSE
20190001 - Aquisição de serviços de reparação e manutenção automóvel para 2019,Consulta Prévia,Aquisição de serviços,"50112000-3, Serviços de reparação e manutenção de automóveis","Instituto Nacional de Saúde Doutor Ricardo Jorge, I. P. (501427511)",Triunfadrenalina (513107878),"8.150,00 €",06-02-2019,31-01-2019,334 dias,"Portugal, Lisboa, Lisboa","Artigo 20.º, n.º 1, alínea c) do Código dos Contratos Públicos","","",,,,Não aplicável.,Não aplicável.,FALSE
20190002 - Aquisição de serviços de Medicina do Trabalho,Consulta Prévia,Aquisição de serviços,"85147000-1, Serviços de medicina do trabalho","Instituto Nacional de Saúde Doutor Ricardo Jorge, I. P. (501427511)","Silva Graça - Clínica Médica e do Trabalho, Lda (504942891)","24.125,00 €",06-02-2019,28-01-2019,337 dias,"Portugal, Lisboa, Lisboa<BR/>Portugal, Setúbal, Palmela","Artigo 20.º, n.º 1, alínea c) do Código dos Contratos Públicos","","",,,,Não aplicável.,Não aplicável.,FALSE
20180455 - Aquisição de serviços para a elaboração,Consulta Prévia,Aquisição de serviços,"71314300-5, Serviços de consultoria em matéria de rendimento energético","Instituto Nacional de Saúde Doutor Ricardo Jorge, I. P. (501427511)","GROWVISION, Consultores - Estudos Energéticos e Ambientais, Unipessoal (513795472)","29.050,00 €",31-01-2019,16-08-2018,120 dias,Portugal,"Artigo 20.º, n.º 1, alínea c) do Código dos Contratos Públicos","","",,,,Não aplicável.,Não aplicável.,FALSE
