freguesia,acronym,validVotesPercentage,votes,dicofre
Brasfemes,PS,41.28,232,060309
Brasfemes,PCP-PEV,17.08,96,060309
Brasfemes,PPD/PSD.CDS-PP,14.77,83,060309
Brasfemes,MPT,8.72,49,060309
Brasfemes,B.E.,7.47,42,060309
Brasfemes,L,3.56,20,060309
Brasfemes,PAN,1.78,10,060309
Brasfemes,PCTP/MRPP,1.6,9,060309
Brasfemes,MAS,1.07,6,060309
Brasfemes,PNR,0.89,5,060309
Brasfemes,PPM,0.53,3,060309
Brasfemes,PND,0.36,2,060309
Brasfemes,PPV,0.36,2,060309
Brasfemes,PDA,0.18,1,060309
Brasfemes,POUS,0.18,1,060309
Brasfemes,PTP,0.18,1,060309
