freguesia,acronym,validVotesPercentage,votes,dicofre
Longos Vales,PS,40.61,80,160411
Longos Vales,PPD/PSD,38.58,76,160411
Longos Vales,CDS-PP,9.64,19,160411
Longos Vales,B.E.,3.55,7,160411
Longos Vales,A,1.52,3,160411
Longos Vales,PAN,1.52,3,160411
Longos Vales,NC,1.02,2,160411
Longos Vales,PCP-PEV,1.02,2,160411
Longos Vales,PTP,1.02,2,160411
Longos Vales,L,0.51,1,160411
Longos Vales,PCTP/MRPP,0.51,1,160411
Longos Vales,PDR,0.51,1,160411
Longos Vales,IL,0,0,160411
Longos Vales,MAS,0,0,160411
Longos Vales,PNR,0,0,160411
Longos Vales,PPM.PPV/CDC,0,0,160411
Longos Vales,PURP,0,0,160411
