freguesia,acronym,validVotesPercentage,votes,dicofre
Fajão-Vidual,PPD/PSD.CDS-PP,57.94,62,061211
Fajão-Vidual,PS,22.43,24,061211
Fajão-Vidual,MPT,8.41,9,061211
Fajão-Vidual,PCP-PEV,5.61,6,061211
Fajão-Vidual,B.E.,2.8,3,061211
Fajão-Vidual,MAS,0.93,1,061211
Fajão-Vidual,PAN,0.93,1,061211
Fajão-Vidual,PNR,0.93,1,061211
Fajão-Vidual,L,0,0,061211
Fajão-Vidual,PCTP/MRPP,0,0,061211
Fajão-Vidual,PDA,0,0,061211
Fajão-Vidual,PND,0,0,061211
Fajão-Vidual,POUS,0,0,061211
Fajão-Vidual,PPM,0,0,061211
Fajão-Vidual,PPV,0,0,061211
Fajão-Vidual,PTP,0,0,061211
