Objeto do Contrato,Tipo de Procedimento,Tipo(s) de Contrato,CPVs,Entidade(s) Adjudicante(s),Entidade(s) Adjudicatária(s),Preço Contratual,Data de Publicação,Data de Celebração do Contrato,Prazo de Execução,Local de Execução,Fundamentação,Data de Fecho do Contrato,Preço Total Efetivo,Causas das Alterações ao Prazo,Causas das Alterações ao Preço,Estado,N.º registo do Acordo Quadro,Descrição do Acordo Quadro,Procedimento Centralizado
Aquisição de Serviços de Consultoria para Otimização da Farmácia da ULSLA EPE,Ajuste Direto Regime Geral,Aquisição de serviços,"72000000-5, Serviços de TI: consultoria, desenvolvimento de software, Internet e apoio","Unidade Local de Saúde do Litoral Alentejano, E. P. E. (510445152)",FTA Consulting Lda (510431828),"24.900,00 €",10-11-2017,01-10-2017,120 dias,"Portugal, Setúbal, Santiago do Cacém","Artigo 20.º, n.º 1, alínea a) do Código dos Contratos Públicos",,,,,,Não aplicável.,Não aplicável.,FALSE
Aquisição de Serviços de Consultoria Especializada de Otimização de Processos -Metodologia Lean,Ajuste Direto Regime Geral,Aquisição de serviços,"72000000-5, Serviços de TI: consultoria, desenvolvimento de software, Internet e apoio","Unidade Local de Saúde do Litoral Alentejano, E. P. E. (510445152)",Pensamento Inesperado Lda (510310591),"30.000,00 €",06-11-2017,03-02-2017,60 dias,"Portugal, Setúbal, Santiago do Cacém","Artigo 20.º, n.º 1, alínea a) do Código dos Contratos Públicos",,,,,,Não aplicável.,Não aplicável.,FALSE
Fornecimento de Serviços de Consultoria: Otimização da Gestão de Serviços IT da ULSLA EPE,Ao abrigo de acordo-quadro (art.º 259.º),Aquisição de serviços,"72000000-5, Serviços de TI: consultoria, desenvolvimento de software, Internet e apoio",ULSLA - Unidade Local Saúde Litoral Alentejano - SNCP (510445152),Iten Solutions Sistemas de Informação SA (510728189),"77.303,00 €",06-11-2017,10-02-2017,180 dias,"Portugal, Setúbal, Santiago do Cacém",Artigo 259.º do Código dos Contratos Públicos,,,,,,610968,Acordo quadro de licenciamento de software e serviços conexos,FALSE
