Objeto do Contrato,Tipo de Procedimento,Tipo(s) de Contrato,CPVs,Entidade(s) Adjudicante(s),Entidade(s) Adjudicatária(s),Preço Contratual,Data de Publicação,Data de Celebração do Contrato,Prazo de Execução,Local de Execução,Fundamentação,Data de Fecho do Contrato,Preço Total Efetivo,Causas das Alterações ao Prazo,Causas das Alterações ao Preço,Estado,N.º registo do Acordo Quadro,Descrição do Acordo Quadro,Procedimento Centralizado
Prestação de Serviços de Colocação e Fornecimento de Pessoal TDT - Serviço Patologia Clínica,Consulta Prévia,Aquisição de serviços,"79620000-6, Serviços de fornecimento de pessoal, inclusive temporário","Unidade Local de Saúde do Alto Minho, E. P. E. (508786193)","e-sycare, Lda (509706134)","3.182,40 €",16-10-2018,05-07-2018,60 dias,"Portugal, Viana do Castelo, Viana do Castelo","Artigo 20.º, n.º 1, alínea c) do Código dos Contratos Públicos","","","","",,Não aplicável.,Não aplicável.,FALSE
Prestação de Serviços de Colocação e Fornecimento de Pessoal Administrativo - Bloco Ambulatório,Consulta Prévia,Aquisição de serviços,"79620000-6, Serviços de fornecimento de pessoal, inclusive temporário","Unidade Local de Saúde do Alto Minho, E. P. E. (508786193)","e-sycare, Lda (509706134)","4.576,56 €",15-10-2018,27-04-2018,120 dias,"Portugal, Viana do Castelo, Viana do Castelo","Artigo 20.º, n.º 1, alínea c) do Código dos Contratos Públicos","","","","",,Não aplicável.,Não aplicável.,FALSE
Prestação de Serviços de colocação e Fornecimento de Pessoal TDT - Imuno II,Consulta Prévia,Aquisição de serviços,"79620000-6, Serviços de fornecimento de pessoal, inclusive temporário","Unidade Local de Saúde do Alto Minho, E. P. E. (508786193)","e-sycare, Lda (509706134)","7.956,00 €",20-09-2018,17-05-2018,150 dias,"Portugal, Viana do Castelo, Viana do Castelo","Artigo 20.º, n.º 1, alínea c) do Código dos Contratos Públicos","","","","",,Não aplicável.,Não aplicável.,FALSE
Prestação de Serviços de 2 AOS UCSP Valença,Consulta Prévia,Aquisição de serviços,"79620000-6, Serviços de fornecimento de pessoal, inclusive temporário","Unidade Local de Saúde do Alto Minho, E. P. E. (508786193)","e-sycare, Lda (509706134)","13.765,80 €",20-09-2018,01-07-2018,150 dias,"Portugal, Viana do Castelo, Viana do Castelo","Artigo 20.º, n.º 1, alínea c) do Código dos Contratos Públicos","","","","",,Não aplicável.,Não aplicável.,FALSE
"Aquisição de serviços de apoio ao secretariado da SPMS, EPE",Concurso público,Aquisição de serviços,"79992000-4, Serviços de recepção","SPMS - Serviços Partilhados do Ministério da Saúde, E. P. E. (509540716)","e-sycare, Lda (509706134)","56.708,16 €",11-09-2018,24-08-2018,365 dias,Portugal,"Artigo 20.º, n.º 1, alínea a) do Código dos Contratos Públicos","","","","",,Não aplicável.,Não aplicável.,FALSE
Prestação de Serviços de Colocação e Fornecimento de Pessoal Administrativo - 1 Adm SIE 2016,Consulta Prévia,Aquisição de serviços,"79620000-6, Serviços de fornecimento de pessoal, inclusive temporário","Unidade Local de Saúde do Alto Minho, E. P. E. (508786193)","e-sycare, SA (509706134)","1.144,14 €",07-09-2018,27-04-2018,120 dias,"Portugal, Viana do Castelo, Viana do Castelo","Artigo 20.º, n.º 1, alínea c) do Código dos Contratos Públicos","","","","",,Não aplicável.,Não aplicável.,FALSE
Prestação de Serviços de Colocação e Fornecimento de Pessoal Administrativo - 1 Adm SIE 2015,Consulta Prévia,Aquisição de serviços,"79620000-6, Serviços de fornecimento de pessoal, inclusive temporário","Unidade Local de Saúde do Alto Minho, E. P. E. (508786193)","e-sycare, SA (509706134)","1.144,14 €",07-09-2018,10-05-2018,120 dias,"Portugal, Viana do Castelo, Viana do Castelo","Artigo 20.º, n.º 1, alínea c) do Código dos Contratos Públicos","","","","",,Não aplicável.,Não aplicável.,FALSE
Prestação de Serviços de Colocação e Fornecimento de Pessoal Administrativo - 1 Adm Dep Mulher e Criança,Consulta Prévia,Aquisição de serviços,"79620000-6, Serviços de fornecimento de pessoal, inclusive temporário","Unidade Local de Saúde do Alto Minho, E. P. E. (508786193)","e-sycare, SA (509706134)","1.144,14 €",06-09-2018,27-04-2018,120 dias,"Portugal, Viana do Castelo, Viana do Castelo","Artigo 20.º, n.º 1, alínea c) do Código dos Contratos Públicos","","","","",,Não aplicável.,Não aplicável.,FALSE
Prestação de Serviços de Colocação e Fornecimento de Pessoal Administrativo - 2 Administrativos Consulta Externa,Consulta Prévia,Aquisição de serviços,"79620000-6, Serviços de fornecimento de pessoal, inclusive temporário","Unidade Local de Saúde do Alto Minho, E. P. E. (508786193)","e-sycare, SA (509706134)","2.288,28 €",05-09-2018,23-07-2018,120 dias,"Portugal, Viana do Castelo, Viana do Castelo","Artigo 20.º, n.º 1, alínea c) do Código dos Contratos Públicos","","","","",,Não aplicável.,Não aplicável.,FALSE
Prestação de Serviços de Colocação e Fornecimento de Pessoal Assistente Operacional - 1 AO SUB Ponte de Lima,Consulta Prévia,Aquisição de serviços,"79414000-9, Serviços de consultoria em matéria de gestão de recursos humanos","Unidade Local de Saúde do Alto Minho, E. P. E. (508786193)","e-sycare, SA (509706134)","1.309,31 €",13-08-2018,01-05-2018,150 dias,"Portugal, Viana do Castelo, Viana do Castelo","Artigo 20.º, n.º 1, alínea c) do Código dos Contratos Públicos","","","","",,Não aplicável.,Não aplicável.,FALSE
Prestação de Serviços de Colocação e Fornecimento de Pessoal Assistente Operacional - 1 AO Ginecologia,Consulta Prévia,Aquisição de serviços,"79414000-9, Serviços de consultoria em matéria de gestão de recursos humanos","Unidade Local de Saúde do Alto Minho, E. P. E. (508786193)","e-sycare, SA (509706134)","1.309,31 €",10-08-2018,01-05-2018,150 dias,"Portugal, Viana do Castelo, Viana do Castelo","Artigo 20.º, n.º 1, alínea c) do Código dos Contratos Públicos","","","","",,Não aplicável.,Não aplicável.,FALSE
Prestação de Serviços de Colocação e Fornecimento de Pessoal Assistente Operacional - 1 AO Cirurgia 2,Consulta Prévia,Aquisição de serviços,"79414000-9, Serviços de consultoria em matéria de gestão de recursos humanos","Unidade Local de Saúde do Alto Minho, E. P. E. (508786193)","e-sycare, SA (509706134)","1.298,81 €",07-08-2018,03-05-2018,120 dias,"Portugal, Viana do Castelo, Viana do Castelo","Artigo 20.º, n.º 1, alínea c) do Código dos Contratos Públicos","","","","",,Não aplicável.,Não aplicável.,FALSE
Prestação de Serviços de Colocação e Fornecimento de Pessoal Assistente Operacional - 1 AO UCIM,Consulta Prévia,Aquisição de serviços,"79414000-9, Serviços de consultoria em matéria de gestão de recursos humanos","Unidade Local de Saúde do Alto Minho, E. P. E. (508786193)","e-sycare, SA (509706134)","1.309,31 €",06-08-2018,27-04-2018,150 dias,"Portugal, Viana do Castelo, Viana do Castelo","Artigo 20.º, n.º 1, alínea c) do Código dos Contratos Públicos","","","","",,Não aplicável.,Não aplicável.,FALSE
Prestação de Serviços de Colocação e Fornecimento de Pessoal Assistente Operacional - 1 AO HCB,Consulta Prévia,Aquisição de serviços,"79414000-9, Serviços de consultoria em matéria de gestão de recursos humanos","Unidade Local de Saúde do Alto Minho, E. P. E. (508786193)","e-sycare, SA (509706134)","1.309,31 €",03-08-2018,27-04-2018,150 dias,"Portugal, Viana do Castelo, Viana do Castelo","Artigo 20.º, n.º 1, alínea c) do Código dos Contratos Públicos","","","","",,Não aplicável.,Não aplicável.,FALSE
Aquisição de Serviços de Enfermagem e de Auxiliares de Ação Médica para o Centro de Apoio Social de Runa para o periodo de 01 de janeiro a 30 de setembro,Ajuste Direto Regime Geral,Aquisição de serviços,"85000000-9, Serviços de saúde e acção social","Instituto de Ação Social das Forças Armadas, I. P. (500746427)","e-sycare, SA (509706134)","84.081,19 €",23-05-2018,27-07-2016,273 dias,"Portugal, Lisboa, Torres Vedras","Artigo 20.º, n.º 1, alínea a) do Código dos Contratos Públicos",30-09-2016,"84.081,19 €","","",,Não aplicável.,Não aplicável.,FALSE
"Considerando que, de acordo com o enquadramento supra referido e tendo por base um racional de custo/eficácia, a solução apresentada satisfaz o solicitado;",Ajuste Direto Regime Geral,Aquisição de serviços,"85000000-9, Serviços de saúde e acção social","Instituto de Ação Social das Forças Armadas, I. P. (500746427)","e-sycare, SA (509706134)","84.081,19 €",27-11-2017,27-07-2016,273 dias,"Portugal, Lisboa, Torres Vedras","Artigo 20.º, n.º 1, alínea a) do Código dos Contratos Públicos",30-09-2016,"84.081,19 €","","",,Não aplicável.,Não aplicável.,FALSE
Ajuste Direto n.º 47/SE/2016/GRM – Aquisição de Serviços de Enfermagem e de Auxiliares de Ação Médica para o Centro de Apoio Social de Runa para o periodo de 01 de janeiro a 30 de setembro,Ajuste Direto Regime Geral,Aquisição de serviços,"85000000-9, Serviços de saúde e acção social","Instituto de Ação Social das Forças Armadas, I. P. (500746427)","e-sycare, SA (509706134)","19.100,00 €",27-11-2017,06-06-2016,182 dias,"Portugal, Lisboa, Torres Vedras","Artigo 20.º, n.º 1, alínea a) do Código dos Contratos Públicos",30-09-2016,"19.100,00 €","","",,Não aplicável.,Não aplicável.,FALSE
Aquisição de Serviços de Enfermagem e de Serviços Auxiliares de Ação Médica para o Centro de Apoio Social de Runa – Outubro 2016.,Ajuste Direto Regime Geral,Aquisição de serviços,"85000000-9, Serviços de saúde e acção social","Instituto de Ação Social das Forças Armadas, I. P. (500746427)","e-sycare, SA (509706134)","22.322,82 €",14-11-2017,28-10-2016,31 dias,"Portugal, Lisboa, Torres Vedras","Artigo 20.º, n.º 1, alínea a) do Código dos Contratos Públicos",31-10-2016,"22.322,82 €","","",,Não aplicável.,Não aplicável.,FALSE
Prestação de Serviços de Assistente Dentária,Concurso público,Aquisição de serviços,"85100000-0, Serviços de saúde","Administração Regional de Saúde do Algarve, I. P. (503148709)","e-sycare, SA (509706134)","3.773,60 €",16-10-2017,01-10-2017,92 dias,"Portugal, Faro, Faro","Artigo 20.º, n.º 1, alínea b) do Código dos Contratos Públicos",31-12-2017,"1.866,80 €","",Horas Contratadas não foram todas executadas,,Não aplicável.,Não aplicável.,TRUE
49017115-Prestação serviços na area do serviço social,Ajuste Direto Regime Geral,Aquisição de serviços,"79600000-0, Serviços de recrutamento",Hospital Dr. Francisco Zagalo - Ovar (501510150),"E-Sycare, Lda. (509706134)","27.600,00 €",22-02-2017,02-02-2017,365 dias,"Portugal, Aveiro, Ovar","Artigo 20.º, n.º 1, alínea a) do Código dos Contratos Públicos",31-12-2017,"28.743,29 €","",serviços acima do previsto,,Não aplicável.,Não aplicável.,FALSE
49017015-Prestação serviços na area de psicologia,Ajuste Direto Regime Geral,Aquisição de serviços,"79600000-0, Serviços de recrutamento",Hospital Dr. Francisco Zagalo (501510150),"E-Sycare, Lda. (509706134)","17.000,00 €",22-02-2017,01-02-2017,153 dias,"Portugal, Aveiro, Ovar","Artigo 20.º, n.º 1, alínea a) do Código dos Contratos Públicos",31-12-2017,"43.670,56 €","",Serviços acima do previsto,,Não aplicável.,Não aplicável.,FALSE
Serviços medicos,Ajuste Direto Regime Geral,Aquisição de serviços,"79600000-0, Serviços de recrutamento",Hospital Dr. Francisco Zagalo (501510150),"E-Sycare, Lda. (509706134)","5.807,21 €",16-02-2016,20-01-2016,30 dias,"Portugal, Aveiro, Ovar","Artigo 20.º, n.º 1, alínea a) do Código dos Contratos Públicos",31-01-2016,"5.807,21 €","","",,Não aplicável.,Não aplicável.,FALSE
Prestação serviços na area da psicologia,Ajuste Direto Regime Geral,Aquisição de serviços,"79000000-4, Serviços a empresas: direito, comercialização, consultoria, recrutamento, impressão e segurança",Hospital Dr. Francisco Zagalo (501510150),"E-Sycare, Lda. (509706134)","18.618,60 €",22-10-2015,24-09-2015,120 dias,"Portugal, Aveiro, Ovar","Artigo 20.º, n.º 1, alínea a) do Código dos Contratos Públicos",31-12-2016,"52.046,84 €",O contrato iniciou em Setembro 2015 e foi prorrogado até 31/12/2016,contrato encerrado em 31/12/2016,,Não aplicável.,Não aplicável.,FALSE
Prestação serviços para tecnicos de serviço social,Ajuste Direto Regime Geral,Aquisição de serviços,"79000000-4, Serviços a empresas: direito, comercialização, consultoria, recrutamento, impressão e segurança",Hospital Dr. Francisco Zagalo (501510150),"E-Sycare, Lda. (509706134)","14.864,00 €",22-10-2015,22-09-2015,120 dias,"Portugal, Aveiro, Ovar","Artigo 20.º, n.º 1, alínea a) do Código dos Contratos Públicos",31-12-2016,"34.860,73 €",Foi prorrogado o contrato até 31/12/2016,serviços acima do previsto,,Não aplicável.,Não aplicável.,FALSE
aquisição de serviços de saúdemedicos,Ajuste Direto Regime Geral,Aquisição de serviços,"85000000-9, Serviços de saúde e acção social",Direção-Geral de Reinserção e Serviços Prisionais (600085171),"E-Sycare, Lda (509706134)","15.558,10 €",06-07-2015,06-07-2015,45 dias,Portugal,"Artigo 24.º, n.º 1, alínea c) do Código dos Contratos Públicos","","","","",,Não aplicável.,Não aplicável.,FALSE
"Aquisição de serviços médicos sem especialidade, na área dos Cuidados de Saúde Primários da ARSNORTE, I.P. - Aces do Alto Trás-os-Montes II Alto Tâmega e Barroso",Ao abrigo de acordo-quadro (art.º 259.º),Aquisição de serviços,"79625000-1, Serviços de fornecimento de pessoal médico","Administração Regional de Saúde do Norte, I.P. (503135593)",E-SYCARE S.A. Portugal (509706134),"17,95 €",06-08-2013,30-04-2013,270 dias,"Portugal, Vila Real",Artigo 259.º do Código dos Contratos Públicos,31-12-2013,"17,95 €","","",,454020,"CONCURSO PÚBLICO PARA A CELEBRAÇÃO DE CONTRATOS PÚBLICOS DE APROVISIONAMENTO PARA A ÁREA DA SAÚDE, COM VISTA À PRESTAÇÃO DE SERVIÇOS MÉDICOS ÀS INSTITUIÇÕES E SERVIÇOS DO SERVIÇO NACIONAL DE SAÚDE",
"Aquisição de serviços de secretariado clinico para a área de influência da ARSLVT,IP (ACES XVIII), em regime de outsourcing, pelo período de 6 meses. Aditamento nº1 ao contrato nº135/2012",Ajuste Direto Regime Geral,Aquisição de serviços,"75122000-7, Serviços administrativos na área da saúde","Administração Regional de Saúde de Lisboa e Vale do Tejo, I.P. (503148776)","E-SYCARE, S.A. (509706134)","689,25 €",24-01-2013,14-12-2012,180 dias,"Portugal, Lisboa","Artigo 24.º, n.º 1, alínea e) do Código dos Contratos Públicos","","","","",,Não aplicável.,Não aplicável.,
"Aquisição de serviços de secretariado clínico para a área de influência da ARSLVT, IP. (ACES I), em regime de outsourcing, pelo período de 6 meses. Aditamento nº1 ao contrato nº134/2012.",Ajuste Direto Regime Geral,Aquisição de serviços,"75122000-7, Serviços administrativos na área da saúde","Administração Regional de Saúde de Lisboa e Vale do Tejo, I.P. (503148776)","E-SYCARE, S.A. (509706134)","1.659,48 €",24-01-2013,19-12-2012,180 dias,"Portugal, Lisboa, Lisboa","Artigo 24.º, n.º 1, alínea e) do Código dos Contratos Públicos","","","","",,Não aplicável.,Não aplicável.,
Prestação de serviços de cuidados de saúde na área de enfermagem,Concurso público,Aquisição de serviços,"85141200-1, Serviços prestados pelo pessoal de enfermagem","Administração Regional de Saúde de Lisboa e Vale do Tejo, I.P. (503148776)","E-Sycare, SA (509706134)","31.021,90 €",10-10-2012,12-07-2012,91 dias,"Portugal, Lisboa, Odivelas","Artigo 155.º, alínea a) do Código dos Contratos Públicos","","","","",,Não aplicável.,Não aplicável.,
Prestação de serviços de cuidados de saúde na área de enfermagem,Concurso público,Aquisição de serviços,"85141200-1, Serviços prestados pelo pessoal de enfermagem","Administração Regional de Saúde de Lisboa e Vale do Tejo, I.P. (503148776)","E-Sycare, SA (509706134)","33.237,75 €",10-10-2012,12-07-2012,91 dias,"Portugal, Santarém, Ferreira do Zezere<BR/>Portugal, Lisboa, Vila Franca de Xira","Artigo 155.º, alínea a) do Código dos Contratos Públicos","","","","",,Não aplicável.,Não aplicável.,
Prestação de serviços de cuidados de saúde na área de enfermagem,Concurso público,Aquisição de serviços,"85141200-1, Serviços prestados pelo pessoal de enfermagem","Administração Regional de Saúde de Lisboa e Vale do Tejo, I.P. (503148776)","E-Sycare, SA (509706134)","50.271,39 €",10-10-2012,12-07-2012,91 dias,"Portugal, Setúbal, Seixal<BR/>Portugal, Setúbal, Almada","Artigo 155.º, alínea a) do Código dos Contratos Públicos","","","","",,Não aplicável.,Não aplicável.,
"Prestação de serviços médicos de Clínica Geral para o Serviço de Urgência, na Unidade Hospitalar da Póvoa de Varzim do Centro Hospitalar Póvoa de Varzim/Vila do Conde. EPE, pelo período de onze meses a contar a partir da data da assinatura do contrato, em cumprimento e ao abrigo do disposto no Despacho n.º 08/SEAS/2007 da Senhora Secretária de Estado Adjunta e da Saúde e respectivo anexo.",Concurso público,Aquisição de serviços,"85121100-4, Serviços de médicos de clínica geral","Centro Hospitalar Póvoa de Varzim - Vila do Conde, E.P.E. (508741823)","E-Sycare, S.A. (509706134)","195.590,40 €",16-01-2012,04-10-2011,336 dias,"Portugal, Porto","Artigo 20.º, n.º 1, alínea b) do Código dos Contratos Públicos","","","","",,Não aplicável.,Não aplicável.,
