freguesia,acronym,validVotesPercentage,votes,dicofre
Vila Ruiva,PCP-PEV,50.82,93,020704
Vila Ruiva,PS,31.69,58,020704
Vila Ruiva,PPD/PSD.CDS-PP,5.46,10,020704
Vila Ruiva,PCTP/MRPP,4.37,8,020704
Vila Ruiva,PAN,2.19,4,020704
Vila Ruiva,B.E.,1.64,3,020704
Vila Ruiva,PNR,1.09,2,020704
Vila Ruiva,MAS,0.55,1,020704
Vila Ruiva,MPT,0.55,1,020704
Vila Ruiva,PND,0.55,1,020704
Vila Ruiva,PPM,0.55,1,020704
Vila Ruiva,PPV,0.55,1,020704
Vila Ruiva,L,0,0,020704
Vila Ruiva,PDA,0,0,020704
Vila Ruiva,POUS,0,0,020704
Vila Ruiva,PTP,0,0,020704
