freguesia,acronym,validVotesPercentage,votes,dicofre
"União das freguesias de Lavandeira, Beira Grande e Selores",PPD/PSD.CDS-PP,56.74,101,040323
"União das freguesias de Lavandeira, Beira Grande e Selores",PS,24.16,43,040323
"União das freguesias de Lavandeira, Beira Grande e Selores",MPT,6.18,11,040323
"União das freguesias de Lavandeira, Beira Grande e Selores",PCP-PEV,5.06,9,040323
"União das freguesias de Lavandeira, Beira Grande e Selores",B.E.,3.37,6,040323
"União das freguesias de Lavandeira, Beira Grande e Selores",PCTP/MRPP,2.25,4,040323
"União das freguesias de Lavandeira, Beira Grande e Selores",PAN,1.12,2,040323
"União das freguesias de Lavandeira, Beira Grande e Selores",MAS,0.56,1,040323
"União das freguesias de Lavandeira, Beira Grande e Selores",PND,0.56,1,040323
"União das freguesias de Lavandeira, Beira Grande e Selores",L,0,0,040323
"União das freguesias de Lavandeira, Beira Grande e Selores",PDA,0,0,040323
"União das freguesias de Lavandeira, Beira Grande e Selores",PNR,0,0,040323
"União das freguesias de Lavandeira, Beira Grande e Selores",POUS,0,0,040323
"União das freguesias de Lavandeira, Beira Grande e Selores",PPM,0,0,040323
"União das freguesias de Lavandeira, Beira Grande e Selores",PPV,0,0,040323
"União das freguesias de Lavandeira, Beira Grande e Selores",PTP,0,0,040323
