freguesia,acronym,validVotesPercentage,votes,dicofre
Vilarinho de Agrochão,PPD/PSD,45.28,24,040536
Vilarinho de Agrochão,PS,45.28,24,040536
Vilarinho de Agrochão,CDS-PP,5.66,3,040536
Vilarinho de Agrochão,A,1.89,1,040536
Vilarinho de Agrochão,B.E.,1.89,1,040536
Vilarinho de Agrochão,IL,0,0,040536
Vilarinho de Agrochão,L,0,0,040536
Vilarinho de Agrochão,MAS,0,0,040536
Vilarinho de Agrochão,NC,0,0,040536
Vilarinho de Agrochão,PAN,0,0,040536
Vilarinho de Agrochão,PCP-PEV,0,0,040536
Vilarinho de Agrochão,PCTP/MRPP,0,0,040536
Vilarinho de Agrochão,PDR,0,0,040536
Vilarinho de Agrochão,PNR,0,0,040536
Vilarinho de Agrochão,PPM.PPV/CDC,0,0,040536
Vilarinho de Agrochão,PTP,0,0,040536
Vilarinho de Agrochão,PURP,0,0,040536
