freguesia,acronym,validVotesPercentage,votes,dicofre
Odeleite,PS,55.23,132,080403
Odeleite,PPD/PSD.CDS-PP,30.13,72,080403
Odeleite,PCP-PEV,6.69,16,080403
Odeleite,MPT,1.26,3,080403
Odeleite,PCTP/MRPP,1.26,3,080403
Odeleite,POUS,1.26,3,080403
Odeleite,B.E.,0.84,2,080403
Odeleite,PAN,0.84,2,080403
Odeleite,PTP,0.84,2,080403
Odeleite,MAS,0.42,1,080403
Odeleite,PDA,0.42,1,080403
Odeleite,PND,0.42,1,080403
Odeleite,PPM,0.42,1,080403
Odeleite,L,0,0,080403
Odeleite,PNR,0,0,080403
Odeleite,PPV,0,0,080403
