freguesia,acronym,validVotesPercentage,votes,dicofre
Faial,PPD/PSD.CDS-PP,52.23,269,310902
Faial,PS,19.03,98,310902
Faial,MPT,7.38,38,310902
Faial,PTP,6.99,36,310902
Faial,PAN,2.33,12,310902
Faial,PCP-PEV,2.33,12,310902
Faial,PND,1.75,9,310902
Faial,B.E.,1.55,8,310902
Faial,L,1.36,7,310902
Faial,PCTP/MRPP,1.36,7,310902
Faial,PPM,1.36,7,310902
Faial,MAS,0.58,3,310902
Faial,PPV,0.58,3,310902
Faial,PDA,0.39,2,310902
Faial,PNR,0.39,2,310902
Faial,POUS,0.39,2,310902
