Objeto do Contrato,Tipo de Procedimento,Tipo(s) de Contrato,CPVs,Entidade(s) Adjudicante(s),Entidade(s) Adjudicatária(s),Preço Contratual,Data de Publicação,Data de Celebração do Contrato,Prazo de Execução,Local de Execução,Fundamentação,Data de Fecho do Contrato,Preço Total Efetivo,Causas das Alterações ao Prazo,Causas das Alterações ao Preço,Estado,N.º registo do Acordo Quadro,Descrição do Acordo Quadro,Procedimento Centralizado
4S0059/2017 SERV MED ANESTESIA P/ ANO 2017,Ajuste Direto Regime Geral,Aquisição de serviços,"85100000-0, Serviços de saúde","Centro Hospitalar Barreiro Montijo, E. P. E. (509186998)","ANESTIMED ANESTESIOLOGIA, SOCIEDADE UNIP., LDA. (509914977)","37.061,52 €",23-10-2017,13-02-2017,365 dias,"Portugal, Setúbal, Barreiro","Artigo 20.º, n.º 1, alínea a) do Código dos Contratos Públicos",31-03-2017,"1.660,00 €","A médica prestadora de serviços, faleceu",Apenas houve prestação de serviços no mes de Janeiro,,Não aplicável.,Não aplicável.,FALSE
4S0020/2016 SERV MÉD ANESTESIA P ANO 2016,Ajuste Direto Regime Geral,Aquisição de serviços,"85140000-2, Serviços de saúde diversos","Centro Hospitalar Barreiro Montijo, E. P. E. (509186998)","ANESTIMED ANESTESIOLOGIA, SOCIEDADE UNIP., LDA. (509914977)","23.520,00 €",14-02-2017,27-01-2016,365 dias,"Portugal, Setúbal, Barreiro","Artigo 20.º, n.º 1, alínea a) do Código dos Contratos Públicos",31-12-2016,"21.276,13 €","",Consumo efetivo inferior ao inicialmente estimado,,Não aplicável.,Não aplicável.,FALSE
