Objeto do Contrato,Tipo de Procedimento,Tipo(s) de Contrato,CPVs,Entidade(s) Adjudicante(s),Entidade(s) Adjudicatária(s),Preço Contratual,Data de Publicação,Data de Celebração do Contrato,Prazo de Execução,Local de Execução,Fundamentação,Data de Fecho do Contrato,Preço Total Efetivo,Causas das Alterações ao Prazo,Causas das Alterações ao Preço,Estado,N.º registo do Acordo Quadro,Descrição do Acordo Quadro,Procedimento Centralizado
"Assistência técnica a Servidores e Equipamentos de Rede, do INEM, I.P.",Ajuste Direto Regime Geral,Aquisição de serviços,"72000000-5, Serviços de TI: consultoria, desenvolvimento de software, Internet e apoio","Instituto Nacional de Emergência Médica, I. P. (501356126)","Integrator – Tecnologias da Informação, SA. (506619290)","18.738,00 €",09-06-2017,30-05-2017,91 dias,"Portugal, Portugal Continental","Artigo 20.º, n.º 1, alínea a) do Código dos Contratos Públicos",,,,,,Não aplicável.,Não aplicável.,FALSE
Aquisição de fardamento (polos),Ajuste Direto Regime Geral,Aquisição de bens móveis,"18100000-0, Vestuário profissional, vestuário de trabalho especial e acessórios","Instituto Nacional de Emergência Médica, I. P. (501356126)","Badoni - Serigrafia, Lda. (504797034)","2.100,00 €",08-06-2017,01-06-2017,5 dias,"Portugal, Portugal Continental","Artigo 20.º, n.º 1, alínea a) do Código dos Contratos Públicos",,,,,,Não aplicável.,Não aplicável.,FALSE
Aquisição de fardamento (polos),Ajuste Direto Regime Geral,Aquisição de bens móveis,"18100000-0, Vestuário profissional, vestuário de trabalho especial e acessórios","Instituto Nacional de Emergência Médica, I. P. (501356126)","Fugal, Comércio Internacional de Vestuário, Lda. (510541283)","36.708,00 €",08-06-2017,01-06-2017,5 dias,"Portugal, Portugal Continental","Artigo 20.º, n.º 1, alínea a) do Código dos Contratos Públicos",,,,,,Não aplicável.,Não aplicável.,FALSE
Recolha de imagens da atividade do INEM,Ajuste Direto Regime Geral,Aquisição de serviços,"92110000-5, Serviços de produção de filmes e fitas de vídeo e afins","Instituto Nacional de Emergência Médica, I. P. (501356126)","Indigo Virtual Unip., Lda. (513047042)","4.980,00 €",07-06-2017,06-06-2017,30 dias,"Portugal, Lisboa, Lisboa","Artigo 20.º, n.º 1, alínea a) do Código dos Contratos Públicos",,,,,,Não aplicável.,Não aplicável.,FALSE
Fornecimento de eletricidade BTN,Ajuste Direto Regime Geral,Aquisição de serviços,"65300000-6, Serviços de distribuição de electricidade e serviços conexos","Instituto Nacional de Emergência Médica, I. P. (501356126)","EDP Comercial, S.A. (503504564)","5.000,00 €",07-06-2017,06-06-2017,240 dias,"Portugal, Porto, Vila Nova de Gaia","Artigo 24.º, n.º 1, alínea e) do Código dos Contratos Públicos",,,,,,Não aplicável.,Não aplicável.,FALSE
Prestação de serviço de higiene e limpeza a nível nacional MAI/17,Ajuste Direto Regime Geral,Aquisição de serviços,"90000000-7, Serviços relativos a águas residuais, resíduos, limpeza e ambiente","Instituto Nacional de Emergência Médica, I. P. (501356126)","Interlimpe - Facility Services, S.A. (502611057)","23.201,39 €",06-06-2017,23-05-2017,31 dias,"Portugal, Lisboa, Lisboa<BR/>Portugal, Faro, Faro<BR/>Portugal, Coimbra, Coimbra<BR/>Portugal, Porto, Vila Nova de Gaia<BR/>Portugal, Porto, Porto","Artigo 24.º, n.º 1, alínea c) do Código dos Contratos Públicos",,,,,,Não aplicável.,Não aplicável.,FALSE
AQUISIÇÃO DE DIVERSOS CONSUMÍVEIS PARA LIFEPAK,Ajuste Direto Regime Geral,Aquisição de bens móveis,"33000000-0, Equipamento médico, medicamentos e produtos para cuidados pessoais","Instituto Nacional de Emergência Médica, I. P. (501356126)",PHYSIO PORTUGAL SALES (510137946),"118.694,12 €",02-06-2017,26-04-2017,8 dias,"Portugal, Lisboa, Lisboa","Artigo 24.º, n.º 1, alínea e) do Código dos Contratos Públicos",,,,,,Não aplicável.,Não aplicável.,FALSE
AQUISIÇÃO DE SERINGAS IRRECUPERÁVEIS 5ML E 10ML,Ajuste Direto Regime Geral,Aquisição de bens móveis,"33000000-0, Equipamento médico, medicamentos e produtos para cuidados pessoais","Instituto Nacional de Emergência Médica, I. P. (501356126)",B. BRAUN MEDICAL (501506543),"0,00 €",02-06-2017,03-05-2017,1 dias,"Portugal, Lisboa, Lisboa","Artigo 26.º, n.º 1, alínea e) do Código dos Contratos Públicos",,,,,,2779504,AQUISIÇÃO DE SERINGAS IRRECUPERÁVEIS 5ML E 10ML,FALSE
AQUISIÇÃO DE CONJUNTOS DE SUTURA ESTERILIZADO DESCARTÁVEIS E LENÇÓIS DESCARTÁVEIS 80 X 210 CM,Ajuste Direto Regime Geral,Aquisição de bens móveis,"33000000-0, Equipamento médico, medicamentos e produtos para cuidados pessoais","Instituto Nacional de Emergência Médica, I. P. (501356126)",BASTOS VIEGAS (500042772),"14.875,00 €",02-06-2017,11-05-2017,5 dias,"Portugal, Lisboa, Lisboa","Artigo 20.º, n.º 1, alínea a) do Código dos Contratos Públicos",,,,,,Não aplicável.,Não aplicável.,FALSE
"Aquisição de pensos rápidos estéreis, contentores recolha cortantes contaminados",Ajuste Direto Regime Geral,Aquisição de bens móveis,"33000000-0, Equipamento médico, medicamentos e produtos para cuidados pessoais","Instituto Nacional de Emergência Médica, I. P. (501356126)",OVERPHARMA (505792362),"0,00 €",02-06-2017,16-05-2017,2 dias,"Portugal, Lisboa, Lisboa","Artigo 26.º, n.º 1, alínea e) do Código dos Contratos Públicos",,,,,,2778966,"Aquisição de pensos rápidos estéreis, contentores recolha cortantes contaminados",FALSE
Aquisição de frascos de glucagom,Ajuste Direto Regime Geral,Aquisição de bens móveis,"33600000-6, Produtos farmacêuticos","Instituto Nacional de Emergência Médica, I. P. (501356126)",NOVO NORDISK (501485210),"0,00 €",02-06-2017,29-05-2017,3 dias,"Portugal, Lisboa, Lisboa","Artigo 26.º, n.º 1, alínea e) do Código dos Contratos Públicos",,,,,,2778912,Aquisição de frascos de glucagom,FALSE
"AQUISIÇÃO DE ESMOLOL, SOL.INJ. 100MG/10ML E CLORETO DE SÓDIO 0,9% FR. 500ML",Ajuste Direto Regime Geral,Aquisição de bens móveis,"33600000-6, Produtos farmacêuticos","Instituto Nacional de Emergência Médica, I. P. (501356126)",BAXTER (503347345),"0,00 €",02-06-2017,29-05-2017,1 dias,"Portugal, Lisboa, Lisboa","Artigo 26.º, n.º 1, alínea e) do Código dos Contratos Públicos",,,,,,2778874,"AQUISIÇÃO DE ESMOLOL, SOL.INJ. 100MG/10ML E CLORETO DE SÓDIO 0,9% FR. 500ML",FALSE
"AQUISIÇÃO DE ÓCULOS DE ADMINISTRAÇÃO O2 PEDIÁTRICOS, TUBOS CONEXÃO O2, CÂNULAS OROFARIN.IRRECUPERÁVEIS, MÁSCARAS DE INSUFLADOR, MÁSCARAS INALAÇÃO O2, CIRCUITOS VENTILAÇÃO E CONETORES",Ajuste Direto Regime Geral,Aquisição de bens móveis,"33000000-0, Equipamento médico, medicamentos e produtos para cuidados pessoais","Instituto Nacional de Emergência Médica, I. P. (501356126)",INTERSURGICAL (503480045),"5.908,80 €",02-06-2017,02-05-2017,3 dias,"Portugal, Lisboa, Lisboa","Artigo 20.º, n.º 1, alínea a) do Código dos Contratos Públicos",,,,,,Não aplicável.,Não aplicável.,FALSE
AQUISIÇÃO DE CONJUNTOS PARA CRICOTIROTOMIA DE EMERGÊNCIA ADULTO E PEDIÁTRICO,Ajuste Direto Regime Geral,Aquisição de bens móveis,"33000000-0, Equipamento médico, medicamentos e produtos para cuidados pessoais","Instituto Nacional de Emergência Médica, I. P. (501356126)",BIOSONDA (501463313),"3.150,00 €",02-06-2017,11-05-2017,1 dias,"Portugal, Lisboa, Lisboa","Artigo 20.º, n.º 1, alínea a) do Código dos Contratos Públicos",,,,,,Não aplicável.,Não aplicável.,FALSE
"AQUISIÇÃO DE CONECTORES PARA CONTROLO DIGITAL DE ASPIRAÇÃO, ALGÁLIAS, MÁSCARAS INALAÇÃO O2 ALTA CONCENTRAÇÃO, FILTROS PARA DOENTE ENTUBADO ADULTO E ELÉTRODOS ECG",Ajuste Direto Regime Geral,Aquisição de bens móveis,"33000000-0, Equipamento médico, medicamentos e produtos para cuidados pessoais","Instituto Nacional de Emergência Médica, I. P. (501356126)",HR HOSPITALAR (501895558),"4.230,18 €",02-06-2017,16-05-2017,1 dias,"Portugal, Lisboa, Lisboa","Artigo 20.º, n.º 1, alínea a) do Código dos Contratos Públicos",,,,,,Não aplicável.,Não aplicável.,FALSE
"Prestação de serviço de Gestão Oficinal de frota do INEM, I.P.",Ajuste Direto Regime Geral,Aquisição de serviços,"50000000-5, Serviços de reparação e manutenção","Instituto Nacional de Emergência Médica, I. P. (501356126)","Finlog - Aluguer e Comércio de Automóveis, S.A. (502584866)","502.000,00 €",01-06-2017,23-05-2017,61 dias,"Portugal, Portugal Continental","Artigo 27.º, n.º 1, alínea a) do Código dos Contratos Públicos",,,,,,Não aplicável.,Não aplicável.,FALSE
