Objeto do Contrato,Tipo de Procedimento,Tipo(s) de Contrato,CPVs,Entidade(s) Adjudicante(s),Entidade(s) Adjudicatária(s),Preço Contratual,Data de Publicação,Data de Celebração do Contrato,Prazo de Execução,Local de Execução,Fundamentação,Data de Fecho do Contrato,Preço Total Efetivo,Causas das Alterações ao Prazo,Causas das Alterações ao Preço,Estado,N.º registo do Acordo Quadro,Descrição do Acordo Quadro,Procedimento Centralizado
C.P. S10005/2016 Serviços Médicos de Gastrenterologia ao CHBM EPE,Concurso público,Aquisição de serviços,"85121251-7, Serviços de gastroenterologia","Centro Hospitalar Barreiro Montijo, E. P. E. (509186998)","FOCO POSITIVO - ACTIVIDADES MÉDICAS, LDA (509620426)","29.620,00 €",08-11-2016,02-02-2016,366 dias,"Portugal, Setúbal, Barreiro","Artigo 20.º, n.º 1, alínea b) do Código dos Contratos Públicos",31-03-2016,"5.661,00 €",,Houve rescisão de contato,,Não aplicável.,Não aplicável.,FALSE
4CPS0001/2015 Serviços Médicos de Gastrenterologia - MCDT para ano 2015,Ajuste Direto Regime Geral,Aquisição de serviços,"85000000-9, Serviços de saúde e acção social","Centro Hospitalar Barreiro Montijo, E. P. E. (509186998)","FOCO POSITIVO - ACTIVIDADES MÉDICAS, LDA (509620426)","14.882,50 €",01-03-2016,09-09-2015,220 dias,"Portugal, Setúbal, Barreiro","Artigo 27.º, n.º 1, alínea a) do Código dos Contratos Públicos",31-12-2015,"10.629,00 €",,Nº exames realizados inferior ao inicialmente estimado,,Não aplicável.,Não aplicável.,FALSE
4CPS0001/2014 Fornecimento de Serviços de Gastrenterologia - MCDT,Ajuste Direto Regime Geral,Aquisição de serviços,"79625000-1, Serviços de fornecimento de pessoal médico","Centro Hospitalar Barreiro Montijo, E. P. E. (509186998)","Foco Positivo - Actividades Médicas, Lda. (509620426)","32.330,80 €",26-03-2015,14-01-2014,365 dias,"Portugal, Setúbal, Barreiro","Artigo 27.º, n.º 1, alínea a) do Código dos Contratos Públicos",31-12-2014,"29.607,35 €",,Consumos inferiores ao inicialmente estimado,,Não aplicável.,Não aplicável.,FALSE
