freguesia,acronym,validVotesPercentage,votes,dicofre
São Cristóvão,PCP-PEV,49.81,131,070606
São Cristóvão,PPD/PSD.CDS-PP,20.53,54,070606
São Cristóvão,PS,18.25,48,070606
São Cristóvão,PCTP/MRPP,3.8,10,070606
São Cristóvão,B.E.,3.04,8,070606
São Cristóvão,L,1.9,5,070606
São Cristóvão,MPT,1.9,5,070606
São Cristóvão,PND,0.38,1,070606
São Cristóvão,PPM,0.38,1,070606
São Cristóvão,MAS,0,0,070606
São Cristóvão,PAN,0,0,070606
São Cristóvão,PDA,0,0,070606
São Cristóvão,PNR,0,0,070606
São Cristóvão,POUS,0,0,070606
São Cristóvão,PPV,0,0,070606
São Cristóvão,PTP,0,0,070606
