freguesia,acronym,validVotesPercentage,votes,dicofre
Valdosende,PPD/PSD.CDS-PP,40.74,88,031015
Valdosende,PS,34.26,74,031015
Valdosende,PCP-PEV,13.43,29,031015
Valdosende,MPT,5.09,11,031015
Valdosende,B.E.,1.39,3,031015
Valdosende,PCTP/MRPP,0.93,2,031015
Valdosende,PND,0.93,2,031015
Valdosende,PPV,0.93,2,031015
Valdosende,PTP,0.93,2,031015
Valdosende,L,0.46,1,031015
Valdosende,PAN,0.46,1,031015
Valdosende,PNR,0.46,1,031015
Valdosende,MAS,0,0,031015
Valdosende,PDA,0,0,031015
Valdosende,POUS,0,0,031015
Valdosende,PPM,0,0,031015
