Objeto do Contrato,Tipo de Procedimento,Tipo(s) de Contrato,CPVs,Entidade(s) Adjudicante(s),Entidade(s) Adjudicatária(s),Preço Contratual,Data de Publicação,Data de Celebração do Contrato,Prazo de Execução,Local de Execução,Fundamentação,Data de Fecho do Contrato,Preço Total Efetivo,Causas das Alterações ao Prazo,Causas das Alterações ao Preço,Estado,N.º registo do Acordo Quadro,Descrição do Acordo Quadro,Procedimento Centralizado
Aquisição de Metilprednisolona 125mg Pó Sol. Inj. IM IV,Ao abrigo de acordo-quadro (art.º 258.º),Aquisição de bens móveis,"33690000-3, Medicamentos vários","Administração Regional de Saúde de Lisboa e Vale do Tejo, I. P. (503148776)","Laboratórios Pfizer, Lda (500162166)","1.494,00 €",21-12-2015,03-12-2015,10 dias,"Portugal, Lisboa, Lisboa",Artigo 258.º do Código dos Contratos Públicos,"","",,,,1415640,CP 2015/7 - ACORDO QUADRO PARA FORNECIMENTO DE HORMONAS E OUTROS MEDICAMENTOS USADOS NO TRATAMENTO DAS DOENÇAS ENDÓCRINAS ÀS INSTITUIÇÕES E SERVIÇOS DO SERVIÇO NACIONAL DE SAÚDE,FALSE
Calibração equipamento Usf Gama - Aces Oeste Sul,Ajuste Direto Regime Geral,Aquisição de serviços,"50000000-5, Serviços de reparação e manutenção","Administração Regional de Saúde de Lisboa e Vale do Tejo, I. P. (503148776)",ISQ - Instituto Superior Qualidade (500140022),"692,28 €",21-12-2015,21-04-2015,20 dias,"Portugal, Lisboa, Torres Vedras","Artigo 24.º, n.º 1, alínea e) do Código dos Contratos Públicos",21-04-2015,"692,28 €",,,,Não aplicável.,Não aplicável.,FALSE
Aquisiçãode vinhetas e blocos de receituário - Aces Oeste Sul,Ajuste Direto Regime Geral,Aquisição de bens móveis,"30199761-2, Etiquetas com códigos de barras","Administração Regional de Saúde de Lisboa e Vale do Tejo, I. P. (503148776)",INCM - Imprensa Nacional - Casa da Moeda (500792887),"100,00 €",21-12-2015,06-10-2015,20 dias,"Portugal, Lisboa, Torres Vedras","Artigo 24.º, n.º 1, alínea e) do Código dos Contratos Públicos",06-10-2015,"100,00 €",,,,Não aplicável.,Não aplicável.,FALSE
Calibração de equipamentos Usf Arandis - Aces Oeste Sul,Ajuste Direto Regime Geral,Aquisição de serviços,"50000000-5, Serviços de reparação e manutenção","Administração Regional de Saúde de Lisboa e Vale do Tejo, I. P. (503148776)",ISQ - Instituto Soldadura e Qualidade (500140022),"1.204,56 €",21-12-2015,29-04-2015,20 dias,"Portugal, Lisboa, Torres Vedras","Artigo 24.º, n.º 1, alínea e) do Código dos Contratos Públicos",29-04-2015,"1.204,56 €",,,,Não aplicável.,Não aplicável.,FALSE
Aquisição de vinhetas e blocos de receituario - Aces Oeste Sul,Ajuste Direto Regime Geral,Aquisição de bens móveis,"30199761-2, Etiquetas com códigos de barras","Administração Regional de Saúde de Lisboa e Vale do Tejo, I. P. (503148776)",INCM - Imprensa Nacional -Casa da Moeda (500792887),"150,00 €",21-12-2015,16-11-2015,20 dias,"Portugal, Lisboa, Torres Vedras","Artigo 24.º, n.º 1, alínea e) do Código dos Contratos Públicos",16-11-2015,"150,00 €",,,,Não aplicável.,Não aplicável.,FALSE
Aquisição de vinhetas e blocos de receituario - Aces Oeste Sul,Ajuste Direto Regime Geral,Aquisição de bens móveis,"30199761-2, Etiquetas com códigos de barras","Administração Regional de Saúde de Lisboa e Vale do Tejo, I. P. (503148776)",INCM - Imprensa Nacional - Casa da Moeda (500792887),"200,00 €",21-12-2015,10-12-2015,20 dias,"Portugal, Lisboa, Torres Vedras","Artigo 24.º, n.º 1, alínea e) do Código dos Contratos Públicos",10-12-2015,"200,00 €",,,,Não aplicável.,Não aplicável.,FALSE
"AQ. EQUIPAMENTO CLINICO P/USF TRAVESSA DA SAÚDE, AO ABRIGO DOS INCENTIVOS INSTITUCIONAIS",Ajuste Direto Regime Geral,Aquisição de bens móveis,"33000000-0, Equipamento médico, medicamentos e produtos para cuidados pessoais","Administração Regional de Saúde de Lisboa e Vale do Tejo, I. P. (503148776)","MEDINVIV, LDA (509815359)","3.146,00 €",18-12-2015,17-11-2015,10 dias,"Portugal, Lisboa, Loures","Artigo 20.º, n.º 1, alínea a) do Código dos Contratos Públicos","","",,,,Não aplicável.,Não aplicável.,FALSE
"AQ. EQUIPAMENTO CLINICO P/USF RAMADA, AO ABRIGO DOS INCENTIVOS INSTITUCIONAIS",Ajuste Direto Regime Geral,Aquisição de bens móveis,"33000000-0, Equipamento médico, medicamentos e produtos para cuidados pessoais","Administração Regional de Saúde de Lisboa e Vale do Tejo, I. P. (503148776)","MEDINVIV, LDA (509815359)","457,00 €",18-12-2015,16-11-2015,10 dias,"Portugal, Lisboa, Loures","Artigo 20.º, n.º 1, alínea a) do Código dos Contratos Públicos","","",,,,Não aplicável.,Não aplicável.,FALSE
PEQUENAS REPARÇAÕES NOS VÁRIOS EDIFÍCIOS DO ACES LOURES-ODIVELAS,Ajuste Direto Regime Geral,Aquisição de serviços,"50000000-5, Serviços de reparação e manutenção","Administração Regional de Saúde de Lisboa e Vale do Tejo, I. P. (503148776)","CSQL, LDA (509649742)","5.000,00 €",18-12-2015,08-10-2015,60 dias,"Portugal, Lisboa, Loures","Artigo 20.º, n.º 1, alínea a) do Código dos Contratos Públicos","","",,,,Não aplicável.,Não aplicável.,FALSE
FERRAMENTAS DESGASTE RÁPIDO,Ajuste Direto Regime Geral,Aquisição de bens móveis,"33000000-0, Equipamento médico, medicamentos e produtos para cuidados pessoais","Administração Regional de Saúde de Lisboa e Vale do Tejo, I. P. (503148776)","MEDICAL IMPORT, LDA (506662055)","300,00 €",18-12-2015,17-09-2015,10 dias,"Portugal, Lisboa, Loures","Artigo 20.º, n.º 1, alínea a) do Código dos Contratos Públicos","","",,,,Não aplicável.,Não aplicável.,FALSE
REPARAÇÕES DE EQUIPAMENTOS MÉDICOS,Ajuste Direto Regime Geral,Aquisição de serviços,"50000000-5, Serviços de reparação e manutenção","Administração Regional de Saúde de Lisboa e Vale do Tejo, I. P. (503148776)","MEDICAL IMPORT, LDA (506662055)","5.000,00 €",18-12-2015,22-06-2015,100 dias,"Portugal, Lisboa, Loures","Artigo 20.º, n.º 1, alínea a) do Código dos Contratos Públicos","","",,,,Não aplicável.,Não aplicável.,FALSE
PEQUENAS REPARAÇÕES NOS VÁRIOS EDIFÍCIOS,Ajuste Direto Regime Geral,Aquisição de serviços,"50000000-5, Serviços de reparação e manutenção","Administração Regional de Saúde de Lisboa e Vale do Tejo, I. P. (503148776)","CSQL, LDA (509649742)","5.000,00 €",18-12-2015,22-01-2015,300 dias,"Portugal, Lisboa, Loures","Artigo 20.º, n.º 1, alínea a) do Código dos Contratos Públicos","","",,,,Não aplicável.,Não aplicável.,FALSE
REPARAÇÃO/MANUTENÇÃO DE VÁRIAS CENTRAIS E LINHAS TELEFÓNICAS,Ajuste Direto Regime Geral,Aquisição de serviços,"50000000-5, Serviços de reparação e manutenção","Administração Regional de Saúde de Lisboa e Vale do Tejo, I. P. (503148776)","LUSOFÓNICA, LDA (501793054)","5.000,00 €",18-12-2015,21-01-2015,360 dias,"Portugal, Lisboa, Loures","Artigo 20.º, n.º 1, alínea a) do Código dos Contratos Públicos","","",,,,Não aplicável.,Não aplicável.,FALSE
ESCALAS OPTOMÉTRICAS SECRETÁRIA,Ajuste Direto Regime Geral,Aquisição de bens móveis,"33000000-0, Equipamento médico, medicamentos e produtos para cuidados pessoais","Administração Regional de Saúde de Lisboa e Vale do Tejo, I. P. (503148776)","MEDINVIV, LDA (509815359)","260,00 €",18-12-2015,03-11-2015,10 dias,"Portugal, Lisboa, Loures","Artigo 20.º, n.º 1, alínea a) do Código dos Contratos Públicos","","",,,,Não aplicável.,Não aplicável.,FALSE
"PROC. 226/2015 - AQ. EQUIPAMENTO CLINICO P/USF LOURES SAUDÁVEL, AO ABRIGO DOS INCENTIVOS INSTITUCIONAIS",Ajuste Direto Regime Geral,Aquisição de bens móveis,"33000000-0, Equipamento médico, medicamentos e produtos para cuidados pessoais","Administração Regional de Saúde de Lisboa e Vale do Tejo, I. P. (503148776)","MEDINVIV, LDA (509815359)","783,00 €",18-12-2015,04-12-2015,10 dias,"Portugal, Lisboa, Loures","Artigo 20.º, n.º 1, alínea a) do Código dos Contratos Públicos","","",,,,Não aplicável.,Não aplicável.,FALSE
MEMBRANAS P/OTOSCÓPIOS,Ajuste Direto Regime Geral,Aquisição de bens móveis,"33000000-0, Equipamento médico, medicamentos e produtos para cuidados pessoais","Administração Regional de Saúde de Lisboa e Vale do Tejo, I. P. (503148776)","MEDINVIV, LDA (509815359)","9,60 €",18-12-2015,03-11-2015,10 dias,"Portugal, Lisboa, Loures","Artigo 20.º, n.º 1, alínea a) do Código dos Contratos Públicos","","",,,,Não aplicável.,Não aplicável.,FALSE
"AQ. EQUIPAMENTO CLINICO P/USF MAGNÓLIA, AO ABRIGO DOS INCENTIVOS INSTITUCIONAIS",Ajuste Direto Regime Geral,Aquisição de bens móveis,"33000000-0, Equipamento médico, medicamentos e produtos para cuidados pessoais","Administração Regional de Saúde de Lisboa e Vale do Tejo, I. P. (503148776)","MEDINVIV, LDA (509815359)","2.480,00 €",18-12-2015,16-11-2015,5 dias,"Portugal, Lisboa, Loures","Artigo 20.º, n.º 1, alínea a) do Código dos Contratos Públicos","","",,,,Não aplicável.,Não aplicável.,FALSE
Prestação de serviços combinados de vigilância e segurança humana e de ligação a central de receção e monitorização de alarmes da região de Lisboa e Vale do Tejo,Ao abrigo de acordo-quadro (art.º 259.º),Aquisição de serviços,"79714000-2, Serviços de vigilância","Administração Regional de Saúde de Lisboa e Vale do Tejo, I. P. (503148776)","Prestibel, SA (501326456)","9.922.412,11 €",18-12-2015,16-07-2015,550 dias,"Portugal, Leiria<BR/>Portugal, Lisboa<BR/>Portugal, Santarém<BR/>Portugal, Setúbal",Artigo 259.º do Código dos Contratos Públicos,"","",,,,613183,Acordo quadro para a prestação de serviços de vigilância e segurança,TRUE
"Aquisição de prestação de serviços de manutenção e reparação dos veículos da sede da ARSLVT, IP",Concurso público,Aquisição de serviços,"50100000-6, Serviços de reparação e manutenção de veículos e equipamento afim, e serviços conexos","Administração Regional de Saúde de Lisboa e Vale do Tejo, I. P. (503148776)","Strobosom, Lda (505445166)","35.800,00 €",18-12-2015,25-11-2015,403 dias,"Portugal, Lisboa, Lisboa","Artigo 20.º, n.º 1, alínea b) do Código dos Contratos Públicos","","",,,,Não aplicável.,Não aplicável.,FALSE
"Aquisição de prestação de serviços de seguros do ramo automóvel para a frota da Administração Regional de Saúde de Lisboa e Vale do Tejo, IP para o período de 12 meses",Ajuste Direto Regime Geral,Aquisição de serviços,"66510000-8, Serviços de seguros","Administração Regional de Saúde de Lisboa e Vale do Tejo, I. P. (503148776)","Origem Segura, Mediação de Seguros, Lda (508239265)","50.200,00 €",18-12-2015,09-12-2015,365 dias,"Portugal, Lisboa, Lisboa","Artigo 20.º, n.º 1, alínea a) do Código dos Contratos Públicos","","",,,,Não aplicável.,Não aplicável.,FALSE
Vinhetas,Ajuste Direto Regime Geral,Aquisição de bens móveis,"22000000-0, Material impresso e afins","Administração Regional de Saúde de Lisboa e Vale do Tejo, I. P. (503148776)",INCM (500792887),"330,00 €",17-12-2015,02-12-2015,5 dias,"Portugal, Lisboa, Loures","Artigo 24.º, n.º 1, alínea e) do Código dos Contratos Públicos","","",,,,Não aplicável.,Não aplicável.,FALSE
Transportes-Mudanças de Bens entre Unidades,Ajuste Direto Regime Geral,Aquisição de serviços,"60000000-8, Serviços de transporte (excl. transporte de resíduos)","Administração Regional de Saúde de Lisboa e Vale do Tejo, I. P. (503148776)","TEODORO E FERREIRA, LDA (501228500)","4.445,40 €",16-12-2015,26-11-2015,20 dias,"Portugal, Lisboa, Loures","Artigo 20.º, n.º 1, alínea a) do Código dos Contratos Públicos","","",,,,Não aplicável.,Não aplicável.,FALSE
"Material Economato p/ USF TEJO, ao abrigo dos Incentivos Institucionais",Ajuste Direto Regime Geral,Aquisição de bens móveis,"30000000-9, Máquinas, equipamento e material de escritório e de informática, excepto mobiliário e pacotes de programas (software)","Administração Regional de Saúde de Lisboa e Vale do Tejo, I. P. (503148776)","A UM, LDA (502129425)","40,20 €",16-12-2015,02-11-2015,5 dias,"Portugal, Lisboa, Loures","Artigo 20.º, n.º 1, alínea a) do Código dos Contratos Públicos","","",,,,Não aplicável.,Não aplicável.,FALSE
Trabalhos realizados em várias Unidades de Saúde,Ajuste Direto Regime Geral,Aquisição de serviços,"50000000-5, Serviços de reparação e manutenção","Administração Regional de Saúde de Lisboa e Vale do Tejo, I. P. (503148776)","BINGOTECNICA, LDA (504114506)","2.485,41 €",16-12-2015,23-06-2015,15 dias,"Portugal, Lisboa, Loures","Artigo 24.º, n.º 1, alínea e) do Código dos Contratos Públicos","","",,,,Não aplicável.,Não aplicável.,FALSE
Trabalhos realizados em várias Unidades de Saúde,Ajuste Direto Regime Geral,Aquisição de serviços,"50000000-5, Serviços de reparação e manutenção","Administração Regional de Saúde de Lisboa e Vale do Tejo, I. P. (503148776)","BINGOTECNICA, LDA (504114506)","2.008,83 €",16-12-2015,26-11-2015,10 dias,"Portugal, Lisboa, Loures","Artigo 24.º, n.º 1, alínea e) do Código dos Contratos Públicos","","",,,,Não aplicável.,Não aplicável.,FALSE
Aspirador,Ajuste Direto Regime Geral,Aquisição de bens móveis,"31000000-6, Maquinaria, aparelhagem, equipamento e consumíveis eléctricos; iluminação","Administração Regional de Saúde de Lisboa e Vale do Tejo, I. P. (503148776)","MONTILETRICA, LDA (501976329)","104,00 €",16-12-2015,30-11-2015,10 dias,"Portugal, Lisboa, Loures","Artigo 20.º, n.º 1, alínea a) do Código dos Contratos Públicos","","",,,,Não aplicável.,Não aplicável.,FALSE
ALUGUER PLATAFORMA,Ajuste Direto Regime Geral,Locação de bens móveis,"34000000-7, Equipamento e produtos auxiliares de transporte","Administração Regional de Saúde de Lisboa e Vale do Tejo, I. P. (503148776)","TEODORO E FERREIRA, LDA (501228500)","4.872,47 €",16-12-2015,26-11-2015,20 dias,"Portugal, Lisboa, Loures","Artigo 20.º, n.º 1, alínea a) do Código dos Contratos Públicos","","",,,,Não aplicável.,Não aplicável.,FALSE
CARIMBOS,Ajuste Direto Regime Geral,Aquisição de bens móveis,"30000000-9, Máquinas, equipamento e material de escritório e de informática, excepto mobiliário e pacotes de programas (software)","Administração Regional de Saúde de Lisboa e Vale do Tejo, I. P. (503148776)","A UM, LDA (502129425)","31,84 €",16-12-2015,03-11-2015,10 dias,"Portugal, Lisboa, Loures","Artigo 20.º, n.º 1, alínea a) do Código dos Contratos Públicos","","",,,,Não aplicável.,Não aplicável.,FALSE
"Fornecimento de energia eletrica em baixa tensão normal, em regime de mercado livre para a ARSLVT, IP",Concurso público,Aquisição de serviços,"65310000-9, Distribuição de electricidade","Administração Regional de Saúde de Lisboa e Vale do Tejo, I. P. (503148776)","EDP Comercial - Comercialização de Energia, SA (503504564)","251.220,38 €",16-12-2015,11-11-2015,139 dias,Portugal,"Artigo 20.º, n.º 1, alínea b) do Código dos Contratos Públicos","","",,,,Não aplicável.,Não aplicável.,FALSE
Cortinas ignífugas com calhas p/USF PRIOR VELHO,Ajuste Direto Regime Geral,Aquisição de bens móveis,"33000000-0, Equipamento médico, medicamentos e produtos para cuidados pessoais","Administração Regional de Saúde de Lisboa e Vale do Tejo, I. P. (503148776)","MEDICAL IMPORT, LDA (506662055)","590,00 €",16-12-2015,03-11-2015,10 dias,"Portugal, Lisboa, Loures","Artigo 20.º, n.º 1, alínea a) do Código dos Contratos Públicos","","",,,,Não aplicável.,Não aplicável.,FALSE
Contrato Rede de Esgotos - Resíduos,Ajuste Direto Regime Geral,Aquisição de serviços,"50000000-5, Serviços de reparação e manutenção","Administração Regional de Saúde de Lisboa e Vale do Tejo, I. P. (503148776)",DESENTOP AMBIENTE (503555380),"1.200,00 €",16-12-2015,19-01-2015,365 dias,"Portugal, Lisboa, Loures","Artigo 20.º, n.º 1, alínea a) do Código dos Contratos Públicos","","",,,,Não aplicável.,Não aplicável.,FALSE
Aquecedores,Ajuste Direto Regime Geral,Aquisição de bens móveis,"31000000-6, Maquinaria, aparelhagem, equipamento e consumíveis eléctricos; iluminação","Administração Regional de Saúde de Lisboa e Vale do Tejo, I. P. (503148776)","MONTILETRICA, LDA (501976329)","95,94 €",16-12-2015,07-12-2015,5 dias,"Portugal, Lisboa, Loures","Artigo 20.º, n.º 1, alínea a) do Código dos Contratos Públicos","","",,,,Não aplicável.,Não aplicável.,FALSE
Pequenas Reparações nos diversos edifícios do ACES Loures Odivelas,Ajuste Direto Regime Geral,Aquisição de serviços,"50000000-5, Serviços de reparação e manutenção","Administração Regional de Saúde de Lisboa e Vale do Tejo, I. P. (503148776)","CSQL, LDA (509649742)","5.000,00 €",16-12-2015,22-06-2015,15 dias,"Portugal, Lisboa, Loures","Artigo 20.º, n.º 1, alínea a) do Código dos Contratos Públicos","","",,,,Não aplicável.,Não aplicável.,FALSE
Aluguer de equipamento telefónico para o ACES Lisboa Ocidental e Oeiras,Ajuste Direto Regime Geral,Aquisição de serviços,"98390000-3, Outros serviços","Administração Regional de Saúde de Lisboa e Vale do Tejo, I. P. (503148776)","FONOTEL - Comunicações, S.A. (501397469)","13.380,12 €",16-12-2015,14-12-2015,20 dias,"Portugal, Lisboa, Oeiras","Artigo 24.º, n.º 1, alínea e) do Código dos Contratos Públicos","","",,,,Não aplicável.,Não aplicável.,FALSE
Obras de reparação de infiltração na cobertura do edifício do C.S. Ajuda,Ajuste Direto Regime Geral,Empreitadas de obras públicas,"45113000-2, Obras no local","Administração Regional de Saúde de Lisboa e Vale do Tejo, I. P. (503148776)","METAL CUBICO, LDA (503852880)","5.050,00 €",16-12-2015,11-12-2015,15 dias,"Portugal, Lisboa, Lisboa","Artigo 19.º, alínea a) do Código dos Contratos Públicos","","",,,,Não aplicável.,Não aplicável.,FALSE
Obras de reparação urgentes de rotura de água no edifício do Centro de Saúde de Stª Iria da Azoia,Ajuste Direto Regime Geral,Empreitadas de obras públicas,"45113000-2, Obras no local","Administração Regional de Saúde de Lisboa e Vale do Tejo, I. P. (503148776)","MTRSANTOS - Inst. Técnicas Unipessoal, Lda. (509424066)","5.950,00 €",16-12-2015,15-12-2015,15 dias,"Portugal, Lisboa, Loures","Artigo 19.º, alínea a) do Código dos Contratos Públicos","","",,,,Não aplicável.,Não aplicável.,FALSE
Aquisição de Polielectrolitico Sol. inj 500ml IV,Ao abrigo de acordo-quadro (art.º 259.º),Aquisição de bens móveis,"33690000-3, Medicamentos vários","Administração Regional de Saúde de Lisboa e Vale do Tejo, I. P. (503148776)",Labesfal - Laboratórios Almiro SA (501169580),"253,76 €",16-12-2015,30-11-2015,10 dias,"Portugal, Lisboa, Lisboa",Artigo 259.º do Código dos Contratos Públicos,"","",,,,1331181,Acordo Quadro para fornecimento de corretivos da volémia e outras soluções estéreis às Instituições e Serviços do Serviço Nacional de Saúde,FALSE
Realocação de equipamentos de ar condicionado,Ajuste Direto Regime Geral,Aquisição de serviços,"50000000-5, Serviços de reparação e manutenção","Administração Regional de Saúde de Lisboa e Vale do Tejo, I. P. (503148776)",ODICLIMA - Sociedade Técnica de Ar Condicionado (502835230),"5.403,00 €",14-12-2015,16-11-2015,10 dias,"Portugal, Lisboa, Loures","Artigo 20.º, n.º 1, alínea a) do Código dos Contratos Públicos","","",,,,Não aplicável.,Não aplicável.,FALSE
Chaves,Ajuste Direto Regime Geral,Aquisição de bens móveis,"44000000-0, Estruturas e materiais de construção; produtos auxiliares de construção (excepto aparelhos eléctricos)","Administração Regional de Saúde de Lisboa e Vale do Tejo, I. P. (503148776)","DIPLOFER - Técnica e Comércio de Ferragens, Lda (509203787)","429,12 €",14-12-2015,28-10-2015,10 dias,"Portugal, Lisboa, Loures","Artigo 24.º, n.º 1, alínea e) do Código dos Contratos Públicos","","",,,,Não aplicável.,Não aplicável.,FALSE
Aquisição de Amicacina 500MG/2ML,Ao abrigo de acordo-quadro (art.º 259.º),Aquisição de bens móveis,"33690000-3, Medicamentos vários","Administração Regional de Saúde de Lisboa e Vale do Tejo, I. P. (503148776)","Labesfal - Laboratórios almiro, s.A. (501169580)","1.200,00 €",14-12-2015,14-12-2015,20 dias,"Portugal, Lisboa, Lisboa",Artigo 259.º do Código dos Contratos Públicos,"","",,,,1326195,ACORDO QUADRO PARA FORNECIMENTO DE MEDICAMENTOS ANTI-INFECIOSOS: EXCETO ANTIVÍRICOS E ANTIFÚNGICOS ÀS INSTITUIÇÕES E SERVIÇOS DO SERVIÇO NACIONAL DE SAÚDE,FALSE
