Objeto do Contrato,Tipo de Procedimento,Tipo(s) de Contrato,CPVs,Entidade(s) Adjudicante(s),Entidade(s) Adjudicatária(s),Preço Contratual,Data de Publicação,Data de Celebração do Contrato,Prazo de Execução,Local de Execução,Fundamentação,Data de Fecho do Contrato,Preço Total Efetivo,Causas das Alterações ao Prazo,Causas das Alterações ao Preço,Estado,N.º registo do Acordo Quadro,Descrição do Acordo Quadro,Procedimento Centralizado
MS/ARSN/GIE/BRG - AP 950/2018 - Fornecimento de serviços e bens acessórios para reparar o sistema de aquecimento central da unidade de saúde de Esposende.,Ajuste Direto Regime Geral,Aquisição de serviços,"50712000-9, Serviços de reparação e manutenção de equipamento mecânico em edifícios","Administração Regional de Saúde do Norte, I. P. (503135593)","Balance Season, Climatização e Ventilação, Lda (510793339)","5.530,48 €",10-08-2018,31-07-2018,10 dias,"Portugal, Braga, Esposende","Artigo 20.º, n.º 1, alínea d) do Código dos Contratos Públicos","","",,"",,Não aplicável.,Não aplicável.,FALSE
AP 40 - 160 ampolas 10 mg/ml emil inj fr 20 ml IV; 4500 unidades lidocaina 100 mg/10 ml sol inj 10 ml IV SC; 900 comprimidos tiocolquicosido 4 mg Comp,Ao abrigo de acordo-quadro (art.º 259.º),Aquisição de bens móveis,"33600000-6, Produtos farmacêuticos","Administração Regional de Saúde do Norte, I. P. (503135593)","Generis Farmacêutica, SA (508107997)","67,50 €",10-08-2018,26-03-2018,270 dias,"Portugal, Porto, Maia<BR/>Portugal, Vila Real, Vila Real",Artigo 259.º do Código dos Contratos Públicos,"","",,"",,2211341,Medicamentos anestésicos e relaxantes musculares,FALSE
AP 40 - 160 ampolas 10 mg/ml emil inj fr 20 ml IV; 4500 unidades lidocaina 100 mg/10 ml sol inj 10 ml IV SC; 900 comprimidos tiocolquicosido 4 mg Comp,Ao abrigo de acordo-quadro (art.º 259.º),Aquisição de bens móveis,"33600000-6, Produtos farmacêuticos","Administração Regional de Saúde do Norte, I. P. (503135593)","B Braun Medical, Lda (501506543)","5.040,00 €",10-08-2018,26-03-2018,270 dias,"Portugal, Porto, Maia<BR/>Portugal, Vila Real, Vila Real",Artigo 259.º do Código dos Contratos Públicos,"","",,"",,2211341,Medicamentos anestésicos e relaxantes musculares,FALSE
AP 40 - 160 ampolas 10 mg/ml emil inj fr 20 ml IV; 4500 unidades lidocaina 100 mg/10 ml sol inj 10 ml IV SC; 900 comprimidos tiocolquicosido 4 mg Comp,Ao abrigo de acordo-quadro (art.º 259.º),Aquisição de bens móveis,"33600000-6, Produtos farmacêuticos","Administração Regional de Saúde do Norte, I. P. (503135593)","Baxter Medico Farmacêutica, Lda (503347345)","102,40 €",10-08-2018,04-04-2018,240 dias,"Portugal, Vila Real, Vila Real<BR/>Portugal, Porto, Maia",Artigo 259.º do Código dos Contratos Públicos,"","",,"",,2211341,Medicamentos anestésicos e relaxantes musculares,FALSE
Aquisição de 16 Carros de Tratamento e 28 Mesas rodadas para uso clínico,Concurso público,Locação de bens móveis,"33100000-1, Equipamento médico","Administração Regional de Saúde do Norte,IP (ARSN) (503135593)","ALFRAPHAR - Eq. e Produtos Farmacêuticos, Lda. (504223895)","17.320,00 €",10-08-2018,23-07-2018,157 dias,"Portugal, Distrito não determinado, Concelho não determinado","Artigo 20.º, n.º 1, alínea a) do Código dos Contratos Públicos",23-10-2018,"17.320,00 €",,"",,Não aplicável.,Não aplicável.,FALSE
"Aquisição de 105 Oxímetros de dedo para adulto, 93 Oxímetros de dedo pediátricos, 36 Marquesas bipartidas elétricas, 6 Cadeiras de rodas simples, 2 Marquesas tripartidas elétricas, 18 Marquesas ginecológicas tripartidas elétricas",Concurso público,Locação de bens móveis,"33100000-1, Equipamento médico","Administração Regional de Saúde do Norte,IP (ARSN) (503135593)","Filsat - Equipamento Médico Cientifico, Lda (506708616)","40.662,00 €",10-08-2018,25-07-2018,155 dias,"Portugal, Distrito não determinado, Concelho não determinado","Artigo 20.º, n.º 1, alínea a) do Código dos Contratos Públicos",31-12-2018,"40.662,00 €",,"",,Não aplicável.,Não aplicável.,FALSE
Aquisição de 29 Balanças digitais de coluna mecânica com craveira,Concurso público,Locação de bens móveis,"33100000-1, Equipamento médico","Administração Regional de Saúde do Norte,IP (ARSN) (503135593)","Bacelar & Irmão, Lda. (500532818)","11.020,00 €",10-08-2018,25-07-2018,155 dias,"Portugal, Distrito não determinado, Concelho não determinado","Artigo 20.º, n.º 1, alínea a) do Código dos Contratos Públicos",10-09-2018,"11.020,00 €",,"",,Não aplicável.,Não aplicável.,FALSE
Aquisição de Dispositivos Médicos,Concurso público,Locação de bens móveis,"33100000-1, Equipamento médico","Administração Regional de Saúde do Norte,IP (ARSN) (503135593)","Space - Equipamentos Médicos, Lda.  (507662407)","9.373,40 €",10-08-2018,23-07-2018,140 dias,"Portugal, Distrito não determinado, Concelho não determinado","Artigo 20.º, n.º 1, alínea a) do Código dos Contratos Públicos",19-09-2018,"9.373,40 €",,"",,Não aplicável.,Não aplicável.,FALSE
AP 143 - 8000 Unidades Sol. polimérica p/reforço estrato córneo 28 ml DM,Ao abrigo de acordo-quadro (art.º 259.º),Aquisição de bens móveis,"33600000-6, Produtos farmacêuticos","Administração Regional de Saúde do Norte, I. P. (503135593)",B Braun Medical (501506543),"37.600,00 €",10-08-2018,26-03-2018,270 dias,"Portugal, Vila Real, Vila Real<BR/>Portugal, Porto, Maia",Artigo 259.º do Código dos Contratos Públicos,"","",,"",,2791664,CP 2017/27 - Acordo quadro para fornecimento de Material de Ostomia e Eliminação - Parte II,FALSE
AP 591 - 100 ampolas sulfato de magnésio 2000 mg/10 ml sol inj 10 ml IM IV; 200 ampolas cloreto de cálcio 100 mg/ml sol inj fr 10 ml IV; Eletrolitos+gelatina sol inj fr 500 ml,Ao abrigo de acordo-quadro (art.º 259.º),Aquisição de bens móveis,"33600000-6, Produtos farmacêuticos","Administração Regional de Saúde do Norte, I. P. (503135593)",Fresenius Portugal (504293753),"894,60 €",10-08-2018,02-08-2018,120 dias,"Portugal, Porto, Maia<BR/>Portugal, Vila Real, Vila Real",Artigo 259.º do Código dos Contratos Públicos,"","",,"",,2528675,CP 2017/3 - Acordo Quadro para fornecimento de corretivos da volémia e outras soluções estéreis,FALSE
AP 591 - 100 ampolas sulfato de magnésio 2000 mg/10 ml sol inj 10 ml IM IV; 200 ampolas cloreto de cálcio 100 mg/ml sol inj fr 10 ml IV; Eletrolitos+gelatina sol inj fr 500 ml,Ao abrigo de acordo-quadro (art.º 259.º),Aquisição de bens móveis,"33600000-6, Produtos farmacêuticos","Administração Regional de Saúde do Norte, I. P. (503135593)","Labesfal, SA (501169580)","508,98 €",10-08-2018,18-06-2018,180 dias,"Portugal, Vila Real, Vila Real<BR/>Portugal, Porto, Maia",Artigo 259.º do Código dos Contratos Públicos,"","",,"",,2528675,CP 2017/3 - Acordo Quadro para fornecimento de corretivos da volémia e outras soluções estéreis,FALSE
AP 35 - 390 Unidades Teste Saliva Multi-Drogas 24 000 testes Reagente det gonadotropina corionica humana na urina,Ao abrigo de acordo-quadro (art.º 259.º),Aquisição de bens móveis,"33600000-6, Produtos farmacêuticos","Administração Regional de Saúde do Norte, I. P. (503135593)","Quilaban, Lda (500399670)","3.000,00 €",10-08-2018,09-04-2018,240 dias,"Portugal, Vila Real, Vila Real<BR/>Portugal, Porto, Maia",Artigo 259.º do Código dos Contratos Públicos,"","",,"",,1555404,CP 2015/73 - Acordo quadro para fornecimento de Reagentes - Testes Rápidos às Instituições e Serviços do Serviço Nacional de Saúde,FALSE
AP 35 - 390 Unidades Teste Saliva Multi-Drogas 24 000 testes Reagente det gonadotropina corionica humana na urina,Ao abrigo de acordo-quadro (art.º 259.º),Aquisição de bens móveis,"33600000-6, Produtos farmacêuticos","Administração Regional de Saúde do Norte, I. P. (503135593)","Normax, Lda (500203130)","3.462,42 €",10-08-2018,11-04-2018,240 dias,"Portugal, Vila Real, Vila Real<BR/>Portugal, Porto, Maia",Artigo 259.º do Código dos Contratos Públicos,"","",,"",,1555404,CP 2015/73 - Acordo quadro para fornecimento de Reagentes - Testes Rápidos às Instituições e Serviços do Serviço Nacional de Saúde,FALSE
AP 654 - 600 Testes rápidos pesquisa de mycrobacterium tuberculosis complex,Ao abrigo de acordo-quadro (art.º 259.º),Aquisição de bens móveis,"33600000-6, Produtos farmacêuticos","Administração Regional de Saúde do Norte, I. P. (503135593)","Quilaban, SA (500399670)","1.980,00 €",10-08-2018,03-07-2018,150 dias,"Portugal, Porto, Maia<BR/>Portugal, Vila Real, Vila Real",Artigo 259.º do Código dos Contratos Públicos,"","",,"",,1555404,CP 2015/73 - Acordo quadro para fornecimento de Reagentes - Testes Rápidos às Instituições e Serviços do Serviço Nacional de Saúde,FALSE
"AP 144 - 10 000 Bisnagas Polihexanida e Betaina, gel, bisnaga 30 ml",Ao abrigo de acordo-quadro (art.º 258.º),Aquisição de bens móveis,"33600000-6, Produtos farmacêuticos","Administração Regional de Saúde do Norte, I. P. (503135593)","B Braun Medical, Lda (501506543)","74.800,00 €",10-08-2018,20-03-2018,270 dias,"Portugal, Vila Real, Vila Real<BR/>Portugal, Porto, Maia",Artigo 258.º do Código dos Contratos Públicos,"","",,"",,1415642,CP 2015/36,FALSE
AP 22 - 6 900 Unidades Teste rápido Burprenorfina (subutex),Ao abrigo de acordo-quadro (art.º 258.º),Aquisição de bens móveis,"33600000-6, Produtos farmacêuticos","Administração Regional de Saúde do Norte, I. P. (503135593)","Quilaban, Quim. Lab. Analitica, Lda (500399670)","1.137,12 €",10-08-2018,21-03-2018,270 dias,"Portugal, Porto, Maia<BR/>Portugal, Vila Real, Vila Real",Artigo 258.º do Código dos Contratos Públicos,"","",,"",,2347058,CP 2016/73 - Acordo quadro para fornecimento de Reagentes - Testes rápidos - Parte II e Outro para as Instituições e  Serviços do Serviço Nacional de Saúde,FALSE
AP 744 - 1 698 ampolas Clonixina 50 mg/ml sol inj 2 ml IM IV,Ao abrigo de acordo-quadro (art.º 258.º),Aquisição de bens móveis,"33600000-6, Produtos farmacêuticos","Administração Regional de Saúde do Norte, I. P. (503135593)","Jaba Recordati, SA (500492867)","393,43 €",10-08-2018,23-05-2018,210 dias,"Portugal, Porto, Maia<BR/>Portugal, Vila Real, Vila Real",Artigo 258.º do Código dos Contratos Públicos,"","",,"",,2545980,CP 2017/61 - Acordo quadro para fornecimento de Medicamentos Diversos   às Instituições e Serviços do Serviço Nacional de Saúde,FALSE
"AP 589 - 29 000 Unidades Reagente determinação VIH 41,2 no sangue, tira",Ao abrigo de acordo-quadro (art.º 258.º),Aquisição de bens móveis,"33600000-6, Produtos farmacêuticos","Administração Regional de Saúde do Norte, I. P. (503135593)","ALERE, LDA (502518863)","132.820,00 €",10-08-2018,04-05-2018,210 dias,"Portugal, Porto, Maia<BR/>Portugal, Vila Real, Vila Real",Artigo 258.º do Código dos Contratos Públicos,"","",,"",,2810777,CP 2017/31 - Acordo Quadro para fornecimento de Material de Prevenção e Deteção de HIV às Instituições e Serviços do Serviço Nacional de Saúde,FALSE
AP 27 - 50 ampolas sulfato de magnésio 2000 mg/10 ml sol inj 10 ml IM IV,Ao abrigo de acordo-quadro (art.º 258.º),Aquisição de bens móveis,"33600000-6, Produtos farmacêuticos","Administração Regional de Saúde do Norte, I. P. (503135593)","Labesfal, Laboratório Almiro, SA (501169580)","65,50 €",10-08-2018,21-03-2018,270 dias,"Portugal, Vila Real, Vila Real<BR/>Portugal, Porto, Maia",Artigo 258.º do Código dos Contratos Públicos,"","",,"",,2528675,CP 2017/3 - Acordo Quadro para fornecimento de corretivos da volémia e outras soluções estéreis,FALSE
AP 23 - 280 000 Unidades Ligadura elástica 4-5mx10 cm; Malha de fixação para tronco nº 7; malha de fixação para mão/dedos nº 2,Ao abrigo de acordo-quadro (art.º 258.º),Aquisição de bens móveis,"33140000-3, Material médico de consumo","Administração Regional de Saúde do Norte, I. P. (503135593)",Bastos Viegas SA - Besleasing e Factoring (500042772),"56.710,00 €",10-08-2018,05-04-2018,240 dias,"Portugal, Porto, Maia<BR/>Portugal, Vila Real, Vila Real",Artigo 258.º do Código dos Contratos Públicos,"","",,"",,2196665,"Ligaduras Medicadas, de Fixação e Proteção",FALSE
2 000 Unidades Articaína 72 mg/1.8 ml+adrenalina 0.018 mg/1.8 ml sol inj,Ao abrigo de acordo-quadro (art.º 258.º),Aquisição de bens móveis,"33600000-6, Produtos farmacêuticos","Administração Regional de Saúde do Norte, I. P. (503135593)","Laboratório INIBSA, SA (500139571)","531,00 €",10-08-2018,08-05-2018,210 dias,"Portugal, Vila Real, Vila Real<BR/>Portugal, Porto, Maia",Artigo 258.º do Código dos Contratos Públicos,"","",,"",,2211341,Medicamentos anestésicos e relaxantes musculares,FALSE
36 000 Unidades Flureto de sódio 2 mg/ml sol fucal Fr 100 ml,Ajuste Direto Regime Geral,Aquisição de bens móveis,"33600000-6, Produtos farmacêuticos","Administração Regional de Saúde do Norte, I. P. (503135593)",Labesfal - Laboratório Aliro SA (501169580),"70.196,40 €",09-08-2018,01-08-2018,150 dias,"Portugal, Vila Real, Vila Real<BR/>Portugal, Porto, Maia","Artigo 24.º, n.º 1, alínea e), subalínea ii) do Código dos Contratos Públicos","","",,"",,Não aplicável.,Não aplicável.,FALSE
"Máscara Laríngea nº. 4  Máscara Insuflador Manual nº. 2  Máscara Insuflador Manual nº. 3 Máscara Insuflador Manual nº. 4 Tubo endotraqueal com cuff nº 3,5 Tubo endotraqueal com cuff nº 4  Tubo endotraqueal com cuff nº 6,5  Tubo endotraqueal com cuff nº 6  Tubo endotraqueal com cuff nº 8  Tubo endotraqueal com cuff nº 7,5  Tubo Guia Adulto  Tubo endotraqueal com cuff nº 2  Pás p/ disfibrilhador adulto  Pás p/ disfibrilhador criança  Insuflador Manual c/reserv.e filtro descartável, Adulto  Insuflador Manual c/saco reserv.e filtro descartá, Pedi  ",Consulta Prévia,Aquisição de bens móveis,"33140000-3, Material médico de consumo","Administração Regional de Saúde do Norte, I. P. (503135593)",Intersurgical - Portugal (503480045),"457,00 €",09-08-2018,04-07-2018,150 dias,"Portugal, Vila Real, Vila Real<BR/>Portugal, Porto, Maia","Artigo 20.º, n.º 1, alínea c) do Código dos Contratos Públicos","","",,"",,Não aplicável.,Não aplicável.,FALSE
"Máscara Laríngea nº. 4  Máscara Insuflador Manual nº. 2  Máscara Insuflador Manual nº. 3 Máscara Insuflador Manual nº. 4 Tubo endotraqueal com cuff nº 3,5 Tubo endotraqueal com cuff nº 4  Tubo endotraqueal com cuff nº 6,5  Tubo endotraqueal com cuff nº 6  Tubo endotraqueal com cuff nº 8  Tubo endotraqueal com cuff nº 7,5  Tubo Guia Adulto  Tubo endotraqueal com cuff nº 2  Pás p/ disfibrilhador adulto  Pás p/ disfibrilhador criança  Insuflador Manual c/reserv.e filtro descartável, Adulto  Insuflador Manual c/saco reserv.e filtro descartá, Pedi  ",Consulta Prévia,Aquisição de bens móveis,"33140000-3, Material médico de consumo","Administração Regional de Saúde do Norte, I. P. (503135593)","HR Hospitalar Unipessoal, Lda (501895558)","1.131,90 €",09-08-2018,04-07-2018,150 dias,"Portugal, Porto, Maia<BR/>Portugal, Vila Real, Vila Real","Artigo 20.º, n.º 1, alínea c) do Código dos Contratos Públicos","","",,"",,Não aplicável.,Não aplicável.,FALSE
"2 Unidades de Permanganato de potássio 0,01N 0,002 M 2 000 ML ácido cloridrico 1 M 250 Gr cloridrato de hidroxilamida 1 000 ml ácido ortofosfórico 85% 10 Gr dicloridrato de N 25 Gr muxerida 25 Gr Negro de Eriocromo",Ajuste Direto Regime Geral,Aquisição de bens móveis,"33696500-0, Reagentes de laboratório","Administração Regional de Saúde do Norte, I. P. (503135593)","VWR Internacional, Material de laboratório (503842770)","290,30 €",09-08-2018,25-07-2018,150 dias,"Portugal, Vila Real, Vila Real<BR/>Portugal, Porto, Maia","Artigo 20.º, n.º 1, alínea d) do Código dos Contratos Públicos","","",,"",,Não aplicável.,Não aplicável.,FALSE
3 840 Unidades de Ponta micropipeta 20-200 coom filtro isento de RNA e DDNA 24 000 Unidades ponta 10-200,Consulta Prévia,Aquisição de bens móveis,"33696500-0, Reagentes de laboratório","Administração Regional de Saúde do Norte, I. P. (503135593)","Normax - fabrica de vidros cientificos, Lda (500203130)","288,00 €",09-08-2018,22-06-2018,180 dias,"Portugal, Porto, Maia<BR/>Portugal, Vila Real, Vila Real","Artigo 20.º, n.º 1, alínea c) do Código dos Contratos Públicos","","",,"",,Não aplicável.,Não aplicável.,FALSE
420 Testes Geno Type MTBDR plus,Ajuste Direto Regime Geral,Aquisição de bens móveis,"33696500-0, Reagentes de laboratório","Administração Regional de Saúde do Norte, I. P. (503135593)",Iberlab&Imunoreage (503406694),"20.839,69 €",09-08-2018,23-07-2018,150 dias,"Portugal, Porto, Maia<BR/>Portugal, Vila Real, Vila Real","Artigo 24.º, n.º 1, alínea e), subalínea ii) do Código dos Contratos Públicos","","",,"",,Não aplicável.,Não aplicável.,FALSE
Equipamentos de terminais biométricos e leitores para o sistema de gestão de controlo de assiduidade refº 00128_2018,Consulta Prévia,Aquisição de bens móveis,"35125200-8, Sistema de controlo do tempo ou registador do tempo de trabalho","Administração Regional de Saúde do Norte, I. P. (503135593)","Innux Technologies, Lda (507301560)","29.002,00 €",08-08-2018,17-05-2018,75 dias,"Portugal, Porto, Porto","Artigo 20.º, n.º 1, alínea c) do Código dos Contratos Públicos",24-05-2018,"29.002,00 €",,"",,Não aplicável.,Não aplicável.,FALSE
AP 1 - Aquisição de Papel Fotocópia - A4 - 80 grs,Ao abrigo de acordo-quadro (art.º 259.º),Aquisição de bens móveis,"30197630-1, Papel para impressão","Administração Regional de Saúde do Norte, I. P. (503135593)","MAX ONE - MATERIAL DE ESCRITÓRIO, LDA (507052609)","167.200,00 €",07-08-2018,03-08-2018,180 dias,"Portugal, Porto, Maia<BR/>Portugal, Vila Real, Vila Real",Artigo 259.º do Código dos Contratos Públicos,31-12-2018,"167.200,00 €",,"",,1351201,Acordo quadro de fornecimento de papel e economato,FALSE
"Aquisição de material de consumo clínico, de penso, de tratamento e de laboratório",Concurso público,Aquisição de bens móveis,"33140000-3, Material médico de consumo","Administração Regional de Saúde do Norte,IP (ARSN) (503135593)","BSN Medical, S.A. (505385058)","21.360,00 €",07-08-2018,01-08-2018,213 dias,"Portugal, Vila Real, Vila Real<BR/>Portugal, Porto, Maia",Artigo 155.º do Código dos Contratos Públicos,22-12-2018,"21.360,00 €",,"",,Não aplicável.,Não aplicável.,FALSE
"Aquisição de material de consumo clínico, de penso, de tratamento e de laboratório",Concurso público,Aquisição de bens móveis,"33140000-3, Material médico de consumo","Administração Regional de Saúde do Norte,IP (ARSN) (503135593)",Anastácio Saldanha Unip. Lda (505804441),"567,00 €",07-08-2018,01-08-2018,213 dias,"Portugal, Porto, Maia<BR/>Portugal, Vila Real, Vila Real",Artigo 155.º do Código dos Contratos Públicos,11-10-2018,"567,00 €",,"",,Não aplicável.,Não aplicável.,FALSE
"Aquisição de material de consumo clínico, de penso, de tratamento e de laboratório",Concurso público,Aquisição de bens móveis,"33140000-3, Material médico de consumo","Administração Regional de Saúde do Norte,IP (ARSN) (503135593)","Overpharma - Prod. Médicos, Lda (505792362)","4.152,00 €",07-08-2018,01-08-2018,213 dias,"Portugal, Porto, Maia<BR/>Portugal, Vila Real, Vila Real",Artigo 155.º do Código dos Contratos Públicos,05-11-2018,"4.152,00 €",,"",,Não aplicável.,Não aplicável.,FALSE
"Aquisição de material de consumo clínico, de penso, de tratamento e de laboratório",Concurso público,Aquisição de bens móveis,"33140000-3, Material médico de consumo","Administração Regional de Saúde do Norte,IP (ARSN) (503135593)",Lineamédica - Dispositivos (505148676),"10.432,80 €",07-08-2018,01-08-2018,213 dias,"Portugal, Vila Real, Vila Real<BR/>Portugal, Porto, Maia",Artigo 155.º do Código dos Contratos Públicos,27-09-2018,"10.432,80 €",,"",,Não aplicável.,Não aplicável.,FALSE
"Aquisição de material de consumo clínico, de penso, de tratamento e de laboratório",Concurso público,Aquisição de bens móveis,"33140000-3, Material médico de consumo","Administração Regional de Saúde do Norte,IP (ARSN) (503135593)",IBERLAB & IMUNOREAGE  (503406694),"882,00 €",07-08-2018,01-08-2018,213 dias,"Portugal, Vila Real, Vila Real<BR/>Portugal, Porto, Maia",Artigo 155.º do Código dos Contratos Públicos,16-11-2018,"882,00 €",,"",,Não aplicável.,Não aplicável.,FALSE
APROV-VR-18001652-AP1291 - Aquisição de  produtos farmacêuticos,Ao abrigo de acordo-quadro (art.º 259.º),Aquisição de bens móveis,"33600000-6, Produtos farmacêuticos","Administração Regional de Saúde do Norte, I. P. (503135593)","Generis Farmacêutica, S.A. (508107997)","198,00 €",07-08-2018,31-07-2018,180 dias,"Portugal, Porto, Maia<BR/>Portugal, Vila Real, Vila Real",Artigo 259.º do Código dos Contratos Públicos,28-08-2018,"198,00 €",,"",,613285,"CONCURSO PÚBLICO PARA A CELEBRAÇÃO DE CONTRATOS PÚBLICOS DE APROVISIONAMENTO PARA A ÁREA DA SAÚDE, COM VISTA AO FORNECIMENTO DE MEDICAMENTOS ANALGÉSICOS, ANTIPIRÉTICOS E ANTIDEPRESSORES, ÀS INSTITUIÇÕES E SERVIÇOS DO SERVIÇO NACIONAL DE SAÚDE",FALSE
APROV-VR-18001652-AP1291 - Aquisição de  produtos farmacêuticos,Ao abrigo de acordo-quadro (art.º 259.º),Aquisição de bens móveis,"33600000-6, Produtos farmacêuticos","Administração Regional de Saúde do Norte, I. P. (503135593)","TECNIMEDE, S.A. (500626413)","62,95 €",07-08-2018,31-07-2018,180 dias,"Portugal, Porto, Maia<BR/>Portugal, Vila Real, Vila Real",Artigo 259.º do Código dos Contratos Públicos,29-08-2018,"62,95 €",,"",,613285,"CONCURSO PÚBLICO PARA A CELEBRAÇÃO DE CONTRATOS PÚBLICOS DE APROVISIONAMENTO PARA A ÁREA DA SAÚDE, COM VISTA AO FORNECIMENTO DE MEDICAMENTOS ANALGÉSICOS, ANTIPIRÉTICOS E ANTIDEPRESSORES, ÀS INSTITUIÇÕES E SERVIÇOS DO SERVIÇO NACIONAL DE SAÚDE",FALSE
APROV-VR-18001652-AP1291 - Aquisição de  produtos farmacêuticos,Ao abrigo de acordo-quadro (art.º 259.º),Aquisição de bens móveis,"33600000-6, Produtos farmacêuticos","Administração Regional de Saúde do Norte, I. P. (503135593)","Mylan, Lda (502248793)","50,19 €",07-08-2018,31-07-2018,180 dias,"Portugal, Vila Real, Vila Real<BR/>Portugal, Porto, Maia",Artigo 259.º do Código dos Contratos Públicos,06-08-2018,"50,19 €",,"",,613285,"CONCURSO PÚBLICO PARA A CELEBRAÇÃO DE CONTRATOS PÚBLICOS DE APROVISIONAMENTO PARA A ÁREA DA SAÚDE, COM VISTA AO FORNECIMENTO DE MEDICAMENTOS ANALGÉSICOS, ANTIPIRÉTICOS E ANTIDEPRESSORES, ÀS INSTITUIÇÕES E SERVIÇOS DO SERVIÇO NACIONAL DE SAÚDE",FALSE
APROV-VR-18001652-AP1291 - Aquisição de  produtos farmacêuticos,Ao abrigo de acordo-quadro (art.º 259.º),Aquisição de bens móveis,"33600000-6, Produtos farmacêuticos","Administração Regional de Saúde do Norte, I. P. (503135593)","Mundipharma - farmacêutica, Lda (506760014)","14,72 €",07-08-2018,31-07-2018,180 dias,"Portugal, Vila Real, Vila Real<BR/>Portugal, Porto, Maia",Artigo 259.º do Código dos Contratos Públicos,31-12-2018,"14,72 €",,"",,613285,"CONCURSO PÚBLICO PARA A CELEBRAÇÃO DE CONTRATOS PÚBLICOS DE APROVISIONAMENTO PARA A ÁREA DA SAÚDE, COM VISTA AO FORNECIMENTO DE MEDICAMENTOS ANALGÉSICOS, ANTIPIRÉTICOS E ANTIDEPRESSORES, ÀS INSTITUIÇÕES E SERVIÇOS DO SERVIÇO NACIONAL DE SAÚDE",FALSE
Renovação da prestação de serviços de consultadoria jurídica no âmbito da parceria público privada do Hospital de Braga ano 2018. Processo nº18000229 - CA nº7892018,Ajuste Direto Regime Geral,Aquisição de serviços,"79100000-5, Serviços jurídicos","Administração Regional de Saúde do Norte, I. P. (503135593)","BRITO, ARTUR SILVA E ASSOCIADOS SP, RL (509100007)","31.580,00 €",06-08-2018,25-05-2018,366 dias,"Portugal, Porto, Porto<BR/>Portugal, Braga, Braga","Artigo 27.º, n.º 1, alínea a) do Código dos Contratos Públicos",28-12-2018,"21.792,81 €",,Numero de horas realizadas inferiores ao numero de horas contratadas,,Não aplicável.,Não aplicável.,FALSE
APROV-VR-18001652-AP1291 - Aquisição de  produtos farmacêuticos,Ao abrigo de acordo-quadro (art.º 259.º),Aquisição de bens móveis,"33600000-6, Produtos farmacêuticos","Administração Regional de Saúde do Norte, I. P. (503135593)",Pharmakern Portugal (507002571),"3,83 €",06-08-2018,31-07-2018,180 dias,"Portugal, Porto, Maia<BR/>Portugal, Vila Real, Vila Real",Artigo 259.º do Código dos Contratos Públicos,02-08-2018,"3,83 €",,"",,613285,"CONCURSO PÚBLICO PARA A CELEBRAÇÃO DE CONTRATOS PÚBLICOS DE APROVISIONAMENTO PARA A ÁREA DA SAÚDE, COM VISTA AO FORNECIMENTO DE MEDICAMENTOS ANALGÉSICOS, ANTIPIRÉTICOS E ANTIDEPRESSORES, ÀS INSTITUIÇÕES E SERVIÇOS DO SERVIÇO NACIONAL DE SAÚDE",FALSE
"Renovação da prestação de serviços gerais para as áreas de arquivo, logística e compras ano de 2018. Processo nº 18000223 - CA nº5912018.",Ajuste Direto Regime Geral,Aquisição de serviços,"71356300-1, Serviços de apoio técnico","Administração Regional de Saúde do Norte, I. P. (503135593)","Interlimpe - Facility Services, SA (502611057)","262.006,96 €",06-08-2018,19-04-2018,366 dias,"Portugal, Porto, Maia<BR/>Portugal, Vila Real, Vila Real<BR/>Portugal, Porto, Porto","Artigo 27.º, n.º 1, alínea a) do Código dos Contratos Públicos",31-12-2018,"261.190,52 €",,Valor total do contrato inferior devido à faltas dos profissionais,,Não aplicável.,Não aplicável.,FALSE
"AP55 - Aquisição de 7.300.000 Compressa em T.N.T. esterilizada/5unidades  10x10cm; 5.200.000 Compressa em T.N.T. esterilizada  20x15cm; 3.400.000 Compressa em T.N.T. esterilizada/5unidades  5x5cm e 6.600.000 Compressa em T.N.T. esterilizada/5unidades  7,5x7,5cm",Ao abrigo de acordo-quadro (art.º 259.º),Aquisição de bens móveis,"33140000-3, Material médico de consumo","Administração Regional de Saúde do Norte, I. P. (503135593)","ALBINO DIAS ANDRADE,LDA (500013810)","39.200,00 €",02-08-2018,05-04-2018,266 dias,"Portugal, Distrito não determinado, Concelho não determinado<BR/>Portugal, Porto, Maia<BR/>Portugal, Vila Real, Vila Real",Artigo 259.º do Código dos Contratos Públicos,"","",,"",,2190354,CP 2016/21 - Acordo quadro para fornecimento de Gazes Medicadas e Ligaduras de Gaze às Instituições e Serviços do Serviço Nacional de Saúde,FALSE
"AP55 - Aquisição de 7.300.000 Compressa em T.N.T. esterilizada/5unidades  10x10cm; 5.200.000 Compressa em T.N.T. esterilizada  20x15cm; 3.400.000 Compressa em T.N.T. esterilizada/5unidades  5x5cm e 6.600.000 Compressa em T.N.T. esterilizada/5unidades  7,5x7,5cm",Ao abrigo de acordo-quadro (art.º 259.º),Aquisição de bens móveis,"33140000-3, Material médico de consumo","Administração Regional de Saúde do Norte, I. P. (503135593)","Silva, Gomes & Moura Unipessoal, Lda. (513835717)","184.440,00 €",02-08-2018,05-04-2018,266 dias,"Portugal, Distrito não determinado, Concelho não determinado<BR/>Portugal, Porto, Maia<BR/>Portugal, Vila Real, Vila Real",Artigo 259.º do Código dos Contratos Públicos,"","",,"",,2190354,CP 2016/21 - Acordo quadro para fornecimento de Gazes Medicadas e Ligaduras de Gaze às Instituições e Serviços do Serviço Nacional de Saúde,FALSE
"AD-2018-14 - AP793 - Aquisição da Vacina T222 - Tuberculina PPD RT 23 SSI 2 UT Sol inj 1,5ml ID",Ajuste Direto Regime Geral,Aquisição de bens móveis,"33651600-4, Vacinas","Administração Regional de Saúde do Norte, I. P. (503135593)","J.M.Farmacêutica, S.A. (503550558)","7.800,00 €",02-08-2018,27-04-2018,243 dias,"Portugal, Porto, Maia<BR/>Portugal, Vila Real, Vila Real<BR/>Portugal, Distrito não determinado, Concelho não determinado","Artigo 24.º, n.º 1, alínea e), subalínea iii) do Código dos Contratos Públicos","","",,"",,Não aplicável.,Não aplicável.,FALSE
"P259/2018-25 - AP 412 - Aquisição da Vacina V3 - Vac haemophilus tipo b 10 µg/0,5 ml Pó Sol inj IM",Ao abrigo de acordo-quadro (art.º 259.º),Aquisição de bens móveis,"33651600-4, Vacinas","Administração Regional de Saúde do Norte, I. P. (503135593)",GlaxoSmithKline Lda (500139962),"3.084,00 €",01-08-2018,12-03-2018,290 dias,"Portugal, Vila Real, Vila Real<BR/>Portugal, Distrito não determinado, Concelho não determinado<BR/>Portugal, Porto, Maia",Artigo 259.º do Código dos Contratos Públicos,"","",,"",,2327827,CP 2016/13-A - Acordo Quadro para fornecimento de Vacinas e Tuberculinas - Parte II,FALSE
