Objeto do Contrato,Tipo de Procedimento,Tipo(s) de Contrato,CPVs,Entidade(s) Adjudicante(s),Entidade(s) Adjudicatária(s),Preço Contratual,Data de Publicação,Data de Celebração do Contrato,Prazo de Execução,Local de Execução,Fundamentação,Data de Fecho do Contrato,Preço Total Efetivo,Causas das Alterações ao Prazo,Causas das Alterações ao Preço,Estado,N.º registo do Acordo Quadro,Descrição do Acordo Quadro,Procedimento Centralizado
Aquisição de 2 malas de avaliação infantil para a USF D.Diniz,Ajuste Direto Regime Geral,Aquisição de bens móveis,"33000000-0, Equipamento médico, medicamentos e produtos para cuidados pessoais","Administração Regional de Saúde do Centro, I.P. (503122165)","EDIPSICO-Edições e Investigação em Psicologia, Lda (503466085)","1.319,50 €",27-05-2011,27-05-2011,5 dias,"Portugal, Leiria, Leiria","Artigo 20.º, n.º 1, alínea a) do Código dos Contratos Públicos",,,,,,Não aplicável.,Não aplicável.,
Aquisição de 1 Disco Externo de 500Gb de 3.5 para a USF D.Diniz,Ajuste Direto Regime Geral,Aquisição de bens móveis,"30230000-0, Equipamento informático","Administração Regional de Saúde do Centro, I.P. (503122165)","Trifida - Comércio de Material Informático, Lda (504551663)","45,00 €",27-05-2011,27-05-2011,3 dias,"Portugal, Leiria, Leiria","Artigo 20.º, n.º 1, alínea a) do Código dos Contratos Públicos",,,,,,Não aplicável.,Não aplicável.,
Manutenção dos Sistemas Vita His Care - Ano 2011,Ajuste Direto Regime Geral,Outros Tipos (Manutenção dos Sitemas Vita His Care - Ano 2011),"50324100-3, Serviços de manutenção de sistemas","Administração Regional de Saúde do Centro, I.P. (503122165)","PT Prime, SA. (502840757)","36.441,43 €",25-05-2011,22-02-2011,365 dias,"Portugal, Lisboa, Lisboa","Artigo 20.º, n.º 1, alínea a) do Código dos Contratos Públicos",,,,,,Não aplicável.,Não aplicável.,
