freguesia,acronym,validVotesPercentage,votes,dicofre
Telões,PPD/PSD,44.41,147,171311
Telões,PS,32.63,108,171311
Telões,B.E.,5.74,19,171311
Telões,CDS-PP,3.93,13,171311
Telões,PAN,3.63,12,171311
Telões,PPM.PPV/CDC,2.42,8,171311
Telões,PCP-PEV,2.11,7,171311
Telões,A,1.21,4,171311
Telões,L,1.21,4,171311
Telões,PNR,1.21,4,171311
Telões,IL,0.6,2,171311
Telões,NC,0.3,1,171311
Telões,PCTP/MRPP,0.3,1,171311
Telões,PURP,0.3,1,171311
Telões,MAS,0,0,171311
Telões,PDR,0,0,171311
Telões,PTP,0,0,171311
