freguesia,acronym,validVotesPercentage,votes,dicofre
Vilela,PPD/PSD,53.37,696,131024
Vilela,PS,23.47,306,131024
Vilela,CDS-PP,9.36,122,131024
Vilela,B.E.,3.91,51,131024
Vilela,PAN,3.45,45,131024
Vilela,PCP-PEV,1.07,14,131024
Vilela,A,0.84,11,131024
Vilela,L,0.77,10,131024
Vilela,PCTP/MRPP,0.69,9,131024
Vilela,PDR,0.61,8,131024
Vilela,IL,0.54,7,131024
Vilela,PTP,0.54,7,131024
Vilela,PPM.PPV/CDC,0.46,6,131024
Vilela,MAS,0.38,5,131024
Vilela,NC,0.23,3,131024
Vilela,PNR,0.15,2,131024
Vilela,PURP,0.15,2,131024
