freguesia,acronym,validVotesPercentage,votes,dicofre
Cidade da Maia,PS,31.23,4586,130619
Cidade da Maia,PPD/PSD,25.44,3735,130619
Cidade da Maia,B.E.,13.49,1981,130619
Cidade da Maia,PAN,8.07,1185,130619
Cidade da Maia,CDS-PP,6.01,883,130619
Cidade da Maia,PCP-PEV,4.41,648,130619
Cidade da Maia,IL,2.42,356,130619
Cidade da Maia,L,2.12,312,130619
Cidade da Maia,NC,1.99,292,130619
Cidade da Maia,A,1.7,250,130619
Cidade da Maia,PPM.PPV/CDC,0.94,138,130619
Cidade da Maia,PCTP/MRPP,0.53,78,130619
Cidade da Maia,PDR,0.52,76,130619
Cidade da Maia,PNR,0.48,70,130619
Cidade da Maia,PURP,0.28,41,130619
Cidade da Maia,PTP,0.22,33,130619
Cidade da Maia,MAS,0.13,19,130619
