Objeto do Contrato,Tipo de Procedimento,Tipo(s) de Contrato,CPVs,Entidade(s) Adjudicante(s),Entidade(s) Adjudicatária(s),Preço Contratual,Data de Publicação,Data de Celebração do Contrato,Prazo de Execução,Local de Execução,Fundamentação,Data de Fecho do Contrato,Preço Total Efetivo,Causas das Alterações ao Prazo,Causas das Alterações ao Preço,Estado,N.º registo do Acordo Quadro,Descrição do Acordo Quadro,Procedimento Centralizado
Aquisição de Ventilador Neonatal,Ajuste Direto Regime Geral,Aquisição de bens móveis,"33170000-2, Anestesia e reanimação","Unidade Local de Saúde do Alto Minho, EPE (ULSAM) (508786193)","Pulmocor - Equipamento Médico, S. A. (501402578)","20.815,00 €",10-08-2015,07-08-2015,30 dias,"Portugal, Viana do Castelo, Viana do Castelo","Artigo 20.º, n.º 1, alínea a) do Código dos Contratos Públicos",,,,,,Não aplicável.,Não aplicável.,FALSE
Manutenção Servidores HP,Ajuste Direto Regime Geral,Aquisição de serviços,"50800000-3, Serviços de reparação e manutenção diversos","Unidade Local de Saúde do Alto Minho, EPE (ULSAM) (508786193)","Hewlett-Packard Portugal, Lda. (502407697)","24.500,00 €",06-08-2015,10-07-2015,365 dias,"Portugal, Viana do Castelo","Artigo 20.º, n.º 1, alínea a) do Código dos Contratos Públicos",,,,,,Não aplicável.,Não aplicável.,FALSE
Manutenção Preventiva e Assistência Técnica às Câmaras Fluxo Laminar e Salas Limpas,Ajuste Direto Regime Geral,Aquisição de serviços,"50800000-3, Serviços de reparação e manutenção diversos","Unidade Local de Saúde do Alto Minho, EPE (ULSAM) (508786193)",TRADELABOR - Importação e Exportação Lda. (503069442),"2.900,00 €",06-08-2015,29-06-2015,365 dias,"Portugal, Viana do Castelo","Artigo 20.º, n.º 1, alínea a) do Código dos Contratos Públicos",,,,,,Não aplicável.,Não aplicável.,FALSE
Manutenção Preventiva e Assistência Técnica aos Grupos Moto-Geradores de Emergência da ULSAM,Ajuste Direto Regime Geral,Aquisição de serviços,"50700000-2, Serviços de reparação e manutenção de equipamento em edifícios","Unidade Local de Saúde do Alto Minho, EPE (ULSAM) (508786193)","SGSV - Silvério Guilherme Santos Valente, Lda. (503423270)","6.955,50 €",06-08-2015,29-06-2015,365 dias,"Portugal, Viana do Castelo","Artigo 20.º, n.º 1, alínea a) do Código dos Contratos Públicos",,,,,,Não aplicável.,Não aplicável.,FALSE
Aquisição de Software de Imobilizado,Ajuste Direto Regime Geral,Aquisição de bens móveis,"48100000-9, Pacote de software para sectores específicos","Unidade Local de Saúde do Alto Minho, E. P. E. (508786193)","ST+I - Serviços Técnicos de Informática, Unipessoal, Lda. (502246995)","15.000,00 €",05-08-2015,23-07-2015,30 dias,"Portugal, Viana do Castelo","Artigo 20.º, n.º 1, alínea a) do Código dos Contratos Públicos",,,,,,Não aplicável.,Não aplicável.,FALSE
Aquisição de Desfibrilhadores,Ajuste Direto Regime Geral,Aquisição de bens móveis,"33182100-0, Desfibrilhador","Unidade Local de Saúde do Alto Minho, E. P. E. (508786193)","Clinifar, S. A. (503281115)","17.990,00 €",05-08-2015,23-07-2015,30 dias,"Portugal, Viana do Castelo","Artigo 20.º, n.º 1, alínea a) do Código dos Contratos Públicos",,,,,,Não aplicável.,Não aplicável.,FALSE
Aquisição Grades Universais para Camas,Ajuste Direto Regime Geral,Aquisição de bens móveis,"33192000-2, Mobiliário para fins médicos","Unidade Local de Saúde do Alto Minho, EPE (ULSAM) (508786193)","Mundinter, Intercâmbio Mundial de Comercio, S. A. (500199906)","487,02 €",05-08-2015,17-07-2015,30 dias,"Portugal, Viana do Castelo, Valença","Artigo 20.º, n.º 1, alínea a) do Código dos Contratos Públicos",,,,,,Não aplicável.,Não aplicável.,FALSE
Aquisição Papeleiras Exteriores com Cinzeiro,Ajuste Direto Regime Geral,Aquisição de bens móveis,"39100000-3, Mobiliário","Unidade Local de Saúde do Alto Minho, EPE (ULSAM) (508786193)","Jeset Comércio e Distribuição, Lda. (513079777)","208,00 €",05-08-2015,17-07-2015,30 dias,"Portugal, Viana do Castelo, Ponte de Lima","Artigo 20.º, n.º 1, alínea a) do Código dos Contratos Públicos",,,,,,Não aplicável.,Não aplicável.,FALSE
Aquisição de Doppler Fetal e Vascular,Ajuste Direto Regime Geral,Aquisição de bens móveis,"33180000-5, Apoio funcional","Unidade Local de Saúde do Alto Minho, EPE (ULSAM) (508786193)","Mundinter, Intercâmbio Mundial de Comércio, S. A. (500199906)","420,00 €",05-08-2015,17-07-2015,30 dias,"Portugal, Viana do Castelo, Viana do Castelo","Artigo 20.º, n.º 1, alínea a) do Código dos Contratos Públicos",,,,,,Não aplicável.,Não aplicável.,FALSE
Aquisição de Carro de Emergência,Ajuste Direto Regime Geral,Aquisição de bens móveis,"33180000-5, Apoio funcional","Unidade Local de Saúde do Alto Minho, EPE (ULSAM) (508786193)","Porto Saúde Equip. Clínicos Laboratoriais e Hospitalares, Lda. (502927178)","2.500,00 €",05-08-2015,17-07-2015,30 dias,"Portugal, Viana do Castelo, Viana do Castelo","Artigo 20.º, n.º 1, alínea a) do Código dos Contratos Públicos",,,,,,Não aplicável.,Não aplicável.,FALSE
Aquisição Candeeiros Teto LED,Ajuste Direto Regime Geral,Aquisição de bens móveis,"31524120-2, Candeeiros de tecto","Unidade Local de Saúde do Alto Minho, EPE (ULSAM) (508786193)","Bacelar & Irmão, Lda. (500532818)","3.930,00 €",05-08-2015,17-07-2015,30 dias,"Portugal, Viana do Castelo, Viana do Castelo","Artigo 20.º, n.º 1, alínea a) do Código dos Contratos Públicos",,,,,,Não aplicável.,Não aplicável.,FALSE
Aquisição de Oxímetros,Ajuste Direto Regime Geral,Aquisição de bens móveis,"33180000-5, Apoio funcional","Unidade Local de Saúde do Alto Minho, EPE (ULSAM) (508786193)","Bacelar & Irmão, Lda. (500532818)","616,00 €",05-08-2015,17-07-2015,30 dias,"Portugal, Viana do Castelo","Artigo 20.º, n.º 1, alínea a) do Código dos Contratos Públicos",,,,,,Não aplicável.,Não aplicável.,FALSE
Aquisição de Oxímetros,Ajuste Direto Regime Geral,Aquisição de bens móveis,"33180000-5, Apoio funcional","Unidade Local de Saúde do Alto Minho, EPE (ULSAM) (508786193)","Clinifar, S. A. (503281115)","1.050,00 €",05-08-2015,17-07-2015,30 dias,"Portugal, Viana do Castelo, Viana do Castelo","Artigo 20.º, n.º 1, alínea a) do Código dos Contratos Públicos",,,,,,Não aplicável.,Não aplicável.,FALSE
