Objeto do Contrato,Tipo de Procedimento,Tipo(s) de Contrato,CPVs,Entidade(s) Adjudicante(s),Entidade(s) Adjudicatária(s),Preço Contratual,Data de Publicação,Data de Celebração do Contrato,Prazo de Execução,Local de Execução,Fundamentação,Data de Fecho do Contrato,Preço Total Efetivo,Causas das Alterações ao Prazo,Causas das Alterações ao Preço,Estado,N.º registo do Acordo Quadro,Descrição do Acordo Quadro,Procedimento Centralizado
20170556 - Aquisição de reagentes para Projeto PTDC/BIM-MEC/4762/2014,Ajuste Direto Regime Geral,Aquisição de bens móveis,"33696500-0, Reagentes de laboratório","Instituto Nacional de Saúde Doutor Ricardo Jorge, I. P. (501427511)","ALFAGENE - NOVAS TECNOLOGIAS DAS C DA VIDA, LDA(503387398) (503387398)","3.429,44 €",03-08-2017,03-08-2017,140 dias,"Portugal, Lisboa, Lisboa","Artigo 26.º, n.º 1, alínea a) do Código dos Contratos Públicos",24-11-2017,"1.818,94 €",,Não foram adquiridas as quantidades inicialmente previstas,,Não aplicável.,Não aplicável.,FALSE
20170558 - Aquisição de Reagente para fins de investigação  Projeto Emerge,Ajuste Direto Regime Geral,Aquisição de bens móveis,"33600000-6, Produtos farmacêuticos","Instituto Nacional de Saúde Doutor Ricardo Jorge, I. P. (501427511)",Frilabo II Lda (507958861),"365,93 €",02-08-2017,27-07-2017,139 dias,"Portugal, Lisboa, Lisboa","Artigo 26.º, n.º 1, alínea a) do Código dos Contratos Públicos",09-08-2017,"365,93 €",,"",,Não aplicável.,Não aplicável.,FALSE
20170415 - Aquisição de reagentes para estudo de mRNA,Ajuste Direto Regime Geral,Aquisição de bens móveis,"33696500-0, Reagentes de laboratório","Instituto Nacional de Saúde Doutor Ricardo Jorge, I. P. (501427511)",Exiqon A/S (18984431),"27.496,40 €",01-08-2017,20-06-2017,180 dias,"Portugal, Lisboa, Lisboa","Artigo 24.º, n.º 1, alínea e) do Código dos Contratos Públicos",28-12-2017,"",,Por questões de natureza técnica o contrato não tece execução.,,Não aplicável.,Não aplicável.,FALSE
