Objeto do Contrato,Tipo de Procedimento,Tipo(s) de Contrato,CPVs,Entidade(s) Adjudicante(s),Entidade(s) Adjudicatária(s),Preço Contratual,Data de Publicação,Data de Celebração do Contrato,Prazo de Execução,Local de Execução,Fundamentação,Data de Fecho do Contrato,Preço Total Efetivo,Causas das Alterações ao Prazo,Causas das Alterações ao Preço,Estado,N.º registo do Acordo Quadro,Descrição do Acordo Quadro,Procedimento Centralizado
Aquisição de mobiliário de escritório,Ajuste Direto Regime Geral,Aquisição de bens móveis,"39000000-2, Mobiliário (incl. de escritório), acessórios, aparelhos domésticos (excl. iluminação) e produtos de limpeza","Administração Central do Sistema de Saúde, I. P. (508188423)","FAMO COMERCIAL - Mobiliário de Escritório, Lda. (500109036)","12.810,80 €",25-08-2014,05-05-2014,20 dias,"Portugal, Lisboa, Lisboa","Artigo 20.º, n.º 1, alínea a) do Código dos Contratos Públicos",25-05-2014,"12.810,80 €",,"",,Não aplicável.,Não aplicável.,FALSE
"Aquisição de serviços para informatização dos processos da ACSS, I.P.",Ajuste Direto Regime Geral,Aquisição de serviços,"72000000-5, Serviços de TI: consultoria, desenvolvimento de software, Internet e apoio","Administração Central do Sistema de Saúde, I. P. (508188423)","MasterLink - Sistemas de Informação, Lda. (504143603)","24.950,00 €",25-08-2014,07-07-2014,360 dias,"Portugal, Lisboa, Lisboa","Artigo 20.º, n.º 1, alínea a) do Código dos Contratos Públicos",31-12-2014,"24.950,00 €",,"",,Não aplicável.,Não aplicável.,FALSE
Aquisição de serviços para validação da qualidade de dados do sistema de informação para contratualização e acompanhamento (SICA) e do Sistema da Consulta a Tempo e Horas (CTH),Ajuste Direto Regime Geral,Aquisição de serviços,"72000000-5, Serviços de TI: consultoria, desenvolvimento de software, Internet e apoio","Administração Central do Sistema de Saúde, I. P. (508188423)","One Plus One - Consulting, Lda. (508314216)","45.000,00 €",25-08-2014,25-07-2014,360 dias,"Portugal, Lisboa, Lisboa","Artigo 20.º, n.º 1, alínea a) do Código dos Contratos Públicos",31-03-2016,"45.000,00 €",,"",,Não aplicável.,Não aplicável.,FALSE
Aquisição de serviços de consultoria externa para monitorização da implementação das medidas no âmbito do Plano da Reforma Hospitalar,Ajuste Direto Regime Geral,Aquisição de serviços,"73000000-2, Serviços de investigação e desenvolvimento e serviços de consultoria conexos","Administração Central do Sistema de Saúde, I. P. (508188423)",Universidade do Porto (501413197),"27.000,00 €",25-08-2014,02-06-2014,240 dias,"Portugal, Lisboa, Lisboa","Artigo 20.º, n.º 1, alínea a) do Código dos Contratos Públicos",31-12-2014,"20.250,00 €",,Acertos finais,,Não aplicável.,Não aplicável.,FALSE
Aquisição de serviços para a realização do trabalho de consolidação de contas do SNS de 2013,Ajuste Direto Regime Geral,Aquisição de serviços,"75000000-6, Serviços relacionados com a administração pública, a defesa e a segurança social","Administração Central do Sistema de Saúde, I. P. (508188423)",ISCTE- Instituto Universitário de Lisboa (501510184),"32.000,00 €",22-08-2014,23-05-2014,30 dias,"Portugal, Lisboa, Lisboa","Artigo 20.º, n.º 1, alínea a) do Código dos Contratos Públicos",23-08-2014,"32.000,00 €",,"",,Não aplicável.,Não aplicável.,FALSE
"Aquisição de serviços de consultadoria para cálculo de limiares de exceção, custos e pesos relativos portugueses por GDH",Ajuste Direto Regime Geral,Aquisição de serviços,"72000000-5, Serviços de TI: consultoria, desenvolvimento de software, Internet e apoio","Administração Central do Sistema de Saúde, I. P. (508188423)","3M Portugal, Lda (500193940)","56.500,00 €",22-08-2014,03-06-2014,180 dias,"Portugal, Lisboa, Lisboa","Artigo 24.º, n.º 1, alínea e) do Código dos Contratos Públicos",22-12-2014,"56.500,00 €",,"",,Não aplicável.,Não aplicável.,FALSE
Aquisição de serviços de consultoria para o desenvolvimento de um sistema de informação para exploração da informação dos recursos humanos,Ajuste Direto Regime Geral,Aquisição de serviços,"72000000-5, Serviços de TI: consultoria, desenvolvimento de software, Internet e apoio","Administração Central do Sistema de Saúde, I. P. (508188423)","SPMS - Serviços Partilhados do Ministério da saúde, EPE (509540716)","75.000,00 €",22-08-2014,16-07-2013,180 dias,"Portugal, Lisboa, Lisboa","Artigo 20.º, n.º 1, alínea a) do Código dos Contratos Públicos","","",,"",,Não aplicável.,Não aplicável.,FALSE
