Objeto do Contrato,Tipo de Procedimento,Tipo(s) de Contrato,CPVs,Entidade(s) Adjudicante(s),Entidade(s) Adjudicatária(s),Preço Contratual,Data de Publicação,Data de Celebração do Contrato,Prazo de Execução,Local de Execução,Fundamentação,Data de Fecho do Contrato,Preço Total Efetivo,Causas das Alterações ao Prazo,Causas das Alterações ao Preço,Estado,N.º registo do Acordo Quadro,Descrição do Acordo Quadro,Procedimento Centralizado
Reagentes para Avaliação de Qualidade Externa para o LRSP,Ajuste Direto Regime Geral,Aquisição de bens móveis,"33696500-0, Reagentes de laboratório","Administração Regional de Saúde do Algarve, I.P. (503148709)",Biognóstica Distribuição Produtos Equip. Técnicos Lda (504441256),"6.903,00 €",08-03-2012,07-03-2012,5 dias,"Portugal, Faro, Faro","Artigo 24.º, n.º 1, alínea e) do Código dos Contratos Públicos",22-06-2012,"6.903,00 €",,"",,Não aplicável.,Não aplicável.,
Aquisição Reagentes para Pesquisa de BK - Tuberculose,Ajuste Direto Regime Geral,Aquisição de bens móveis,"33696500-0, Reagentes de laboratório","Administração Regional de Saúde do Algarve, I.P. (503148709)","Quilaban-Quimíca Laboratorial Analitica, Lda. (500399670)","30.963,90 €",08-03-2012,08-03-2012,365 dias,"Portugal, Faro, Faro","Artigo 24.º, n.º 1, alínea e) do Código dos Contratos Públicos",26-12-2012,"29.579,15 €",,Quantidades fornecidas.,,Não aplicável.,Não aplicável.,
Aquisição de Reagentes para Laboratório,Ajuste Direto Regime Geral,Aquisição de bens móveis,"33696500-0, Reagentes de laboratório","Administração Regional de Saúde do Algarve, I.P. (503148709)",BioMerieux Portugal Aparelhos e Reagentes de Laboratório LDA (501524177),"3.821,50 €",06-03-2012,05-03-2012,3 dias,"Portugal, Faro, Faro","Artigo 24.º, n.º 1, alínea e) do Código dos Contratos Públicos",19-03-2012,"3.559,30 €",,Quantidades adquiridas,,Não aplicável.,Não aplicável.,
Aquisição de Consumíveis para LRSP,Ajuste Direto Regime Geral,Aquisição de bens móveis,"33696500-0, Reagentes de laboratório","Administração Regional de Saúde do Algarve, I.P. (503148709)",Interface Equipamento e Tecnica Lda. (501379860),"2.487,26 €",06-03-2012,23-02-2012,180 dias,"Portugal, Faro, Faro","Artigo 20.º, n.º 1, alínea a) do Código dos Contratos Públicos",14-12-2012,"2.487,26 €",,"",,Não aplicável.,Não aplicável.,
Aquisição de Consumíveis para LRSP,Ajuste Direto Regime Geral,Aquisição de bens móveis,"33696500-0, Reagentes de laboratório","Administração Regional de Saúde do Algarve, I.P. (503148709)",Type Solution SA (508400317),"4.681,20 €",06-03-2012,23-02-2012,180 dias,"Portugal, Faro, Faro","Artigo 20.º, n.º 1, alínea a) do Código dos Contratos Públicos",27-07-2012,"1.967,20 €",,Quantidades fornecidas.,,Não aplicável.,Não aplicável.,
Aquisição de Papel de Marquesa Plastificado,Ajuste Direto Regime Geral,Aquisição de bens móveis,"33772000-2, Artigos de papel descartáveis","Administração Regional de Saúde do Algarve, I.P. (503148709)",ECR-ROLLPAPER LDA (509587836),"25.715,20 €",06-03-2012,05-03-2012,365 dias,"Portugal, Faro, Lagoa<BR/>Portugal, Faro, Tavira<BR/>Portugal, Faro, Albufeira<BR/>Portugal, Faro, Lagos<BR/>Portugal, Faro, Faro<BR/>Portugal, Faro, Silves<BR/>Portugal, Faro, Olhão<BR/>Portugal, Faro, Vila Real Sto Antonio<BR/>Portugal, Faro, Loulé<BR/>Portugal, Faro, Portimão","Artigo 20.º, n.º 1, alínea a) do Código dos Contratos Públicos","","",,"",,Não aplicável.,Não aplicável.,
Reagente Diagnóstico Rápido Determinação Tempo Protombina,Ajuste Direto Regime Geral,Aquisição de bens móveis,"33696500-0, Reagentes de laboratório","Administração Regional de Saúde do Algarve, I.P. (503148709)","Izasa Portugal - Distribuições Técnicas, Lda. (501086110)","26.550,00 €",05-03-2012,05-03-2012,90 dias,"Portugal, Faro<BR/>Portugal, Faro, Faro","Artigo 24.º, n.º 1, alínea e) do Código dos Contratos Públicos",26-03-2012,"26.550,00 €",,"",,Não aplicável.,Não aplicável.,
Material de Drenagem,Ajuste Direto Regime Geral,Aquisição de bens móveis,"33140000-3, Material médico de consumo","Administração Regional de Saúde do Algarve, I.P. (503148709)","Anastácio Saldanha Unipessoal, Lda. (505804441)","2.757,00 €",01-03-2012,22-02-2012,3 dias,"Portugal, Faro, Faro","Artigo 20.º, n.º 1, alínea a) do Código dos Contratos Públicos",09-10-2012,"2.747,50 €",,Quantidades fornecidas.,,Não aplicável.,Não aplicável.,
Material de Drenagem,Ajuste Direto Regime Geral,Aquisição de bens móveis,"33140000-3, Material médico de consumo","Administração Regional de Saúde do Algarve, I.P. (503148709)","HR - HOSPITALAR, LDA. (501895558)","98,00 €",01-03-2012,22-02-2012,5 dias,"Portugal, Faro, Faro","Artigo 20.º, n.º 1, alínea a) do Código dos Contratos Públicos",02-05-2012,"98,00 €",,"",,Não aplicável.,Não aplicável.,
