freguesia,acronym,validVotesPercentage,votes,dicofre
Revelhe,PS,49.72,89,030724
Revelhe,PPD/PSD,20.11,36,030724
Revelhe,B.E.,11.17,20,030724
Revelhe,PAN,3.91,7,030724
Revelhe,CDS-PP,2.79,5,030724
Revelhe,PCP-PEV,2.79,5,030724
Revelhe,PCTP/MRPP,2.23,4,030724
Revelhe,L,1.68,3,030724
Revelhe,PPM.PPV/CDC,1.68,3,030724
Revelhe,PTP,1.68,3,030724
Revelhe,A,1.12,2,030724
Revelhe,NC,0.56,1,030724
Revelhe,PURP,0.56,1,030724
Revelhe,IL,0,0,030724
Revelhe,MAS,0,0,030724
Revelhe,PDR,0,0,030724
Revelhe,PNR,0,0,030724
