freguesia,acronym,validVotesPercentage,votes,dicofre
Campanhã,PS,42.03,4990,131203
Campanhã,PPD/PSD.CDS-PP,19.69,2338,131203
Campanhã,PCP-PEV,17.43,2069,131203
Campanhã,MPT,7.01,832,131203
Campanhã,B.E.,5.7,677,131203
Campanhã,PCTP/MRPP,2.11,250,131203
Campanhã,PAN,1.97,234,131203
Campanhã,L,1.73,205,131203
Campanhã,PTP,0.51,60,131203
Campanhã,PPM,0.46,55,131203
Campanhã,PND,0.43,51,131203
Campanhã,MAS,0.33,39,131203
Campanhã,PNR,0.29,35,131203
Campanhã,PPV,0.19,22,131203
Campanhã,PDA,0.06,7,131203
Campanhã,POUS,0.07,8,131203
