freguesia,acronym,validVotesPercentage,votes,dicofre
União das freguesias de Souto da Carpalhosa e Ortigosa,PPD/PSD,41.95,704,100940
União das freguesias de Souto da Carpalhosa e Ortigosa,PS,21.04,353,100940
União das freguesias de Souto da Carpalhosa e Ortigosa,CDS-PP,14.9,250,100940
União das freguesias de Souto da Carpalhosa e Ortigosa,B.E.,6.85,115,100940
União das freguesias de Souto da Carpalhosa e Ortigosa,PAN,4.23,71,100940
União das freguesias de Souto da Carpalhosa e Ortigosa,A,2.98,50,100940
União das freguesias de Souto da Carpalhosa e Ortigosa,L,1.37,23,100940
União das freguesias de Souto da Carpalhosa e Ortigosa,PPM.PPV/CDC,1.19,20,100940
União das freguesias de Souto da Carpalhosa e Ortigosa,NC,1.13,19,100940
União das freguesias de Souto da Carpalhosa e Ortigosa,PCP-PEV,1.07,18,100940
União das freguesias de Souto da Carpalhosa e Ortigosa,IL,0.72,12,100940
União das freguesias de Souto da Carpalhosa e Ortigosa,PDR,0.72,12,100940
União das freguesias de Souto da Carpalhosa e Ortigosa,PCTP/MRPP,0.54,9,100940
União das freguesias de Souto da Carpalhosa e Ortigosa,MAS,0.36,6,100940
União das freguesias de Souto da Carpalhosa e Ortigosa,PURP,0.36,6,100940
União das freguesias de Souto da Carpalhosa e Ortigosa,PNR,0.3,5,100940
União das freguesias de Souto da Carpalhosa e Ortigosa,PTP,0.3,5,100940
