freguesia,acronym,validVotesPercentage,votes,dicofre
Pedrouços,PS,36.16,1386,130617
Pedrouços,PPD/PSD.CDS-PP,24.45,937,130617
Pedrouços,PCP-PEV,15.24,584,130617
Pedrouços,MPT,8.61,330,130617
Pedrouços,B.E.,6.47,248,130617
Pedrouços,PAN,2.58,99,130617
Pedrouços,PCTP/MRPP,2.01,77,130617
Pedrouços,L,1.9,73,130617
Pedrouços,PND,0.52,20,130617
Pedrouços,PPM,0.52,20,130617
Pedrouços,PTP,0.39,15,130617
Pedrouços,PPV,0.34,13,130617
Pedrouços,PNR,0.31,12,130617
Pedrouços,MAS,0.26,10,130617
Pedrouços,POUS,0.21,8,130617
Pedrouços,PDA,0.03,1,130617
