freguesia,acronym,validVotesPercentage,votes,dicofre
Benquerenças,PS,54.89,129,050203
Benquerenças,PPD/PSD,15.74,37,050203
Benquerenças,B.E.,10.21,24,050203
Benquerenças,CDS-PP,3.83,9,050203
Benquerenças,PPM.PPV/CDC,3.4,8,050203
Benquerenças,PURP,2.55,6,050203
Benquerenças,A,1.7,4,050203
Benquerenças,PAN,1.7,4,050203
Benquerenças,PCP-PEV,1.7,4,050203
Benquerenças,L,1.28,3,050203
Benquerenças,IL,0.85,2,050203
Benquerenças,NC,0.43,1,050203
Benquerenças,PCTP/MRPP,0.43,1,050203
Benquerenças,PDR,0.43,1,050203
Benquerenças,PNR,0.43,1,050203
Benquerenças,PTP,0.43,1,050203
Benquerenças,MAS,0,0,050203
