Entidade.x,2017,2018,Entidade.y,NIF_Adjudicante,dist
"Administração Regional de Saúde de Lisboa e Vale do Tejo, I.P.",2 941 464 €,2 874 819 €,"Administração Regional de Saúde de Lisboa e Vale do Tejo, I.P. ",503148776,0.005291005291
"Instituto Nacional de Saúde Dr. Ricardo Jorge, I.P.",19 098 €,20 427 €,"Instituto Nacional de Saúde Dr. Ricardo Jorge, I.P. ",501427511,0.00641025641
"Administração Regional de Saúde do Centro, I.P.",509 748 €,576 798 €,"Administração Regional de Saúde do Centro, I.P. ",503122165,0.006944444444
"Hospital de Magalhães Lemos, E.P.E.",57 287 €,72 737 €,"Hospital de Magalhães Lemos, E.P.E. ",502828790,0.009259259259
"Administração Regional de Saúde do Alentejo, I.P.",778 746 €,722 791 €,"Administração Regional de Saúde do Alentejo, I. P. ",503148768,0.01307189542
"Administração Regional de Saúde do Algarve, I.P.",40 278 €,439 398 €,"Administração Regional de Saúde do Algarve, I. P. ",503148709,0.01333333333
"Centro Hospitalar e Universitário de Coimbra, E.P.E.",894 192 €,913 233 €,"Centro Hospitalar e Universitário de Coimbra, E. P. E. ",510103448,0.01818181818
"Centro Hospitalar de Setúbal, E.P.E.",4 436 020 €,5 007 978 €,Centro Hospitalar de Setúbal E.P.E.,507606787,0.01851851852
"Hospital do Espírito Santo de Évora, E.P.E.",1 980 556 €,1 967 568 €,"Hospital do Espírito Santo de Évora, E. P. E. ",508085888,0.02173913043
"Centro Hospitalar Barreiro Montijo, E.P.E.",2 381 016 €,2 751 566 €,"Centro Hospitalar Barreiro Montijo, E. P. E. ",509186998,0.02222222222
"Instituto Nacional de Emergência Médica, I.P.",2 040 475 €,2 123 283 €,"Instituto Nacional de Emergência Médica, IP ",501356126,0.02239057239
"Centro Hospitalar Tondela-Viseu, E.P.E.",487 621 €,490 056 €,"Centro Hospitalar Tondela-Viseu, E. P. E. ",509822940,0.02380952381
"Centro Hospitalar do Médio Ave, E.P.E.",1 667 024 €,1 665 747 €,"Centro Hospitalar do Médio Ave, E. P. E. ",508093937,0.0243902439
"Hospital Distrital de Santarém, E.P.E.",2 247 240 €,2 420 347 €,"Hospital Distrital de Santarém, E. P. E. ",506361462,0.0243902439
"Centro Hospitalar de Leiria, E.P.E.",4 042 557 €,3 399 491 €,"Centro Hospitalar de Leiria, E. P. E. ",509822932,0.02631578947
"Hospital Garcia de Orta, E.P.E.",2 962 997 €,3 384 509 €,"Hospital Garcia de Orta, E. P. E. ",506361470,0.02941176471
"Centro Hospitalar de Lisboa Ocidental, E.P.E.",2 049 206 €,1 857 366 €,"Centro Hospitalar de Lisboa Ocidental, EPE ",507618319,0.02997416021
"Centro Hospitalar do Baixo Vouga, E.P.E.",2 440 549 €,2 689 023 €,"Centro Hospitalar do Baixo Vouga, E. P. E ",510123210,0.03214285714
"Administração Regional de Saúde do Norte, I.P.",2 000 862 €,1 814 395 €,"Administração Regional de Saúde do Norte, I.P.",503135593,
Instituto de Oftalmologia Gama Pinto,64 718 €,43 137 €,Instituto de Oftalmologia Dr. Gama Pinto,600000052,0.06379855465
"Hospital da Senhora da Oliveira - Guimarães, E.P.E.",1 878 849 €,1 684 764 €,"Hospital da Senhora da Oliveira Guimarães, E. P. E. ",508080827,0.0660231272
"Centro Hospitalar Póvoa de Varzim/Vila do Conde, E.P.E.",1 405 232 €,1 104 309 €,"Centro Hospitalar Póvoa de Varzim - Vila do Conde, E.P.E. ",508741823,0.0753454081
"Unidade Local de Saúde Alto Minho, E.P.E.",2 060 456 €,1 852 521 €,"Unidade Local de Saúde do Alto Minho, E.P.E. ",508786193,0.07841011743
"Unidade Local de Saúde Nordeste, E.P.E.",2 198 573 €,2 938 501 €,"Unidade Local de Saúde do Nordeste, E. P. E. ",509932584,0.08290598291
Centro Hospitalar Psiquiátrico de Lisboa,41 929 €,22 822 €,Centro Hospitalar Psiquiatrico de Lisboa,508338476,0.08869606004
"Centro Hospitalar Médio Tejo, E.P.E.",7 363 354 €,6 807 076 €,"Centro Hospitalar do Médio Tejo, E.P.E. ",506361608,0.08888888889
"Unidade Local de Saúde Matosinhos, E.P.E.",1 735 941 €,1 634 921 €,"Unidade Local de Saúde de Matosinhos, E. P. E. ",506361390,0.09133367929
"Hospital Distrital da Figueira da Foz, E.P.E.",576 522 €,691 637 €,"Hospital Distrital Figueira da Foz, E.P.E. ",506361527,0.1000861326
"Unidade Local de Saúde Norte Alentejano, E.P.E.",4 496 668 €,4 633 810 €,"Unidade Local de Saúde do Norte Alentejano, E. P. E. ",508094461,0.1015656363
"Centro Hospitalar Tâmega e Sousa, E.P.E.",3 167 671 €,4 093 473 €,"Centro Hospitalar do Tâmega e Sousa, E. P. E. ",508318262,0.1059782609
"Centro Hospitalar do Oeste, E.P.E.",5 283 945 €,5 358 367 €,Centro Hospitalar do Oeste,510412009,
"Unidade Local de Saúde Castelo Branco, E.P.E.",1 220 133 €,1 437 077 €,"Unidade Local de Saúde de Castelo Branco, E. P. E.",509309844,
Hospital Arcebispo João Crisóstomo - Cantanhede,429 394 €,359 477 €,Hospital do Arcebispo João Crisóstomo  Cantanhede,501626123,0.1231052705
"Instituto Português Oncologia Francisco Gentil - Porto, E.P.E.",293 544 €,225 324 €,"Instituto Português de Oncologia do Porto Francisco Gentil, E. P. E. ",506362299,0.1287231406
"Unidade Local de Saúde Baixo Alentejo, E.P.E.",4 521 364 €,4 574 695 €,Unidade Local Saude Baixo Alentejo EPE,508754275,
"Instituto Português Oncologia Francisco Gentil - Coimbra, E.P.E.",38 806 €,20 605 €,"Instituto Português de Oncologia de Coimbra Francisco Gentil, E. P. E. ",506361438,0.1327141087
"Centro Hospitalar de Vila Nova de Gaia/Espinho, E.P.E.",627 900 €,744 133 €,"Centro Hospitalar Vila Nova de Gaia - Espinho, E. P. E. ",508142156,0.1332477435
"Centro Hospitalar Universitário de Lisboa Norte, E.P.E.",1 185 331 €,1 164 027 €,"Centro Hospitalar Universitário de Lisboa Norte, E. P. E. ",508481287,
"Instituto Português Oncologia Francisco Gentil - Lisboa, E.P.E.",237 655 €,183 627 €,"Instituto Português de Oncologia de Lisboa Francisco Gentil, E. P. E. ",506361616,0.1347840928
"Centro Hospitalar Universitário Cova da Beira, E.P.E.",978 592 €,910 006 €,"Centro Hospitalar Cova da Beira, EPE ",506361659,
"Unidade Local de Saúde Litoral Alentejano, E.P.E.",3 706 611 €,3 583 910 €,"Unidade Local de Saúde do Litoral Alentejano, E. P. E.",510445152,
"Centro Hospitalar Universitário do Algarve, E.P.E.",5 852 827 €,8 519 083 €,"Centro Hospitalar Universitário do Algarve, E. P. E.",510745997,
"Instituto Português do Sangue e da Transplantação, I.P.",570 290 €,556 978 €,"Instituto Português do Sangue, I.P. ",502423943,0.1429292929
"Hospital Santa Maria Maior, E.P.E.",793 087 €,828 146 €,"Hospital de Santa Maria Maior, E. P. E. ",506361381,0.1431372549
"Unidade Local de Saúde Guarda, E.P.E.",2 454 310 €,2 397 330 €,"Unidade Local de Saúde da Guarda, E. P. E.",508752000,
Centro Medicina de Reabilitação da Região Centro - Rovisco Pais,42 848 €,29 321 €,Centro de Medicina de Reabilitação da Região Centro - Rovisco Pais,503767336,0.1468846245
"Centro Hospitalar Universitário Lisboa Central, E.P.E.",719 066 €,695 722 €,"Centro Hospitalar de Lisboa Central, E. P. E. ",508080142,0.1506786289
"Centro Hospitalar de Entre o Douro e Vouga, E.P.E.",3 402 060 €,2 771 407 €,"Centro Hospitalar de Entre o Douro e Vouga, E.P.E.",508878462,
"Centro Hospitalar Universitário do Porto, E.P.E.",1 528 187 €,1 878 874 €,"Centro Hospitalar Universitário do Porto, E. P. E.",508331471,
"Centro Hospitalar Universitário de S. João, E.P.E.",557 527 €,556 179 €,"Centro Hospitalar de S. João, E.P.E",509821197,
Hospital Doutor Francisco Zagalo - Ovar,630 636 €,442 714 €,Hospital Dr. Francisco Zagalo,501510150,0.2000294724
"Centro Hospitalar de Trás-os-Montes e Alto Douro, E.P.E.",2 680 138 €,2 892 113 €,"CENTRO HOSP. DE TRÁS-OS-MONTES E ALTO DOURO, EPE",508100496,
"Hospital Professor Doutor Fernando Fonseca, E.P.E.",4 576 096 €,3 684 503 €,"Hospital Professor Doutor Fernando Fonseca, E. P. E.",503035416,