﻿ano;temperatura
1999/2000;16,5
2000/2001;17,4
2001/2002;16,4
2002/2003;16,8
2003/2004;15,8
2004/2005;15,4
2005/2006;15,8
2006/2007;15,6
2007/2008;15,1
2008/2009;15,7
2009/2010;16,1
2010/2011;16,1
2011/2012;15
2012/2013;15,4
2013/2014;15,4
2014/2015;15,8
2015/2016;16,1