Objeto do Contrato,Tipo de Procedimento,Tipo(s) de Contrato,CPVs,Entidade(s) Adjudicante(s),Entidade(s) Adjudicatária(s),Preço Contratual,Data de Publicação,Data de Celebração do Contrato,Prazo de Execução,Local de Execução,Fundamentação,Data de Fecho do Contrato,Preço Total Efetivo,Causas das Alterações ao Prazo,Causas das Alterações ao Preço,Estado,N.º registo do Acordo Quadro,Descrição do Acordo Quadro,Procedimento Centralizado
"Remodelação do Piso 3 do Edifício de Internamento do HEM nas áreas de pintura, verificação de janelas e estores, fornecimento de bancadas e pias em inox, reparação e envernizamento de rodas de macas, portas de roupeiros e cacifos e assentamentos de placas de teto.",Ajuste Direto Regime Geral,Empreitadas de obras públicas,"45215100-8, Obras de construção de edifícios relacionados com serviços de saúde","Centro Hospitalar de Lisboa Ocidental, EPE (507618319)","Pentalaxia - Unipessoal, Lda (510363245)","18.127,50 €",21-11-2012,30-10-2012,60 dias,"Portugal, Lisboa, Lisboa","Artigo 19.º, alínea a) do Código dos Contratos Públicos",,,,,,Não aplicável.,Não aplicável.,
Remodelação do Piso 3 do Edifício de Internamento do HEM na área de eletricidade,Ajuste Direto Regime Geral,Empreitadas de obras públicas,"71314100-3, Serviços de electricidade","Centro Hospitalar de Lisboa Ocidental, EPE (507618319)","Multiluz, Lda (503717444)","6.716,67 €",21-11-2012,30-10-2012,60 dias,"Portugal, Lisboa, Lisboa","Artigo 19.º, alínea a) do Código dos Contratos Públicos",,,,,,Não aplicável.,Não aplicável.,
"Remodelação do Piso 3 do Edifício de Internamento do Hospital de Egas Moniz nas áreas de demolição, alvenarias, revestimentos, divisórias, carpintaria, tetos e aparelhos sanitários com as respetivas áreas de águas e esgotos e pavimentos.",Ajuste Direto Regime Geral,Empreitadas de obras públicas,"45215100-8, Obras de construção de edifícios relacionados com serviços de saúde","Centro Hospitalar de Lisboa Ocidental, EPE (507618319)","Resolve Express, Lda (506201937)","64.860,09 €",21-11-2012,30-10-2012,60 dias,"Portugal, Lisboa, Lisboa","Artigo 19.º, alínea a) do Código dos Contratos Públicos",,,,,,Não aplicável.,Não aplicável.,
"Remodelação do Piso 1 do Edificio da Consulta Externa do Hospital de Egas Moniz nas áreas de demolição, alvenarias, revestimentos, divisórias, carpintaria, tetos e aparelhos sanitários com as respetivas áreas de águas e esgotos, pavimentos e ainda eletricidade.",Ajuste Direto Regime Geral,Empreitadas de obras públicas,"45215100-8, Obras de construção de edifícios relacionados com serviços de saúde","Centro Hospitalar de Lisboa Ocidental, EPE (507618319)","Resolve Express, Lda (506201937)","79.125,27 €",21-11-2012,30-10-2012,60 dias,"Portugal, Lisboa, Lisboa","Artigo 19.º, alínea a) do Código dos Contratos Públicos",,,,,,Não aplicável.,Não aplicável.,
Aquisição de Serviços de Alimentação para o CHLO para o periodo de 04/08/2012 a 31/12/2012,Ajuste Direto Regime Geral,Aquisição de serviços,"55322000-3, Serviços de confecção de refeições","Centro Hospitalar de Lisboa Ocidental, EPE (507618319)","ITAU - Instituto Técnico de Alimentação Humana, SA (500142858)","842.956,99 €",16-11-2012,13-11-2012,150 dias,"Portugal, Lisboa, Lisboa","Artigo 27.º, n.º 1, alínea a) do Código dos Contratos Públicos",,,,,,Não aplicável.,Não aplicável.,
Aquisição de 530 caixas de REAGENTE PARA DETERMINAÇÃO DO TEMPO DE PROTROMBINA para o ano 2013,Ajuste Direto Regime Geral,Aquisição de bens móveis,"33694000-1, Meios de diagnóstico","Centro Hospitalar de Lisboa Ocidental, EPE (507618319)","IZASA PORTUGAL, LDA. (501086110)","39.532,70 €",13-11-2012,08-11-2012,365 dias,"Portugal, Lisboa, Lisboa","Artigo 24.º, n.º 1, alínea e) do Código dos Contratos Públicos",,,,,,Não aplicável.,Não aplicável.,
