Objeto do Contrato,Tipo de Procedimento,Tipo(s) de Contrato,CPVs,Entidade(s) Adjudicante(s),Entidade(s) Adjudicatária(s),Preço Contratual,Data de Publicação,Data de Celebração do Contrato,Prazo de Execução,Local de Execução,Fundamentação,Data de Fecho do Contrato,Preço Total Efetivo,Causas das Alterações ao Prazo,Causas das Alterações ao Preço,Estado,N.º registo do Acordo Quadro,Descrição do Acordo Quadro,Procedimento Centralizado
Fornecimento do Equipamento de Monitorização,Ajuste Direto Regime Geral,Aquisição de bens móveis,"32000000-3, Equipamento de rádio, televisão, comunicação, telecomunicações e afins","Hospital do Espírito Santo de Évora, E. P. E. (508085888)","Philips Portuguesa, SA (500216843)","20.000,00 €",15-01-2015,22-10-2014,30 dias,"Portugal, Évora, Évora","Artigo 20.º, n.º 1, alínea a) do Código dos Contratos Públicos",,,,,,Não aplicável.,Não aplicável.,FALSE
Aquisição de Televisores e Suportes,Ajuste Direto Regime Geral,Aquisição de bens móveis,"32320000-2, Equipamento audiovisual e de televisão","Hospital do Espírito Santo de Évora, EPE (508085888)","Novabit, Informatica Unipessoal, LDA (503411302)","25.118,38 €",15-01-2015,31-10-2014,30 dias,"Portugal, Évora, Évora","Artigo 20.º, n.º 1, alínea a) do Código dos Contratos Públicos",,,,,,Não aplicável.,Não aplicável.,FALSE
