Objeto do Contrato,Tipo de Procedimento,Tipo(s) de Contrato,CPVs,Entidade(s) Adjudicante(s),Entidade(s) Adjudicatária(s),Preço Contratual,Data de Publicação,Data de Celebração do Contrato,Prazo de Execução,Local de Execução,Fundamentação,Data de Fecho do Contrato,Preço Total Efetivo,Causas das Alterações ao Prazo,Causas das Alterações ao Preço,Estado,N.º registo do Acordo Quadro,Descrição do Acordo Quadro,Procedimento Centralizado
"Aquisição de Serviços de Implementação do desenho de soluções - Hospital de Dia do CHSJ, EPE.",Ajuste Direto Regime Geral,Aquisição de serviços,"73000000-2, Serviços de investigação e desenvolvimento e serviços de consultoria conexos","Centro Hospitalar de São João, E. P. E. (509821197)","Kaizen Institute Spain, Sl. (9802148)","63.250,00 €",14-06-2016,21-12-2015,100 dias,"Portugal, Porto, Porto","Artigo 20.º, n.º 1, alínea a) do Código dos Contratos Públicos",,,,,,Não aplicável.,Não aplicável.,FALSE
"Empreitada de Remodelação da Antiga Copa Farmácia para Sala Higienização e Lavagem da Farmácia do CHSJ, EPE",Ajuste Direto Regime Geral,Empreitadas de obras públicas,"45113000-2, Obras no local","Centro Hospitalar de São João, E. P. E. (509821197)",Arestasignus Lda. (510803768),"4.991,40 €",13-06-2016,13-06-2016,20 dias,"Portugal, Porto, Porto","Artigo 19.º, alínea a) do Código dos Contratos Públicos",,,,,,Não aplicável.,Não aplicável.,FALSE
"Aquisição de 35 (trinta e cinco) Electrocardiógrafos para o CHSJ, EPE",Concurso público,Aquisição de bens móveis,"33123200-0, Aparelhos para electrocardiografia","Centro Hospitalar de São João, E. P. E. (509821197)","Hospisistemas, Lda. (505437147)","111.650,00 €",13-06-2016,12-05-2016,25 dias,"Portugal, Porto, Porto","Artigo 20.º, n.º 1, alínea b) do Código dos Contratos Públicos",,,,,,Não aplicável.,Não aplicável.,FALSE
"Empreitada para Abertura de Vala para Alimentação do Chiller e Central Térmica do CAM do CHSJ, EPE",Ajuste Direto Regime Geral,Empreitadas de obras públicas,"45113000-2, Obras no local","Centro Hospitalar de São João, E. P. E. (509821197)","Vector Linear, Lda. (509611338)","7.971,75 €",13-06-2016,09-05-2016,20 dias,"Portugal, Porto, Porto","Artigo 19.º, alínea a) do Código dos Contratos Públicos",,,,,,Não aplicável.,Não aplicável.,FALSE
"Aquisição de um Refractómetro para a Consulta de Oftalmologia do CHSJ, EPE",Ajuste Direto Regime Geral,Aquisição de bens móveis,"33122000-1, Equipamento oftalmológico","Centro Hospitalar de São João, E. P. E. (509821197)","José Cotta - Equip Médicos Serviços, SA (500155739)","7.800,00 €",13-06-2016,08-06-2016,10 dias,"Portugal, Porto, Porto","Artigo 20.º, n.º 1, alínea a) do Código dos Contratos Públicos",,,,,,Não aplicável.,Não aplicável.,FALSE
"Aquisição de Serviços de Otimização do Centro de Ambulatório do Centro Hospitalar de São João, Epe.",Ajuste Direto Regime Geral,Aquisição de serviços,"73000000-2, Serviços de investigação e desenvolvimento e serviços de consultoria conexos","Centro Hospitalar de São João, E. P. E. (509821197)","Kaizen Institute Portugal, Lda. (508830001)","62.100,00 €",13-06-2016,06-04-2015,100 dias,"Portugal, Porto, Porto","Artigo 20.º, n.º 1, alínea a) do Código dos Contratos Públicos",,,,,,Não aplicável.,Não aplicável.,FALSE
"Aquisição de 1 Cistoscópio para o Bloco Operatório de Urologia do CHSJ, EPE",Ajuste Direto Regime Geral,Aquisição de bens móveis,"33168000-5, Aparelhos para endoscopia e endocirurgia","Centro Hospitalar de São João, E. P. E. (509821197)",Olympus Iberia S.A.U. (980474710),"6.197,27 €",13-06-2016,08-06-2016,30 dias,"Portugal, Porto, Porto","Artigo 20.º, n.º 1, alínea a) do Código dos Contratos Públicos",,,,,,Não aplicável.,Não aplicável.,FALSE
"Empreitada de remodelação com fornecimento de Elevador para o Centro Hospitalar de São João, EPE",Ajuste Direto Regime Geral,Empreitadas de obras públicas,"45313100-5, Instalação de elevadores","Centro Hospitalar São João, EPE (509821197)","Schmitt Elevadores, Lda.  (500230757)","118.990,00 €",13-06-2016,11-05-2016,60 dias,"Portugal, Porto, Porto","Artigo 19.º, alínea a) do Código dos Contratos Públicos",,,,,,Não aplicável.,Não aplicável.,FALSE
"Aquisição de 2 Videogastroscópios para o Serviço de Gastro do CHSJ, EPE",Ajuste Direto Regime Geral,Aquisição de bens móveis,"33168000-5, Aparelhos para endoscopia e endocirurgia","Centro Hospitalar de São João, E. P. E. (509821197)",Olympus iberia S.A.U (980474710),"44.000,00 €",13-06-2016,12-05-2016,30 dias,"Portugal, Porto, Porto","Artigo 24.º, n.º 1, alínea e) do Código dos Contratos Públicos",,,,,,Não aplicável.,Não aplicável.,FALSE
"Aquisição por substituição de Ampola THA Straton Z do TAC Somaton Sensation 64/Cardiac/64 do CHSJ, EPE",Ajuste Direto Regime Geral,Aquisição de bens móveis,"33110000-4, Equipamento de imagiologia para uso médico, dentário e veterinário","Centro Hospitalar de São João, E. P. E. (509821197)",Siemens Healthcare Lda. (507925173),"130.000,00 €",13-06-2016,17-05-2016,10 dias,"Portugal, Porto, Porto","Artigo 24.º, n.º 1, alínea e) do Código dos Contratos Públicos",,,,,,Não aplicável.,Não aplicável.,FALSE
"Empreitada de Impermeabilização da Cobertura da Ressonância Magnética do CHSJ, EPE",Ajuste Direto Regime Geral,Empreitadas de obras públicas,"45113000-2, Obras no local","Centro Hospitalar de São João, E. P. E. (509821197)","Arestasignus - Construções Unipessoal, Lda. (510803768)","10.383,50 €",13-06-2016,03-05-2016,30 dias,"Portugal, Porto, Porto","Artigo 19.º, alínea a) do Código dos Contratos Públicos",,,,,,Não aplicável.,Não aplicável.,FALSE
