freguesia,acronym,validVotesPercentage,votes,dicofre
Cavez,PS,50.72,247,030407
Cavez,PPD/PSD.CDS-PP,38.6,188,030407
Cavez,MPT,4.11,20,030407
Cavez,PCP-PEV,2.67,13,030407
Cavez,B.E.,0.82,4,030407
Cavez,PND,0.82,4,030407
Cavez,L,0.41,2,030407
Cavez,MAS,0.41,2,030407
Cavez,PCTP/MRPP,0.41,2,030407
Cavez,PDA,0.41,2,030407
Cavez,PAN,0.21,1,030407
Cavez,PPM,0.21,1,030407
Cavez,PTP,0.21,1,030407
Cavez,PNR,0,0,030407
Cavez,POUS,0,0,030407
Cavez,PPV,0,0,030407
