Objeto do Contrato,Tipo de Procedimento,Tipo(s) de Contrato,CPVs,Entidade(s) Adjudicante(s),Entidade(s) Adjudicatária(s),Preço Contratual,Data de Publicação,Data de Celebração do Contrato,Prazo de Execução,Local de Execução,Fundamentação,Data de Fecho do Contrato,Preço Total Efetivo,Causas das Alterações ao Prazo,Causas das Alterações ao Preço,Estado,N.º registo do Acordo Quadro,Descrição do Acordo Quadro,Procedimento Centralizado
Prestação serviços área de cardiopneumologia,Ajuste Direto Regime Geral,Aquisição de serviços,"79620000-6, Serviços de fornecimento de pessoal, inclusive temporário","Hospital do Espírito Santo de Évora, E. P. E. (508085888)",Daniela Coelho da Rocha (224401165),"20.800,00 €",08-04-2016,14-01-2016,180 dias,"Portugal, Évora, Évora","Artigo 20.º, n.º 1, alínea a) do Código dos Contratos Públicos",,,,,,Não aplicável.,Não aplicável.,FALSE
Aquisição de Material de Penso com Efeito Terapêutico,Ao abrigo de acordo-quadro (art.º 259.º),Aquisição de bens móveis,"33140000-3, Material médico de consumo","Hospital do Espírito Santo de Évora, E. P. E. (508085888)","CLINIFAR MEDICAL CARE SOLUTIONS (503281115), JOHNSON & JOHNSON LDA (500153370), MEDICINALIA-CORMEDICA (500684324), PARS CONSULTORIA PREST SERVICO (505642948), QUILABAN QUIMICA LABORATORIAL ANALITICA SA (500399670), KVTECH PORTUGAL - PRODUTOS MEDICOS UNIP (508671531), QUEENLABS - ESPEC FARMAC LDA (503984485), B BRAUN MEDICAL LDA (501506543), SMITH & NEPHEW LDA (503552461), LINEA MEDICA-DISP MED CIRG SA (505148676), PAUL HARTMANN LDA (502271728), BSN MEDICAL SA (505385058)","36.879,25 €",08-04-2016,16-03-2016,300 dias,"Portugal, Évora, Évora",Artigo 259.º do Código dos Contratos Públicos,,,,,,1315192,Acordo Quadro para fornecimento de material de penso de efeito terapêutico às Instituições e Serviços do Serviço Nacional de Saúde,FALSE
Prestação de Serviços de Alimentação,Ajuste Direto Regime Geral,Aquisição de serviços,"55320000-9, Serviços de provimento de refeições","Hospital do Espírito Santo de Évora, E. P. E. (508085888)",GERTAL (500126623),"147.788,84 €",07-04-2016,01-02-2016,60 dias,"Portugal, Évora, Évora","Artigo 24.º, n.º 1, alínea c) do Código dos Contratos Públicos",,,,,,Não aplicável.,Não aplicável.,FALSE
Aquisição de Medicamentos Retro Virais,Ao abrigo de acordo-quadro (art.º 259.º),Aquisição de bens móveis,"33651400-2, Antivíricos de uso sistémico","Hospital do Espírito Santo de Évora, E. P. E. (508085888)","ROCHE FARMACEUTICA QUIMICA LDA (500233810), TEVA PHARMA - PRODUTOS FARMACEUTICOS LDA (507045491), BRISTOL-MYERS SQUIB FARMAC PORTUGUESA SA (500048193), ABBVIE LDA (510229050), UNILFARMA (500293023), MERCK SHARP & DOME LDA (500191360), JANSSEN CILAG FARMACEUTICA LDA (500189412)","481.932,61 €",06-04-2016,10-03-2016,300 dias,"Portugal, Évora, Évora",Artigo 259.º do Código dos Contratos Públicos,,,,,,1120578,"CONCURSO PÚBLICO PARA A CELEBRAÇÃO DE CONTRATOS PÚBLICOS DE APROVISIONAMENTO PARA A ÁREA DA SAÚDE, COM VISTA AO FORNECIMENTO DE MEDICAMENTOS ANTI-RETROVIRAIS, ÀS INSTITUIÇÕES E SERVIÇOS DO SERVIÇO NACIONAL DE SAÚDE  ",FALSE
Aquisição de medicamentos: Lenalidomida 5mg,Ajuste Direto Regime Geral,Aquisição de bens móveis,"33650000-1, Anti-infecciosos gerais de uso sistémico, vacinas, antineoplásicos e imunomoduladores","Hospital do Espírito Santo de Évora, E. P. E. (508085888)",CELGENE - SOCIEDADE UNIPESSOAL LDA (507791690),"8.905,86 €",06-04-2016,30-03-2016,8 dias,"Portugal, Évora, Évora","Artigo 24.º, n.º 1, alínea e) do Código dos Contratos Públicos",,,,,,Não aplicável.,Não aplicável.,FALSE
Aquisição de medicamentos: Ustecinumab 45mg,Ajuste Direto Regime Geral,Aquisição de bens móveis,"33650000-1, Anti-infecciosos gerais de uso sistémico, vacinas, antineoplásicos e imunomoduladores","Hospital do Espírito Santo de Évora, E. P. E. (508085888)",JANSSEN CILAG FARMACEUTICA LDA (500189412),"15.071,58 €",06-04-2016,30-03-2016,8 dias,"Portugal, Évora, Évora","Artigo 26.º, n.º 1, alínea e) do Código dos Contratos Públicos",,,,,,Não aplicável.,Não aplicável.,FALSE
Aquisição de medicamentos: Everolimus 10mg,Ajuste Direto Regime Geral,Aquisição de bens móveis,"33652200-7, Medicamentos usados na terapêutica endócrina","Hospital do Espírito Santo de Évora, E. P. E. (508085888)",NOVARTIS FARMA-PROD FARMACEUT (500063524),"6.009,00 €",06-04-2016,30-03-2016,8 dias,"Portugal, Évora, Évora","Artigo 26.º, n.º 1, alínea e) do Código dos Contratos Públicos",,,,,,Não aplicável.,Não aplicável.,FALSE
Aquisição de medicamentos: Imunoglobulina 100 mg,Ajuste Direto Regime Geral,Aquisição de bens móveis,"33651520-9, Imunoglobulinas","Hospital do Espírito Santo de Évora, E. P. E. (508085888)","CSL BEHRING, LDA (503047201)","25.316,00 €",06-04-2016,29-02-2016,8 dias,"Portugal, Évora, Évora","Artigo 24.º, n.º 1, alínea e) do Código dos Contratos Públicos",,,,,,Não aplicável.,Não aplicável.,FALSE
Aquisição de medicamentos: Cetuximab 5mg,Ajuste Direto Regime Geral,Aquisição de bens móveis,"33690000-3, Medicamentos vários","Hospital do Espírito Santo de Évora, E. P. E. (508085888)",MERCK SA (500650870),"16.544,00 €",06-04-2016,29-03-2016,8 dias,"Portugal, Évora, Évora","Artigo 26.º, n.º 1, alínea e) do Código dos Contratos Públicos",,,,,,Não aplicável.,Não aplicável.,FALSE
Aquisição de medicamentos: Pertuzumab 420mg,Ajuste Direto Regime Geral,Aquisição de bens móveis,"33690000-3, Medicamentos vários","Hospital do Espírito Santo de Évora, E. P. E. (508085888)",ROCHE FARMACEUTICA QUIMICA LDA (500233810),"5.523,30 €",06-04-2016,28-03-2016,8 dias,"Portugal, Évora, Évora","Artigo 24.º, n.º 1, alínea e) do Código dos Contratos Públicos",,,,,,Não aplicável.,Não aplicável.,FALSE
Aquisição de medicamentos: Omalizumab 150mg,Ajuste Direto Regime Geral,Aquisição de bens móveis,"33670000-7, Medicamentos para o aparelho respiratório","Hospital do Espírito Santo de Évora, E. P. E. (508085888)",NOVARTIS FARMA-PROD FARMACEUT (500063524),"6.161,80 €",06-04-2016,28-03-2016,8 dias,"Portugal, Évora, Évora","Artigo 24.º, n.º 1, alínea e) do Código dos Contratos Públicos",,,,,,Não aplicável.,Não aplicável.,FALSE
Aquisição de medicamentos: Panitumumab 20mg,Ajuste Direto Regime Geral,Aquisição de bens móveis,"33652000-5, Antineoplásicos e imunomoduladores","Hospital do Espírito Santo de Évora, E. P. E. (508085888)",AMGEN BIOFARMACEUTICA LDA (502942959),"7.065,20 €",06-04-2016,28-03-2016,8 dias,"Portugal, Évora, Évora","Artigo 26.º, n.º 1, alínea e) do Código dos Contratos Públicos",,,,,,Não aplicável.,Não aplicável.,FALSE
Aquisição de medicamentos: Natalizumab 20 mg,Ajuste Direto Regime Geral,Aquisição de bens móveis,"33690000-3, Medicamentos vários","Hospital do Espírito Santo de Évora, E. P. E. (508085888)",BIOGEN IDEC PORTUGAL (506415740),"7.614,12 €",05-04-2016,28-03-2016,8 dias,"Portugal, Évora, Évora","Artigo 26.º, n.º 1, alínea e) do Código dos Contratos Públicos",,,,,,Não aplicável.,Não aplicável.,FALSE
Aquisição de medicamentos:  Antitripsina alfa,Ajuste Direto Regime Geral,Aquisição de bens móveis,"33690000-3, Medicamentos vários","Hospital do Espírito Santo de Évora, E. P. E. (508085888)",GRIFOLS PORTUGAL LDA (502041285),"10.128,00 €",05-04-2016,28-03-2016,8 dias,"Portugal, Évora, Évora","Artigo 26.º, n.º 1, alínea e) do Código dos Contratos Públicos",,,,,,Não aplicável.,Não aplicável.,FALSE
Aquisição de medicamentos: Bortezomib 3.5 mg,Ajuste Direto Regime Geral,Aquisição de bens móveis,"33690000-3, Medicamentos vários","Hospital do Espírito Santo de Évora, E. P. E. (508085888)",JANSSEN CILAG FARMACEUTICA LDA (500189412),"8.931,40 €",05-04-2016,28-03-2016,8 dias,"Portugal, Évora, Évora","Artigo 26.º, n.º 1, alínea e) do Código dos Contratos Públicos",,,,,,Não aplicável.,Não aplicável.,FALSE
Aquisição de medicamentos: Adalimumab 40 mg,Ajuste Direto Regime Geral,Aquisição de bens móveis,"33650000-1, Anti-infecciosos gerais de uso sistémico, vacinas, antineoplásicos e imunomoduladores","Hospital do Espírito Santo de Évora, E. P. E. (508085888)",ABBVIE LDA (510229050),"36.051,60 €",05-04-2016,16-03-2016,8 dias,"Portugal, Évora, Évora","Artigo 26.º, n.º 1, alínea e) do Código dos Contratos Públicos",,,,,,Não aplicável.,Não aplicável.,FALSE
Aquisição de medicamentos : Abiraterona 250 mg,Ajuste Direto Regime Geral,Aquisição de bens móveis,"33690000-3, Medicamentos vários","Hospital do Espírito Santo de Évora, E. P. E. (508085888)",JANSSEN CILAG FARMACEUTICA LDA (500189412),"17.891,28 €",05-04-2016,16-03-2016,8 dias,"Portugal, Évora, Évora","Artigo 26.º, n.º 1, alínea e) do Código dos Contratos Públicos",,,,,,Não aplicável.,Não aplicável.,FALSE
Aquisição de medicamentos: Interferão beta,Ajuste Direto Regime Geral,Aquisição de bens móveis,"33652000-5, Antineoplásicos e imunomoduladores","Hospital do Espírito Santo de Évora, E. P. E. (508085888)",BIOGEN IDEC PORTUGAL (506415740),"18.363,75 €",05-04-2016,16-03-2016,8 dias,"Portugal, Évora, Évora","Artigo 26.º, n.º 1, alínea e) do Código dos Contratos Públicos",,,,,,Não aplicável.,Não aplicável.,FALSE
Aquisição de medicamentos: Moroctocog alfa,Ajuste Direto Regime Geral,Aquisição de bens móveis,"33690000-3, Medicamentos vários","Hospital do Espírito Santo de Évora, E. P. E. (508085888)",PFIZER BIOFARMACEUTICA SOC UNIPESSOAL LDA (513300376),"23.159,00 €",05-04-2016,17-03-2016,8 dias,"Portugal, Évora, Évora","Artigo 26.º, n.º 1, alínea e) do Código dos Contratos Públicos",,,,,,Não aplicável.,Não aplicável.,FALSE
Aquisição de medicamentos  Pazopanib 400mg,Ajuste Direto Regime Geral,Aquisição de bens móveis,"33690000-3, Medicamentos vários","Hospital do Espírito Santo de Évora, E. P. E. (508085888)",NOVARTIS FARMA-PROD FARMACEUT (500063524),"30.871,80 €",05-04-2016,17-03-2016,8 dias,"Portugal, Évora, Évora","Artigo 26.º, n.º 1, alínea e) do Código dos Contratos Públicos",,,,,,Não aplicável.,Não aplicável.,FALSE
Aquisição de medicamentos: Sugamadex 100 mg,Ajuste Direto Regime Geral,Aquisição de bens móveis,"33690000-3, Medicamentos vários","Hospital do Espírito Santo de Évora, E. P. E. (508085888)",MERCK SHARP & DOME LDA (500191360),"7.780,00 €",05-04-2016,17-03-2016,8 dias,"Portugal, Évora, Évora","Artigo 26.º, n.º 1, alínea e) do Código dos Contratos Públicos",,,,,,Não aplicável.,Não aplicável.,FALSE
Aquisição de medicamentos: Trastuzumab 150mg,Ajuste Direto Regime Geral,Aquisição de bens móveis,"33690000-3, Medicamentos vários","Hospital do Espírito Santo de Évora, E. P. E. (508085888)",ROCHE FARMACEUTICA QUIMICA LDA (500233810),"24.396,50 €",05-04-2016,17-03-2016,8 dias,"Portugal, Évora, Évora","Artigo 26.º, n.º 1, alínea e) do Código dos Contratos Públicos",,,,,,Não aplicável.,Não aplicável.,FALSE
Aquisição de medicamentos - Rituximab 500mg,Ajuste Direto Regime Geral,Aquisição de bens móveis,"33652000-5, Antineoplásicos e imunomoduladores","Hospital do Espírito Santo de Évora, E. P. E. (508085888)",ROCHE FARMACEUTICA QUIMICA LDA (500233810),"12.286,56 €",05-04-2016,15-03-2016,8 dias,"Portugal, Évora, Évora","Artigo 26.º, n.º 1, alínea e) do Código dos Contratos Públicos",,,,,,Não aplicável.,Não aplicável.,FALSE
Aquisição de medicamentos - Acetado de Glatirâmero 20 mg,Ajuste Direto Regime Geral,Aquisição de bens móveis,"33600000-6, Produtos farmacêuticos","Hospital do Espírito Santo de Évora, E. P. E. (508085888)",TEVA PHARMA - PRODUTOS FARMACEUTICOS LDA (507045491),"5.550,47 €",05-04-2016,17-03-2016,8 dias,"Portugal, Évora, Évora","Artigo 26.º, n.º 1, alínea e) do Código dos Contratos Públicos",,,,,,Não aplicável.,Não aplicável.,FALSE
Aquisição de medicamentos - Tocilizumab 20mg,Ajuste Direto Regime Geral,Aquisição de bens móveis,"33632000-9, Medicamentos para o aparelho músculo-esquelético","Hospital do Espírito Santo de Évora, E. P. E. (508085888)",ROCHE FARMACEUTICA QUIMICA LDA (500233810),"7.138,32 €",05-04-2016,16-03-2016,8 dias,"Portugal, Évora, Évora","Artigo 26.º, n.º 1, alínea e) do Código dos Contratos Públicos",,,,,,Não aplicável.,Não aplicável.,FALSE
Aquisição de medicamentos: Enoxaparina sódica 40mg,Ajuste Direto Regime Geral,Aquisição de bens móveis,"33620000-2, Medicamentos para o sangue, para os órgãos hematopoiéticos e para o aparelho cardiovascular","Hospital do Espírito Santo de Évora, E. P. E. (508085888)",SANOFI- PRODUTOS FARMACEUTICOS LDA (500134960),"7.166,88 €",05-04-2016,01-04-2016,8 dias,"Portugal, Évora, Évora","Artigo 26.º, n.º 1, alínea e) do Código dos Contratos Públicos",,,,,,Não aplicável.,Não aplicável.,FALSE
Aquisição de medicamentos - Lenalidomida 10mg,Ajuste Direto Regime Geral,Aquisição de bens móveis,"33650000-1, Anti-infecciosos gerais de uso sistémico, vacinas, antineoplásicos e imunomoduladores","Hospital do Espírito Santo de Évora, E. P. E. (508085888)",CELGENE - SOCIEDADE UNIPESSOAL LDA (507791690),"9.374,60 €",05-04-2016,01-04-2016,8 dias,"Portugal, Évora, Évora","Artigo 24.º, n.º 1, alínea e) do Código dos Contratos Públicos",,,,,,Não aplicável.,Não aplicável.,FALSE
