freguesia,acronym,validVotesPercentage,votes,dicofre
Teixeira,PS,56.57,56,091221
Teixeira,PPD/PSD,25.25,25,091221
Teixeira,CDS-PP,8.08,8,091221
Teixeira,PCP-PEV,4.04,4,091221
Teixeira,PAN,2.02,2,091221
Teixeira,B.E.,1.01,1,091221
Teixeira,NC,1.01,1,091221
Teixeira,PCTP/MRPP,1.01,1,091221
Teixeira,PPM.PPV/CDC,1.01,1,091221
Teixeira,A,0,0,091221
Teixeira,IL,0,0,091221
Teixeira,L,0,0,091221
Teixeira,MAS,0,0,091221
Teixeira,PDR,0,0,091221
Teixeira,PNR,0,0,091221
Teixeira,PTP,0,0,091221
Teixeira,PURP,0,0,091221
