freguesia,acronym,validVotesPercentage,votes,dicofre
União das freguesias de Reboreda e Nogueira,PS,39.84,102,161018
União das freguesias de Reboreda e Nogueira,PPD/PSD.CDS-PP,34.77,89,161018
União das freguesias de Reboreda e Nogueira,MPT,9.77,25,161018
União das freguesias de Reboreda e Nogueira,PCP-PEV,7.42,19,161018
União das freguesias de Reboreda e Nogueira,B.E.,3.13,8,161018
União das freguesias de Reboreda e Nogueira,L,2.73,7,161018
União das freguesias de Reboreda e Nogueira,PND,0.78,2,161018
União das freguesias de Reboreda e Nogueira,PAN,0.39,1,161018
União das freguesias de Reboreda e Nogueira,PCTP/MRPP,0.39,1,161018
União das freguesias de Reboreda e Nogueira,PDA,0.39,1,161018
União das freguesias de Reboreda e Nogueira,PPM,0.39,1,161018
União das freguesias de Reboreda e Nogueira,MAS,0,0,161018
União das freguesias de Reboreda e Nogueira,PNR,0,0,161018
União das freguesias de Reboreda e Nogueira,POUS,0,0,161018
União das freguesias de Reboreda e Nogueira,PPV,0,0,161018
União das freguesias de Reboreda e Nogueira,PTP,0,0,161018
