freguesia,acronym,validVotesPercentage,votes,dicofre
Borba (São Bartolomeu),PS,48.17,92,070304
Borba (São Bartolomeu),PPD/PSD,15.71,30,070304
Borba (São Bartolomeu),PCP-PEV,12.04,23,070304
Borba (São Bartolomeu),B.E.,6.28,12,070304
Borba (São Bartolomeu),CDS-PP,5.76,11,070304
Borba (São Bartolomeu),PAN,4.71,9,070304
Borba (São Bartolomeu),PPM.PPV/CDC,2.62,5,070304
Borba (São Bartolomeu),A,1.05,2,070304
Borba (São Bartolomeu),IL,1.05,2,070304
Borba (São Bartolomeu),NC,1.05,2,070304
Borba (São Bartolomeu),L,0.52,1,070304
Borba (São Bartolomeu),PCTP/MRPP,0.52,1,070304
Borba (São Bartolomeu),PNR,0.52,1,070304
Borba (São Bartolomeu),MAS,0,0,070304
Borba (São Bartolomeu),PDR,0,0,070304
Borba (São Bartolomeu),PTP,0,0,070304
Borba (São Bartolomeu),PURP,0,0,070304
