Objeto do Contrato,Tipo de Procedimento,Tipo(s) de Contrato,CPVs,Entidade(s) Adjudicante(s),Entidade(s) Adjudicatária(s),Preço Contratual,Data de Publicação,Data de Celebração do Contrato,Prazo de Execução,Local de Execução,Fundamentação,Data de Fecho do Contrato,Preço Total Efetivo,Causas das Alterações ao Prazo,Causas das Alterações ao Preço,Estado,N.º registo do Acordo Quadro,Descrição do Acordo Quadro,Procedimento Centralizado
AQUISICAO DE EQUIPAMENTO DE FITNESS,Ajuste Direto Regime Geral,Aquisição de bens móveis,"37440000-4, Equipamentos para preparação física (fitness)",Centro Hospitalar Psiquiatrico de Lisboa (508338476),"VECOJUNCAL, LDA. (505070022)","3.503,00 €",31-01-2013,13-12-2012,0 dias,"Portugal, Lisboa, Lisboa","Artigo 20.º, n.º 1, alínea a) do Código dos Contratos Públicos",13-12-2012,"3.503,00 €",,,,Não aplicável.,Não aplicável.,
"INST. ELETRICAS DO PAV 18A; ILUMUNAÇÃO EXTERIOR DO PSL, SISTEMA DE PROTEÇÃO ATMOSFÉRICA CONTRA DESCARGAS DO PSL",Ajuste Direto Regime Geral,Empreitadas de obras públicas,"45310000-3, Obras de instalação eléctrica",Centro Hospitalar Psiquiatrico de Lisboa (508338476),MOTOLIVEIRA (507652550),"3.252,03 €",29-01-2013,15-11-2012,33 dias,"Portugal, Lisboa, Lisboa","Artigo 19.º, alínea a) do Código dos Contratos Públicos",15-11-2012,"3.252,03 €",,,,Não aplicável.,Não aplicável.,
AQUISICAO DE DOIS DISCOS RIGIDOS,Ajuste Direto Regime Geral,Aquisição de bens móveis,"37453300-1, Discos",Centro Hospitalar Psiquiatrico de Lisboa (508338476),RFB (502843330),"378,00 €",29-01-2013,18-07-2012,0 dias,"Portugal, Lisboa, Lisboa","Artigo 20.º, n.º 1, alínea a) do Código dos Contratos Públicos",23-07-2012,"378,00 €",,,,Não aplicável.,Não aplicável.,
AQUISIÇAO DE EQUIPAMENTO INFORMATICO - PARA O NIC DE CINTRA,Ajuste Direto Regime Geral,Aquisição de bens móveis,"30230000-0, Equipamento informático",Centro Hospitalar Psiquiatrico de Lisboa (508338476),"TECNOVISÃO - PRODUÇÃO DE AUDIVISUAIS, LDA (503361852)","7.079,22 €",29-01-2013,12-12-2012,32 dias,"Portugal, Lisboa, Lisboa","Artigo 20.º, n.º 1, alínea a) do Código dos Contratos Públicos",12-12-2012,"7.079,22 €",,,,Não aplicável.,Não aplicável.,
ALFALTAGEM E PAVIMENTACAO,Ajuste Direto Regime Geral,Empreitadas de obras públicas,"45233222-1, Obras de pavimentação e asfaltagem",Centro Hospitalar Psiquiatrico de Lisboa (508338476),ARMANDO CUNHA (500316066),"34.847,00 €",28-01-2013,09-08-2012,0 dias,"Portugal, Lisboa, Lisboa","Artigo 19.º, alínea a) do Código dos Contratos Públicos",23-08-2012,"34.847,00 €",,,,Não aplicável.,Não aplicável.,
AQUISIÇÃO DE LEITORES BIOMETRICOS,Ajuste Direto Regime Geral,Aquisição de bens móveis,"35125110-0, Sensores biométricos",Centro Hospitalar Psiquiatrico de Lisboa (508338476),"ELO - SISTEMAS DE INFORMAÇÃO, LDA (503258601)","9.982,40 €",28-01-2013,03-12-2012,16 dias,"Portugal, Lisboa, Lisboa","Artigo 20.º, n.º 1, alínea a) do Código dos Contratos Públicos",17-07-2013,"9.982,40 €",,,,Não aplicável.,Não aplicável.,
"AQUISIÇÃO DE SOFTWARE PARA EDIÇÃO DE IMAGEM, VIDEO ...",Ajuste Direto Regime Geral,Aquisição de bens móveis,"48328000-3, Pacote de software para processamento de imagens",Centro Hospitalar Psiquiatrico de Lisboa (508338476),"CIL - CENTRO DE INFORMATICA, SA (500809690)","5.488,56 €",28-01-2013,06-12-2012,19 dias,"Portugal, Lisboa, Lisboa","Artigo 20.º, n.º 1, alínea a) do Código dos Contratos Públicos",06-12-2012,"5.488,56 €",,,,Não aplicável.,Não aplicável.,
AQUISICAO DE MATERIAL INFORMATICO,Ajuste Direto Regime Geral,Aquisição de bens móveis,"30230000-0, Equipamento informático",Centro Hospitalar Psiquiatrico de Lisboa (508338476),"CIL, SA (500809690)","19.792,00 €",28-01-2013,18-09-2012,0 dias,"Portugal, Lisboa, Lisboa","Artigo 20.º, n.º 1, alínea a) do Código dos Contratos Públicos",18-09-2012,"19.792,00 €",,,,Não aplicável.,Não aplicável.,
AQUISIÇÃO DE LICENÇAS DE VMWV PARA VIEWS,Ajuste Direto Regime Geral,Aquisição de bens móveis,"48218000-9, Pacote de software para gestão de licenças",Centro Hospitalar Psiquiatrico de Lisboa (508338476),"CIL - CENTRO DE INFORMATICA, SA (500809690)","8.403,64 €",28-01-2013,06-12-2012,13 dias,"Portugal, Lisboa, Lisboa","Artigo 20.º, n.º 1, alínea a) do Código dos Contratos Públicos",06-12-2012,"8.403,64 €",,,,Não aplicável.,Não aplicável.,
AQUISICAO DE EQUIPAMENTO INFORMATICO,Ajuste Direto Regime Geral,Aquisição de bens móveis,"30213300-8, Computadores de secretária (desktop computers)",Centro Hospitalar Psiquiatrico de Lisboa (508338476),"CIL, SA (500809690)","5.308,00 €",28-01-2013,24-08-2012,0 dias,"Portugal, Lisboa, Lisboa","Artigo 20.º, n.º 1, alínea a) do Código dos Contratos Públicos",24-08-2012,"5.308,00 €",,,,Não aplicável.,Não aplicável.,
aquisição e montagem de ups,Ajuste Direto Regime Geral,Aquisição de bens móveis,"30210000-4, Máquinas de processamento de dados (hardware)",Centro Hospitalar Psiquiatrico de Lisboa (508338476),"AUGE - AUTOMAÇAO E GERADOR, LDA. (502977663)","650,00 €",28-01-2013,13-12-2012,0 dias,"Portugal, Lisboa, Lisboa","Artigo 20.º, n.º 1, alínea a) do Código dos Contratos Públicos",13-12-2012,"650,00 €",,,,Não aplicável.,Não aplicável.,
aquisição de tapere com logotipo,Ajuste Direto Regime Geral,Aquisição de bens móveis,"39530000-6, Carpetes, capachos e tapetes",Centro Hospitalar Psiquiatrico de Lisboa (508338476),"TRICANA, SA (500278741)","960,80 €",28-01-2013,13-12-2012,0 dias,"Portugal, Lisboa, Lisboa","Artigo 20.º, n.º 1, alínea a) do Código dos Contratos Públicos",13-12-2012,"960,80 €",,,,Não aplicável.,Não aplicável.,
aquisição e montagem de 2 (duas)  ups,Ajuste Direto Regime Geral,Aquisição de bens móveis,"30210000-4, Máquinas de processamento de dados (hardware)",Centro Hospitalar Psiquiatrico de Lisboa (508338476),AUGE - AUTOMAÇAO E GERADORES LDA (502977663),"320,00 €",28-01-2013,13-12-2012,0 dias,"Portugal, Lisboa, Lisboa","Artigo 20.º, n.º 1, alínea a) do Código dos Contratos Públicos",31-12-2012,"320,00 €",,,,Não aplicável.,Não aplicável.,
AQUISICAO DE MOBILIARIO HOSPITALAR,Ajuste Direto Regime Geral,Aquisição de bens móveis,"33192000-2, Mobiliário para fins médicos",Centro Hospitalar Psiquiatrico de Lisboa (508338476),"MUNDINTER (500199906), SANO-TECNICA (500239819)","23.175,00 €",28-01-2013,05-12-2012,0 dias,"Portugal, Lisboa, Lisboa","Artigo 20.º, n.º 1, alínea a) do Código dos Contratos Públicos",06-12-2012,"23.175,00 €",,,,Não aplicável.,Não aplicável.,
RECUPERACAO DE DOIS TANQUES,Ajuste Direto Regime Geral,Aquisição de bens móveis,"44611000-6, Tanques",Centro Hospitalar Psiquiatrico de Lisboa (508338476),RASCUNHO FACIL (509005586),"9.998,00 €",25-01-2013,20-12-2012,0 dias,"Portugal, Lisboa, Lisboa","Artigo 20.º, n.º 1, alínea a) do Código dos Contratos Públicos",20-12-2012,"9.998,00 €",,,,Não aplicável.,Não aplicável.,
AQUISICAO DE CONTENTORES,Ajuste Direto Regime Geral,Aquisição de bens móveis,"34221000-2, Contentores móveis para usos especiais",Centro Hospitalar Psiquiatrico de Lisboa (508338476),CELPUR (500060169),"5.969,00 €",25-01-2013,18-12-2012,0 dias,"Portugal, Lisboa, Lisboa","Artigo 20.º, n.º 1, alínea a) do Código dos Contratos Públicos",18-12-2012,"5.969,00 €",,,,Não aplicável.,Não aplicável.,
AQUISICAO DE CADEIRA  DE RODAS,Ajuste Direto Regime Geral,Aquisição de bens móveis,"33193120-6, Cadeiras de rodas",Centro Hospitalar Psiquiatrico de Lisboa (508338476),ORTOPEDIA ALVALADE (501939741),"1.100,00 €",22-01-2013,18-12-2012,0 dias,"Portugal, Lisboa, Lisboa","Artigo 20.º, n.º 1, alínea a) do Código dos Contratos Públicos",18-12-2012,"1.100,00 €",,,,Não aplicável.,Não aplicável.,
AQUISICAO DE PLATAFORMA,Ajuste Direto Regime Geral,Aquisição de bens móveis,"34514700-0, Plataforma móvel",Centro Hospitalar Psiquiatrico de Lisboa (508338476),MANUTAN (504779079),"6.713,00 €",21-01-2013,18-12-2012,0 dias,"Portugal, Lisboa, Lisboa","Artigo 20.º, n.º 1, alínea a) do Código dos Contratos Públicos",18-12-2012,"6.713,00 €",,,,Não aplicável.,Não aplicável.,
