freguesia,acronym,validVotesPercentage,votes,dicofre
"União das freguesias de Brunhozinho, Castanheira e Sanhoane",PPD/PSD,50,52,040829
"União das freguesias de Brunhozinho, Castanheira e Sanhoane",PS,23.08,24,040829
"União das freguesias de Brunhozinho, Castanheira e Sanhoane",CDS-PP,7.69,8,040829
"União das freguesias de Brunhozinho, Castanheira e Sanhoane",B.E.,3.85,4,040829
"União das freguesias de Brunhozinho, Castanheira e Sanhoane",L,3.85,4,040829
"União das freguesias de Brunhozinho, Castanheira e Sanhoane",PCP-PEV,1.92,2,040829
"União das freguesias de Brunhozinho, Castanheira e Sanhoane",PDR,1.92,2,040829
"União das freguesias de Brunhozinho, Castanheira e Sanhoane",A,0.96,1,040829
"União das freguesias de Brunhozinho, Castanheira e Sanhoane",IL,0.96,1,040829
"União das freguesias de Brunhozinho, Castanheira e Sanhoane",MAS,0.96,1,040829
"União das freguesias de Brunhozinho, Castanheira e Sanhoane",NC,0.96,1,040829
"União das freguesias de Brunhozinho, Castanheira e Sanhoane",PAN,0.96,1,040829
"União das freguesias de Brunhozinho, Castanheira e Sanhoane",PCTP/MRPP,0.96,1,040829
"União das freguesias de Brunhozinho, Castanheira e Sanhoane",PNR,0.96,1,040829
"União das freguesias de Brunhozinho, Castanheira e Sanhoane",PURP,0.96,1,040829
"União das freguesias de Brunhozinho, Castanheira e Sanhoane",PPM.PPV/CDC,0,0,040829
"União das freguesias de Brunhozinho, Castanheira e Sanhoane",PTP,0,0,040829
