freguesia,acronym,validVotesPercentage,votes,dicofre
Ligares,PPD/PSD,37.78,34,040404
Ligares,PS,30,27,040404
Ligares,B.E.,15.56,14,040404
Ligares,CDS-PP,7.78,7,040404
Ligares,NC,3.33,3,040404
Ligares,PCP-PEV,2.22,2,040404
Ligares,PAN,1.11,1,040404
Ligares,PCTP/MRPP,1.11,1,040404
Ligares,PTP,1.11,1,040404
Ligares,A,0,0,040404
Ligares,IL,0,0,040404
Ligares,L,0,0,040404
Ligares,MAS,0,0,040404
Ligares,PDR,0,0,040404
Ligares,PNR,0,0,040404
Ligares,PPM.PPV/CDC,0,0,040404
Ligares,PURP,0,0,040404
