Objeto do Contrato,Tipo de Procedimento,Tipo(s) de Contrato,CPVs,Entidade(s) Adjudicante(s),Entidade(s) Adjudicatária(s),Preço Contratual,Data de Publicação,Data de Celebração do Contrato,Prazo de Execução,Local de Execução,Fundamentação,Data de Fecho do Contrato,Preço Total Efetivo,Causas das Alterações ao Prazo,Causas das Alterações ao Preço,Estado,N.º registo do Acordo Quadro,Descrição do Acordo Quadro,Procedimento Centralizado
CP-AC-2018-09 Aquisição de medicamentos para as Instituições do Serviço Nacional de Saúde,Concurso público,Aquisição de bens móveis,"33600000-6, Produtos farmacêuticos","Centro Hospitalar do Porto, E.P.E. (CHP) (508331471)","PharmaKERN Portugal-Prod. Farmaceuticos, Lda (507002571)","18.538,00 €",06-12-2018,26-09-2018,183 dias,"Portugal, Porto, Porto<BR/>Portugal","Artigo 20.º, n.º 1, alínea a) do Código dos Contratos Públicos",,,,,,Não aplicável.,Não aplicável.,TRUE
CP-AC-2018-09 Aquisição de medicamentos para as Instituições do Serviço Nacional de Saúde,Concurso público,Aquisição de bens móveis,"33600000-6, Produtos farmacêuticos","Centro Hospitalar do Porto, E.P.E. (CHP) (508331471)","TEVA PHARMA-PRODUTOS FARMACÊUTICOS, LDA (507045491)","3.732,30 €",06-12-2018,26-09-2018,183 dias,"Portugal, Porto, Porto<BR/>Portugal","Artigo 20.º, n.º 1, alínea a) do Código dos Contratos Públicos",,,,,,Não aplicável.,Não aplicável.,TRUE
CP-AC-2018-09 Aquisição de medicamentos para as Instituições do Serviço Nacional de Saúde,Concurso público,Aquisição de bens móveis,"33600000-6, Produtos farmacêuticos","Centro Hospitalar do Porto, E.P.E. (CHP) (508331471)","TEVA PHARMA-PRODUTOS FARMACÊUTICOS, LDA (507045491)","549.335,70 €",06-12-2018,26-09-2018,183 dias,"Portugal<BR/>Portugal, Porto, Porto","Artigo 20.º, n.º 1, alínea a) do Código dos Contratos Públicos",,,,,,Não aplicável.,Não aplicável.,TRUE
P259-2018-162 - Aquisição ao abrigo do AQ 2017/67 para as instituições do SNS,Ao abrigo de acordo-quadro (art.º 259.º),Aquisição de bens móveis,"33600000-6, Produtos farmacêuticos","Centro Hospitalar do Porto, E.P.E. (CHP) (508331471)",GILEAD SCIENCES LDª (503604704),"27.600,00 €",06-12-2018,22-11-2018,365 dias,"Portugal, Porto, Porto<BR/>Portugal",Artigo 259.º do Código dos Contratos Públicos,,,,,,3023927,CP 2017/67 - Medicamentos para a Hepatite C crónica,TRUE
P259-2018-162 - Aquisição ao abrigo do AQ 2017/67 para as instituições do SNS,Ao abrigo de acordo-quadro (art.º 259.º),Aquisição de bens móveis,"33600000-6, Produtos farmacêuticos","Centro Hospitalar do Porto, E.P.E. (CHP) (508331471)",GILEAD SCIENCES LDª (503604704),"20.700,00 €",06-12-2018,22-11-2018,365 dias,"Portugal<BR/>Portugal, Porto, Porto",Artigo 259.º do Código dos Contratos Públicos,,,,,,3023927,CP 2017/67 - Medicamentos para a Hepatite C crónica,TRUE
P259-2018-156- Convite ao abrigo do AQ 2017/67 Hepatite C Crónica para as Instituições do SNS,Ao abrigo de acordo-quadro (art.º 259.º),Aquisição de bens móveis,"33600000-6, Produtos farmacêuticos","Centro Hospitalar do Porto, E.P.E. (CHP) (508331471)","ABBVIE, LDA (510229050)","13.199,99 €",05-12-2018,07-11-2018,365 dias,"Portugal<BR/>Portugal, Porto, Porto",Artigo 259.º do Código dos Contratos Públicos,,,,,,3023927,CP 2017/67 - Medicamentos para a Hepatite C crónica,TRUE
P259-2018-156- Convite ao abrigo do AQ 2017/67 Hepatite C Crónica para as Instituições do SNS,Ao abrigo de acordo-quadro (art.º 259.º),Aquisição de bens móveis,"33600000-6, Produtos farmacêuticos","Centro Hospitalar do Porto, E.P.E. (CHP) (508331471)","ABBVIE, LDA (510229050)","32.999,99 €",05-12-2018,07-11-2018,365 dias,"Portugal, Porto, Porto<BR/>Portugal",Artigo 259.º do Código dos Contratos Públicos,,,,,,3023927,CP 2017/67 - Medicamentos para a Hepatite C crónica,TRUE
P259-2018-157 - Aquisição ao abrigo do AQ 2017/67 para as instituições do SNS,Ao abrigo de acordo-quadro (art.º 259.º),Aquisição de bens móveis,"33600000-6, Produtos farmacêuticos","Centro Hospitalar do Porto, E.P.E. (CHP) (508331471)",MERCK SHARP & DOHME LDª (500191360),"33.503,69 €",05-12-2018,07-11-2018,365 dias,"Portugal, Porto, Porto<BR/>Portugal",Artigo 259.º do Código dos Contratos Públicos,,,,,,3023927,CP 2017/67 - Medicamentos para a Hepatite C crónica,TRUE
"CP/1058/2018 - Aquisição de Testes para extração e deteção/quantificação de ADN de BKV, HSV1, HSV2, VZV, JCV e Mycobacterium Tuberculosis com colocação de equipamento em regime de comodato.",Concurso público,Aquisição de bens móveis,"33000000-0, Equipamento médico, medicamentos e produtos para cuidados pessoais","Centro Hospitalar do Porto, E.P.E. (CHP) (508331471)",WERFEN PORTUGAL LDA (501086110),"24.496,00 €",04-12-2018,03-12-2018,365 dias,"Portugal, Porto, Porto","Artigo 20.º, n.º 1, alínea b) do Código dos Contratos Públicos",,,,,,Não aplicável.,Não aplicável.,FALSE
"CP/1058/2018 - Aquisição de Testes para extração e deteção/quantificação de ADN de BKV, HSV1, HSV2, VZV, JCV e Mycobacterium Tuberculosis com colocação de equipamento em regime de comodato.",Concurso público,Aquisição de bens móveis,"33000000-0, Equipamento médico, medicamentos e produtos para cuidados pessoais","Centro Hospitalar do Porto, E.P.E. (CHP) (508331471)","BioPortugal - Quimico Farmaceutica, Lda (502380543)","64.120,00 €",04-12-2018,03-12-2018,365 dias,"Portugal, Porto, Porto","Artigo 20.º, n.º 1, alínea b) do Código dos Contratos Públicos",,,,,,Não aplicável.,Não aplicável.,FALSE
