Objeto do Contrato,Tipo de Procedimento,Tipo(s) de Contrato,CPVs,Entidade(s) Adjudicante(s),Entidade(s) Adjudicatária(s),Preço Contratual,Data de Publicação,Data de Celebração do Contrato,Prazo de Execução,Local de Execução,Fundamentação,Data de Fecho do Contrato,Preço Total Efetivo,Causas das Alterações ao Prazo,Causas das Alterações ao Preço,Estado,N.º registo do Acordo Quadro,Descrição do Acordo Quadro,Procedimento Centralizado
Contratação de serviços médicos para os meses de abril e maio de 2016,Ajuste Direto Regime Geral,Aquisição de serviços,"85121000-3, Serviços de prática médica",Administração Regional de Saúde do Alentejo (ARSA) (503148768),"Kelly Services - Healthcare, Unipessoal, Lda. (510723691)","130.064,00 €",10-02-2017,01-04-2016,61 dias,"Portugal, Évora, Montemor-o-Novo<BR/>Portugal, Évora, Estremoz<BR/>Portugal, Évora, Vila Viçosa<BR/>Portugal, Évora, Viana do Alentejo<BR/>Portugal, Évora, Vendas Novas<BR/>Portugal, Évora, Arraiolos<BR/>Portugal, Évora, Reguengos de Monsaraz","Artigo 24.º, n.º 1, alínea c) do Código dos Contratos Públicos",31-05-2016,"126.539,75 €",,Número de horas efetuadas inferior ao número de horas contratadas.,,Não aplicável.,Não aplicável.,FALSE
Equipamento hoteleiro para o Centro de Saúde de Sines,Ajuste Direto Regime Geral,Aquisição de bens móveis,"39300000-5, Equipamento diverso",Administração Regional de Saúde do Alentejo (ARSA) (503148768),Helena Maria Frausto Maia Santos (202529193),"2.649,00 €",10-02-2017,14-09-2016,180 dias,"Portugal, Setúbal, Sines","Artigo 20.º, n.º 1, alínea a) do Código dos Contratos Públicos",31-12-2016,"2.649,00 €",,"",,Não aplicável.,Não aplicável.,FALSE
"Aquisição de serviços de leitura radiológica para as UCSP de Estremoz, Montemor-o-Novo e Vendas Novas",Ajuste Direto Regime Geral,Aquisição de serviços,"85150000-5, Serviços de imagiologia médica",Administração Regional de Saúde do Alentejo (ARSA) (503148768),"CRX - Centro Radiodiagnóstico de Évora, Lda. (501706097)","6.230,00 €",10-02-2017,01-07-2016,183 dias,"Portugal, Évora, Montemor-o-Novo<BR/>Portugal, Évora, Vendas Novas<BR/>Portugal, Évora, Estremoz","Artigo 20.º, n.º 1, alínea a) do Código dos Contratos Públicos",31-12-2016,"1.200,00 €",,Número de relatórios efetuados inferior ao número contratado.,,Não aplicável.,Não aplicável.,FALSE
"Aquisição de Contentores de Resíduos Hospitalares Perigosos e Luminómetros para esterilização da ARS Alentejo, I.P.",Ajuste Direto Regime Geral,Aquisição de bens móveis,"33191000-5, Aparelhos para esterilização, desinfecção e higiene","Administração Regional de Saúde do Alentejo, I. P. (503148768)","Cleancheck, Lda (507225252)","1.936,00 €",09-02-2017,27-12-2016,30 dias,"Portugal, Évora, Évora","Artigo 20.º, n.º 1, alínea a) do Código dos Contratos Públicos",29-12-2016,"1.936,00 €",,"",,Não aplicável.,Não aplicável.,FALSE
"Aquisição de Contentores de Resíduos Hospitalares Perigosos e Luminómetros para esterilização da ARS Alentejo, I.P.",Ajuste Direto Regime Geral,Aquisição de bens móveis,"34928480-6, Contentores e baldes para lixo e resíduos","Administração Regional de Saúde do Alentejo, I. P. (503148768)","Ambimed - Gestão Ambiental, Lda. (503593427)","1.400,84 €",09-02-2017,27-12-2016,30 dias,"Portugal, Évora","Artigo 20.º, n.º 1, alínea a) do Código dos Contratos Públicos",28-12-2016,"1.400,84 €",,"",,Não aplicável.,Não aplicável.,FALSE
Aquisição de maçãs - Material de apoio para reunião com o HESE dia 17/01/2017.,Ajuste Direto Regime Geral,Aquisição de bens móveis,"15000000-8, Produtos alimentares, bebidas, tabaco e produtos afins","Administração Regional de Saúde do Alentejo, I. P. (503148768)","Panis - Supermercados, Ldª (501587276)","0,84 €",08-02-2017,16-01-2017,5 dias,"Portugal, Évora, Évora","Artigo 20.º, n.º 1, alínea a) do Código dos Contratos Públicos",23-01-2017,"0,84 €",,"",,Não aplicável.,Não aplicável.,FALSE
"Aquisição de Aparelho de RX intraoral Digital para Centro de Saúde de Estremoz, Cadeira de dentista para Centro de Saúde de Évora e Compressor para o Centro de Saúde de Montemor-o-Novo",Ajuste Direto Regime Geral,Aquisição de bens móveis,"33192410-9, Cadeiras de odontologia","Administração Regional de Saúde do Alentejo, I. P. (503148768)","Dentina, Importação e Comércio de Material Dentário, Lda. (502335335)","20.886,50 €",07-02-2017,12-12-2016,60 dias,"Portugal, Évora, Évora<BR/>Portugal, Évora, Montemor-o-Novo<BR/>Portugal, Évora, Estremoz","Artigo 20.º, n.º 1, alínea a) do Código dos Contratos Públicos",27-12-2016,"20.886,50 €",,"",,Não aplicável.,Não aplicável.,FALSE
Contratação serviços de enfermagem para o CS Redondo,Ajuste Direto Regime Geral,Aquisição de serviços,"85141200-1, Serviços prestados pelo pessoal de enfermagem",Administração Regional de Saúde do Alentejo (ARSA) (503148768),"Corevalue Healthcare Solutions, Lda. (513654577)","2.757,30 €",07-02-2017,14-10-2016,78 dias,"Portugal, Évora, Redondo","Artigo 20.º, n.º 1, alínea a) do Código dos Contratos Públicos",31-12-2016,"2.757,30 €",,"",,Não aplicável.,Não aplicável.,FALSE
"Contratação de serviços de assistentes técnicos, assistentes operacionais e enfermeiros para o ACES",Ajuste Direto Regime Geral,Aquisição de serviços,"79610000-3, Serviços de colocação de pessoal",Administração Regional de Saúde do Alentejo (ARSA) (503148768),"Medipeople Soluções de Saúde e Educação, Lda. (508543436)","53.790,45 €",07-02-2017,19-07-2016,165 dias,"Portugal, Évora","Artigo 20.º, n.º 1, alínea a) do Código dos Contratos Públicos",31-12-2016,"47.444,90 €",,Número de horas prestadas inferior ao número de horas contratadas,,Não aplicável.,Não aplicável.,FALSE
Aquisição de caixa de tubos de grafite para determinação de metais pesados por espectrometria de absorção atómica em câmara de grafite para o Laboratório de Saúde Pública do Alentejo - Polo de Portalegre,Ajuste Direto Regime Geral,Aquisição de bens móveis,"33696500-0, Reagentes de laboratório","Administração Regional de Saúde do Alentejo, I. P. (503148768)","I.L.C. Serviços, Lda (504721410)","2.106,90 €",02-02-2017,25-05-2016,30 dias,"Portugal, Portalegre, Portalegre","Artigo 20.º, n.º 1, alínea a) do Código dos Contratos Públicos","","",,"",,Não aplicável.,Não aplicável.,FALSE
Aquisição de Serviços de manutenção Corretiva e Evolutiva aos Sistemas Aplicacionais para o ano 2016.,Ajuste Direto Regime Geral,Aquisição de serviços,"50000000-5, Serviços de reparação e manutenção","Administração Regional de Saúde do Alentejo, I. P. (503148768)",First Solutions (505345978),"25.630,43 €",01-02-2017,25-05-2016,365 dias,"Portugal, Évora","Artigo 20.º, n.º 1, alínea a) do Código dos Contratos Públicos",30-12-2016,"25.630,43 €",,"",,Não aplicável.,Não aplicável.,FALSE
Contratação de serviços para manutenção do espectrofotómetro de absorção atómica do Laboratório de Saúde Pública do Alentejo - Polo de Portalegre,Ajuste Direto Regime Geral,Aquisição de serviços,"50400000-9, Serviços de reparação e manutenção de equipamento médico e de precisão","Administração Regional de Saúde do Alentejo, I. P. (503148768)","I.L.C. Serviços, Lda (504721410)","1.388,00 €",01-02-2017,25-05-2016,120 dias,"Portugal, Portalegre, Portalegre","Artigo 20.º, n.º 1, alínea a) do Código dos Contratos Públicos",23-09-2016,"1.388,00 €",,"",,Não aplicável.,Não aplicável.,FALSE
Contratação de serviços para manutenção do fotómetro de chama do Laboratório de Saúde Pública do Alentejo - Polo de Évora,Ajuste Direto Regime Geral,Aquisição de serviços,"50400000-9, Serviços de reparação e manutenção de equipamento médico e de precisão",Administração Regional de Saúde do Alentejo (ARSA) (503148768),"IZASA II Scientific Unipessoal, Ldª (513252088)","266,58 €",01-02-2017,21-12-2016,30 dias,"Portugal, Évora, Évora","Artigo 20.º, n.º 1, alínea a) do Código dos Contratos Públicos",23-12-2016,"266,58 €",,"",,Não aplicável.,Não aplicável.,FALSE
