Objeto do Contrato,Tipo de Procedimento,Tipo(s) de Contrato,CPVs,Entidade(s) Adjudicante(s),Entidade(s) Adjudicatária(s),Preço Contratual,Data de Publicação,Data de Celebração do Contrato,Prazo de Execução,Local de Execução,Fundamentação,Data de Fecho do Contrato,Preço Total Efetivo,Causas das Alterações ao Prazo,Causas das Alterações ao Preço,Estado,N.º registo do Acordo Quadro,Descrição do Acordo Quadro,Procedimento Centralizado
Aquisição de Material de Penso,Concurso público,Aquisição de bens móveis,"33140000-3, Material médico de consumo","Hospital de Santa Maria Maior, E. P. E. (506361381)","Molnlycke Health Care - Comercialização de Produtos Hospitalares, Lda. (511101066)","377,30 €",10-08-2017,20-07-2017,164 dias,"Portugal, Braga, Barcelos","Artigo 20.º, n.º 1, alínea b) do Código dos Contratos Públicos",,,,,,Não aplicável.,Não aplicável.,FALSE
Aquisição de Material de Penso,Concurso público,Aquisição de bens móveis,"33140000-3, Material médico de consumo","Hospital de Santa Maria Maior, E. P. E. (506361381)","BSN MEDICAL, S.A. (505385058)","1.507,80 €",10-08-2017,20-07-2017,164 dias,"Portugal, Braga, Barcelos","Artigo 20.º, n.º 1, alínea b) do Código dos Contratos Públicos",,,,,,Não aplicável.,Não aplicável.,FALSE
Aquisição de Material de Penso,Concurso público,Aquisição de bens móveis,"33140000-3, Material médico de consumo","Hospital de Santa Maria Maior, E. P. E. (506361381)","TEXTIL PLANAS OLIVEIRAS PORTUGAL, UNIP.LDA. (509211216)","153,80 €",10-08-2017,20-07-2017,164 dias,"Portugal, Braga, Barcelos","Artigo 20.º, n.º 1, alínea b) do Código dos Contratos Públicos",,,,,,Não aplicável.,Não aplicável.,FALSE
Aquisição de Material de Penso,Concurso público,Aquisição de bens móveis,"33140000-3, Material médico de consumo","Hospital de Santa Maria Maior, E. P. E. (506361381)","Abilio Freire, Lda (500432600)","2.449,34 €",09-08-2017,20-07-2017,164 dias,"Portugal, Braga, Barcelos","Artigo 20.º, n.º 1, alínea b) do Código dos Contratos Públicos",,,,,,Não aplicável.,Não aplicável.,FALSE
Aquisição de Material de Penso,Concurso público,Aquisição de bens móveis,"33140000-3, Material médico de consumo","Hospital de Santa Maria Maior, E. P. E. (506361381)","Bastos Viegas, S.A. (500042772)","2.140,16 €",09-08-2017,20-07-2017,164 dias,"Portugal, Braga, Barcelos","Artigo 20.º, n.º 1, alínea b) do Código dos Contratos Públicos",,,,,,Não aplicável.,Não aplicável.,FALSE
Aquisição de Material de Penso,Concurso público,Aquisição de bens móveis,"33140000-3, Material médico de consumo","Hospital de Santa Maria Maior, E. P. E. (506361381)","Clinifar - Produtos Clínicos Farmacêuticos, Lda. (503281115)","579,50 €",09-08-2017,20-07-2017,164 dias,"Portugal, Braga, Barcelos","Artigo 20.º, n.º 1, alínea b) do Código dos Contratos Públicos",,,,,,Não aplicável.,Não aplicável.,FALSE
Aquisição de Material de Penso,Concurso público,Aquisição de bens móveis,"33140000-3, Material médico de consumo","Hospital de Santa Maria Maior, E. P. E. (506361381)",PAUL HARTMANN (502271728),"4.410,85 €",09-08-2017,20-07-2017,164 dias,"Portugal, Braga, Barcelos","Artigo 20.º, n.º 1, alínea b) do Código dos Contratos Públicos",,,,,,Não aplicável.,Não aplicável.,FALSE
Aquisição de Material de Penso,Concurso público,Aquisição de bens móveis,"33140000-3, Material médico de consumo","Hospital de Santa Maria Maior, E. P. E. (506361381)","Medicinalia Cormedica - MCMedical, Lda. (500684324)","4.019,96 €",09-08-2017,20-07-2017,164 dias,"Portugal, Braga, Barcelos","Artigo 20.º, n.º 1, alínea b) do Código dos Contratos Públicos",,,,,,Não aplicável.,Não aplicável.,FALSE
Aquisição de Material de Penso,Concurso público,Aquisição de bens móveis,"33140000-3, Material médico de consumo","Hospital de Santa Maria Maior, E. P. E. (506361381)","DOCWORLD, Lda (508592909)","512,84 €",09-08-2017,20-07-2017,164 dias,"Portugal, Braga, Barcelos","Artigo 20.º, n.º 1, alínea b) do Código dos Contratos Públicos",,,,,,Não aplicável.,Não aplicável.,FALSE
Aquisição de Material de Penso,Concurso público,Aquisição de bens móveis,"33140000-3, Material médico de consumo","Hospital de Santa Maria Maior, E. P. E. (506361381)","MEDIFILANIS - Com. Artigos Médicos, Lda. (505806843)","106,93 €",09-08-2017,20-07-2017,164 dias,"Portugal, Braga, Barcelos","Artigo 20.º, n.º 1, alínea b) do Código dos Contratos Públicos",,,,,,Não aplicável.,Não aplicável.,FALSE
Aquisição de Material de Penso,Concurso público,Aquisição de bens móveis,"33140000-3, Material médico de consumo","Hospital de Santa Maria Maior, E. P. E. (506361381)",FACTOR PLUS (502810645),"150,28 €",09-08-2017,20-07-2017,164 dias,"Portugal, Braga, Barcelos","Artigo 20.º, n.º 1, alínea b) do Código dos Contratos Públicos",,,,,,Não aplicável.,Não aplicável.,FALSE
Prestação de Serviços de Higiene e Limpeza,Concurso público,Aquisição de serviços,"90910000-9, Serviços de limpeza","Hospital de Santa Maria Maior, E. P. E. (506361381)","Garnica Facility Services, Lda. (509909515)","6.435,63 €",03-08-2017,29-06-2017,185 dias,"Portugal, Braga, Barcelos","Artigo 20.º, n.º 1, alínea b) do Código dos Contratos Públicos",,,,,,Não aplicável.,Não aplicável.,FALSE
