freguesia,acronym,validVotesPercentage,votes,dicofre
Galegos,PPD/PSD,39.53,68,030912
Galegos,PS,36.63,63,030912
Galegos,B.E.,8.72,15,030912
Galegos,CDS-PP,4.65,8,030912
Galegos,PAN,3.49,6,030912
Galegos,L,1.74,3,030912
Galegos,PCP-PEV,1.74,3,030912
Galegos,NC,1.16,2,030912
Galegos,A,0.58,1,030912
Galegos,PCTP/MRPP,0.58,1,030912
Galegos,PPM.PPV/CDC,0.58,1,030912
Galegos,PTP,0.58,1,030912
Galegos,IL,0,0,030912
Galegos,MAS,0,0,030912
Galegos,PDR,0,0,030912
Galegos,PNR,0,0,030912
Galegos,PURP,0,0,030912
