freguesia,acronym,validVotesPercentage,votes,dicofre
Pedreiras,PPD/PSD.CDS-PP,47.28,304,101609
Pedreiras,PS,25.82,166,101609
Pedreiras,MPT,9.49,61,101609
Pedreiras,PCP-PEV,6.38,41,101609
Pedreiras,B.E.,2.8,18,101609
Pedreiras,L,1.56,10,101609
Pedreiras,PCTP/MRPP,1.56,10,101609
Pedreiras,PND,1.4,9,101609
Pedreiras,PAN,1.09,7,101609
Pedreiras,PNR,0.78,5,101609
Pedreiras,MAS,0.62,4,101609
Pedreiras,PPM,0.62,4,101609
Pedreiras,PTP,0.62,4,101609
Pedreiras,PDA,0,0,101609
Pedreiras,POUS,0,0,101609
Pedreiras,PPV,0,0,101609
