freguesia,acronym,validVotesPercentage,votes,dicofre
Pico,PPD/PSD.CDS-PP,60.51,118,031335
Pico,PS,22.05,43,031335
Pico,MPT,6.67,13,031335
Pico,PCP-PEV,2.56,5,031335
Pico,B.E.,1.54,3,031335
Pico,L,1.54,3,031335
Pico,PAN,1.03,2,031335
Pico,PCTP/MRPP,1.03,2,031335
Pico,PPM,1.03,2,031335
Pico,MAS,0.51,1,031335
Pico,PND,0.51,1,031335
Pico,PNR,0.51,1,031335
Pico,PTP,0.51,1,031335
Pico,PDA,0,0,031335
Pico,POUS,0,0,031335
Pico,PPV,0,0,031335
