freguesia,acronym,validVotesPercentage,votes,dicofre
"União das freguesias de Eucisia, Gouveia e Valverde",PS,39.2,49,040122
"União das freguesias de Eucisia, Gouveia e Valverde",PPD/PSD,32.8,41,040122
"União das freguesias de Eucisia, Gouveia e Valverde",B.E.,8,10,040122
"União das freguesias de Eucisia, Gouveia e Valverde",CDS-PP,8,10,040122
"União das freguesias de Eucisia, Gouveia e Valverde",L,4,5,040122
"União das freguesias de Eucisia, Gouveia e Valverde",PAN,1.6,2,040122
"União das freguesias de Eucisia, Gouveia e Valverde",PPM.PPV/CDC,1.6,2,040122
"União das freguesias de Eucisia, Gouveia e Valverde",PURP,1.6,2,040122
"União das freguesias de Eucisia, Gouveia e Valverde",IL,0.8,1,040122
"União das freguesias de Eucisia, Gouveia e Valverde",MAS,0.8,1,040122
"União das freguesias de Eucisia, Gouveia e Valverde",PCP-PEV,0.8,1,040122
"União das freguesias de Eucisia, Gouveia e Valverde",PDR,0.8,1,040122
"União das freguesias de Eucisia, Gouveia e Valverde",A,0,0,040122
"União das freguesias de Eucisia, Gouveia e Valverde",NC,0,0,040122
"União das freguesias de Eucisia, Gouveia e Valverde",PCTP/MRPP,0,0,040122
"União das freguesias de Eucisia, Gouveia e Valverde",PNR,0,0,040122
"União das freguesias de Eucisia, Gouveia e Valverde",PTP,0,0,040122
