freguesia,acronym,validVotesPercentage,votes,dicofre
Manigoto,PPD/PSD,50.79,32,091014
Manigoto,PS,30.16,19,091014
Manigoto,CDS-PP,7.94,5,091014
Manigoto,PAN,6.35,4,091014
Manigoto,B.E.,1.59,1,091014
Manigoto,PPM.PPV/CDC,1.59,1,091014
Manigoto,PURP,1.59,1,091014
Manigoto,A,0,0,091014
Manigoto,IL,0,0,091014
Manigoto,L,0,0,091014
Manigoto,MAS,0,0,091014
Manigoto,NC,0,0,091014
Manigoto,PCP-PEV,0,0,091014
Manigoto,PCTP/MRPP,0,0,091014
Manigoto,PDR,0,0,091014
Manigoto,PNR,0,0,091014
Manigoto,PTP,0,0,091014
