freguesia,acronym,validVotesPercentage,votes,dicofre
Freamunde,PS,41.49,861,130908
Freamunde,PPD/PSD,24.58,510,130908
Freamunde,PCP-PEV,8.77,182,130908
Freamunde,B.E.,8.29,172,130908
Freamunde,PAN,5.35,111,130908
Freamunde,CDS-PP,3.81,79,130908
Freamunde,PCTP/MRPP,2.17,45,130908
Freamunde,L,1.78,37,130908
Freamunde,IL,0.82,17,130908
Freamunde,A,0.72,15,130908
Freamunde,NC,0.72,15,130908
Freamunde,PPM.PPV/CDC,0.63,13,130908
Freamunde,PURP,0.29,6,130908
Freamunde,PNR,0.24,5,130908
Freamunde,PDR,0.14,3,130908
Freamunde,MAS,0.1,2,130908
Freamunde,PTP,0.1,2,130908
