freguesia,acronym,validVotesPercentage,votes,dicofre
São João Baptista,PS,39.76,1017,141001
São João Baptista,PPD/PSD.CDS-PP,19.78,506,141001
São João Baptista,PCP-PEV,16.61,425,141001
São João Baptista,B.E.,8.13,208,141001
São João Baptista,MPT,6.76,173,141001
São João Baptista,L,2.03,52,141001
São João Baptista,PCTP/MRPP,1.95,50,141001
São João Baptista,PAN,1.52,39,141001
São João Baptista,PNR,0.66,17,141001
São João Baptista,PPM,0.66,17,141001
São João Baptista,PND,0.63,16,141001
São João Baptista,PTP,0.55,14,141001
São João Baptista,PPV,0.35,9,141001
São João Baptista,MAS,0.23,6,141001
São João Baptista,PDA,0.23,6,141001
São João Baptista,POUS,0.12,3,141001
