Objeto do Contrato,Tipo de Procedimento,Tipo(s) de Contrato,CPVs,Entidade(s) Adjudicante(s),Entidade(s) Adjudicatária(s),Preço Contratual,Data de Publicação,Data de Celebração do Contrato,Prazo de Execução,Local de Execução,Fundamentação,Data de Fecho do Contrato,Preço Total Efetivo,Causas das Alterações ao Prazo,Causas das Alterações ao Preço,Estado,N.º registo do Acordo Quadro,Descrição do Acordo Quadro,Procedimento Centralizado
Fornecimento de reagentes para o Laboratório de Patologia Clínica - Microbiologia ( Biologia Molecular ),Concurso público,Aquisição de bens móveis,"33696200-7, Reagentes para análises ao sangue","Hospital da Senhora da Oliveira Guimarães, E. P. E. (508080827)","BIOMERIEUX PORTUGAL, LDA. (501524177)","38.160,00 €",06-11-2017,14-08-2017,365 dias,"Portugal, Braga, Guimarães","Artigo 20.º, n.º 1, alínea b) do Código dos Contratos Públicos",,,,,,Não aplicável.,Não aplicável.,FALSE
Fornecimento de reagentes para o Laboratório de Patologia Clínica - Microbiologia ( Biologia Molecular ),Concurso público,Aquisição de bens móveis,"33696200-7, Reagentes para análises ao sangue","Hospital da Senhora da Oliveira Guimarães, E. P. E. (508080827)","WERFEN PORTUGAL, LDA. (501086110)","27.214,00 €",06-11-2017,14-08-2017,365 dias,"Portugal, Braga, Guimarães","Artigo 20.º, n.º 1, alínea b) do Código dos Contratos Públicos",,,,,,Não aplicável.,Não aplicável.,FALSE
Fornecimento de reagentes para o Laboratório de Patologia Clínica - Microbiologia ( Biologia Molecular ),Concurso público,Aquisição de bens móveis,"33696200-7, Reagentes para análises ao sangue","Hospital da Senhora da Oliveira Guimarães, E. P. E. (508080827)","BIOPORTUGAL - Químico Farmacêutica, LDA. (502380543)","73.500,00 €",06-11-2017,14-08-2017,365 dias,"Portugal, Braga, Guimarães","Artigo 20.º, n.º 1, alínea b) do Código dos Contratos Públicos",,,,,,Não aplicável.,Não aplicável.,FALSE
