freguesia,acronym,validVotesPercentage,votes,dicofre
Santiago de Piães,PS,39.48,122,180412
Santiago de Piães,PPD/PSD.CDS-PP,37.86,117,180412
Santiago de Piães,MPT,9.71,30,180412
Santiago de Piães,PCP-PEV,3.24,10,180412
Santiago de Piães,B.E.,2.27,7,180412
Santiago de Piães,PND,1.62,5,180412
Santiago de Piães,L,1.29,4,180412
Santiago de Piães,PCTP/MRPP,1.29,4,180412
Santiago de Piães,PTP,1.29,4,180412
Santiago de Piães,MAS,0.65,2,180412
Santiago de Piães,PAN,0.65,2,180412
Santiago de Piães,PDA,0.32,1,180412
Santiago de Piães,PPM,0.32,1,180412
Santiago de Piães,PNR,0,0,180412
Santiago de Piães,POUS,0,0,180412
Santiago de Piães,PPV,0,0,180412
