Objeto do Contrato,Tipo de Procedimento,Tipo(s) de Contrato,CPVs,Entidade(s) Adjudicante(s),Entidade(s) Adjudicatária(s),Preço Contratual,Data de Publicação,Data de Celebração do Contrato,Prazo de Execução,Local de Execução,Fundamentação,Data de Fecho do Contrato,Preço Total Efetivo,Causas das Alterações ao Prazo,Causas das Alterações ao Preço,Estado,N.º registo do Acordo Quadro,Descrição do Acordo Quadro,Procedimento Centralizado
Material de Tratamento - Sondas,Ajuste Direto Regime Geral,Aquisição de bens móveis,"33141641-5, Sondas","Administração Regional de Saúde do Algarve, I.P. (503148709)",Vygon Portugal Produtos Médicos e Farmaceuticos Lda. (503232785),"889,50 €",30-01-2012,24-01-2012,3 dias,"Portugal, Faro, Faro","Artigo 20.º, n.º 1, alínea a) do Código dos Contratos Públicos",03-09-2012,"889,50 €",,,,Não aplicável.,Não aplicável.,
Aquisição de Sacos de Plástico,Ajuste Direto Regime Geral,Aquisição de bens móveis,"19640000-4, Sacos de polietileno para recolha de lixo e resíduos","Administração Regional de Saúde do Algarve, I.P. (503148709)",Plasticolors Transformação Materias Plasticas Lda. (504183346),"27.760,00 €",30-01-2012,27-01-2012,270 dias,"Portugal, Faro, Faro","Artigo 20.º, n.º 1, alínea a) do Código dos Contratos Públicos","","",,,,Não aplicável.,Não aplicável.,
Aquisição de Sacos de Plástico,Ajuste Direto Regime Geral,Aquisição de bens móveis,"19640000-4, Sacos de polietileno para recolha de lixo e resíduos","Administração Regional de Saúde do Algarve, I.P. (503148709)",Palma & Palma Representações Lda. (502675250),"7.073,50 €",30-01-2012,17-01-2012,270 dias,"Portugal, Faro, Faro","Artigo 20.º, n.º 1, alínea a) do Código dos Contratos Públicos","","",,,,Não aplicável.,Não aplicável.,
AQUISIÇÃO DE IMPRESSOS,Ajuste Direto Regime Geral,Aquisição de bens móveis,"22800000-8, Livros de registo e de contabilidade, capas, formulários e outros artigos de papelaria impressos, de papel ou cartão","Administração Regional de Saúde do Algarve, I.P. (503148709)","Gráfica, Lda. (500129860)","16.209,10 €",26-01-2012,26-01-2012,10 dias,"Portugal, Faro, Faro","Artigo 20.º, n.º 1, alínea a) do Código dos Contratos Públicos","","",,,,Não aplicável.,Não aplicável.,
AQUISIÇÃO DE IMPRESSOS,Ajuste Direto Regime Geral,Aquisição de bens móveis,"22800000-8, Livros de registo e de contabilidade, capas, formulários e outros artigos de papelaria impressos, de papel ou cartão","Administração Regional de Saúde do Algarve, I.P. (503148709)","Gráfica Central Mealhadense, Lda. (500129789)","1.100,00 €",26-01-2012,23-01-2012,10 dias,"Portugal, Faro<BR/>Portugal, Faro, Faro","Artigo 20.º, n.º 1, alínea a) do Código dos Contratos Públicos","","",,,,Não aplicável.,Não aplicável.,
"Empreitada de reposição das frações das antigas instalações da Farmácia. Os trabalhos a desenvolver são na sua maioria de Construção Civil dividindo-se em demolições e remoções, reparações e pinturas em paredes e tectos e outros trabalhos diversos.",Ajuste Direto Regime Geral,Empreitadas de obras públicas,"45453000-7, Obras de revisão e recuperação","Administração Regional de Saúde do Algarve, I.P. (503148709)","Obra dArte - Engenharia, Lda (506036383)","2.495,10 €",25-01-2012,16-01-2012,15 dias,"Portugal, Faro, Faro","Artigo 19.º, alínea a) do Código dos Contratos Públicos",13-02-2012,"2.495,10 €",,,,Não aplicável.,Não aplicável.,
Material de Consumo Hoteleiro,Ajuste Direto Regime Geral,Aquisição de bens móveis,"39830000-9, Produtos de limpeza","Administração Regional de Saúde do Algarve, I.P. (503148709)",Francisco Felizardo Monteiro (159910633),"4.234,04 €",25-01-2012,20-01-2012,270 dias,"Portugal, Faro, Faro","Artigo 20.º, n.º 1, alínea a) do Código dos Contratos Públicos","","",,,,Não aplicável.,Não aplicável.,
