Objeto do Contrato,Tipo de Procedimento,Tipo(s) de Contrato,CPVs,Entidade(s) Adjudicante(s),Entidade(s) Adjudicatária(s),Preço Contratual,Data de Publicação,Data de Celebração do Contrato,Prazo de Execução,Local de Execução,Fundamentação,Data de Fecho do Contrato,Preço Total Efetivo,Causas das Alterações ao Prazo,Causas das Alterações ao Preço,Estado,N.º registo do Acordo Quadro,Descrição do Acordo Quadro,Procedimento Centralizado
Substituição de celas de contagem do posto de seccionamento,Ajuste Direto Regime Geral,Aquisição de bens móveis,"31682000-0, Material para electricidade","Centro Hospitalar Cova da Beira, E. P. E. (506361659)","CINOV- INDUSTRIA E COMERCIO, S.A. (500704864)","7.840,00 €",21-11-2018,08-10-2018,15 dias,"Portugal, Castelo Branco, Covilhã","Artigo 20.º, n.º 1, alínea d) do Código dos Contratos Públicos",,,,,,Não aplicável.,Não aplicável.,FALSE
Aquisição de ligaduras e redes elásticas,Ao abrigo de acordo-quadro (art.º 259.º),Aquisição de bens móveis,"33600000-6, Produtos farmacêuticos","Centro Hospitalar Cova da Beira, E. P. E. (506361659)","Paul Hartmann, Lda. (502271728)","9.300,00 €",21-11-2018,24-10-2018,1095 dias,"Portugal, Castelo Branco, Covilhã",Artigo 259.º do Código dos Contratos Públicos,,,,,,2819651,"Aquisição de Medicamentos desencadeada pela SPMS, no âmbito do Despacho 1571/B de 2016, ao Abrigo do Acordo quadro 2015/6 e 2014/18, Ref.ª P259-AC-2017-86",FALSE
"AD 33-18-Serviços Manutenção de Software Aplicacional HS-SGICM (Interface Imobilizado), MAC (SIEs) e HS-DIET",Ajuste Direto Regime Geral,Aquisição de serviços,"72267000-4, Serviços de manutenção e reparação de software","Centro Hospitalar Cova da Beira, EPE (506361659)","Glintt - Healthcare Solutions, S.A. (502479418)","9.670,06 €",16-11-2018,06-11-2018,365 dias,"Portugal<BR/>Portugal, Castelo Branco, Covilhã","Artigo 24.º, n.º 1, alínea e), subalínea ii) do Código dos Contratos Públicos",,,,,,Não aplicável.,Não aplicável.,FALSE
Medicamento: Dexmedetomidina,Ajuste Direto Regime Geral,Aquisição de bens móveis,"33600000-6, Produtos farmacêuticos","Centro Hospitalar Cova da Beira, E. P. E. (506361659)","Orifin Unipessoal, Lda. (508907365)","27.900,00 €",16-11-2018,23-07-2018,153 dias,"Portugal, Castelo Branco, Covilhã","Artigo 24.º, n.º 1, alínea e), subalínea iii) do Código dos Contratos Públicos",,,,,,Não aplicável.,Não aplicável.,FALSE
