freguesia,acronym,validVotesPercentage,votes,dicofre
Rebordãos,PPD/PSD.CDS-PP,63.06,70,040236
Rebordãos,PS,14.41,16,040236
Rebordãos,MPT,7.21,8,040236
Rebordãos,PCP-PEV,4.5,5,040236
Rebordãos,B.E.,3.6,4,040236
Rebordãos,PND,2.7,3,040236
Rebordãos,L,1.8,2,040236
Rebordãos,PPM,1.8,2,040236
Rebordãos,MAS,0.9,1,040236
Rebordãos,PAN,0,0,040236
Rebordãos,PCTP/MRPP,0,0,040236
Rebordãos,PDA,0,0,040236
Rebordãos,PNR,0,0,040236
Rebordãos,POUS,0,0,040236
Rebordãos,PPV,0,0,040236
Rebordãos,PTP,0,0,040236
