freguesia,acronym,validVotesPercentage,votes,dicofre
Peniche,PS,33.41,1116,101407
Peniche,PCP-PEV,23.62,789,101407
Peniche,PPD/PSD.CDS-PP,22.37,747,101407
Peniche,MPT,7.51,251,101407
Peniche,B.E.,4.61,154,101407
Peniche,PCTP/MRPP,2.6,87,101407
Peniche,PAN,1.89,63,101407
Peniche,L,1.83,61,101407
Peniche,PPM,0.54,18,101407
Peniche,PNR,0.39,13,101407
Peniche,PPV,0.36,12,101407
Peniche,PTP,0.36,12,101407
Peniche,PND,0.24,8,101407
Peniche,MAS,0.12,4,101407
Peniche,PDA,0.12,4,101407
Peniche,POUS,0.03,1,101407
