Objeto do Contrato,Tipo de Procedimento,Tipo(s) de Contrato,CPVs,Entidade(s) Adjudicante(s),Entidade(s) Adjudicatária(s),Preço Contratual,Data de Publicação,Data de Celebração do Contrato,Prazo de Execução,Local de Execução,Fundamentação,Data de Fecho do Contrato,Preço Total Efetivo,Causas das Alterações ao Prazo,Causas das Alterações ao Preço,Estado,N.º registo do Acordo Quadro,Descrição do Acordo Quadro,Procedimento Centralizado
Serviços Médicos para Interrupção Voluntária da Gravidez,Concurso público,Aquisição de serviços,"85121000-3, Serviços de prática médica","Hospital Distrital de Santarém, E. P. E. (506361462)","Samer Ames, Sa  (507740343)","48.021,78 €",09-08-2017,03-08-2017,140 dias,"Portugal, Santarém, Santarém","Artigo 20.º, n.º 1, alínea b) do Código dos Contratos Públicos",,,,,,Não aplicável.,Não aplicável.,FALSE
Misturadores de cimento ósseo,Concurso público,Aquisição de bens móveis,"33140000-3, Material médico de consumo","Hospital Distrital de Santarém, E. P. E. (506361462)","ARTUR SALGADO, S.A. (503612600)","1.000,00 €",08-08-2017,02-08-2017,152 dias,"Portugal, Santarém, Santarém","Artigo 20.º, n.º 1, alínea b) do Código dos Contratos Públicos",,,,,,Não aplicável.,Não aplicável.,FALSE
Misturadores de cimento ósseo,Concurso público,Aquisição de bens móveis,"33140000-3, Material médico de consumo","Hospital Distrital de Santarém, E. P. E. (506361462)","HERAUES MEDICAL PORTUGAL, LDA (508322227)","1.250,00 €",08-08-2017,02-08-2017,152 dias,"Portugal, Santarém, Santarém","Artigo 20.º, n.º 1, alínea b) do Código dos Contratos Públicos",,,,,,Não aplicável.,Não aplicável.,FALSE
MEDICAMENTOS,Ajuste Direto Regime Geral,Aquisição de bens móveis,"33600000-6, Produtos farmacêuticos","Hospital Distrital de Santarém, EPE (506361462)",ASTRAZENECA PRODUTOS FARMACEUTICOS LDA (502942240),"192.579,47 €",05-08-2017,23-01-2017,342 dias,"Portugal, Santarém, Santarém","Artigo 24.º, n.º 1, alínea e) do Código dos Contratos Públicos",,,,,,Não aplicável.,Não aplicável.,FALSE
Packs para injeção intraocular,Concurso público,Aquisição de bens móveis,"33141620-2, Kits médicos","Hospital Distrital de Santarém, E. P. E. (506361462)","MEDLINE INTERNATIONAL UNIPESSOAL, LDA (510533515)","2.988,00 €",02-08-2017,21-06-2017,153 dias,"Portugal, Santarém, Santarém","Artigo 20.º, n.º 1, alínea b) do Código dos Contratos Públicos",,,,,,Não aplicável.,Não aplicável.,FALSE
Fibra para Laser Lumenis,Ajuste Direto Regime Geral,Aquisição de bens móveis,"33140000-3, Material médico de consumo","Hospital Distrital de Santarém, EPE (506361462)","Medicinália Cormédica, Lda (500684324)","17.500,00 €",01-08-2017,24-07-2017,150 dias,"Portugal, Santarém, Santarém","Artigo 24.º, n.º 1, alínea e) do Código dos Contratos Públicos",,,,,,Não aplicável.,Não aplicável.,FALSE
Pacemaker,Ajuste Direto Regime Geral,Aquisição de bens móveis,"33182210-4, Estimulador cardíaco (pacemaker)","Hospital Distrital de Santarém, EPE (506361462)","St. Jude Medical Portugal, Lda (504180746)","30.650,00 €",31-07-2017,14-06-2017,90 dias,"Portugal, Santarém, Santarém","Artigo 20.º, n.º 1, alínea a) do Código dos Contratos Públicos",,,,,,Não aplicável.,Não aplicável.,FALSE
