freguesia,acronym,validVotesPercentage,votes,dicofre
"União das freguesias de Aldeia da Ribeira, Vilar Maior e Badamalos",PPD/PSD,51.35,57,091141
"União das freguesias de Aldeia da Ribeira, Vilar Maior e Badamalos",PS,19.82,22,091141
"União das freguesias de Aldeia da Ribeira, Vilar Maior e Badamalos",B.E.,5.41,6,091141
"União das freguesias de Aldeia da Ribeira, Vilar Maior e Badamalos",CDS-PP,4.5,5,091141
"União das freguesias de Aldeia da Ribeira, Vilar Maior e Badamalos",PAN,4.5,5,091141
"União das freguesias de Aldeia da Ribeira, Vilar Maior e Badamalos",A,2.7,3,091141
"União das freguesias de Aldeia da Ribeira, Vilar Maior e Badamalos",PCP-PEV,2.7,3,091141
"União das freguesias de Aldeia da Ribeira, Vilar Maior e Badamalos",PCTP/MRPP,2.7,3,091141
"União das freguesias de Aldeia da Ribeira, Vilar Maior e Badamalos",L,1.8,2,091141
"União das freguesias de Aldeia da Ribeira, Vilar Maior e Badamalos",PDR,1.8,2,091141
"União das freguesias de Aldeia da Ribeira, Vilar Maior e Badamalos",MAS,0.9,1,091141
"União das freguesias de Aldeia da Ribeira, Vilar Maior e Badamalos",NC,0.9,1,091141
"União das freguesias de Aldeia da Ribeira, Vilar Maior e Badamalos",PPM.PPV/CDC,0.9,1,091141
"União das freguesias de Aldeia da Ribeira, Vilar Maior e Badamalos",IL,0,0,091141
"União das freguesias de Aldeia da Ribeira, Vilar Maior e Badamalos",PNR,0,0,091141
"União das freguesias de Aldeia da Ribeira, Vilar Maior e Badamalos",PTP,0,0,091141
"União das freguesias de Aldeia da Ribeira, Vilar Maior e Badamalos",PURP,0,0,091141
