freguesia,acronym,validVotesPercentage,votes,dicofre
Fridão,PS,53.95,123,130115
Fridão,PPD/PSD,21.05,48,130115
Fridão,B.E.,8.77,20,130115
Fridão,CDS-PP,7.02,16,130115
Fridão,PDR,2.19,5,130115
Fridão,PAN,1.75,4,130115
Fridão,PCP-PEV,1.32,3,130115
Fridão,L,0.88,2,130115
Fridão,PCTP/MRPP,0.88,2,130115
Fridão,PNR,0.88,2,130115
Fridão,A,0.44,1,130115
Fridão,PPM.PPV/CDC,0.44,1,130115
Fridão,PTP,0.44,1,130115
Fridão,IL,0,0,130115
Fridão,MAS,0,0,130115
Fridão,NC,0,0,130115
Fridão,PURP,0,0,130115
