freguesia,acronym,validVotesPercentage,votes,dicofre
Canidelo,PS,40.58,3667,131704
Canidelo,PPD/PSD,17.36,1569,131704
Canidelo,B.E.,15.08,1363,131704
Canidelo,PAN,7.22,652,131704
Canidelo,PCP-PEV,6.34,573,131704
Canidelo,CDS-PP,4.13,373,131704
Canidelo,NC,1.84,166,131704
Canidelo,L,1.76,159,131704
Canidelo,IL,1.23,111,131704
Canidelo,A,1.16,105,131704
Canidelo,PCTP/MRPP,0.87,79,131704
Canidelo,PPM.PPV/CDC,0.81,73,131704
Canidelo,PDR,0.6,54,131704
Canidelo,PURP,0.37,33,131704
Canidelo,PNR,0.33,30,131704
Canidelo,PTP,0.18,16,131704
Canidelo,MAS,0.14,13,131704
