freguesia,acronym,validVotesPercentage,votes,dicofre
Quadrazais,PS,50.85,60,091123
Quadrazais,PPD/PSD,28.81,34,091123
Quadrazais,B.E.,5.08,6,091123
Quadrazais,CDS-PP,4.24,5,091123
Quadrazais,PAN,3.39,4,091123
Quadrazais,A,1.69,2,091123
Quadrazais,PCP-PEV,1.69,2,091123
Quadrazais,PNR,1.69,2,091123
Quadrazais,PTP,1.69,2,091123
Quadrazais,L,0.85,1,091123
Quadrazais,IL,0,0,091123
Quadrazais,MAS,0,0,091123
Quadrazais,NC,0,0,091123
Quadrazais,PCTP/MRPP,0,0,091123
Quadrazais,PDR,0,0,091123
Quadrazais,PPM.PPV/CDC,0,0,091123
Quadrazais,PURP,0,0,091123
