Objeto do Contrato,Tipo de Procedimento,Tipo(s) de Contrato,CPVs,Entidade(s) Adjudicante(s),Entidade(s) Adjudicatária(s),Preço Contratual,Data de Publicação,Data de Celebração do Contrato,Prazo de Execução,Local de Execução,Fundamentação,Data de Fecho do Contrato,Preço Total Efetivo,Causas das Alterações ao Prazo,Causas das Alterações ao Preço,Estado,N.º registo do Acordo Quadro,Descrição do Acordo Quadro,Procedimento Centralizado
CAT - Cytovison,Ajuste Direto Regime Geral,Aquisição de serviços,"50000000-5, Serviços de reparação e manutenção","Instituto Nacional de Saúde Dr. Ricardo Jorge, I. P. (501427511)","Emílio de Azevedo Campos, SA (500094853)","450,00 €",10-01-2014,03-07-2013,180 dias,"Portugal, Lisboa, Lisboa","Artigo 20.º, n.º 1, alínea a) do Código dos Contratos Públicos",,,,,,Não aplicável.,Não aplicável.,FALSE
Aquisição de serviços e manutenção de autoclaves,Ajuste Direto Regime Geral,Aquisição de serviços,"50410000-2, Serviços de reparação e manutenção de aparelhos de medição, ensaio e controlo",Instituto Nacional de Saúde Dr.Ricardo Jorge(INSA) (501427511),Serviço de Utilização Comum dos Hospitais (500900469),"2.927,50 €",10-01-2014,14-08-2013,137 dias,"Portugal, Lisboa, Lisboa","Artigo 20.º, n.º 1, alínea a) do Código dos Contratos Públicos",,,,,,Não aplicável.,Não aplicável.,FALSE
20130625 - Aquisição de reagentes,Ajuste Direto Regime Geral,Aquisição de bens móveis,"33140000-3, Material médico de consumo","Instituto Nacional de Saúde Dr. Ricardo Jorge, I. P. (501427511)","VWR INTERNATIONAL - MATERIAL DE LABORATÓRIO, LDA (503842770)","25,00 €",10-01-2014,21-10-2013,90 dias,"Portugal, Lisboa, Lisboa","Artigo 20.º, n.º 1, alínea a) do Código dos Contratos Públicos",,,,,,Não aplicável.,Não aplicável.,FALSE
20130625 - Aquisição de reagentes,Ajuste Direto Regime Geral,Aquisição de bens móveis,"33140000-3, Material médico de consumo","Instituto Nacional de Saúde Dr. Ricardo Jorge, I. P. (501427511)","REAGENTE 5 -  QUÍMICA E ELECTRÓNICA, LDA (501194053)","62,00 €",10-01-2014,21-10-2013,90 dias,"Portugal, Lisboa, Lisboa","Artigo 20.º, n.º 1, alínea a) do Código dos Contratos Públicos",,,,,,Não aplicável.,Não aplicável.,FALSE
20130625 - Aquisição de reagentes,Ajuste Direto Regime Geral,Aquisição de bens móveis,"33140000-3, Material médico de consumo","Instituto Nacional de Saúde Dr. Ricardo Jorge, I. P. (501427511)","REAGENTE 5 -  QUÍMICA E ELECTRÓNICA, LDA (501194053)","16,00 €",10-01-2014,21-10-2013,90 dias,"Portugal, Lisboa, Lisboa","Artigo 20.º, n.º 1, alínea a) do Código dos Contratos Públicos",,,,,,Não aplicável.,Não aplicável.,FALSE
20130625 - Aquisição de reagentes,Ajuste Direto Regime Geral,Aquisição de bens móveis,"33140000-3, Material médico de consumo","Instituto Nacional de Saúde Dr. Ricardo Jorge, I. P. (501427511)","REAGENTE 5 -  QUÍMICA E ELECTRÓNICA, LDA (501194053)","23,00 €",10-01-2014,21-10-2013,90 dias,"Portugal, Lisboa, Lisboa","Artigo 20.º, n.º 1, alínea a) do Código dos Contratos Públicos",,,,,,Não aplicável.,Não aplicável.,FALSE
20130625 - Aquisição de reagentes,Ajuste Direto Regime Geral,Aquisição de bens móveis,"33140000-3, Material médico de consumo","Instituto Nacional de Saúde Dr. Ricardo Jorge, I. P. (501427511)","VWR INTERNATIONAL - MATERIAL DE LABORATÓRIO, LDA (503842770)","220,00 €",10-01-2014,21-10-2013,90 dias,"Portugal, Lisboa, Lisboa","Artigo 20.º, n.º 1, alínea a) do Código dos Contratos Públicos",,,,,,Não aplicável.,Não aplicável.,FALSE
20130625 - Aquisição de reagentes,Ajuste Direto Regime Geral,Aquisição de bens móveis,"33140000-3, Material médico de consumo","Instituto Nacional de Saúde Dr. Ricardo Jorge, I. P. (501427511)","VWR INTERNATIONAL - MATERIAL DE LABORATÓRIO, LDA (503842770)","95,00 €",10-01-2014,21-10-2013,90 dias,"Portugal, Lisboa, Lisboa","Artigo 20.º, n.º 1, alínea a) do Código dos Contratos Públicos",,,,,,Não aplicável.,Não aplicável.,FALSE
20130625 - Aquisição de reagentes,Ajuste Direto Regime Geral,Aquisição de bens móveis,"33140000-3, Material médico de consumo","Instituto Nacional de Saúde Dr. Ricardo Jorge, I. P. (501427511)","REAGENTE 5 -  QUÍMICA E ELECTRÓNICA, LDA (501194053)","132,00 €",10-01-2014,21-10-2013,90 dias,"Portugal, Lisboa, Lisboa","Artigo 20.º, n.º 1, alínea a) do Código dos Contratos Públicos",,,,,,Não aplicável.,Não aplicável.,FALSE
20130625 - Aquisição de reagentes,Ajuste Direto Regime Geral,Aquisição de bens móveis,"33140000-3, Material médico de consumo","Instituto Nacional de Saúde Dr. Ricardo Jorge, I. P. (501427511)","VWR INTERNATIONAL - MATERIAL DE LABORATÓRIO, LDA (503842770)","19,00 €",10-01-2014,21-10-2013,90 dias,"Portugal, Lisboa, Lisboa","Artigo 20.º, n.º 1, alínea a) do Código dos Contratos Públicos",,,,,,Não aplicável.,Não aplicável.,FALSE
20130625 - Aquisição de reagentes,Ajuste Direto Regime Geral,Aquisição de bens móveis,"33140000-3, Material médico de consumo","Instituto Nacional de Saúde Dr. Ricardo Jorge, I. P. (501427511)","VWR INTERNATIONAL - MATERIAL DE LABORATÓRIO, LDA (503842770)","60,00 €",10-01-2014,21-10-2013,90 dias,"Portugal, Lisboa, Lisboa","Artigo 20.º, n.º 1, alínea a) do Código dos Contratos Públicos",,,,,,Não aplicável.,Não aplicável.,FALSE
20130625 - Aquisição de reagentes,Ajuste Direto Regime Geral,Aquisição de bens móveis,"33140000-3, Material médico de consumo","Instituto Nacional de Saúde Dr. Ricardo Jorge, I. P. (501427511)","VWR INTERNATIONAL - MATERIAL DE LABORATÓRIO, LDA (503842770)","76,00 €",10-01-2014,21-10-2013,90 dias,"Portugal, Lisboa, Lisboa","Artigo 20.º, n.º 1, alínea a) do Código dos Contratos Públicos",,,,,,Não aplicável.,Não aplicável.,FALSE
20130625 - Aquisição de reagentes,Ajuste Direto Regime Geral,Aquisição de bens móveis,"33140000-3, Material médico de consumo","Instituto Nacional de Saúde Dr. Ricardo Jorge, I. P. (501427511)","REAGENTE 5 -  QUÍMICA E ELECTRÓNICA, LDA (501194053)","92,00 €",10-01-2014,21-10-2013,90 dias,"Portugal, Lisboa, Lisboa","Artigo 20.º, n.º 1, alínea a) do Código dos Contratos Públicos",,,,,,Não aplicável.,Não aplicável.,FALSE
20130625 - Aquisição de reagentes,Ajuste Direto Regime Geral,Aquisição de bens móveis,"33140000-3, Material médico de consumo","Instituto Nacional de Saúde Dr. Ricardo Jorge, I. P. (501427511)","VWR INTERNATIONAL - MATERIAL DE LABORATÓRIO, LDA (503842770)","19,00 €",10-01-2014,21-10-2013,90 dias,"Portugal, Lisboa, Lisboa","Artigo 20.º, n.º 1, alínea a) do Código dos Contratos Públicos",,,,,,Não aplicável.,Não aplicável.,FALSE
20130625 -Aquisição de reagentes,Ajuste Direto Regime Geral,Aquisição de bens móveis,"33140000-3, Material médico de consumo","Instituto Nacional de Saúde Dr. Ricardo Jorge, I. P. (501427511)","VWR INTERNATIONAL - MATERIAL DE LABORATÓRIO, LDA (503842770)","38,00 €",10-01-2014,21-10-2013,90 dias,"Portugal, Lisboa, Lisboa","Artigo 20.º, n.º 1, alínea a) do Código dos Contratos Públicos",,,,,,Não aplicável.,Não aplicável.,FALSE
20130625 - Aquisição de reagentes,Ajuste Direto Regime Geral,Aquisição de bens móveis,"33140000-3, Material médico de consumo","Instituto Nacional de Saúde Dr. Ricardo Jorge, I. P. (501427511)","VWR INTERNATIONAL - MATERIAL DE LABORATÓRIO, LDA (503842770)","38,00 €",09-01-2014,21-10-2013,90 dias,"Portugal, Lisboa, Lisboa","Artigo 20.º, n.º 1, alínea a) do Código dos Contratos Públicos",,,,,,Não aplicável.,Não aplicável.,FALSE
20130625 - Aquisição de reagentes,Ajuste Direto Regime Geral,Aquisição de bens móveis,"33140000-3, Material médico de consumo","Instituto Nacional de Saúde Dr. Ricardo Jorge, I. P. (501427511)","VWR INTERNATIONAL - MATERIAL DE LABORATÓRIO, LDA (503842770)","19,00 €",09-01-2014,21-10-2013,90 dias,"Portugal, Lisboa, Lisboa","Artigo 20.º, n.º 1, alínea a) do Código dos Contratos Públicos",,,,,,Não aplicável.,Não aplicável.,FALSE
20130625 - Aquisição de reagentes,Ajuste Direto Regime Geral,Aquisição de bens móveis,"33140000-3, Material médico de consumo","Instituto Nacional de Saúde Dr. Ricardo Jorge, I. P. (501427511)","VWR INTERNATIONAL - MATERIAL DE LABORATÓRIO, LDA (503842770)","57,00 €",09-01-2014,21-10-2013,90 dias,"Portugal, Lisboa, Lisboa","Artigo 20.º, n.º 1, alínea a) do Código dos Contratos Públicos",,,,,,Não aplicável.,Não aplicável.,FALSE
20130625 - Aquisição de reagentes,Ajuste Direto Regime Geral,Aquisição de bens móveis,"33140000-3, Material médico de consumo","Instituto Nacional de Saúde Dr. Ricardo Jorge, I. P. (501427511)","REAGENTE 5 -  QUÍMICA E ELECTRÓNICA, LDA (501194053)","105,00 €",09-01-2014,21-10-2013,90 dias,"Portugal, Lisboa, Lisboa","Artigo 20.º, n.º 1, alínea a) do Código dos Contratos Públicos",,,,,,Não aplicável.,Não aplicável.,FALSE
20130625 - Aquisição de reagentes,Ajuste Direto Regime Geral,Aquisição de bens móveis,"33140000-3, Material médico de consumo","Instituto Nacional de Saúde Dr. Ricardo Jorge, I. P. (501427511)","REAGENTE 5 -  QUÍMICA E ELECTRÓNICA, LDA (501194053)","45,00 €",09-01-2014,21-10-2013,90 dias,"Portugal, Lisboa, Lisboa","Artigo 20.º, n.º 1, alínea a) do Código dos Contratos Públicos",,,,,,Não aplicável.,Não aplicável.,FALSE
20130625 - Aquisição de reagentes,Ajuste Direto Regime Geral,Aquisição de bens móveis,"33140000-3, Material médico de consumo","Instituto Nacional de Saúde Dr. Ricardo Jorge, I. P. (501427511)","REAGENTE 5 -  QUÍMICA E ELECTRÓNICA, LDA (501194053)","90,00 €",09-01-2014,21-10-2013,90 dias,"Portugal, Lisboa, Lisboa","Artigo 20.º, n.º 1, alínea a) do Código dos Contratos Públicos",,,,,,Não aplicável.,Não aplicável.,FALSE
20130625 - Aquisição de reagentes,Ajuste Direto Regime Geral,Aquisição de bens móveis,"33140000-3, Material médico de consumo","Instituto Nacional de Saúde Dr. Ricardo Jorge, I. P. (501427511)","REAGENTE 5 -  QUÍMICA E ELECTRÓNICA, LDA (501194053)","121,00 €",09-01-2014,21-10-2013,90 dias,"Portugal, Lisboa, Lisboa","Artigo 20.º, n.º 1, alínea a) do Código dos Contratos Públicos",,,,,,Não aplicável.,Não aplicável.,FALSE
20130625 - Aquisição de reagentes,Ajuste Direto Regime Geral,Aquisição de bens móveis,"33140000-3, Material médico de consumo","Instituto Nacional de Saúde Dr. Ricardo Jorge, I. P. (501427511)",FISHER SCIENTIFIC LDA. (506429210),"109,00 €",09-01-2014,21-10-2013,90 dias,"Portugal, Lisboa, Lisboa","Artigo 20.º, n.º 1, alínea a) do Código dos Contratos Públicos",,,,,,Não aplicável.,Não aplicável.,FALSE
20130625 - Aquisição de reagentes,Ajuste Direto Regime Geral,Aquisição de bens móveis,"33140000-3, Material médico de consumo","Instituto Nacional de Saúde Dr. Ricardo Jorge, I. P. (501427511)","VWR INTERNATIONAL - MATERIAL DE LABORATÓRIO, LDA (503842770)","50,20 €",09-01-2014,21-10-2013,90 dias,"Portugal, Lisboa, Lisboa","Artigo 20.º, n.º 1, alínea a) do Código dos Contratos Públicos",,,,,,Não aplicável.,Não aplicável.,FALSE
20130625 - Aquisição de reagentes,Ajuste Direto Regime Geral,Aquisição de bens móveis,"33140000-3, Material médico de consumo","Instituto Nacional de Saúde Dr. Ricardo Jorge, I. P. (501427511)","VWR INTERNATIONAL - MATERIAL DE LABORATÓRIO, LDA (503842770)","10,00 €",09-01-2014,21-10-2013,90 dias,"Portugal, Lisboa, Lisboa","Artigo 20.º, n.º 1, alínea a) do Código dos Contratos Públicos",,,,,,Não aplicável.,Não aplicável.,FALSE
20130625 - Aquisição de reagentes,Ajuste Direto Regime Geral,Aquisição de bens móveis,"33140000-3, Material médico de consumo","Instituto Nacional de Saúde Dr. Ricardo Jorge, I. P. (501427511)","VWR INTERNATIONAL - MATERIAL DE LABORATÓRIO, LDA (503842770)","27,00 €",09-01-2014,21-10-2013,90 dias,"Portugal, Lisboa, Lisboa","Artigo 20.º, n.º 1, alínea a) do Código dos Contratos Públicos",,,,,,Não aplicável.,Não aplicável.,FALSE
20130625 - Aquisição de reagentes,Ajuste Direto Regime Geral,Aquisição de bens móveis,"33140000-3, Material médico de consumo","Instituto Nacional de Saúde Dr. Ricardo Jorge, I. P. (501427511)",FISHER SCIENTIFIC LDA. (506429210),"451,00 €",09-01-2014,21-10-2013,90 dias,"Portugal, Lisboa, Lisboa","Artigo 20.º, n.º 1, alínea a) do Código dos Contratos Públicos",,,,,,Não aplicável.,Não aplicável.,FALSE
20130625 - Aquisição de reagentes,Ajuste Direto Regime Geral,Aquisição de bens móveis,"33140000-3, Material médico de consumo","Instituto Nacional de Saúde Dr. Ricardo Jorge, I. P. (501427511)",FISHER SCIENTIFIC LDA. (506429210),"451,00 €",09-01-2014,21-10-2013,90 dias,"Portugal, Lisboa, Lisboa","Artigo 20.º, n.º 1, alínea a) do Código dos Contratos Públicos",,,,,,Não aplicável.,Não aplicável.,FALSE
20130625 - Aquisição de reagentes,Ajuste Direto Regime Geral,Aquisição de bens móveis,"33140000-3, Material médico de consumo","Instituto Nacional de Saúde Dr. Ricardo Jorge, I. P. (501427511)",FISHER SCIENTIFIC LDA. (506429210),"451,00 €",09-01-2014,21-10-2013,90 dias,"Portugal, Lisboa, Lisboa","Artigo 20.º, n.º 1, alínea a) do Código dos Contratos Públicos",,,,,,Não aplicável.,Não aplicável.,FALSE
20130625 - Aquisição de reagentes,Ajuste Direto Regime Geral,Aquisição de bens móveis,"33140000-3, Material médico de consumo","Instituto Nacional de Saúde Dr. Ricardo Jorge, I. P. (501427511)",FISHER SCIENTIFIC LDA. (506429210),"810,00 €",09-01-2014,21-10-2013,90 dias,"Portugal, Lisboa, Lisboa","Artigo 20.º, n.º 1, alínea a) do Código dos Contratos Públicos",,,,,,Não aplicável.,Não aplicável.,FALSE
20130625 - Aquisição de reagentes,Ajuste Direto Regime Geral,Aquisição de bens móveis,"33140000-3, Material médico de consumo","Instituto Nacional de Saúde Dr. Ricardo Jorge, I. P. (501427511)",FISHER SCIENTIFIC LDA. (506429210),"159,30 €",09-01-2014,21-10-2013,90 dias,"Portugal, Lisboa, Lisboa","Artigo 20.º, n.º 1, alínea a) do Código dos Contratos Públicos",,,,,,Não aplicável.,Não aplicável.,FALSE
20130625 - Aquisição de reagentes,Ajuste Direto Regime Geral,Aquisição de bens móveis,"33140000-3, Material médico de consumo","Instituto Nacional de Saúde Dr. Ricardo Jorge, I. P. (501427511)",FISHER SCIENTIFIC LDA. (506429210),"238,95 €",09-01-2014,21-10-2013,90 dias,"Portugal, Lisboa, Lisboa","Artigo 20.º, n.º 1, alínea a) do Código dos Contratos Públicos",,,,,,Não aplicável.,Não aplicável.,FALSE
20130625 - Aquisição de reagentes,Ajuste Direto Regime Geral,Aquisição de bens móveis,"33140000-3, Material médico de consumo","Instituto Nacional de Saúde Dr. Ricardo Jorge, I. P. (501427511)",FISHER SCIENTIFIC LDA. (506429210),"902,00 €",09-01-2014,21-10-2013,90 dias,"Portugal, Lisboa, Lisboa","Artigo 20.º, n.º 1, alínea a) do Código dos Contratos Públicos",,,,,,Não aplicável.,Não aplicável.,FALSE
20130625 - Aquisição de reagentes,Ajuste Direto Regime Geral,Aquisição de bens móveis,"33140000-3, Material médico de consumo","Instituto Nacional de Saúde Dr. Ricardo Jorge, I. P. (501427511)",FISHER SCIENTIFIC LDA. (506429210),"159,30 €",09-01-2014,21-10-2013,90 dias,"Portugal, Lisboa, Lisboa","Artigo 20.º, n.º 1, alínea a) do Código dos Contratos Públicos",,,,,,Não aplicável.,Não aplicável.,FALSE
20130625 - Aquisição de reagentes,Ajuste Direto Regime Geral,Aquisição de bens móveis,"33140000-3, Material médico de consumo","Instituto Nacional de Saúde Dr. Ricardo Jorge, I. P. (501427511)",FISHER SCIENTIFIC LDA. (506429210),"225,65 €",09-01-2014,21-10-2013,90 dias,"Portugal, Lisboa, Lisboa","Artigo 20.º, n.º 1, alínea a) do Código dos Contratos Públicos",,,,,,Não aplicável.,Não aplicável.,FALSE
20130625 - Aquisição de reagentes,Ajuste Direto Regime Geral,Aquisição de bens móveis,"33140000-3, Material médico de consumo","Instituto Nacional de Saúde Dr. Ricardo Jorge, I. P. (501427511)",FISHER SCIENTIFIC LDA. (506429210),"902,00 €",09-01-2014,21-10-2013,90 dias,"Portugal, Lisboa, Lisboa","Artigo 20.º, n.º 1, alínea a) do Código dos Contratos Públicos",,,,,,Não aplicável.,Não aplicável.,FALSE
20130625 - Aquisição de reagentes,Ajuste Direto Regime Geral,Aquisição de bens móveis,"33140000-3, Material médico de consumo","Instituto Nacional de Saúde Dr. Ricardo Jorge, I. P. (501427511)",FISHER SCIENTIFIC LDA. (506429210),"159,30 €",09-01-2014,21-10-2013,90 dias,"Portugal, Lisboa, Lisboa","Artigo 20.º, n.º 1, alínea a) do Código dos Contratos Públicos",,,,,,Não aplicável.,Não aplicável.,FALSE
20130625 - Aquisição de reagentes,Ajuste Direto Regime Geral,Aquisição de bens móveis,"33140000-3, Material médico de consumo","Instituto Nacional de Saúde Dr. Ricardo Jorge, I. P. (501427511)",FISHER SCIENTIFIC LDA. (506429210),"318,60 €",09-01-2014,21-10-2013,90 dias,"Portugal, Lisboa, Lisboa","Artigo 20.º, n.º 1, alínea a) do Código dos Contratos Públicos",,,,,,Não aplicável.,Não aplicável.,FALSE
20130625 - Aquisição de reagentes,Ajuste Direto Regime Geral,Aquisição de bens móveis,"33140000-3, Material médico de consumo","Instituto Nacional de Saúde Dr. Ricardo Jorge, I. P. (501427511)",FISHER SCIENTIFIC LDA. (506429210),"902,00 €",09-01-2014,21-10-2013,90 dias,"Portugal, Lisboa, Lisboa","Artigo 20.º, n.º 1, alínea a) do Código dos Contratos Públicos",,,,,,Não aplicável.,Não aplicável.,FALSE
20130625,Ajuste Direto Regime Geral,Aquisição de bens móveis,"33140000-3, Material médico de consumo","Instituto Nacional de Saúde Dr. Ricardo Jorge, I. P. (501427511)",FISHER SCIENTIFIC LDA. (506429210),"398,25 €",09-01-2014,21-10-2013,90 dias,"Portugal, Lisboa, Lisboa","Artigo 20.º, n.º 1, alínea a) do Código dos Contratos Públicos",,,,,,Não aplicável.,Não aplicável.,FALSE
20130625 - Aquisição de reagentes,Ajuste Direto Regime Geral,Aquisição de bens móveis,"33140000-3, Material médico de consumo","Instituto Nacional de Saúde Dr. Ricardo Jorge, I. P. (501427511)",FISHER SCIENTIFIC LDA. (506429210),"902,00 €",09-01-2014,21-10-2013,90 dias,"Portugal, Lisboa, Lisboa","Artigo 20.º, n.º 1, alínea a) do Código dos Contratos Públicos",,,,,,Não aplicável.,Não aplicável.,FALSE
20130625 - Aquisição de reagentes,Ajuste Direto Regime Geral,Aquisição de bens móveis,"33140000-3, Material médico de consumo","Instituto Nacional de Saúde Dr. Ricardo Jorge, I. P. (501427511)",FISHER SCIENTIFIC LDA. (506429210),"902,00 €",09-01-2014,21-10-2013,90 dias,"Portugal, Lisboa, Lisboa","Artigo 20.º, n.º 1, alínea a) do Código dos Contratos Públicos",,,,,,Não aplicável.,Não aplicável.,FALSE
20130625 - Aquisição de reagentes,Ajuste Direto Regime Geral,Aquisição de bens móveis,"33140000-3, Material médico de consumo","Instituto Nacional de Saúde Dr. Ricardo Jorge, I. P. (501427511)",FISHER SCIENTIFIC LDA. (506429210),"1.125,00 €",09-01-2014,21-10-2013,90 dias,"Portugal, Lisboa, Lisboa","Artigo 20.º, n.º 1, alínea a) do Código dos Contratos Públicos",,,,,,Não aplicável.,Não aplicável.,FALSE
20130625 - Aquisição de reagentes,Ajuste Direto Regime Geral,Aquisição de bens móveis,"33140000-3, Material médico de consumo","Instituto Nacional de Saúde Dr. Ricardo Jorge, I. P. (501427511)",FISHER SCIENTIFIC LDA. (506429210),"320,00 €",09-01-2014,21-10-2013,90 dias,"Portugal, Lisboa, Lisboa","Artigo 20.º, n.º 1, alínea a) do Código dos Contratos Públicos",,,,,,Não aplicável.,Não aplicável.,FALSE
CP- 33 Material de consumo clinico,Concurso público,Aquisição de bens móveis,"33140000-3, Material médico de consumo","Instituto Nacional de Saúde Dr. Ricardo Jorge, I.P. (501427511)","ILC - INSTRUMENTOS LABORATÓRIO E CIENTÍFICOS, LDA (500948208)","886,00 €",09-01-2014,09-12-2013,90 dias,"Portugal, Lisboa, Lisboa","Artigo 20.º, n.º 1, alínea b) do Código dos Contratos Públicos",,,,,,Não aplicável.,Não aplicável.,FALSE
CP- 33 Material de consumo clinico,Concurso público,Aquisição de bens móveis,"33140000-3, Material médico de consumo","Instituto Nacional de Saúde Dr. Ricardo Jorge, I.P. (501427511)","ANASTÁCIO SALDANHA UNIPESSOAL, LDA (505804441)","1.999,18 €",09-01-2014,09-12-2013,90 dias,"Portugal, Lisboa, Lisboa","Artigo 20.º, n.º 1, alínea b) do Código dos Contratos Públicos",,,,,,Não aplicável.,Não aplicável.,FALSE
CP -33 Material de consumo clinico,Concurso público,Aquisição de bens móveis,"33140000-3, Material médico de consumo","Instituto Nacional de Saúde Dr. Ricardo Jorge, I.P. (501427511)","ANASTÁCIO SALDANHA UNIPESSOAL, LDA (505804441)","2.700,55 €",09-01-2014,09-12-2013,90 dias,"Portugal, Lisboa, Lisboa","Artigo 20.º, n.º 1, alínea b) do Código dos Contratos Públicos",,,,,,Não aplicável.,Não aplicável.,FALSE
CP -33 Material de consumo clinico,Concurso público,Aquisição de bens móveis,"33140000-3, Material médico de consumo","Instituto Nacional de Saúde Dr. Ricardo Jorge, I.P. (501427511)","SARSTEDT - TECNOLOGIA DE LABORATÓRIO, LDA (503019461)","720,00 €",09-01-2014,09-12-2013,90 dias,"Portugal, Lisboa, Lisboa","Artigo 20.º, n.º 1, alínea b) do Código dos Contratos Públicos",,,,,,Não aplicável.,Não aplicável.,FALSE
CP -33 Material de consumo clinico,Concurso público,Aquisição de bens móveis,"33140000-3, Material médico de consumo","Instituto Nacional de Saúde Dr. Ricardo Jorge, I.P. (501427511)","TYPE SOLUTION, SA (508400317)","1.794,40 €",09-01-2014,09-12-2013,90 dias,"Portugal, Lisboa, Lisboa","Artigo 20.º, n.º 1, alínea b) do Código dos Contratos Públicos",,,,,,Não aplicável.,Não aplicável.,FALSE
CP -33 Material de consumo clinico,Concurso público,Aquisição de bens móveis,"33140000-3, Material médico de consumo","Instituto Nacional de Saúde Dr. Ricardo Jorge, I.P. (501427511)","VIDROLAB 2 - VIDROS E MATERIAL DE LABORATÓRIO, LDA (501450629)","204,00 €",09-01-2014,09-12-2013,90 dias,"Portugal, Lisboa, Lisboa","Artigo 20.º, n.º 1, alínea b) do Código dos Contratos Públicos",,,,,,Não aplicável.,Não aplicável.,FALSE
CP- 33 Material consumo clinico,Concurso público,Aquisição de bens móveis,"33140000-3, Material médico de consumo","Instituto Nacional de Saúde Dr. Ricardo Jorge, I.P. (501427511)","TYPE SOLUTION, SA (508400317)","23.673,27 €",09-01-2014,09-12-2013,90 dias,"Portugal, Lisboa, Lisboa","Artigo 20.º, n.º 1, alínea b) do Código dos Contratos Públicos",,,,,,Não aplicável.,Não aplicável.,FALSE
CP -33 Material consumo clinico,Concurso público,Aquisição de bens móveis,"33140000-3, Material médico de consumo","Instituto Nacional de Saúde Dr. Ricardo Jorge, I.P. (501427511)","AIATELAB - EQUIPAMENTOS DE LABORATÓRIO, LDA (508533104)","71,70 €",09-01-2014,09-12-2013,90 dias,"Portugal, Lisboa, Lisboa","Artigo 20.º, n.º 1, alínea b) do Código dos Contratos Públicos",,,,,,Não aplicável.,Não aplicável.,FALSE
CP -33 Material consumo clinico,Concurso público,Aquisição de bens móveis,"33140000-3, Material médico de consumo","Instituto Nacional de Saúde Dr. Ricardo Jorge, I.P. (501427511)","VWR INTERNATIONAL - MATERIAL DE LABORATÓRIO, LDA (503842770)","414,48 €",09-01-2014,09-12-2013,90 dias,"Portugal, Lisboa, Lisboa","Artigo 20.º, n.º 1, alínea b) do Código dos Contratos Públicos",,,,,,Não aplicável.,Não aplicável.,FALSE
CP- 33 Material consumo clinico,Concurso público,Aquisição de bens móveis,"33140000-3, Material médico de consumo","Instituto Nacional de Saúde Dr. Ricardo Jorge, I.P. (501427511)","VWR INTERNATIONAL - MATERIAL DE LABORATÓRIO, LDA (503842770)","304,50 €",09-01-2014,09-12-2013,90 dias,"Portugal, Lisboa, Lisboa","Artigo 20.º, n.º 1, alínea b) do Código dos Contratos Públicos",,,,,,Não aplicável.,Não aplicável.,FALSE
CP -33 Material consumo clinico,Concurso público,Aquisição de bens móveis,"33140000-3, Material médico de consumo","Instituto Nacional de Saúde Dr. Ricardo Jorge, I.P. (501427511)","ANASTÁCIO SALDANHA UNIPESSOAL, LDA (505804441)","37,40 €",09-01-2014,09-12-2013,90 dias,"Portugal, Lisboa, Lisboa","Artigo 20.º, n.º 1, alínea b) do Código dos Contratos Públicos",,,,,,Não aplicável.,Não aplicável.,FALSE
CP-33 Material de consumo clinico,Concurso público,Aquisição de bens móveis,"33140000-3, Material médico de consumo","Instituto Nacional de Saúde Dr. Ricardo Jorge, I.P. (501427511)","VWR INTERNATIONAL - MATERIAL DE LABORATÓRIO, LDA (503842770)","481,00 €",09-01-2014,09-12-2013,90 dias,"Portugal, Lisboa, Lisboa","Artigo 20.º, n.º 1, alínea b) do Código dos Contratos Públicos",,,,,,Não aplicável.,Não aplicável.,FALSE
CP -33 Material consumo clinico,Concurso público,Aquisição de bens móveis,"33140000-3, Material médico de consumo","Instituto Nacional de Saúde Dr. Ricardo Jorge, I.P. (501427511)","AIATELAB - EQUIPAMENTOS DE LABORATÓRIO, LDA (508533104)","6.549,22 €",09-01-2014,09-12-2013,90 dias,"Portugal, Lisboa, Lisboa","Artigo 20.º, n.º 1, alínea b) do Código dos Contratos Públicos",,,,,,Não aplicável.,Não aplicável.,FALSE
CP-33 Material de consumo clinico,Concurso público,Aquisição de bens móveis,"33140000-3, Material médico de consumo","Instituto Nacional de Saúde Dr. Ricardo Jorge, I.P. (501427511)","Potencial Zero - Instrumentação Científica, Lda (506704017)","4.272,00 €",09-01-2014,09-12-2013,90 dias,"Portugal, Lisboa, Lisboa","Artigo 20.º, n.º 1, alínea b) do Código dos Contratos Públicos",,,,,,Não aplicável.,Não aplicável.,FALSE
CP -33 Material de Consumo Clinico,Concurso público,Aquisição de bens móveis,"33140000-3, Material médico de consumo","Instituto Nacional de Saúde Dr. Ricardo Jorge, I.P. (501427511)","AIATELAB - EQUIPAMENTOS DE LABORATÓRIO, LDA (508533104)","898,00 €",09-01-2014,09-12-2013,90 dias,"Portugal, Lisboa, Lisboa","Artigo 20.º, n.º 1, alínea b) do Código dos Contratos Públicos",,,,,,Não aplicável.,Não aplicável.,FALSE
CP-33 Material de C   onsumo Clinico,Concurso público,Aquisição de bens móveis,"33140000-3, Material médico de consumo","Instituto Nacional de Saúde Dr. Ricardo Jorge, I.P. (501427511)","SOQUÍMICA - SOC. REPRESENTAÇÕES DE QUIMICA, LDA. (500274231)","6.336,83 €",09-01-2014,09-12-2013,90 dias,"Portugal, Lisboa, Lisboa","Artigo 20.º, n.º 1, alínea b) do Código dos Contratos Públicos",,,,,,Não aplicável.,Não aplicável.,FALSE
CP-33,Concurso público,Aquisição de bens móveis,"33140000-3, Material médico de consumo","Instituto Nacional de Saúde Dr. Ricardo Jorge, I.P. (501427511)","AVIQUÍMICA - IMPORTAÇÕES E MANUFACTURAS, LDA (500039720)","428,40 €",09-01-2014,09-12-2013,90 dias,"Portugal, Lisboa, Lisboa","Artigo 20.º, n.º 1, alínea b) do Código dos Contratos Públicos",,,,,,Não aplicável.,Não aplicável.,FALSE
Aquisição de reagentes,Ajuste Direto Regime Geral,Aquisição de bens móveis,"33600000-6, Produtos farmacêuticos","Instituto Nacional de Saúde Dr. Ricardo Jorge, I. P. (501427511)",Roche (504282921),"4.762,00 €",09-01-2014,04-12-2013,90 dias,"Portugal, Lisboa, Lisboa","Artigo 26.º, n.º 1, alínea b) do Código dos Contratos Públicos",,,,,,Não aplicável.,Não aplicável.,FALSE
CP-33 Material de consumo clinico,Concurso público,Aquisição de bens móveis,"33140000-3, Material médico de consumo","Instituto Nacional de Saúde Dr. Ricardo Jorge, I.P. (501427511)","AMBICONTROL - CONTROLO DE POLUIÇÃO, LDA (502715464)","5.895,00 €",09-01-2014,09-12-2013,90 dias,"Portugal, Lisboa, Lisboa","Artigo 20.º, n.º 1, alínea b) do Código dos Contratos Públicos",,,,,,Não aplicável.,Não aplicável.,FALSE
Aquisição de reagentes,Ajuste Direto Regime Geral,Aquisição de bens móveis,"33600000-6, Produtos farmacêuticos","Instituto Nacional de Saúde Dr. Ricardo Jorge, I. P. (501427511)",BioPortugal (502380543),"1.900,00 €",09-01-2014,04-12-2013,90 dias,"Portugal, Lisboa, Lisboa","Artigo 26.º, n.º 1, alínea b) do Código dos Contratos Públicos",,,,,,Não aplicável.,Não aplicável.,FALSE
20130516 - Material de consumo clinico,Ajuste Direto Regime Geral,Aquisição de bens móveis,"33140000-3, Material médico de consumo","Instituto Nacional de Saúde Dr. Ricardo Jorge, I. P. (501427511)","JCM Representações, Lda (502099330)","12.308,39 €",09-01-2014,26-07-2013,90 dias,"Portugal, Lisboa, Lisboa","Artigo 20.º, n.º 1, alínea a) do Código dos Contratos Públicos",,,,,,Não aplicável.,Não aplicável.,FALSE
Aquisição de reagentes,Ajuste Direto Regime Geral,Aquisição de bens móveis,"33600000-6, Produtos farmacêuticos","Instituto Nacional de Saúde Dr. Ricardo Jorge, I. P. (501427511)",Baptista Marques (501439110),"4.850,73 €",09-01-2014,04-12-2013,90 dias,"Portugal, Lisboa, Lisboa","Artigo 26.º, n.º 1, alínea b) do Código dos Contratos Públicos",,,,,,Não aplicável.,Não aplicável.,FALSE
20130624 - Aquisição de reagentes,Ajuste Direto Regime Geral,Aquisição de bens móveis,"33140000-3, Material médico de consumo","Instituto Nacional de Saúde Dr. Ricardo Jorge, I. P. (501427511)","AIATELAB - EQUIPAMENTOS DE LABORATÓRIO, LDA (508533104)","188,95 €",08-01-2014,16-10-2013,90 dias,"Portugal, Lisboa, Lisboa","Artigo 20.º, n.º 1, alínea a) do Código dos Contratos Públicos",,,,,,Não aplicável.,Não aplicável.,FALSE
20130624 - Aquisição de reagentes,Ajuste Direto Regime Geral,Aquisição de bens móveis,"33140000-3, Material médico de consumo","Instituto Nacional de Saúde Dr. Ricardo Jorge, I. P. (501427511)","AIATELAB - EQUIPAMENTOS DE LABORATÓRIO, LDA (508533104)","110,63 €",08-01-2014,16-10-2013,90 dias,"Portugal, Lisboa, Lisboa","Artigo 20.º, n.º 1, alínea a) do Código dos Contratos Públicos",,,,,,Não aplicável.,Não aplicável.,FALSE
20130624 - Aquisição de reagentes,Ajuste Direto Regime Geral,Aquisição de bens móveis,"33140000-3, Material médico de consumo","Instituto Nacional de Saúde Dr. Ricardo Jorge, I. P. (501427511)","ILC - INSTRUMENTOS LABORATÓRIO E CIENTÍFICOS, LDA (500948208)","211,00 €",08-01-2014,16-10-2013,90 dias,"Portugal, Lisboa, Lisboa","Artigo 20.º, n.º 1, alínea a) do Código dos Contratos Públicos",,,,,,Não aplicável.,Não aplicável.,FALSE
2013624 - Aquisição de reagentes,Ajuste Direto Regime Geral,Aquisição de bens móveis,"33140000-3, Material médico de consumo","Instituto Nacional de Saúde Dr. Ricardo Jorge, I. P. (501427511)","AIATELAB - EQUIPAMENTOS DE LABORATÓRIO, LDA (508533104)","188,95 €",08-01-2014,16-10-2013,90 dias,"Portugal, Lisboa, Lisboa","Artigo 20.º, n.º 1, alínea a) do Código dos Contratos Públicos",,,,,,Não aplicável.,Não aplicável.,FALSE
20130624 - Aquisição de reagentes,Ajuste Direto Regime Geral,Aquisição de bens móveis,"33140000-3, Material médico de consumo","Instituto Nacional de Saúde Dr. Ricardo Jorge, I. P. (501427511)","ILC - INSTRUMENTOS LABORATÓRIO E CIENTÍFICOS, LDA (500948208)","450,00 €",08-01-2014,16-10-2013,90 dias,"Portugal, Lisboa, Lisboa","Artigo 20.º, n.º 1, alínea a) do Código dos Contratos Públicos",,,,,,Não aplicável.,Não aplicável.,FALSE
20130624 - Aquisição de reagente,Ajuste Direto Regime Geral,Aquisição de bens móveis,"33140000-3, Material médico de consumo","Instituto Nacional de Saúde Dr. Ricardo Jorge, I. P. (501427511)","ILC - INSTRUMENTOS LABORATÓRIO E CIENTÍFICOS, LDA (500948208)","300,00 €",08-01-2014,16-10-2013,90 dias,"Portugal, Lisboa, Lisboa","Artigo 20.º, n.º 1, alínea a) do Código dos Contratos Públicos",,,,,,Não aplicável.,Não aplicável.,FALSE
20130624 - Aquisição de reagentes,Ajuste Direto Regime Geral,Aquisição de bens móveis,"33140000-3, Material médico de consumo","Instituto Nacional de Saúde Dr. Ricardo Jorge, I. P. (501427511)","ILC - INSTRUMENTOS LABORATÓRIO E CIENTÍFICOS, LDA (500948208)","11,70 €",08-01-2014,16-10-2013,90 dias,"Portugal, Lisboa, Lisboa","Artigo 20.º, n.º 1, alínea a) do Código dos Contratos Públicos",,,,,,Não aplicável.,Não aplicável.,FALSE
20130624 - Aquisição de reagentes,Ajuste Direto Regime Geral,Aquisição de bens móveis,"33140000-3, Material médico de consumo","Instituto Nacional de Saúde Dr. Ricardo Jorge, I. P. (501427511)","AIATELAB - EQUIPAMENTOS DE LABORATÓRIO, LDA (508533104)","188,95 €",08-01-2014,16-10-2013,90 dias,"Portugal, Lisboa, Lisboa","Artigo 20.º, n.º 1, alínea a) do Código dos Contratos Públicos",,,,,,Não aplicável.,Não aplicável.,FALSE
20130624 - Aquisição de reagentes,Ajuste Direto Regime Geral,Aquisição de bens móveis,"33140000-3, Material médico de consumo","Instituto Nacional de Saúde Dr. Ricardo Jorge, I. P. (501427511)","AIATELAB - EQUIPAMENTOS DE LABORATÓRIO, LDA (508533104)","189,46 €",08-01-2014,16-10-2013,90 dias,"Portugal, Lisboa, Lisboa","Artigo 20.º, n.º 1, alínea a) do Código dos Contratos Públicos",,,,,,Não aplicável.,Não aplicável.,FALSE
20130624 - Aquisição de reagentes,Ajuste Direto Regime Geral,Aquisição de bens móveis,"33140000-3, Material médico de consumo","Instituto Nacional de Saúde Dr. Ricardo Jorge, I. P. (501427511)","ILC - INSTRUMENTOS LABORATÓRIO E CIENTÍFICOS, LDA (500948208)","382,00 €",08-01-2014,16-10-2013,90 dias,"Portugal, Lisboa, Lisboa","Artigo 20.º, n.º 1, alínea a) do Código dos Contratos Públicos",,,,,,Não aplicável.,Não aplicável.,FALSE
20130624,Ajuste Direto Regime Geral,Aquisição de bens móveis,"33140000-3, Material médico de consumo","Instituto Nacional de Saúde Dr. Ricardo Jorge, I. P. (501427511)","AIATELAB - EQUIPAMENTOS DE LABORATÓRIO, LDA (508533104)","177,70 €",08-01-2014,16-10-2013,90 dias,"Portugal, Lisboa, Lisboa","Artigo 20.º, n.º 1, alínea a) do Código dos Contratos Públicos",,,,,,Não aplicável.,Não aplicável.,FALSE
20130624 - Aquisição de reagentes,Ajuste Direto Regime Geral,Aquisição de bens móveis,"33140000-3, Material médico de consumo","Instituto Nacional de Saúde Dr. Ricardo Jorge, I. P. (501427511)","OLYMPUS IBERIA,S.A.U.Sucursal em Portugal (980474710)","11,50 €",08-01-2014,16-10-2013,90 dias,"Portugal, Lisboa, Lisboa","Artigo 20.º, n.º 1, alínea a) do Código dos Contratos Públicos",,,,,,Não aplicável.,Não aplicável.,FALSE
20130624 - Aquisição de reagentes,Ajuste Direto Regime Geral,Aquisição de bens móveis,"33140000-3, Material médico de consumo","Instituto Nacional de Saúde Dr. Ricardo Jorge, I. P. (501427511)","OLYMPUS IBERIA,S.A.U.Sucursal em Portugal (980474710)","532,00 €",08-01-2014,16-10-2013,90 dias,"Portugal, Lisboa, Lisboa","Artigo 20.º, n.º 1, alínea a) do Código dos Contratos Públicos",,,,,,Não aplicável.,Não aplicável.,FALSE
20130624 - Aquisição de reagentes,Ajuste Direto Regime Geral,Aquisição de bens móveis,"33140000-3, Material médico de consumo","Instituto Nacional de Saúde Dr. Ricardo Jorge, I. P. (501427511)","OLYMPUS IBERIA,S.A.U.Sucursal em Portugal (980474710)","984,00 €",08-01-2014,16-10-2013,90 dias,"Portugal, Lisboa, Lisboa","Artigo 20.º, n.º 1, alínea a) do Código dos Contratos Públicos",,,,,,Não aplicável.,Não aplicável.,FALSE
20130624 - Aquisição de reagentes,Ajuste Direto Regime Geral,Aquisição de bens móveis,"33140000-3, Material médico de consumo","Instituto Nacional de Saúde Dr. Ricardo Jorge, I. P. (501427511)","VWR INTERNATIONAL - MATERIAL DE LABORATÓRIO, LDA (503842770)","390,00 €",08-01-2014,16-10-2013,90 dias,"Portugal, Lisboa, Lisboa","Artigo 20.º, n.º 1, alínea a) do Código dos Contratos Públicos",,,,,,Não aplicável.,Não aplicável.,FALSE
Material de consumo clínico,Ajuste Direto Regime Geral,Aquisição de bens móveis,"33100000-1, Equipamento médico","Instituto Nacional de Saúde Dr. Ricardo Jorge, I. P. (501427511)",Bio-Rad (501301321),"220,00 €",08-01-2014,04-12-2013,90 dias,"Portugal, Lisboa, Lisboa","Artigo 26.º, n.º 1, alínea b) do Código dos Contratos Públicos",,,,,,Não aplicável.,Não aplicável.,FALSE
20130624 - Aquisição de reagentes,Ajuste Direto Regime Geral,Aquisição de bens móveis,"33140000-3, Material médico de consumo","Instituto Nacional de Saúde Dr. Ricardo Jorge, I. P. (501427511)","ILC - INSTRUMENTOS LABORATÓRIO E CIENTÍFICOS, LDA (500948208)","114,00 €",08-01-2014,16-10-2013,90 dias,"Portugal, Lisboa, Lisboa","Artigo 20.º, n.º 1, alínea a) do Código dos Contratos Públicos",,,,,,Não aplicável.,Não aplicável.,FALSE
20130624 - Aquisição de reagentes,Ajuste Direto Regime Geral,Aquisição de bens móveis,"33140000-3, Material médico de consumo","Instituto Nacional de Saúde Dr. Ricardo Jorge, I. P. (501427511)","VWR INTERNATIONAL - MATERIAL DE LABORATÓRIO, LDA (503842770)","190,00 €",08-01-2014,16-10-2013,90 dias,"Portugal, Lisboa, Lisboa","Artigo 20.º, n.º 1, alínea a) do Código dos Contratos Públicos",,,,,,Não aplicável.,Não aplicável.,FALSE
20130624 - Aquisição de reagentes,Ajuste Direto Regime Geral,Aquisição de bens móveis,"33140000-3, Material médico de consumo","Instituto Nacional de Saúde Dr. Ricardo Jorge, I. P. (501427511)","VWR INTERNATIONAL - MATERIAL DE LABORATÓRIO, LDA (503842770)","64,00 €",08-01-2014,16-10-2013,90 dias,"Portugal, Lisboa, Lisboa","Artigo 20.º, n.º 1, alínea a) do Código dos Contratos Públicos",,,,,,Não aplicável.,Não aplicável.,FALSE
20130624 - Aquisição de reagentes,Ajuste Direto Regime Geral,Aquisição de bens móveis,"33140000-3, Material médico de consumo","Instituto Nacional de Saúde Dr. Ricardo Jorge, I. P. (501427511)","AIATELAB - EQUIPAMENTOS DE LABORATÓRIO, LDA (508533104)","719,21 €",08-01-2014,16-10-2013,90 dias,"Portugal, Lisboa, Lisboa","Artigo 20.º, n.º 1, alínea a) do Código dos Contratos Públicos",,,,,,Não aplicável.,Não aplicável.,FALSE
20130624 - Aquisição de reagentes,Ajuste Direto Regime Geral,Aquisição de bens móveis,"33140000-3, Material médico de consumo","Instituto Nacional de Saúde Dr. Ricardo Jorge, I. P. (501427511)","ILC - INSTRUMENTOS LABORATÓRIO E CIENTÍFICOS, LDA (500948208)","400,00 €",08-01-2014,16-10-2013,90 dias,"Portugal, Lisboa, Lisboa","Artigo 20.º, n.º 1, alínea a) do Código dos Contratos Públicos",,,,,,Não aplicável.,Não aplicável.,FALSE
20130624 - Aquisição de reagentes,Ajuste Direto Regime Geral,Aquisição de bens móveis,"33140000-3, Material médico de consumo","Instituto Nacional de Saúde Dr. Ricardo Jorge, I. P. (501427511)","ILC - INSTRUMENTOS LABORATÓRIO E CIENTÍFICOS, LDA (500948208)","476,00 €",08-01-2014,16-10-2013,90 dias,"Portugal, Lisboa, Lisboa","Artigo 20.º, n.º 1, alínea a) do Código dos Contratos Públicos",,,,,,Não aplicável.,Não aplicável.,FALSE
20130490-seguro da frota automóvel,Ajuste Direto Regime Geral,Aquisição de serviços,"66514110-0, Serviços de seguro automóvel",Instituto Nacional de Saúde Dr.Ricardo Jorge(INSA) (501427511),"Fidelidade - Companhia de Seguros, S.A. (500918880)","976,55 €",08-01-2014,01-07-2013,182 dias,"Portugal, Lisboa, Lisboa","Artigo 20.º, n.º 1, alínea a) do Código dos Contratos Públicos",,,,,,Não aplicável.,Não aplicável.,FALSE
20130628 - Aquisição de reagentes,Ajuste Direto Regime Geral,Aquisição de bens móveis,"33140000-3, Material médico de consumo","Instituto Nacional de Saúde Dr. Ricardo Jorge, I. P. (501427511)","VWR INTERNATIONAL - MATERIAL DE LABORATÓRIO, LDA (503842770)","7.693,11 €",08-01-2014,03-10-2013,90 dias,"Portugal, Lisboa, Lisboa","Artigo 26.º, n.º 1, alínea b) do Código dos Contratos Públicos",,,,,,Não aplicável.,Não aplicável.,FALSE
Aquisição de reagentes,Ajuste Direto Regime Geral,Aquisição de bens móveis,"33696500-0, Reagentes de laboratório","Instituto Nacional de Saúde Dr. Ricardo Jorge, I. P. (501427511)","Qlabo Equipamentos de Laboratório & serviços, Ldª (503829994)","808,00 €",08-01-2014,30-07-2013,153 dias,"Portugal, Lisboa, Lisboa","Artigo 26.º, n.º 1, alínea e) do Código dos Contratos Públicos",,,,,,Não aplicável.,Não aplicável.,FALSE
Aquisição de acessórios de equipamento,Ajuste Direto Regime Geral,Aquisição de bens móveis,"33140000-3, Material médico de consumo","Instituto Nacional de Saúde Dr. Ricardo Jorge, I. P. (501427511)","UNICAM Sistemas, Analíticos, Ldª (502614625)","3.170,73 €",08-01-2014,20-12-2013,25 dias,"Portugal, Lisboa, Lisboa","Artigo 26.º, n.º 1, alínea e) do Código dos Contratos Públicos",,,,,,Não aplicável.,Não aplicável.,FALSE
Aquisição de acessórios de equipamento laboratorio,Ajuste Direto Regime Geral,Aquisição de bens móveis,"33140000-3, Material médico de consumo","Instituto Nacional de Saúde Dr. Ricardo Jorge, I. P. (501427511)","VWR International - Material de Laboratório, Ldª (503842770)","1.500,00 €",08-01-2014,19-12-2013,43 dias,"Portugal, Lisboa, Lisboa","Artigo 26.º, n.º 1, alínea e) do Código dos Contratos Públicos",,,,,,Não aplicável.,Não aplicável.,FALSE
"20130822 - Aquisição de acessórios de equipamento de cromatografia, microscopia, potenciometria",Ajuste Direto Regime Geral,Aquisição de bens móveis,"38430000-8, Aparelhos de detecção e análise","Instituto Nacional de Saúde Dr. Ricardo Jorge, I. P. (501427511)","ZMWAY, Lda (508085349)","185,00 €",08-01-2014,02-12-2013,20 dias,"Portugal, Lisboa, Lisboa","Artigo 20.º, n.º 1, alínea a) do Código dos Contratos Públicos",,,,,,Não aplicável.,Não aplicável.,FALSE
"20130822 - Aquisição de acessórios de equipamento de cromatografia, microscopia, potenciometria",Ajuste Direto Regime Geral,Aquisição de bens móveis,"38430000-8, Aparelhos de detecção e análise","Instituto Nacional de Saúde Dr. Ricardo Jorge, I. P. (501427511)","VIDROLAB 2 - Equipamentos Mat. Laboratorio,  S.A. (501450629)","36,00 €",08-01-2014,02-12-2013,20 dias,"Portugal, Lisboa, Lisboa","Artigo 20.º, n.º 1, alínea a) do Código dos Contratos Públicos",,,,,,Não aplicável.,Não aplicável.,FALSE
Aquisição de reagentes,Ajuste Direto Regime Geral,Aquisição de bens móveis,"33696500-0, Reagentes de laboratório","Instituto Nacional de Saúde Dr. Ricardo Jorge, I. P. (501427511)","Baptista Marques Diagnóstica e Reagentes, Ldª (501439110)","510,00 €",08-01-2014,06-12-2013,55 dias,"Portugal, Lisboa, Lisboa","Artigo 26.º, n.º 1, alínea e) do Código dos Contratos Públicos",,,,,,Não aplicável.,Não aplicável.,FALSE
Aquisição de consumíveis de laboratorio,Ajuste Direto Regime Geral,Aquisição de bens móveis,"33140000-3, Material médico de consumo","Instituto Nacional de Saúde Dr. Ricardo Jorge, I. P. (501427511)","Specanalitica - Equipamentos Cientificos, Ldª (507350871)","749,95 €",08-01-2014,12-11-2013,45 dias,"Portugal, Lisboa, Lisboa","Artigo 24.º, n.º 1, alínea b) do Código dos Contratos Públicos",,,,,,Não aplicável.,Não aplicável.,FALSE
20130626 - Aquisição de bens moveis,Ajuste Direto Regime Geral,Aquisição de bens móveis,"33696500-0, Reagentes de laboratório",Instituto Nacional de Saúde Dr.Ricardo Jorge(INSA) (501427511),"ISODER - ISÓTOPOS DERIVADOS, LDA (502241594)","3.250,00 €",08-01-2014,02-10-2013,60 dias,"Portugal, Lisboa, Lisboa","Artigo 26.º, n.º 1, alínea b) do Código dos Contratos Públicos",,,,,,Não aplicável.,Não aplicável.,FALSE
20130626 - Aquisição de bens moveis,Ajuste Direto Regime Geral,Aquisição de bens móveis,"33696500-0, Reagentes de laboratório",Instituto Nacional de Saúde Dr.Ricardo Jorge(INSA) (501427511),"BIOMERIEUX PORTUGAL, LDA (501524177)","1.716,80 €",08-01-2014,02-10-2013,60 dias,"Portugal, Lisboa, Lisboa","Artigo 26.º, n.º 1, alínea b) do Código dos Contratos Públicos",,,,,,Não aplicável.,Não aplicável.,FALSE
20130626 - Aquisição de bens moveis,Ajuste Direto Regime Geral,Aquisição de bens móveis,"33696500-0, Reagentes de laboratório",Instituto Nacional de Saúde Dr.Ricardo Jorge(INSA) (501427511),"ALFAGENE - NOVAS TECN. DAS CIÊNCIAS DA VIDA, LDA (503387398)","9.641,62 €",08-01-2014,02-10-2013,60 dias,"Portugal, Lisboa, Lisboa","Artigo 26.º, n.º 1, alínea b) do Código dos Contratos Públicos",,,,,,Não aplicável.,Não aplicável.,FALSE
20130554 - Aquisição de Bens,Ajuste Direto Regime Geral,Aquisição de bens móveis,"33696500-0, Reagentes de laboratório",Instituto Nacional de Saúde Dr.Ricardo Jorge(INSA) (501427511),"ROCHE SISTEMAS DIAGNÓSTICO, LDA (504282921)","17.592,00 €",08-01-2014,30-07-2013,66 dias,"Portugal, Lisboa, Lisboa","Artigo 24.º, n.º 1, alínea b) do Código dos Contratos Públicos",,,,,,Não aplicável.,Não aplicável.,FALSE
20130554 - Aquisição de bens,Ajuste Direto Regime Geral,Aquisição de bens móveis,"33696500-0, Reagentes de laboratório",Instituto Nacional de Saúde Dr.Ricardo Jorge(INSA) (501427511),"ISODER - ISÓTOPOS DERIVADOS, LDA (502241594)","9.550,00 €",08-01-2014,30-07-2013,90 dias,"Portugal, Lisboa, Lisboa","Artigo 24.º, n.º 1, alínea b) do Código dos Contratos Públicos",,,,,,Não aplicável.,Não aplicável.,FALSE
20130627 - Aquisição de bens,Ajuste Direto Regime Geral,Aquisição de bens móveis,"33696500-0, Reagentes de laboratório",Instituto Nacional de Saúde Dr.Ricardo Jorge(INSA) (501427511),"QUILABAN - QUÍMICA LABORATORIAL ANALÍTICA, LDA (500399670)","2.500,00 €",08-01-2014,23-09-2013,30 dias,"Portugal, Lisboa, Lisboa","Artigo 26.º, n.º 1, alínea b) do Código dos Contratos Públicos",,,,,,Não aplicável.,Não aplicável.,FALSE
20130285-Aquisição de serviços de manutenção para cromatógrafos,Ajuste Direto Regime Geral,Aquisição de serviços,"50000000-5, Serviços de reparação e manutenção","Instituto Nacional de Saúde Dr. Ricardo Jorge, I. P. (501427511)","Via Athena Gestão de Laboratórios, Ldª (502272570)","14.116,74 €",08-01-2014,15-11-2013,46 dias,"Portugal, Lisboa, Lisboa","Artigo 20.º, n.º 1, alínea a) do Código dos Contratos Públicos",,,,,,Não aplicável.,Não aplicável.,FALSE
20130627 - Aquisição de bens,Ajuste Direto Regime Geral,Aquisição de bens móveis,"33696500-0, Reagentes de laboratório",Instituto Nacional de Saúde Dr.Ricardo Jorge(INSA) (501427511),"BIO-RAD LABORATORIES - APARELHOS, REAG. LAB., LDA (501301321)","1.487,15 €",08-01-2014,23-09-2013,30 dias,"Portugal, Lisboa, Lisboa","Artigo 26.º, n.º 1, alínea b) do Código dos Contratos Públicos",,,,,,Não aplicável.,Não aplicável.,FALSE
20130062- Aquisição de serviços de manutenção parques e jardins do INSA/SEDE e  CEVDI/Aguas de Moura,Ajuste Direto Regime Geral,Aquisição de serviços,"77310000-6, Serviços de plantação e manutenção de áreas verdes","Instituto Nacional de Saúde Dr. Ricardo Jorge, I. P. (501427511)","Horto do Campo Grande, S.A. (500941084)","6.750,00 €",07-01-2014,06-05-2013,245 dias,"Portugal, Lisboa, Lisboa","Artigo 20.º, n.º 1, alínea a) do Código dos Contratos Públicos",,,,,,Não aplicável.,Não aplicável.,FALSE
"20130287- Aquisição de serviços de manutenção para cromatografos """"Variant""""",Ajuste Direto Regime Geral,Aquisição de serviços,"50000000-5, Serviços de reparação e manutenção","Instituto Nacional de Saúde Dr. Ricardo Jorge, I. P. (501427511)","Bruker Portugal Unipessoal, Ldª (509799434)","8.820,00 €",07-01-2014,13-08-2013,122 dias,"Portugal, Lisboa, Lisboa","Artigo 24.º, n.º 1, alínea e) do Código dos Contratos Públicos",,,,,,Não aplicável.,Não aplicável.,FALSE
"20130075 - Aquisição de serviços de Manutenção para câmaras de fluxo de ar laminar, hottes e campânulas",Ajuste Direto Regime Geral,Aquisição de serviços,"50800000-3, Serviços de reparação e manutenção diversos","Instituto Nacional de Saúde Dr. Ricardo Jorge, I. P. (501427511)","Tradelabor- Importação e exportação, Lda (503069442)","32.820,00 €",07-01-2014,13-05-2013,60 dias,"Portugal, Lisboa, Lisboa","Artigo 20.º, n.º 1, alínea a) do Código dos Contratos Públicos",,,,,,Não aplicável.,Não aplicável.,FALSE
20130168-Aquisição serviços para equipamentos ativos da rede informática,Ajuste Direto Regime Geral,Aquisição de serviços,"72000000-5, Serviços de TI: consultoria, desenvolvimento de software, Internet e apoio","Instituto Nacional de Saúde Dr. Ricardo Jorge, I. P. (501427511)","Nextiraone Portugal - Soluções e Serviços Integrados de Comunicações, S.A. (505134195)","22.607,24 €",07-01-2014,18-07-2013,183 dias,"Portugal, Lisboa, Lisboa","Artigo 20.º, n.º 1, alínea a) do Código dos Contratos Públicos",,,,,,Não aplicável.,Não aplicável.,FALSE
"Aquisição de serviços de assistência técnica e manutenção do equipamento e do sistema """"OMEGA""""",Ajuste Direto Regime Geral,Aquisição de serviços,"72260000-5, Serviços relacionados com software","Instituto Nacional de Saúde Dr. Ricardo Jorge, I. P. (501427511)","Roche Sistemas de Diagnósticos, ldª (504282921)","3.267,41 €",07-01-2014,02-08-2013,152 dias,"Portugal, Lisboa, Lisboa","Artigo 24.º, n.º 1, alínea e) do Código dos Contratos Públicos",,,,,,Não aplicável.,Não aplicável.,FALSE
20130728 - Instalação e reparação de ar condicionados,Ajuste Direto Regime Geral,Aquisição de serviços,"50800000-3, Serviços de reparação e manutenção diversos","Instituto Nacional de Saúde Dr. Ricardo Jorge, I. P. (501427511)","EnergCambra, Lda (509910327)","3.596,00 €",07-01-2014,28-11-2013,60 dias,"Portugal, Lisboa, Lisboa","Artigo 20.º, n.º 1, alínea a) do Código dos Contratos Públicos",,,,,,Não aplicável.,Não aplicável.,FALSE
Aquisição de serviços de assistência ao software dos sistemas de gestão documental,Ajuste Direto Regime Geral,Aquisição de serviços,"72700000-7, Serviços de rede informática","Instituto Nacional de Saúde Dr. Ricardo Jorge, I. P. (501427511)","CSC Computer Sciences (Portugal), Ldª (503948390)","6.720,00 €",07-01-2014,13-08-2013,137 dias,"Portugal, Lisboa, Lisboa","Artigo 24.º, n.º 1, alínea e) do Código dos Contratos Públicos",,,,,,Não aplicável.,Não aplicável.,FALSE
20130766 - Aquisição de Bens,Ajuste Direto Regime Geral,Aquisição de bens móveis,"33140000-3, Material médico de consumo","Instituto Nacional de Saúde Dr. Ricardo Jorge, I. P. (501427511)",Normax (500203130),"2.650,00 €",06-01-2014,18-12-2013,60 dias,"Portugal, Lisboa, Lisboa<BR/>Portugal","Artigo 26.º, n.º 1, alínea b) do Código dos Contratos Públicos",,,,,,Não aplicável.,Não aplicável.,FALSE
20130766 - Aquisição de bens,Ajuste Direto Regime Geral,Aquisição de bens móveis,"33140000-3, Material médico de consumo","Instituto Nacional de Saúde Dr. Ricardo Jorge, I. P. (501427511)","VWR Internacional, Lda (503842770)","1.283,25 €",06-01-2014,18-12-2013,60 dias,"Portugal, Lisboa, Lisboa","Artigo 26.º, n.º 1, alínea b) do Código dos Contratos Públicos",,,,,,Não aplicável.,Não aplicável.,FALSE
20130810 - Aquisição de reagentes,Ajuste Direto Regime Geral,Aquisição de bens móveis,"33696500-0, Reagentes de laboratório","Instituto Nacional de Saúde Dr. Ricardo Jorge, I. P. (501427511)","IZASA PORTUGAL, LDA (501086110)","3.807,74 €",06-01-2014,28-11-2013,30 dias,"Portugal, Lisboa, Lisboa","Artigo 20.º, n.º 1, alínea a) do Código dos Contratos Públicos",,,,,,Não aplicável.,Não aplicável.,FALSE
20130810 - Aquisição de reagentes,Ajuste Direto Regime Geral,Aquisição de bens móveis,"33696500-0, Reagentes de laboratório","Instituto Nacional de Saúde Dr. Ricardo Jorge, I. P. (501427511)","AB SCIEX PORTUGAL, Lda (510460771)","600,00 €",06-01-2014,28-11-2013,30 dias,"Portugal, Lisboa, Lisboa","Artigo 20.º, n.º 1, alínea a) do Código dos Contratos Públicos",,,,,,Não aplicável.,Não aplicável.,FALSE
20130386 - Aquisição de reagentes Imunologia Microbiana,Ajuste Direto Regime Geral,Aquisição de bens móveis,"33140000-3, Material médico de consumo","Instituto Nacional de Saúde Dr. Ricardo Jorge, I. P. (501427511)","Siemens Healthcare Diagnostics, Lda (507925173)","11.071,72 €",06-01-2014,06-06-2013,66 dias,"Portugal, Lisboa, Lisboa","Artigo 24.º, n.º 1, alínea e) do Código dos Contratos Públicos",,,,,,Não aplicável.,Não aplicável.,FALSE
"20130036-serviços de manutenção do sistema de gestão """"DocBase""""",Ajuste Direto Regime Geral,Aquisição de serviços,"72700000-7, Serviços de rede informática","Instituto Nacional de Saúde Dr. Ricardo Jorge, I. P. (501427511)","DID, Documentação, Informática e Desenvolvimento, Ldª (502563770)","1.908,62 €",06-01-2014,07-08-2013,146 dias,"Portugal, Lisboa, Lisboa","Artigo 24.º, n.º 1, alínea a) do Código dos Contratos Públicos",,,,,,Não aplicável.,Não aplicável.,FALSE
"20130768 - Aquisição de reagentes, padrões",Ajuste Direto Regime Geral,Aquisição de bens móveis,"33696500-0, Reagentes de laboratório","Instituto Nacional de Saúde Dr. Ricardo Jorge, I. P. (501427511)","Bioportugal Quimico Farmaceutica, Lda (502380543)","1.083,00 €",06-01-2014,11-12-2013,20 dias,"Portugal, Lisboa, Lisboa","Artigo 20.º, n.º 1, alínea a) do Código dos Contratos Públicos",,,,,,Não aplicável.,Não aplicável.,FALSE
"20130768 - Aquisição de reagentes, padrões",Ajuste Direto Regime Geral,Aquisição de bens móveis,"33696500-0, Reagentes de laboratório","Instituto Nacional de Saúde Dr. Ricardo Jorge, I. P. (501427511)","ILC - Instrumentos de Laboratório e Cientificos, Lda (500948208)","1.780,00 €",06-01-2014,11-12-2013,20 dias,"Portugal, Lisboa, Lisboa","Artigo 20.º, n.º 1, alínea a) do Código dos Contratos Públicos",,,,,,Não aplicável.,Não aplicável.,FALSE
Contrato serviços para manutenções gerais e Eléctricas no CSP Dr. Gonçalves Ferreira -Porto,Ajuste Direto Regime Geral,Aquisição de serviços,"50800000-3, Serviços de reparação e manutenção diversos","Instituto Nacional de Saúde Dr. Ricardo Jorge, I. P. (501427511)",Joaquim Moreira Soares (127558608),"10.530,00 €",06-01-2014,21-05-2013,214 dias,"Portugal, Porto, Porto","Artigo 20.º, n.º 1, alínea a) do Código dos Contratos Públicos",,,,,,Não aplicável.,Não aplicável.,FALSE
"20130768 - Aquisição de reagentes, padrões",Ajuste Direto Regime Geral,Aquisição de bens móveis,"33696500-0, Reagentes de laboratório","Instituto Nacional de Saúde Dr. Ricardo Jorge, I. P. (501427511)","BIOMÉRIEUX PORTUGAL DE LABORATORIO, LDA (501524177)","80,70 €",06-01-2014,11-12-2013,20 dias,"Portugal, Lisboa, Lisboa","Artigo 20.º, n.º 1, alínea a) do Código dos Contratos Públicos",,,,,,Não aplicável.,Não aplicável.,FALSE
"20130768 - Aquisição de reagentes, padrões",Ajuste Direto Regime Geral,Aquisição de bens móveis,"33696500-0, Reagentes de laboratório","Instituto Nacional de Saúde Dr. Ricardo Jorge, I. P. (501427511)","Quilaban - Química Laboratorial Analitica, S.A. (500399670)","220,00 €",06-01-2014,11-12-2013,20 dias,"Portugal, Lisboa, Lisboa","Artigo 20.º, n.º 1, alínea a) do Código dos Contratos Públicos",,,,,,Não aplicável.,Não aplicável.,FALSE
"20130768 - Aquisição de reagentes, padrões",Ajuste Direto Regime Geral,Aquisição de bens móveis,"33696500-0, Reagentes de laboratório","Instituto Nacional de Saúde Dr. Ricardo Jorge, I. P. (501427511)","VWR International, Lda (503842770)","215,79 €",06-01-2014,11-12-2013,30 dias,"Portugal, Lisboa, Lisboa","Artigo 20.º, n.º 1, alínea a) do Código dos Contratos Públicos",,,,,,Não aplicável.,Não aplicável.,FALSE
"Contrato de assistência técnica, manutenção e reparação da infraestrutura de servidores SI/TI",Ajuste Direto Regime Geral,Aquisição de serviços,"72500000-0, Serviços relacionados com a informática","Instituto Nacional de Saúde Dr. Ricardo Jorge, I. P. (501427511)","CPC.IS Companhia Portuguesa de Computadores, Informàtica e Sistemas, S.A. (501267255)","38.446,81 €",06-01-2014,20-05-2013,322 dias,"Portugal, Lisboa, Lisboa","Artigo 20.º, n.º 1, alínea a) do Código dos Contratos Públicos",,,,,,Não aplicável.,Não aplicável.,FALSE
"20130346 - Aquisição de bens no ambito do projecto """"HMSP-ICJ/0022/2011""""",Ajuste Direto Regime Geral,Aquisição de bens móveis,"33140000-3, Material médico de consumo","Instituto Nacional de Saúde Dr. Ricardo Jorge, I. P. (501427511)","Alfagene, Lda (503387398)","352,80 €",06-01-2014,06-05-2013,30 dias,"Portugal, Lisboa, Lisboa","Artigo 26.º, n.º 1, alínea b) do Código dos Contratos Públicos",,,,,,Não aplicável.,Não aplicável.,FALSE
20130760 - Aquisição de reagentes p/doenças infecciosas,Ajuste Direto Regime Geral,Aquisição de bens móveis,"33696500-0, Reagentes de laboratório","Instituto Nacional de Saúde Dr. Ricardo Jorge, I. P. (501427511)","Arium - Sistemas de Diagnostico, Lda (502501880)","1.295,72 €",06-01-2014,13-11-2013,40 dias,"Portugal, Lisboa, Lisboa","Artigo 20.º, n.º 1, alínea a) do Código dos Contratos Públicos",,,,,,Não aplicável.,Não aplicável.,FALSE
20130760 - Aquisição de reagentes p/ doenças infecciosas,Ajuste Direto Regime Geral,Aquisição de bens móveis,"33696500-0, Reagentes de laboratório","Instituto Nacional de Saúde Dr. Ricardo Jorge, I. P. (501427511)","Iberlab & Imunoreage Soluções para Laboratórios, Lda (503406694)","457,80 €",06-01-2014,13-11-2013,40 dias,"Portugal, Lisboa, Lisboa","Artigo 20.º, n.º 1, alínea a) do Código dos Contratos Públicos",,,,,,Não aplicável.,Não aplicável.,FALSE
20130760 - Aquisição de Reagentes p/ doenças infecciosas,Ajuste Direto Regime Geral,Aquisição de bens móveis,"33696500-0, Reagentes de laboratório","Instituto Nacional de Saúde Dr. Ricardo Jorge, I. P. (501427511)","Alere, Lda (502518863)","2.026,32 €",06-01-2014,13-11-2013,40 dias,"Portugal, Lisboa, Lisboa","Artigo 20.º, n.º 1, alínea a) do Código dos Contratos Públicos",,,,,,Não aplicável.,Não aplicável.,FALSE
Consultoria para a preparação de um sistema de colheitas,Ajuste Direto Regime Geral,Aquisição de serviços,"72000000-5, Serviços de TI: consultoria, desenvolvimento de software, Internet e apoio","Instituto Nacional de Saúde Dr. Ricardo Jorge, I. P. (501427511)",Alfagene (503387398),"4.491,00 €",06-01-2014,18-12-2013,15 dias,"Portugal, Lisboa, Lisboa","Artigo 20.º, n.º 1, alínea a) do Código dos Contratos Públicos",,,,,,Não aplicável.,Não aplicável.,FALSE
"20130758 - Aquisição de acessórios de equipamento de cromatografia, electroforese.",Ajuste Direto Regime Geral,Aquisição de bens móveis,"38430000-8, Aparelhos de detecção e análise","Instituto Nacional de Saúde Dr. Ricardo Jorge, I. P. (501427511)","VWR International, Lda (503842770)","254,00 €",03-01-2014,04-11-2013,60 dias,"Portugal, Lisboa, Lisboa","Artigo 20.º, n.º 1, alínea a) do Código dos Contratos Públicos",,,,,,Não aplicável.,Não aplicável.,FALSE
Aquisição de serviços de manutenção de microscópios e lupas,Ajuste Direto Regime Geral,Aquisição de serviços,"50410000-2, Serviços de reparação e manutenção de aparelhos de medição, ensaio e controlo","Instituto Nacional de Saúde Dr. Ricardo Jorge, I. P. (501427511)",Leica Microsistemas Inst. Precisão Soc. Unip. Ldª (500301921),"5.300,00 €",03-01-2014,14-08-2013,137 dias,"Portugal, Lisboa, Lisboa","Artigo 20.º, n.º 1, alínea a) do Código dos Contratos Públicos",,,,,,Não aplicável.,Não aplicável.,FALSE
