Objeto do Contrato,Tipo de Procedimento,Tipo(s) de Contrato,CPVs,Entidade(s) Adjudicante(s),Entidade(s) Adjudicatária(s),Preço Contratual,Data de Publicação,Data de Celebração do Contrato,Prazo de Execução,Local de Execução,Fundamentação,Data de Fecho do Contrato,Preço Total Efetivo,Causas das Alterações ao Prazo,Causas das Alterações ao Preço,Estado,N.º registo do Acordo Quadro,Descrição do Acordo Quadro,Procedimento Centralizado
Aquisição de 582 Filtros para AVAC's/UTA's/Ventiladores do HSM e UCSP da Guarda,Ajuste Direto Regime Geral,Aquisição de bens móveis,"42514310-8, Filtros de ar","UNIDADE LOCAL DE SAÚDE DA GUARDA, E.P.E (508752000)",IBERCONCEPT LDA (507212738),"10.131,76 €",06-07-2017,23-06-2017,30 dias,"Portugal, Guarda, Guarda","Artigo 20.º, n.º 1, alínea a) do Código dos Contratos Públicos",,,,,,Não aplicável.,Não aplicável.,FALSE
Contrato de Manutenção dos Equipamentos de Raios-X Convencional das UCSP's de Gouveia e Pinhel para 2017,Ajuste Direto Regime Geral,Aquisição de serviços,"50421200-4, Serviços de reparação e manutenção de equipamentos de raios X","UNIDADE LOCAL DE SAÚDE DA GUARDA, E.P.E (508752000)","MED XRAY - SISTEMAS MEDICOS, LDA (506187071)","6.300,00 €",05-07-2017,28-06-2017,365 dias,"Portugal, Guarda, Guarda","Artigo 24.º, n.º 1, alínea e) do Código dos Contratos Públicos",,,,,,Não aplicável.,Não aplicável.,FALSE
Contrato de Manutenção Preventiva e Curativa a Bombas Circuladoras GRUNDFOS do HSM para 2017,Ajuste Direto Regime Geral,Aquisição de serviços,"50511100-1, Serviços de reparação e manutenção de bombas para líquidos","UNIDADE LOCAL DE SAÚDE DA GUARDA, E.P.E (508752000)",BOMBAS GRUNDFOS PORTUGAL S.A. (502085576),"13.610,00 €",05-07-2017,27-06-2017,365 dias,"Portugal, Guarda, Guarda","Artigo 20.º, n.º 1, alínea a) do Código dos Contratos Públicos",,,,,,Não aplicável.,Não aplicável.,FALSE
Ajuste Direto para a Aquisição de Serviços de Extração de Base de Dados do ALERT ERP para o novo Sistema GHAF,Ajuste Direto Regime Geral,Aquisição de serviços,"72000000-5, Serviços de TI: consultoria, desenvolvimento de software, Internet e apoio","Unidade Local de Saúde da Guarda, E. P. E. (508752000)","ALERT - LIFE SCIENCES COMPUTING, S.A. (507567455)","9.900,00 €",04-07-2017,28-03-2017,2 dias,"Portugal, Guarda, Guarda","Artigo 20.º, n.º 1, alínea a) do Código dos Contratos Públicos",,,,,,Não aplicável.,Não aplicável.,FALSE
Renovação do Contrato de Manutenção de Equipamentos de Eletromecânica das UCSP’s e do Laboratório da UCSP da Guarda para 2017,Ajuste Direto Regime Geral,Aquisição de serviços,"50420000-5, Serviços de reparação e manutenção de equipamento médico e cirúrgico","UNIDADE LOCAL DE SAÚDE DA GUARDA, E.P.E (508752000)",Serviço de Utilização Comum dos Hospitais (500900469),"27.470,16 €",04-07-2017,27-06-2017,365 dias,"Portugal, Guarda, Guarda","Artigo 20.º, n.º 1, alínea a) do Código dos Contratos Públicos",,,,,,Não aplicável.,Não aplicável.,FALSE
Renovação do Contrato de Prestação dos Serviços de Exploração das Instalações Elétricas da ULSG para 2017,Ajuste Direto Regime Geral,Aquisição de serviços,"50532400-7, Serviços de reparação e manutenção de equipamento de distribuição eléctrica","UNIDADE LOCAL DE SAÚDE DA GUARDA, E.P.E (508752000)",Serviço de Utilização Comum dos Hospitais (500900469),"22.261,20 €",04-07-2017,27-06-2017,365 dias,"Portugal, Guarda, Guarda","Artigo 20.º, n.º 1, alínea a) do Código dos Contratos Públicos",,,,,,Não aplicável.,Não aplicável.,FALSE
