freguesia,acronym,validVotesPercentage,votes,dicofre
Cervães,PPD/PSD.CDS-PP,62.76,391,031309
Cervães,PS,20.22,126,031309
Cervães,MPT,8.19,51,031309
Cervães,PCP-PEV,2.57,16,031309
Cervães,B.E.,1.77,11,031309
Cervães,L,1.12,7,031309
Cervães,PND,0.96,6,031309
Cervães,MAS,0.64,4,031309
Cervães,PCTP/MRPP,0.64,4,031309
Cervães,PAN,0.48,3,031309
Cervães,PTP,0.48,3,031309
Cervães,PPV,0.16,1,031309
Cervães,PDA,0,0,031309
Cervães,PNR,0,0,031309
Cervães,POUS,0,0,031309
Cervães,PPM,0,0,031309
