freguesia,acronym,validVotesPercentage,votes,dicofre
São Paio,PS,54.67,82,160317
São Paio,PPD/PSD.CDS-PP,30.67,46,160317
São Paio,MPT,7.33,11,160317
São Paio,B.E.,2.67,4,160317
São Paio,PND,2,3,160317
São Paio,PAN,0.67,1,160317
São Paio,PCP-PEV,0.67,1,160317
São Paio,PCTP/MRPP,0.67,1,160317
São Paio,PPM,0.67,1,160317
São Paio,L,0,0,160317
São Paio,MAS,0,0,160317
São Paio,PDA,0,0,160317
São Paio,PNR,0,0,160317
São Paio,POUS,0,0,160317
São Paio,PPV,0,0,160317
São Paio,PTP,0,0,160317
