freguesia,acronym,validVotesPercentage,votes,dicofre
União das freguesias de Fânzeres e São Pedro da Cova,PS,40.36,4094,130413
União das freguesias de Fânzeres e São Pedro da Cova,PPD/PSD,16.55,1679,130413
União das freguesias de Fânzeres e São Pedro da Cova,PCP-PEV,13.77,1397,130413
União das freguesias de Fânzeres e São Pedro da Cova,B.E.,11.65,1182,130413
União das freguesias de Fânzeres e São Pedro da Cova,PAN,6.41,650,130413
União das freguesias de Fânzeres e São Pedro da Cova,CDS-PP,2.97,301,130413
União das freguesias de Fânzeres e São Pedro da Cova,PCTP/MRPP,1.68,170,130413
União das freguesias de Fânzeres e São Pedro da Cova,L,1.39,141,130413
União das freguesias de Fânzeres e São Pedro da Cova,PPM.PPV/CDC,1.26,128,130413
União das freguesias de Fânzeres e São Pedro da Cova,NC,0.82,83,130413
União das freguesias de Fânzeres e São Pedro da Cova,A,0.77,78,130413
União das freguesias de Fânzeres e São Pedro da Cova,IL,0.6,61,130413
União das freguesias de Fânzeres e São Pedro da Cova,PDR,0.52,53,130413
União das freguesias de Fânzeres e São Pedro da Cova,PURP,0.43,44,130413
União das freguesias de Fânzeres e São Pedro da Cova,PNR,0.42,43,130413
União das freguesias de Fânzeres e São Pedro da Cova,PTP,0.22,22,130413
União das freguesias de Fânzeres e São Pedro da Cova,MAS,0.17,17,130413
