Objeto do Contrato,Tipo de Procedimento,Tipo(s) de Contrato,CPVs,Entidade(s) Adjudicante(s),Entidade(s) Adjudicatária(s),Preço Contratual,Data de Publicação,Data de Celebração do Contrato,Prazo de Execução,Local de Execução,Fundamentação,Data de Fecho do Contrato,Preço Total Efetivo,Causas das Alterações ao Prazo,Causas das Alterações ao Preço,Estado,N.º registo do Acordo Quadro,Descrição do Acordo Quadro,Procedimento Centralizado
"Centro de Saúde de Redondo, Construção - fase de execução do contrato - omissões",Ajuste Direto Regime Geral,Empreitadas de obras públicas,"45215000-7, Obras de construção de edifícios relacionados com serviços de saúde ou sociais, crematórios e instalações sanitárias públicas","Administração Regional de Saúde do Alentejo, IP (503148768)","A Encosta - Construções, SA (501086153)","5.360,85 €",01-07-2011,24-05-2011,0 dias,"Portugal, Évora, Redondo","Artigo 25.º, n.º 1, alínea a) do Código dos Contratos Públicos",,"5.360,85 €",,,,Não aplicável.,Não aplicável.,
"Pavimentação dos recuos das paredes exteriores, com a adição ao acabamento de produtos hidrófugos",Ajuste Direto Regime Geral,Empreitadas de obras públicas,"45215000-7, Obras de construção de edifícios relacionados com serviços de saúde ou sociais, crematórios e instalações sanitárias públicas","Administração Regional de Saúde do Alentejo, IP (503148768)","A Encosta - Construções, SA (501086153)","2.217,17 €",01-07-2011,06-06-2011,1 dias,"Portugal, Évora, Redondo","Artigo 24.º, n.º 1, alínea e) do Código dos Contratos Públicos",,"2.217,17 €",,,,Não aplicável.,Não aplicável.,
