freguesia,acronym,validVotesPercentage,votes,dicofre
Samuel,PS,52.41,196,061508
Samuel,PPD/PSD.CDS-PP,21.39,80,061508
Samuel,PCP-PEV,7.75,29,061508
Samuel,B.E.,5.61,21,061508
Samuel,MPT,4.81,18,061508
Samuel,PAN,2.41,9,061508
Samuel,L,2.14,8,061508
Samuel,PCTP/MRPP,1.34,5,061508
Samuel,PND,1.07,4,061508
Samuel,MAS,0.53,2,061508
Samuel,PPM,0.27,1,061508
Samuel,PTP,0.27,1,061508
Samuel,PDA,0,0,061508
Samuel,PNR,0,0,061508
Samuel,POUS,0,0,061508
Samuel,PPV,0,0,061508
