freguesia,acronym,validVotesPercentage,votes,dicofre
União das freguesias de Unhão e Lordelo,PS,39.43,125,130338
União das freguesias de Unhão e Lordelo,PPD/PSD,33.12,105,130338
União das freguesias de Unhão e Lordelo,B.E.,9.78,31,130338
União das freguesias de Unhão e Lordelo,CDS-PP,5.68,18,130338
União das freguesias de Unhão e Lordelo,PCP-PEV,4.1,13,130338
União das freguesias de Unhão e Lordelo,PAN,1.89,6,130338
União das freguesias de Unhão e Lordelo,A,1.26,4,130338
União das freguesias de Unhão e Lordelo,L,0.95,3,130338
União das freguesias de Unhão e Lordelo,PDR,0.95,3,130338
União das freguesias de Unhão e Lordelo,PPM.PPV/CDC,0.95,3,130338
União das freguesias de Unhão e Lordelo,MAS,0.63,2,130338
União das freguesias de Unhão e Lordelo,PNR,0.63,2,130338
União das freguesias de Unhão e Lordelo,NC,0.32,1,130338
União das freguesias de Unhão e Lordelo,PURP,0.32,1,130338
União das freguesias de Unhão e Lordelo,IL,0,0,130338
União das freguesias de Unhão e Lordelo,PCTP/MRPP,0,0,130338
União das freguesias de Unhão e Lordelo,PTP,0,0,130338
