freguesia,acronym,validVotesPercentage,votes,dicofre
Meinedo,PS,50.64,598,130513
Meinedo,PPD/PSD,23.79,281,130513
Meinedo,B.E.,8.04,95,130513
Meinedo,PCP-PEV,4.32,51,130513
Meinedo,PAN,3.73,44,130513
Meinedo,CDS-PP,2.88,34,130513
Meinedo,L,1.86,22,130513
Meinedo,PCTP/MRPP,1.02,12,130513
Meinedo,A,0.93,11,130513
Meinedo,PPM.PPV/CDC,0.76,9,130513
Meinedo,IL,0.51,6,130513
Meinedo,PURP,0.42,5,130513
Meinedo,NC,0.34,4,130513
Meinedo,PDR,0.34,4,130513
Meinedo,PTP,0.25,3,130513
Meinedo,MAS,0.17,2,130513
Meinedo,PNR,0,0,130513
