freguesia,acronym,validVotesPercentage,votes,dicofre
Galegos (São Martinho),PPD/PSD,43.62,212,030272
Galegos (São Martinho),PS,29.22,142,030272
Galegos (São Martinho),B.E.,8.85,43,030272
Galegos (São Martinho),CDS-PP,5.97,29,030272
Galegos (São Martinho),PAN,3.5,17,030272
Galegos (São Martinho),PPM.PPV/CDC,1.65,8,030272
Galegos (São Martinho),L,1.44,7,030272
Galegos (São Martinho),PDR,1.44,7,030272
Galegos (São Martinho),PCP-PEV,1.03,5,030272
Galegos (São Martinho),A,0.62,3,030272
Galegos (São Martinho),IL,0.62,3,030272
Galegos (São Martinho),NC,0.62,3,030272
Galegos (São Martinho),MAS,0.41,2,030272
Galegos (São Martinho),PNR,0.41,2,030272
Galegos (São Martinho),PURP,0.41,2,030272
Galegos (São Martinho),PCTP/MRPP,0.21,1,030272
Galegos (São Martinho),PTP,0,0,030272
