Objeto do Contrato,Tipo de Procedimento,Tipo(s) de Contrato,CPVs,Entidade(s) Adjudicante(s),Entidade(s) Adjudicatária(s),Preço Contratual,Data de Publicação,Data de Celebração do Contrato,Prazo de Execução,Local de Execução,Fundamentação,Data de Fecho do Contrato,Preço Total Efetivo,Causas das Alterações ao Prazo,Causas das Alterações ao Preço,Estado,N.º registo do Acordo Quadro,Descrição do Acordo Quadro,Procedimento Centralizado
Aquisição serviços médicos para o  Projeto Autoestima /Centro de Aconselhamento de Guimarães - Processo 18000138,Ajuste Direto Regime Geral,Aquisição de serviços,"85121210-8, Serviços de ginecologia ou obstetrícia","Administração Regional de Saúde do Norte, I. P. (503135593)",Ana Filipa Matos Brás (227321600),"2.704,00 €",20-07-2018,02-02-2018,365 dias,"Portugal, Braga, Guimarães","Artigo 20.º, n.º 1, alínea a) do Código dos Contratos Públicos","","","","",,Não aplicável.,Não aplicável.,FALSE
Aquisição serviços médicos - ACES Gerês/Cabreira - Processo 18000138,Ajuste Direto Regime Geral,Aquisição de serviços,"85121000-3, Serviços de prática médica","Administração Regional de Saúde do Norte, I. P. (503135593)",José Fernando Fernandes da Silva (157267954),"70.304,00 €",20-07-2018,29-01-2018,365 dias,"Portugal, Braga, Vieira do Minho","Artigo 20.º, n.º 1, alínea a) do Código dos Contratos Públicos","","","","",,Não aplicável.,Não aplicável.,FALSE
Aquisição de serviços médicos para o ACES Douro Sul - Processo 18000138,Ajuste Direto Regime Geral,Aquisição de serviços,"85121000-3, Serviços de prática médica","Administração Regional de Saúde do Norte, I. P. (503135593)",Cátia Daniela Aguiar Cabral (251282260),"11.440,00 €",20-07-2018,21-03-2018,365 dias,"Portugal, Viseu, Viseu","Artigo 20.º, n.º 1, alínea a) do Código dos Contratos Públicos","","","","",,Não aplicável.,Não aplicável.,FALSE
AP 124 Aquisição 1.200 frascos Ibuprofeno 20 mg/ml Susp oral,Ao abrigo de acordo-quadro (art.º 259.º),Aquisição de bens móveis,"33600000-6, Produtos farmacêuticos","Administração Regional de Saúde do Norte, I. P. (503135593)","GENERIS FARMACÊUTICA,SA  (508107997)","984,00 €",20-07-2018,11-04-2018,240 dias,"Portugal, Porto, Maia<BR/>Portugal, Vila Real, Vila Real",Artigo 259.º do Código dos Contratos Públicos,"","","","",,1394106,CP 2015/64 - Medicamentos Diversos,FALSE
AP 6 Aquisição de 4.500 ampolas Tiamina 100 mg/2 ml Sol inj 2 ml IM IV SC,Ao abrigo de acordo-quadro (art.º 258.º),Aquisição de bens móveis,"33600000-6, Produtos farmacêuticos","Administração Regional de Saúde do Norte, I. P. (503135593)","LABESFAL - LABORATÓRIOS ALMIRO, S.A.       (501169580)","8.015,40 €",20-07-2018,20-03-2018,270 dias,"Portugal, Porto, Maia<BR/>Portugal, Vila Real, Vila Real",Artigo 258.º do Código dos Contratos Públicos,10-10-2018,"8.015,40 €","","",,2775699,"CP 2017/50 - Medicação antialérgica, vitaminas e sais minerais, medicamentos usados no tratamento de intoxicações e grupo 20.9",FALSE
AP 271 Aquisição de 300  Teste rápido pesquisa de Mycobacterium tuberculosis complex,Ao abrigo de acordo-quadro (art.º 259.º),Aquisição de bens móveis,"33694000-1, Meios de diagnóstico","Administração Regional de Saúde do Norte, I. P. (503135593)","QUILABAN-QUIM. LAB. ANALITICA,LDA                       (500399670)","990,00 €",20-07-2018,10-04-2018,240 dias,"Portugal, Porto, Maia<BR/>Portugal, Vila Real, Vila Real",Artigo 259.º do Código dos Contratos Públicos,08-10-2018,"990,00 €","","",,1555404,CP 2015/73 - Acordo quadro para fornecimento de Reagentes - Testes Rápidos às Instituições e Serviços do Serviço Nacional de Saúde,FALSE
AP 592 Aquisição 600 comprimidos Quetiapina 300 mg Comp,Ao abrigo de acordo-quadro (art.º 259.º),Aquisição de bens móveis,"33600000-6, Produtos farmacêuticos","Administração Regional de Saúde do Norte, I. P. (503135593)",AP 592 Aquisição 600 comprimidos Quetiapina 300 mg Comp (508107997),"120,00 €",20-07-2018,14-05-2018,240 dias,"Portugal, Porto, Maia<BR/>Portugal, Vila Real, Vila Real",Artigo 259.º do Código dos Contratos Públicos,25-05-2018,"120,00 €","","",,2356543,CP 2016/19 - Medicamentos Antipsicóticos,FALSE
AP 123  aquisição 500 ampolas Naloxona 0.4 mg/1 ml Sol inj Fr 1 ml IM IV SC; 180.000 comprimidos Piridoxina (Vitamina B 6) 40 mg ,Ao abrigo de acordo-quadro (art.º 259.º),Aquisição de bens móveis,"33600000-6, Produtos farmacêuticos","Administração Regional de Saúde do Norte, I. P. (503135593)","LABESFAL - LABORATÓRIOS ALMIRO, S.A.            (501169580)","72.432,00 €",20-07-2018,10-04-2018,240 dias,"Portugal, Vila Real, Vila Real<BR/>Portugal, Porto, Maia",Artigo 259.º do Código dos Contratos Públicos,25-10-2018,"72.432,00 €","","",,2775699,"CP 2017/50 - Medicação antialérgica, vitaminas e sais minerais, medicamentos usados no tratamento de intoxicações e grupo 20.9",FALSE
AP 123  aquisição 500 ampolas Naloxona 0.4 mg/1 ml Sol inj Fr 1 ml IM IV SC; 180.000 comprimidos Piridoxina (Vitamina B 6) 40 mg ,Ao abrigo de acordo-quadro (art.º 259.º),Aquisição de bens móveis,"33600000-6, Produtos farmacêuticos","Administração Regional de Saúde do Norte, I. P. (503135593)",B BRAUN MEDICAL LDA        (501506543),"3.080,00 €",20-07-2018,09-04-2018,240 dias,"Portugal, Porto, Maia<BR/>Portugal, Vila Real, Vila Real",Artigo 259.º do Código dos Contratos Públicos,24-09-2018,"3.080,00 €","","",,2775699,"CP 2017/50 - Medicação antialérgica, vitaminas e sais minerais, medicamentos usados no tratamento de intoxicações e grupo 20.9",FALSE
AP 31 aquisição de 3.800 unidades Esponja de Gelatina 8 cm x 5 cm x 1 cm,Ao abrigo de acordo-quadro (art.º 259.º),Aquisição de bens móveis,"33600000-6, Produtos farmacêuticos","Administração Regional de Saúde do Norte, I. P. (503135593)",CLINIFAR - PROD. CLIN. FARMACÊUTICOS S.A.               (503281115),"5.122,40 €",20-07-2018,05-04-2018,240 dias,"Portugal, Porto, Maia<BR/>Portugal, Vila Real, Vila Real",Artigo 259.º do Código dos Contratos Públicos,15-10-2018,"5.122,40 €","","",,1315192,Acordo Quadro para fornecimento de material de penso de efeito terapêutico às Instituições e Serviços do Serviço Nacional de Saúde,FALSE
"Aquisição de Serviços de Higiene e limpeza com fornecimento de consumíveis de casa de Banho, ao abrigo do Lote 17 - Ref. : 00105_2018",Ao abrigo de acordo-quadro (art.º 259.º),Aquisição de bens móveis,"33760000-5, Papel higiénico, lenços, toalhas de mão e guardanapos","Administração Regional de Saúde do Norte, I. P. (503135593)",INTERLIMPE-FACILITY SERVICES   (502611057),"222.421,31 €",20-07-2018,14-06-2018,180 dias,"Portugal, Porto, Maia<BR/>Portugal, Vila Real, Vila Real",Artigo 259.º do Código dos Contratos Públicos,"","","","",,614429,Acordo quadro para higiene e limpeza,FALSE
"AP 36 Aquisição de 350 unidades Sistema fechado colheita aspiração plasma (Li-Hep) 2,6mL;  2.000 unidades Sistema fechado colheita aspiração hemograma (EDTA) 3mL",Ao abrigo de acordo-quadro (art.º 259.º),Aquisição de bens móveis,"33140000-3, Material médico de consumo","Administração Regional de Saúde do Norte, I. P. (503135593)","Sarsted , lda      (503019461)","251,30 €",20-07-2018,22-03-2018,240 dias,"Portugal, Porto, Maia<BR/>Portugal, Vila Real, Vila Real",Artigo 259.º do Código dos Contratos Públicos,22-10-2018,"251,30 €","","",,448705,"CONCURSO PÚBLICO PARA A CELEBRAÇÃO DE CONTRATOS PÚBLICOS DE APROVISIONAMENTO PARA A ÁREA DA SAÚDE, COM VISTA AO FORNECIMENTO DE SERINGAS, AGULHAS, CONTENTORES E SISTEMAS FECHADOS DE COLHEITA,  ÀS INSTITUIÇÕES E SERVIÇOS DO SERVIÇO NACIONAL DE SAÚDE",FALSE
AP 36 Aquisição de 7500 unidades Borboleta extração múltipla sangue por vácuo 21G,Ao abrigo de acordo-quadro (art.º 259.º),Aquisição de bens móveis,"33140000-3, Material médico de consumo","Administração Regional de Saúde do Norte, I. P. (503135593)","VACUETE PORTUGAL, S.A     (505348470)","2.850,00 €",20-07-2018,16-03-2018,240 dias,"Portugal, Vila Real, Vila Real<BR/>Portugal, Porto, Maia",Artigo 259.º do Código dos Contratos Públicos,11-10-2018,"2.850,00 €","","",,448705,"CONCURSO PÚBLICO PARA A CELEBRAÇÃO DE CONTRATOS PÚBLICOS DE APROVISIONAMENTO PARA A ÁREA DA SAÚDE, COM VISTA AO FORNECIMENTO DE SERINGAS, AGULHAS, CONTENTORES E SISTEMAS FECHADOS DE COLHEITA,  ÀS INSTITUIÇÕES E SERVIÇOS DO SERVIÇO NACIONAL DE SAÚDE",FALSE
Material Consumo Clinico,Concurso público,Aquisição de bens móveis,"33140000-3, Material médico de consumo","Administração Regional de Saúde do Norte, I. P. (503135593)",EZEQUIEL PANÃO JORGE; Lda (501412727),"2.480,00 €",20-07-2018,19-07-2018,213 dias,"Portugal, Vila Real, Vila Real<BR/>Portugal, Porto, Maia","Artigo 20.º, n.º 1, alínea b) do Código dos Contratos Públicos","","","","",,Não aplicável.,Não aplicável.,FALSE
Material Consumo Clinico,Concurso público,Aquisição de bens móveis,"33140000-3, Material médico de consumo","Administração Regional de Saúde do Norte, I. P. (503135593)",OVERPHARMA PROD MEDICOS E FARMACEUTICOS LDA (505792362),"870,00 €",20-07-2018,19-07-2018,213 dias,"Portugal, Vila Real, Vila Real<BR/>Portugal, Porto, Maia","Artigo 20.º, n.º 1, alínea b) do Código dos Contratos Públicos","","","","",,Não aplicável.,Não aplicável.,FALSE
Material Consumo Clinico,Concurso público,Aquisição de bens móveis,"33140000-3, Material médico de consumo","Administração Regional de Saúde do Norte, I. P. (503135593)","Quilaban, Lda (500399670)","21,00 €",20-07-2018,19-07-2018,213 dias,"Portugal, Vila Real, Vila Real<BR/>Portugal, Porto, Maia","Artigo 20.º, n.º 1, alínea b) do Código dos Contratos Públicos","","","","",,Não aplicável.,Não aplicável.,FALSE
Renovação de aquisição de serviços médicos com especialidade para unidades do Dicad - CRI Braga/ET Guimarães ano de 2018. Processo nº18000138 - CA nº232018,Ajuste Direto Regime Geral,Aquisição de serviços,"85121270-6, Serviços de psiquiatria ou psicologia","Administração Regional de Saúde do Norte, I. P. (503135593)",Sónia Isabel Eusébio Ribeiro Simões (218717628),"13.520,00 €",20-07-2018,29-01-2018,366 dias,"Portugal, Braga, Guimarães","Artigo 20.º, n.º 1, alínea a) do Código dos Contratos Públicos",31-12-2018,"7.644,00 €","",Numero de horas realizadas inferiores ao numero de horas contratadas,,Não aplicável.,Não aplicável.,FALSE
Renovação de aquisição de serviços médicos com especialidade para unidades do Dicad - CRI Braga/ET Braga ano de 2018. Processo nº18000138 - CA nº202018,Ajuste Direto Regime Geral,Aquisição de serviços,"85121000-3, Serviços de prática médica","Administração Regional de Saúde do Norte, I. P. (503135593)",Mafalda Maria Antunes Sousela (211955680),"27.040,00 €",20-07-2018,29-01-2018,366 dias,"Portugal, Braga, Braga","Artigo 20.º, n.º 1, alínea a) do Código dos Contratos Públicos",31-12-2018,"20.566,00 €","",Numero de horas realizadas inferiores ao numero de horas contratadas,,Não aplicável.,Não aplicável.,FALSE
Renovação de aquisição de serviços médicos com especialidade para unidades do Dicad - CRI Braga/ET Guimarães ano de 2018. Processo nº18000138 - CA nº222018,Ajuste Direto Regime Geral,Aquisição de serviços,"85121000-3, Serviços de prática médica","Administração Regional de Saúde do Norte, I. P. (503135593)",Mafalda Maria Antunes Sousela (211955680),"22.984,00 €",20-07-2018,29-01-2018,366 dias,"Portugal, Braga, Guimarães","Artigo 20.º, n.º 1, alínea a) do Código dos Contratos Públicos",31-12-2018,"16.978,00 €","",Numero de horas realizadas inferiores ao numero de horas contratadas,,Não aplicável.,Não aplicável.,FALSE
AP 471 Material de laboratório,Ajuste Direto Regime Geral,Aquisição de bens móveis,"33696500-0, Reagentes de laboratório","Administração Regional de Saúde do Norte, I. P. (503135593)","Tecnilab Portugal, SA (500758158)","28.055,86 €",20-07-2018,29-03-2018,270 dias,"Portugal, Porto, Maia<BR/>Portugal, Vila Real, Vila Real","Artigo 24.º, n.º 1, alínea e), subalínea ii) do Código dos Contratos Públicos","","","","",,Não aplicável.,Não aplicável.,FALSE
AP 732 Material de Laboratório,Ajuste Direto Regime Geral,Aquisição de bens móveis,"44165100-5, Tubos","Administração Regional de Saúde do Norte, I. P. (503135593)","Biogerm, SA (503265390)","404,00 €",20-07-2018,20-06-2018,180 dias,"Portugal, Porto, Maia<BR/>Portugal, Vila Real, Vila Real","Artigo 24.º, n.º 1, alínea e), subalínea ii) do Código dos Contratos Públicos","","","","",,Não aplicável.,Não aplicável.,FALSE
AP 613 Material de Laboratório,Ajuste Direto Regime Geral,Aquisição de bens móveis,"33600000-6, Produtos farmacêuticos","Administração Regional de Saúde do Norte, I. P. (503135593)","Hach Lange, Lda (507155165)","485,35 €",20-07-2018,29-05-2018,210 dias,"Portugal, Vila Real, Vila Real<BR/>Portugal, Porto, Maia","Artigo 24.º, n.º 1, alínea e), subalínea ii) do Código dos Contratos Públicos","","","","",,Não aplicável.,Não aplicável.,FALSE
3 300 comprimidos acamprosato 333 mg comp GR,Ajuste Direto Regime Geral,Aquisição de bens móveis,"33600000-6, Produtos farmacêuticos","Administração Regional de Saúde do Norte, I. P. (503135593)","Merck, SA (500650870)","606,54 €",20-07-2018,20-06-2018,160 dias,"Portugal, Porto, Maia<BR/>Portugal, Vila Real, Vila Real","Artigo 24.º, n.º 1, alínea e) do Código dos Contratos Públicos","","","","",,Não aplicável.,Não aplicável.,FALSE
Aquisição de serviços médicos com especialidade em Pneumologia para  ACES Douro Sul/ CDP de Lamego.,Ajuste Direto Regime Geral,Aquisição de serviços,"85121232-8, Serviços especializados pulmonares","Administração Regional de Saúde do Norte, I. P. (503135593)",Dulce Teixeira de Sousa Apolinário (220550743),"19.890,00 €",19-07-2018,19-03-2018,360 dias,"Portugal, Viseu, Lamego","Artigo 20.º, n.º 1, alínea a) do Código dos Contratos Públicos",16-09-2018,"1.768,00 €",Rescisão do contrato,Rescisão do contrato,,Não aplicável.,Não aplicável.,FALSE
Aquisição de serviços médicos sem especialidade para o ACES Douro I-Marão e Douro Norte - Processo 18000138,Ajuste Direto Regime Geral,Aquisição de serviços,"85121000-3, Serviços de prática médica","Administração Regional de Saúde do Norte, I. P. (503135593)",Miguel Fernández Diaz (245184384),"8.800,00 €",19-07-2018,26-03-2018,305 dias,"Portugal, Vila Real, Mesão Frio","Artigo 20.º, n.º 1, alínea a) do Código dos Contratos Públicos","","","","",,Não aplicável.,Não aplicável.,FALSE
AP 809 - Material de Consumo Clínico,Ajuste Direto Regime Geral,Aquisição de bens móveis,"33140000-3, Material médico de consumo","Administração Regional de Saúde do Norte, I. P. (503135593)","Quilaban, Lda (500399670)","8.528,59 €",19-07-2018,01-06-2018,180 dias,"Portugal, Porto, Maia<BR/>Portugal, Vila Real, Vila Real","Artigo 24.º, n.º 1, alínea e), subalínea ii) do Código dos Contratos Públicos","","","","",,Não aplicável.,Não aplicável.,FALSE
APROV-VR-18001043 - AP 755 - Aquisição de 1458 frascos de cloreto de etilo Sol pul cut,Ajuste Direto Regime Geral,Aquisição de bens móveis,"33600000-6, Produtos farmacêuticos","Administração Regional de Saúde do Norte, I. P. (503135593)","Overpharma, Lda (505792362)","6.852,00 €",18-07-2018,27-06-2018,180 dias,"Portugal, Vila Real, Vila Real<BR/>Portugal, Porto, Maia","Artigo 20.º, n.º 1, alínea d) do Código dos Contratos Públicos",30-10-2018,"6.852,00 €","","",,Não aplicável.,Não aplicável.,FALSE
"APROV-VR-18001444 - AP 1099 - aquisição de 4000 unid de Sistema fechado colheita aspiração plasma (Li-Hep) 4/4,5 mL",Ao abrigo de acordo-quadro (art.º 258.º),Locação de bens móveis,"33140000-3, Material médico de consumo","Administração Regional de Saúde do Norte, I. P. (503135593)","Sarsted, Lda (503019461)","636,00 €",18-07-2018,21-06-2018,180 dias,"Portugal, Porto, Maia<BR/>Portugal, Vila Real, Vila Real",Artigo 258.º do Código dos Contratos Públicos,30-10-2018,"636,00 €","","",,3141337,CP 2017/70 - Acordo Quadro para fornecimento de Sistemas Fechados de Colheita de Sangue e de Urina às Instituições e Serviços do Serviço Nacional de Saúde,FALSE
APROV-VR-18000788-AP 520 - Aquisição de Reagentes e Produtos de Diagnóstico - Reagente determinação INR no sangue,Ajuste Direto Regime Geral,Aquisição de bens móveis,"33694000-1, Meios de diagnóstico","Administração Regional de Saúde do Norte, I. P. (503135593)","Roche Sistemas de Diagnósticos, Lda (504282921)","174.240,00 €",18-07-2018,06-07-2018,180 dias,"Portugal, Porto, Maia<BR/>Portugal, Vila Real, Vila Real","Artigo 24.º, n.º 1, alínea e), subalínea ii) do Código dos Contratos Públicos",16-11-2018,"174.240,00 €","","",,Não aplicável.,Não aplicável.,FALSE
Empreitada de remodelação da Unidade de Saúde do Cerco (USF Novo Sentido),Concurso público,Empreitadas de obras públicas,"45215100-8, Obras de construção de edifícios relacionados com serviços de saúde","Administração Regional de Saúde do Norte, I. P. (503135593)","QTcivil - Engenharia e Reabilitação, S.A. (503590010)","1.090.382,38 €",18-07-2018,26-06-2018,270 dias,"Portugal, Porto, Porto","Artigo 19.º, alínea b) do Código dos Contratos Públicos","","","","",,Não aplicável.,Não aplicável.,FALSE
APROV-VR- 18001045 - AP 758 - AQUISIÇÃO DE  DE MATERIAL DE CONSUMO CLÍNICO,Ajuste Direto Regime Geral,Aquisição de bens móveis,"33140000-3, Material médico de consumo","Administração Regional de Saúde do Norte, I. P. (503135593)",Intersurgical - Portugal (503480045),"3.124,80 €",18-07-2018,18-06-2018,180 dias,"Portugal, Porto, Maia<BR/>Portugal, Vila Real, Vila Real","Artigo 24.º, n.º 1, alínea e), subalínea ii) do Código dos Contratos Públicos",08-08-2018,"3.124,80 €","","",,Não aplicável.,Não aplicável.,FALSE
"Fornecimento de Gás Natural ao Abrigo do Lote 4 do Acordo Quadro ESPAP, Ref: 00083_2018",Ao abrigo de acordo-quadro (art.º 259.º),Aquisição de bens móveis,"09120000-6, Combustíveis gasosos","Administração Regional de Saúde do Norte, I. P. (503135593)","Galp Power, S.A. (504723456)","140.122,61 €",18-07-2018,01-04-2018,276 dias,Portugal,Artigo 259.º do Código dos Contratos Públicos,"","","","",,1555095,Acordo quadro para o fornecimento de gás natural em regime de mercado livre para Portugal Continental,FALSE
"AP 1151 - Aquisição de 200 Cart de Fio sutura agulha lanc.3/8circ.19mm3/0sinté.absor.rápida, 1 000 Unidades de Sonda de aspiração CH12, 13 000 Unidades de Sonda nelaton CH12 Masculina e 5 000 Unidades de Cânula plástica para aspiração de saliva irrecuperável",Consulta Prévia,Aquisição de bens móveis,"33140000-3, Material médico de consumo","Administração Regional de Saúde do Norte, I. P. (503135593)",B.Braun Medical (501506543),"2.431,00 €",17-07-2018,11-07-2018,180 dias,"Portugal, Distrito não determinado, Concelho não determinado<BR/>Portugal, Porto, Maia<BR/>Portugal, Vila Real, Vila Real","Artigo 20.º, n.º 1, alínea c) do Código dos Contratos Públicos","","","","",,Não aplicável.,Não aplicável.,FALSE
Produtos Farmacêuticos - AP 105 - Aquisição de 7 500 Unidades de Etionamida 250 mg Comp,Concurso público,Aquisição de bens móveis,"33670000-7, Medicamentos para o aparelho respiratório","Administração Regional de Saúde do Norte, I. P. (503135593)","Rb - Produtos Farmacêuticos, Unipessoal Lda  (510784429)","50.475,00 €",17-07-2018,17-04-2018,274 dias,"Portugal, Porto, Maia<BR/>Portugal, Vila Real, Vila Real","Artigo 155.º, alínea a) do Código dos Contratos Públicos","","","","",,Não aplicável.,Não aplicável.,FALSE
Produtos Farmacêuticos - AP 105 - Aquisição de 270 000 comprimidos de Isoniazida 300 mg e 6 000 Unidades de Cicloserina 250 mg,Concurso público,Aquisição de bens móveis,"33670000-7, Medicamentos para o aparelho respiratório","Administração Regional de Saúde do Norte, I. P. (503135593)","DUXPHARMA UNIPESSOAL, LDA (510803679)","49.200,00 €",17-07-2018,17-04-2018,274 dias,"Portugal, Porto, Maia<BR/>Portugal, Vila Real, Vila Real","Artigo 155.º, alínea a) do Código dos Contratos Públicos","","","","",,Não aplicável.,Não aplicável.,FALSE
APROV-VR-18000073-AP16,Ao abrigo de acordo-quadro (art.º 259.º),Aquisição de bens móveis,"33600000-6, Produtos farmacêuticos","Administração Regional de Saúde do Norte, I. P. (503135593)","Labesfal - laboratórios Almiro, S.A. (501169580)","5.700,25 €",17-07-2018,26-03-2018,270 dias,"Portugal, Porto, Maia<BR/>Portugal, Vila Real, Vila Real",Artigo 259.º do Código dos Contratos Públicos,15-10-2018,"5.700,25 €","","",,1974985,"Medicamentos Analgésicos, Antipiréticos e Antidepressivos",FALSE
APROV-VR-18000073-AP16,Ao abrigo de acordo-quadro (art.º 259.º),Aquisição de bens móveis,"33600000-6, Produtos farmacêuticos","Administração Regional de Saúde do Norte, I. P. (503135593)","Overpharma, Lda (505792362)","298,08 €",17-07-2018,21-03-2018,270 dias,"Portugal, Vila Real, Vila Real<BR/>Portugal, Porto, Maia",Artigo 259.º do Código dos Contratos Públicos,15-05-2018,"298,08 €","","",,1974985,"Medicamentos Analgésicos, Antipiréticos e Antidepressivos",FALSE
APROV-VR-18000073-AP16,Ao abrigo de acordo-quadro (art.º 259.º),Aquisição de bens móveis,"33600000-6, Produtos farmacêuticos","Administração Regional de Saúde do Norte, I. P. (503135593)",Unilfarma (500293023),"756,00 €",17-07-2018,23-03-2018,270 dias,"Portugal, Porto, Maia<BR/>Portugal, Vila Real, Vila Real",Artigo 259.º do Código dos Contratos Públicos,30-08-2018,"756,00 €","","",,1974985,"Medicamentos Analgésicos, Antipiréticos e Antidepressivos",FALSE
Aquisição Equipamento Hoteleiro - APROV-PRT AP884/2018,Consulta Prévia,Aquisição de bens móveis,"39300000-5, Equipamento diverso","Administração Regional de Saúde do Norte, I. P. (503135593)",A. De Oliveira Costa - Oliva (123964849),"13.390,84 €",17-07-2018,01-06-2018,210 dias,"Portugal, Distrito não determinado, Concelho não determinado<BR/>Portugal, Distrito não determinado, Concelho não determinado","Artigo 20.º, n.º 1, alínea c) do Código dos Contratos Públicos",16-07-2018,"13.390,84 €","","",,Não aplicável.,Não aplicável.,FALSE
APROV-VR-18000073-AP16,Ao abrigo de acordo-quadro (art.º 259.º),Aquisição de bens móveis,"33600000-6, Produtos farmacêuticos","Administração Regional de Saúde do Norte, I. P. (503135593)","Laboratórios Medinfar, S.A. (500384045)","86,46 €",17-07-2018,26-03-2018,270 dias,"Portugal, Vila Real, Vila Real<BR/>Portugal, Porto, Maia",Artigo 259.º do Código dos Contratos Públicos,31-08-2018,"86,46 €","","",,1974985,"Medicamentos Analgésicos, Antipiréticos e Antidepressivos",FALSE
Aquisição Equipamento Hoteleiro - APROV-PRT AP884/2018,Consulta Prévia,Aquisição de bens móveis,"39300000-5, Equipamento diverso","Administração Regional de Saúde do Norte, I. P. (503135593)","SIFAM - Sistemas Escritorio, Lda. (502388579)","6.510,80 €",17-07-2018,01-06-2018,210 dias,"Portugal, Distrito não determinado, Concelho não determinado<BR/>Portugal, Distrito não determinado, Concelho não determinado","Artigo 20.º, n.º 1, alínea c) do Código dos Contratos Públicos",17-09-2018,"6.510,80 €","","",,Não aplicável.,Não aplicável.,FALSE
APROV-VR-18000073-AP16,Ao abrigo de acordo-quadro (art.º 259.º),Aquisição de bens móveis,"33600000-6, Produtos farmacêuticos","Administração Regional de Saúde do Norte, I. P. (503135593)","Ratiopharm, Lda (502414910)","423,00 €",17-07-2018,21-03-2018,270 dias,"Portugal, Porto, Maia<BR/>Portugal, Vila Real, Vila Real",Artigo 259.º do Código dos Contratos Públicos,06-09-2018,"423,00 €","","",,1974985,"Medicamentos Analgésicos, Antipiréticos e Antidepressivos",FALSE
APROV-VR-18000073-AP16,Ao abrigo de acordo-quadro (art.º 259.º),Aquisição de bens móveis,"33600000-6, Produtos farmacêuticos","Administração Regional de Saúde do Norte, I. P. (503135593)","Generis Farmacêutica, S.A. (508107997)","14,94 €",17-07-2018,21-03-2018,270 dias,"Portugal, Vila Real, Vila Real<BR/>Portugal, Porto, Maia",Artigo 259.º do Código dos Contratos Públicos,03-09-2018,"14,94 €","","",,1974985,"Medicamentos Analgésicos, Antipiréticos e Antidepressivos",FALSE
Aquisição de Produtos farmacêuticos,Ao abrigo de acordo-quadro (art.º 259.º),Aquisição de bens móveis,"33600000-6, Produtos farmacêuticos","Administração Regional de Saúde do Norte, I. P. (503135593)","Sanofi - Produtos Farmacêuticos, Lda (500134960)","1.491,60 €",17-07-2018,26-03-2018,270 dias,"Portugal, Porto, Maia<BR/>Portugal, Vila Real, Vila Real",Artigo 259.º do Código dos Contratos Públicos,06-11-2018,"1.491,60 €","","",,2356543,CP 2016/19 - Medicamentos Antipsicóticos,FALSE
Aquisição de Produtos farmacêuticos,Ao abrigo de acordo-quadro (art.º 259.º),Aquisição de bens móveis,"33600000-6, Produtos farmacêuticos","Administração Regional de Saúde do Norte, I. P. (503135593)","Ratiopharm, Lda (502414910)","134,40 €",17-07-2018,20-03-2018,270 dias,"Portugal, Porto, Maia<BR/>Portugal, Vila Real, Vila Real",Artigo 259.º do Código dos Contratos Públicos,07-11-2018,"134,40 €","","",,2356543,CP 2016/19 - Medicamentos Antipsicóticos,FALSE
APROV- VR -AP 5 Aquisição de reagentes e produtos de diagnóstico,Ao abrigo de acordo-quadro (art.º 259.º),Aquisição de bens móveis,"33694000-1, Meios de diagnóstico","Administração Regional de Saúde do Norte, I. P. (503135593)","Normax - Fábrica de Vidros Cientificos, Lda (500203130)","16.983,00 €",17-07-2018,26-03-2018,270 dias,"Portugal, Vila Real, Vila Real<BR/>Portugal, Porto, Maia",Artigo 259.º do Código dos Contratos Públicos,06-12-2018,"16.983,00 €","","",,3377370,CP 2018/71 - Acordo Quadro para fornecimento de Dispositivos Médicos Diversos às Instituições e Serviços do  Serviço Nacional de Saúde,FALSE
APROV- VR -AP 5 Aquisição de reagentes e produtos de diagnóstico,Ao abrigo de acordo-quadro (art.º 259.º),Aquisição de bens móveis,"33694000-1, Meios de diagnóstico","Administração Regional de Saúde do Norte, I. P. (503135593)","Quilaban, Lda (500399670)","1.318,40 €",17-07-2018,21-03-2018,270 dias,"Portugal, Vila Real, Vila Real<BR/>Portugal, Porto, Maia",Artigo 259.º do Código dos Contratos Públicos,09-08-2018,"1.318,40 €","","",,3377370,CP 2018/71 - Acordo Quadro para fornecimento de Dispositivos Médicos Diversos às Instituições e Serviços do  Serviço Nacional de Saúde,FALSE
"AP 983 - Aquisição de 80 Embalagens de Budesonida 200 mcg/dose Sol. pressu inal c/ câmara expansora e 30 000 Ampolas de Brometo ipratrópio 0,25 mg/2 ml Sol inal neb 2 ml",Ajuste Direto Regime Geral,Aquisição de bens móveis,"33670000-7, Medicamentos para o aparelho respiratório","Administração Regional de Saúde do Norte, I. P. (503135593)","Unilfarma, Lda. (500293023)","4.500,00 €",13-07-2018,08-06-2018,210 dias,"Portugal, Vila Real, Vila Real<BR/>Portugal, Porto, Maia<BR/>Portugal, Distrito não determinado, Concelho não determinado","Artigo 24.º, n.º 1, alínea e), subalínea iii) do Código dos Contratos Públicos","","","","",,Não aplicável.,Não aplicável.,FALSE
Fornecimento de Electricidade - ESPAP Lote 8 - Contrato n.º 54/2018 Ref: 00086_2018,Ao abrigo de acordo-quadro (art.º 259.º),Aquisição de bens móveis,"09310000-5, Electricidade","Administração Regional de Saúde do Norte, I. P. (503135593)","Iberdrola Clientes de Portugal, Unipessoal, Lda (502124083)","2.374.647,04 €",13-07-2018,01-04-2018,276 dias,Portugal,Artigo 259.º do Código dos Contratos Públicos,"","","","",,1494502,Acordo quadro para o fornecimento de eletricidade em regime de mercado livre para Portugal Continental,FALSE
"AP 983 - Aquisição de 80 Embalagens de Budesonida 200 mcg/dose Sol. pressu inal c/ câmara expansora e 30 000 Ampolas de Brometo ipratrópio 0,25 mg/2 ml Sol inal neb 2 ml",Ajuste Direto Regime Geral,Aquisição de bens móveis,"33670000-7, Medicamentos para o aparelho respiratório","Administração Regional de Saúde do Norte, I. P. (503135593)","ANGELINI FARMACEUTICA, LDA (500583650)","1.044,00 €",13-07-2018,08-06-2018,210 dias,"Portugal, Vila Real, Vila Real<BR/>Portugal, Porto, Maia<BR/>Portugal, Distrito não determinado, Concelho não determinado","Artigo 24.º, n.º 1, alínea e), subalínea iii) do Código dos Contratos Públicos","","","","",,Não aplicável.,Não aplicável.,FALSE
AP 1142 - Aquisição de 1 120 Capsulas de Loperamida 2 mg Cáps/Comp,Ao abrigo de acordo-quadro (art.º 258.º),Aquisição de bens móveis,"33600000-6, Produtos farmacêuticos","Administração Regional de Saúde do Norte, I. P. (503135593)","RATIOPHARM, LDA (502414910)","25,20 €",13-07-2018,19-06-2018,180 dias,"Portugal, Porto, Maia<BR/>Portugal, Vila Real, Vila Real<BR/>Portugal, Distrito não determinado, Concelho não determinado",Artigo 258.º do Código dos Contratos Públicos,"","","","",,2222779,Medicamentos do aparelho digestivo,FALSE
AP 491 Aquisição de Material de Escritório,Consulta Prévia,Aquisição de bens móveis,"30192000-1, Material de escritório","Administração Regional de Saúde do Norte, I. P. (503135593)","EUGENIO PEREIRA, LIMITADA             (503989525)","155,10 €",13-07-2018,29-06-2018,180 dias,"Portugal, Vila Real, Vila Real<BR/>Portugal, Porto, Maia","Artigo 20.º, n.º 1, alínea c) do Código dos Contratos Públicos",16-07-2018,"155,10 €","","",,Não aplicável.,Não aplicável.,FALSE
AP 491 Aquisição de Material de Escritório,Consulta Prévia,Aquisição de bens móveis,"30192000-1, Material de escritório","Administração Regional de Saúde do Norte, I. P. (503135593)",DISTRIOFFICE - COM.RECI.PROD.INF.ESC.LDA        (508512077),"1.202,00 €",13-07-2018,29-06-2018,180 dias,"Portugal, Vila Real, Vila Real<BR/>Portugal, Porto, Maia","Artigo 20.º, n.º 1, alínea c) do Código dos Contratos Públicos",16-11-2018,"1.202,00 €","","",,Não aplicável.,Não aplicável.,FALSE
AP 491 Aquisição de Material de Escritório,Consulta Prévia,Aquisição de bens móveis,"30192000-1, Material de escritório","Administração Regional de Saúde do Norte, I. P. (503135593)","CDI - COMPANHIA DISTRIBUIDORA DE INFORMATICA, LDA        (502803355)","402,50 €",13-07-2018,29-06-2018,180 dias,"Portugal, Porto, Maia<BR/>Portugal, Vila Real, Vila Real","Artigo 20.º, n.º 1, alínea c) do Código dos Contratos Públicos","","","","",,Não aplicável.,Não aplicável.,FALSE
AP 491 Aquisição de Material de Escritório,Consulta Prévia,Aquisição de bens móveis,"30192000-1, Material de escritório","Administração Regional de Saúde do Norte, I. P. (503135593)","QUADRIGIRA-CONSUMIVEIS UNIPESSOAL, LDA                  (508109574)","2.109,00 €",13-07-2018,29-06-2018,180 dias,"Portugal, Porto, Maia<BR/>Portugal, Vila Real, Vila Real","Artigo 20.º, n.º 1, alínea c) do Código dos Contratos Públicos",04-07-2018,"2.109,00 €","","",,Não aplicável.,Não aplicável.,FALSE
AP 491 Aquisição de Material de Escritório,Consulta Prévia,Aquisição de bens móveis,"30192000-1, Material de escritório","Administração Regional de Saúde do Norte, I. P. (503135593)",LUIRAMA-COM EQUIPA ESCRITORIO AFINS LDA                 (502762381),"1.603,50 €",13-07-2018,29-06-2018,180 dias,"Portugal, Vila Real, Vila Real<BR/>Portugal, Porto, Maia","Artigo 20.º, n.º 1, alínea c) do Código dos Contratos Públicos",20-07-2018,"1.603,50 €","","",,Não aplicável.,Não aplicável.,FALSE
Material de Consumo Clinico,Concurso público,Aquisição de bens móveis,"33140000-3, Material médico de consumo","Administração Regional de Saúde do Norte, I. P. (503135593)","Anastácio Saldanha, Lda. (505804441)","6.092,50 €",13-07-2018,13-07-2018,213 dias,"Portugal, Porto, Maia<BR/>Portugal, Vila Real, Vila Real","Artigo 20.º, n.º 1, alínea b) do Código dos Contratos Públicos","","","","",,Não aplicável.,Não aplicável.,FALSE
Material de Consumo Clinico - AP 1066 - Aquisição de 850 Unidades de Sonda nasal para administração oxigênio,Concurso público,Aquisição de bens móveis,"33140000-3, Material médico de consumo","Administração Regional de Saúde do Norte, I. P. (503135593)",INTERSURGICAL - PORTUGAL                                (503480045),"170,00 €",13-07-2018,12-07-2018,213 dias,"Portugal, Porto, Maia<BR/>Portugal, Vila Real, Vila Real","Artigo 20.º, n.º 1, alínea b) do Código dos Contratos Públicos","","","","",,Não aplicável.,Não aplicável.,FALSE
"Material de Consumo Clinico - AP 1066 - Aquisição de 2 600 Unidades de Sonda de aspiração CH12, 4 500 Unidades de Sonda de aspiração CH14, 600 Unidades de Sonda de aspiração CH18 e 10 000 Unidades de Sonda de aspiração CH8",Concurso público,Aquisição de bens móveis,"33140000-3, Material médico de consumo","Administração Regional de Saúde do Norte, I. P. (503135593)","Docworld, Lda (508592909)","1.416,00 €",13-07-2018,12-07-2018,213 dias,"Portugal, Vila Real, Vila Real<BR/>Portugal, Porto, Maia","Artigo 20.º, n.º 1, alínea b) do Código dos Contratos Públicos","","","","",,Não aplicável.,Não aplicável.,FALSE
Serviços e Suporte de Manutenção aos Servidores HP Refª 00005_2018 Aprov-Prt 18000148,Consulta Prévia,Aquisição de serviços,"72611000-6, Serviços de assistência técnica informática","Administração Regional de Saúde do Norte, I. P. (503135593)","Decunify - Soluções de Comunicações , S.A. (504889893)","52.886,88 €",13-07-2018,13-05-2018,365 dias,"Portugal, Porto, Porto","Artigo 20.º, n.º 1, alínea c) do Código dos Contratos Públicos",13-12-2018,"52.886,88 €","","",,Não aplicável.,Não aplicável.,FALSE
Renovação de aquisição de serviços médicos com especialidade para unidades do Dicad - CRI de Braga ano de 2018. Processo nº18000138 - CA nº212018 - Luís Manuel Oliveira Fonseca.,Ajuste Direto Regime Geral,Aquisição de serviços,"85121270-6, Serviços de psiquiatria ou psicologia","Administração Regional de Saúde do Norte, I. P. (503135593)",Luís Manuel Oliveira Fonseca (220488185),"10.816,00 €",13-07-2018,29-01-2018,366 dias,"Portugal, Braga, Braga","Artigo 20.º, n.º 1, alínea a) do Código dos Contratos Públicos",31-12-2018,"9.386,00 €","",Numero de horas realizadas inferiores ao numero de horas contratadas,,Não aplicável.,Não aplicável.,FALSE
Renovação de aquisição de serviços médicos sem especialidade para unidades do Dicad - CRI de Bragança ano de 2018. Processo nº18000138 - CA nº192018 - Iva Patrícia Lopes,Ajuste Direto Regime Geral,Aquisição de serviços,"85121000-3, Serviços de prática médica","Administração Regional de Saúde do Norte, I. P. (503135593)",Iva Patrícia Coelho Lopes (218641257),"9.152,00 €",13-07-2018,02-02-2018,366 dias,"Portugal, Braganca, Bragança","Artigo 20.º, n.º 1, alínea a) do Código dos Contratos Públicos",31-08-2018,"5.324,00 €",A profissional rescindiu o contrato.,A profissional rescindiu o contrato.,,Não aplicável.,Não aplicável.,FALSE
AP 773 - Aquisição de Espátula d´Ayre em plástico e Espátula de plástico,Ajuste Direto Regime Geral,Aquisição de bens móveis,"33140000-3, Material médico de consumo","Administração Regional de Saúde do Norte, I. P. (503135593)",Bastos Viegas S.A. (500042772),"12.123,92 €",12-07-2018,17-05-2018,240 dias,"Portugal, Distrito não determinado, Concelho não determinado<BR/>Portugal, Vila Real, Vila Real<BR/>Portugal, Porto, Maia","Artigo 20.º, n.º 1, alínea d) do Código dos Contratos Públicos","","","","",,Não aplicável.,Não aplicável.,FALSE
"AP 841 Aquisição de 720.000 Envelope p/ Liga Portuguesa Contra o Cancro da Mama (RCM)., 600.000 Folha de Ofício Liga Portuguesa Contra Cancro da mama (RCM)",Ajuste Direto Regime Geral,Aquisição de bens móveis,"30199713-1, Envelopes para radiografias impressos","Administração Regional de Saúde do Norte, I. P. (503135593)","Citygrafica, Lda.                                        (510243410)","21.420,00 €",12-07-2018,05-07-2018,150 dias,"Portugal, Vila Real, Vila Real<BR/>Portugal, Porto, Maia","Artigo 20.º, n.º 1, alínea d) do Código dos Contratos Públicos",11-07-2018,"21.420,00 €","","",,Não aplicável.,Não aplicável.,FALSE
AP 741 - Aquisição de Material Farmacêutico,Ao abrigo de acordo-quadro (art.º 258.º),Aquisição de bens móveis,"33670000-7, Medicamentos para o aparelho respiratório","Administração Regional de Saúde do Norte, I. P. (503135593)","Unilfarma, Lda. (500293023)","534,00 €",12-07-2018,03-05-2018,210 dias,"Portugal, Distrito não determinado, Concelho não determinado<BR/>Portugal, Vila Real, Vila Real<BR/>Portugal, Porto, Maia",Artigo 258.º do Código dos Contratos Públicos,"","","","",,1638654,CP 2015/12 - Acordo quadro para fornecimento de Medicamentos do Aparelho Respiratório às Instituições e Serviços do Serviço Nacional de Saúde,FALSE
Licenciamento  de Software - Licenças IBM SPSS  Refª. 00054_2017 Aprov-Prt 18000156,Ao abrigo de acordo-quadro (art.º 259.º),Aquisição de bens móveis,"48000000-8, Pacotes de software e sistemas de informação","Administração Regional de Saúde do Norte, I. P. (503135593)","PSE - Produtos e  Serviços de Estatistica, Lda. (503323390)","2.085,00 €",12-07-2018,25-06-2018,8 dias,"Portugal, Porto, Porto",Artigo 259.º do Código dos Contratos Públicos,02-07-2018,"2.085,00 €","","",,610968,Acordo quadro de licenciamento de software e serviços conexos,FALSE
Serviços de Manutenção e suporte dos servidores BULL  Aprov-Prt 18000149 -refª. 00191_2017,Ajuste Direto Regime Geral,Aquisição de serviços,"72611000-6, Serviços de assistência técnica informática","Administração Regional de Saúde do Norte, I. P. (503135593)","GFI Portugal - Tecnologias de Informação, S.A. (502726890)","89.054,61 €",11-07-2018,11-01-2018,365 dias,"Portugal, Porto, Porto","Artigo 24.º, n.º 1, alínea e) do Código dos Contratos Públicos",06-12-2018,"89.054,61 €","","",,Não aplicável.,Não aplicável.,FALSE
