Objeto do Contrato,Tipo de Procedimento,Tipo(s) de Contrato,CPVs,Entidade(s) Adjudicante(s),Entidade(s) Adjudicatária(s),Preço Contratual,Data de Publicação,Data de Celebração do Contrato,Prazo de Execução,Local de Execução,Fundamentação,Data de Fecho do Contrato,Preço Total Efetivo,Causas das Alterações ao Prazo,Causas das Alterações ao Preço,Estado,N.º registo do Acordo Quadro,Descrição do Acordo Quadro,Procedimento Centralizado
FIOS DE SUTURA,Ajuste Direto Regime Geral,Aquisição de bens móveis,"33000000-0, Equipamento médico, medicamentos e produtos para cuidados pessoais","Centro Hospitalar e Universitário de Coimbra, E. P. E. (510103448)",B BRAUN MEDICAL (501506543),"1.865,16 €",31-12-2017,13-12-2017,1 dias,"Portugal, Coimbra, Coimbra","Artigo 20.º, n.º 1, alínea a) do Código dos Contratos Públicos",,,,,,Não aplicável.,Não aplicável.,FALSE
FIOS DE SUTURA,Ajuste Direto Regime Geral,Aquisição de bens móveis,"33000000-0, Equipamento médico, medicamentos e produtos para cuidados pessoais","Centro Hospitalar e Universitário de Coimbra, E. P. E. (510103448)",MEDTRONIC PORTUGAL (504223933),"453,60 €",31-12-2017,29-12-2017,1 dias,"Portugal, Coimbra, Coimbra","Artigo 20.º, n.º 1, alínea a) do Código dos Contratos Públicos",,,,,,Não aplicável.,Não aplicável.,FALSE
FIOS DE SUTURA,Ajuste Direto Regime Geral,Aquisição de bens móveis,"33000000-0, Equipamento médico, medicamentos e produtos para cuidados pessoais","Centro Hospitalar e Universitário de Coimbra, E. P. E. (510103448)",JOHNSON & JOHNSON (500153370),"5.000,64 €",31-12-2017,13-12-2017,30 dias,"Portugal, Coimbra, Coimbra","Artigo 24.º, n.º 1, alínea e) do Código dos Contratos Públicos",,,,,,Não aplicável.,Não aplicável.,FALSE
CARDIOVERSOR,Ajuste Direto Regime Geral,Aquisição de bens móveis,"33000000-0, Equipamento médico, medicamentos e produtos para cuidados pessoais","Centro Hospitalar e Universitário de Coimbra, E. P. E. (510103448)",BOSTON SCIENTIFIC (504988964),"9.250,00 €",31-12-2017,26-10-2017,30 dias,"Portugal, Coimbra, Coimbra","Artigo 24.º, n.º 1, alínea e) do Código dos Contratos Públicos",,,,,,Não aplicável.,Não aplicável.,FALSE
CARDIOVERSOR,Ajuste Direto Regime Geral,Aquisição de bens móveis,"33000000-0, Equipamento médico, medicamentos e produtos para cuidados pessoais","Centro Hospitalar e Universitário de Coimbra, E. P. E. (510103448)",BOSTON SCIENTIFIC (504988964),"9.250,00 €",31-12-2017,30-10-2017,30 dias,"Portugal, Coimbra, Coimbra","Artigo 24.º, n.º 1, alínea e) do Código dos Contratos Públicos",,,,,,Não aplicável.,Não aplicável.,FALSE
CDI - ELECTRODO SUBCUTANEO,Ajuste Direto Regime Geral,Aquisição de bens móveis,"33000000-0, Equipamento médico, medicamentos e produtos para cuidados pessoais","Centro Hospitalar e Universitário de Coimbra, E. P. E. (510103448)",BOSTON SCIENTIFIC (504988964),"40.950,00 €",31-12-2017,26-10-2017,30 dias,"Portugal, Coimbra, Coimbra","Artigo 24.º, n.º 1, alínea e) do Código dos Contratos Públicos",,,,,,Não aplicável.,Não aplicável.,FALSE
CARDIOVERSOR,Ajuste Direto Regime Geral,Aquisição de bens móveis,"33000000-0, Equipamento médico, medicamentos e produtos para cuidados pessoais","Centro Hospitalar e Universitário de Coimbra, E. P. E. (510103448)",BOSTON SCIENTIFIC (504988964),"46.250,00 €",31-12-2017,26-10-2017,30 dias,"Portugal, Coimbra, Coimbra","Artigo 24.º, n.º 1, alínea e) do Código dos Contratos Públicos",,,,,,Não aplicável.,Não aplicável.,FALSE
Aquisição de 2 ecografos para o serviço de urgência,Ajuste Direto Regime Geral,Aquisição de bens móveis,"33000000-0, Equipamento médico, medicamentos e produtos para cuidados pessoais","Centro Hospitalar e Universitário de Coimbra, E. P. E. (510103448)",GENERAL ELETRIC (500357129),"30.000,00 €",28-12-2017,12-12-2017,19 dias,"Portugal, Coimbra, Coimbra","Artigo 20.º, n.º 1, alínea a) do Código dos Contratos Públicos",,,,,,Não aplicável.,Não aplicável.,FALSE
Aquisição de um doppler vascular para a unidade der crónica,Ajuste Direto Regime Geral,Aquisição de bens móveis,"33000000-0, Equipamento médico, medicamentos e produtos para cuidados pessoais","Centro Hospitalar e Universitário de Coimbra, E. P. E. (510103448)",SANO-TÉCNICA (500239819),"1.031,00 €",28-12-2017,14-12-2017,30 dias,"Portugal, Coimbra, Coimbra","Artigo 20.º, n.º 1, alínea a) do Código dos Contratos Públicos",,,,,,Não aplicável.,Não aplicável.,FALSE
Aquisição de uma unidade de eletrocirurgia para o serviço de cirurgia maxilo facial para o Bloco Operatório Periférico,Ajuste Direto Regime Geral,Aquisição de bens móveis,"33000000-0, Equipamento médico, medicamentos e produtos para cuidados pessoais","Centro Hospitalar e Universitário de Coimbra, E. P. E. (510103448)","BACELAR&IRMAO, LDA (500532818)","6.675,47 €",28-12-2017,15-12-2017,30 dias,"Portugal, Coimbra, Coimbra","Artigo 20.º, n.º 1, alínea a) do Código dos Contratos Públicos",,,,,,Não aplicável.,Não aplicável.,FALSE
Aquisição de um desfibrilhador monitor para a unidade de dor crónica (211),Ajuste Direto Regime Geral,Aquisição de bens móveis,"33000000-0, Equipamento médico, medicamentos e produtos para cuidados pessoais","Centro Hospitalar e Universitário de Coimbra, E. P. E. (510103448)",CORMEDICA (500684324),"9.950,00 €",28-12-2017,15-12-2017,30 dias,"Portugal, Coimbra, Coimbra","Artigo 20.º, n.º 1, alínea a) do Código dos Contratos Públicos",,,,,,Não aplicável.,Não aplicável.,FALSE
Material para  cirurgia da retina,Ajuste Direto Regime Geral,Aquisição de bens móveis,"33140000-3, Material médico de consumo","Centro Hospitalar e Universitário de Coimbra, E.P. (510103448)","ALCON PORTUGAL, LDA. (501251685), OVERPHARMA-PROD.MEDICOS FARMACEUTICOS (505792362), Oftaldata, Produtos para Oftalmologia, Ld.ª (504887459), Optifar (501609377), ORSOLUTIONS - Operating changes (513498664), MEDTRONIC PORTUGAL, LDA. (504223933), DPSO - DISTRIB. PRODUTOS SAUDE OCULAR, LDA. (513689818)","32.523,40 €",28-12-2017,09-05-2017,180 dias,"Portugal, Coimbra, Coimbra","Artigo 20.º, n.º 1, alínea a) do Código dos Contratos Públicos",,,,,,Não aplicável.,Não aplicável.,FALSE
Aquisição de dois aparelhos de anestesia para o Bloco Operatório do Pólo A do SU do CHUC,Ajuste Direto Regime Geral,Aquisição de bens móveis,"33000000-0, Equipamento médico, medicamentos e produtos para cuidados pessoais","Centro Hospitalar e Universitário de Coimbra, E. P. E. (510103448)",DRAGER PORTUGAL LDA (508771323),"69.637,50 €",28-12-2017,15-12-2017,19 dias,"Portugal, Coimbra, Coimbra","Artigo 20.º, n.º 1, alínea a) do Código dos Contratos Públicos",,,,,,Não aplicável.,Não aplicável.,FALSE
Aquisição de computador completo para o serviço de Pneumologia (383),Ajuste Direto Regime Geral,Aquisição de bens móveis,"30000000-9, Máquinas, equipamento e material de escritório e de informática, excepto mobiliário e pacotes de programas (software)","Centro Hospitalar e Universitário de Coimbra, E. P. E. (510103448)",espectro (503115231),"759,80 €",28-12-2017,14-12-2017,30 dias,"Portugal, Coimbra, Coimbra","Artigo 20.º, n.º 1, alínea a) do Código dos Contratos Públicos",,,,,,Não aplicável.,Não aplicável.,FALSE
"Aquisição de estação de trabalho, mais 3 ditafones para o serviço de imagologia",Ajuste Direto Regime Geral,Aquisição de bens móveis,"30000000-9, Máquinas, equipamento e material de escritório e de informática, excepto mobiliário e pacotes de programas (software)","Centro Hospitalar e Universitário de Coimbra, E. P. E. (510103448)",Espectro (503115231),"2.611,40 €",28-12-2017,14-12-2017,30 dias,"Portugal, Coimbra, Coimbra","Artigo 20.º, n.º 1, alínea a) do Código dos Contratos Públicos",,,,,,Não aplicável.,Não aplicável.,FALSE
Conjunto consumíveis para BPSI de debito normal,Ao abrigo de acordo-quadro (art.º 259.º),Aquisição de bens móveis,"33141000-0, Material médico não químico descartável e produtos hematológicos","Centro Hospitalar e Universitário de Coimbra, E. P. E. (510103448)","Roche S. Diagnósticos, Lda (504282921)","155.873,01 €",28-12-2017,21-11-2017,20 dias,"Portugal, Coimbra, Coimbra",Artigo 259.º do Código dos Contratos Públicos,,,,,,1442148,ACORDO QUADRO PARA FORNECIMENTO DE BOMBAS DE PERFUSÃO SUBCUTANEA CONTINUA DE INSULINA E RESPETIVOS CONSUMÍVEIS ÀS INSTITUIÇÕES E SERVIÇOS DO SERVIÇO NACIONAL DE SAÚDE. CP 2015/29,FALSE
Conjunto consumiveis para BPSI de debito normal,Ao abrigo de acordo-quadro (art.º 259.º),Aquisição de bens móveis,"33141000-0, Material médico não químico descartável e produtos hematológicos","Centro Hospitalar e Universitário de Coimbra, E.P. (510103448)",MEDTRONIC PORTUGAL LDA (504223933),"73.100,00 €",28-12-2017,14-11-2017,20 dias,"Portugal, Coimbra, Coimbra",Artigo 259.º do Código dos Contratos Públicos,,,,,,1442148,ACORDO QUADRO PARA FORNECIMENTO DE BOMBAS DE PERFUSÃO SUBCUTANEA CONTINUA DE INSULINA E RESPETIVOS CONSUMÍVEIS ÀS INSTITUIÇÕES E SERVIÇOS DO SERVIÇO NACIONAL DE SAÚDE. CP 2015/29,FALSE
AQUISIÇÃO DE 6 MACAS COM COLCHÃO PARA DIVERSOS SERVIÇOS,Ajuste Direto Regime Geral,Aquisição de bens móveis,"33000000-0, Equipamento médico, medicamentos e produtos para cuidados pessoais","Centro Hospitalar e Universitário de Coimbra, E.P. (510103448)",IMO (500136939),"8.088,00 €",28-12-2017,18-12-2017,30 dias,"Portugal, Coimbra, Coimbra","Artigo 20.º, n.º 1, alínea a) do Código dos Contratos Públicos",,,,,,Não aplicável.,Não aplicável.,FALSE
Bombas perfusão subcutanea insulina,Ao abrigo de acordo-quadro (art.º 259.º),Aquisição de bens móveis,"33141000-0, Material médico não químico descartável e produtos hematológicos","Centro Hospitalar e Universitário de Coimbra, E.P. (510103448)",MEDTRONIC PORTUGAL LDA (504223933),"102.340,00 €",28-12-2017,14-11-2017,20 dias,"Portugal, Coimbra, Coimbra",Artigo 259.º do Código dos Contratos Públicos,,,,,,1442148,ACORDO QUADRO PARA FORNECIMENTO DE BOMBAS DE PERFUSÃO SUBCUTANEA CONTINUA DE INSULINA E RESPETIVOS CONSUMÍVEIS ÀS INSTITUIÇÕES E SERVIÇOS DO SERVIÇO NACIONAL DE SAÚDE. CP 2015/29,FALSE
Aquisição de 90 bombas infusoras para diversos serviços,Ajuste Direto Regime Geral,Aquisição de bens móveis,"33000000-0, Equipamento médico, medicamentos e produtos para cuidados pessoais","Centro Hospitalar e Universitário de Coimbra, E.P. (510103448)",b.braun medical (501506543),"60.075,00 €",28-12-2017,30-11-2017,19 dias,"Portugal, Coimbra, Coimbra","Artigo 20.º, n.º 1, alínea a) do Código dos Contratos Públicos",,,,,,Não aplicável.,Não aplicável.,FALSE
Kit implante DBS com gerador não recarregavel,Ajuste Direto Regime Geral,Aquisição de bens móveis,"33184100-4, Implantes cirúrgicos","Centro Hospitalar e Universitário de Coimbra, E.P. (510103448)",MEDTRONIC PORTUGAL LDA (504223933),"34.300,00 €",28-12-2017,20-11-2017,60 dias,"Portugal, Coimbra, Coimbra","Artigo 20.º, n.º 1, alínea a) do Código dos Contratos Públicos",,,,,,Não aplicável.,Não aplicável.,FALSE
Aquisição de 1 incubadora de transporte neonatal com ventilador para o serviço de neonatologia -UCIRN (723),Ajuste Direto Regime Geral,Aquisição de bens móveis,"33000000-0, Equipamento médico, medicamentos e produtos para cuidados pessoais","Centro Hospitalar e Universitário de Coimbra, E. P. E. (510103448)",SPACEINSP (514126329),"35.027,00 €",28-12-2017,28-06-2017,30 dias,"Portugal, Coimbra, Coimbra","Artigo 20.º, n.º 1, alínea a) do Código dos Contratos Públicos",,,,,,Não aplicável.,Não aplicável.,FALSE
Transdutor pressão invasiva,Ajuste Direto Regime Geral,Aquisição de bens móveis,"33141000-0, Material médico não químico descartável e produtos hematológicos","Centro Hospitalar e Universitário de Coimbra, E. P. E. (510103448)","B.BRAUN MEDICAL, LDA (501506543)","6.800,00 €",28-12-2017,14-11-2017,60 dias,"Portugal, Coimbra, Coimbra","Artigo 24.º, n.º 1, alínea e) do Código dos Contratos Públicos",,,,,,Não aplicável.,Não aplicável.,FALSE
Conexões,Ajuste Direto Regime Geral,Aquisição de bens móveis,"33140000-3, Material médico de consumo","Centro Hospitalar e Universitário de Coimbra, E. P. E. (510103448)","GETINGE GROUP PORTUGAL, UNIP, LDA. (506819698), Lusopalex - Soc. Distribuidora Prod. Hosp. Unipessoal, Lda. (503531588), AVIQUIMICA-IMPORTACAO MANUFACTURAS, LDA (500039720)","2.265,00 €",28-12-2017,28-11-2017,360 dias,"Portugal, Coimbra, Coimbra","Artigo 20.º, n.º 1, alínea a) do Código dos Contratos Públicos",,,,,,Não aplicável.,Não aplicável.,FALSE
Aquisição de um computador para a Direção do serviço de Neurologia (370),Ajuste Direto Regime Geral,Aquisição de bens móveis,"30000000-9, Máquinas, equipamento e material de escritório e de informática, excepto mobiliário e pacotes de programas (software)","Centro Hospitalar e Universitário de Coimbra, E. P. E. (510103448)",normatica (501782230),"663,05 €",28-12-2017,21-12-2017,20 dias,"Portugal, Coimbra, Coimbra","Artigo 20.º, n.º 1, alínea a) do Código dos Contratos Públicos",,,,,,Não aplicável.,Não aplicável.,FALSE
Aquisição de software especifica para o serviço de genética médica do CHUC,Ajuste Direto Regime Geral,Aquisição de bens móveis,"30000000-9, Máquinas, equipamento e material de escritório e de informática, excepto mobiliário e pacotes de programas (software)","Centro Hospitalar e Universitário de Coimbra, E. P. E. (510103448)","CONGENICA, LTD (GB200761257)","9.500,00 €",28-12-2017,15-12-2017,30 dias,"Portugal, Coimbra, Coimbra","Artigo 20.º, n.º 1, alínea a) do Código dos Contratos Públicos",,,,,,Não aplicável.,Não aplicável.,FALSE
Gerador não recarregável duplo canal para implante DBS,Ajuste Direto Regime Geral,Aquisição de bens móveis,"33184100-4, Implantes cirúrgicos","Centro Hospitalar e Universitário de Coimbra, E. P. E. (510103448)",MEDTRONIC PORTUGAL LDA (504223933),"46.000,00 €",28-12-2017,14-11-2017,20 dias,"Portugal, Coimbra, Coimbra","Artigo 24.º, n.º 1, alínea e) do Código dos Contratos Públicos",,,,,,Não aplicável.,Não aplicável.,FALSE
Stent coronário com revestimento fármaco biolimus,Ajuste Direto Regime Geral,Aquisição de bens móveis,"33184500-8, Endopróteses coronárias","Centro Hospitalar e Universitário de Coimbra, E. P. E. (510103448)","CARDINAL HEALTH PORTUGAL 513 UNIPESSOAL, LDA (513620834)","30.750,00 €",28-12-2017,20-10-2017,90 dias,"Portugal, Coimbra, Coimbra","Artigo 24.º, n.º 1, alínea e) do Código dos Contratos Públicos",,,,,,Não aplicável.,Não aplicável.,FALSE
Stent coronário com revestimento everolimus,Ajuste Direto Regime Geral,Aquisição de bens móveis,"33184500-8, Endopróteses coronárias","Centro Hospitalar e Universitário de Coimbra, E. P. E. (510103448)","Abbott Laboratórios, Lda (500006148)","136.400,00 €",28-12-2017,14-11-2017,60 dias,"Portugal, Coimbra, Coimbra","Artigo 24.º, n.º 1, alínea e) do Código dos Contratos Públicos",,,,,,Não aplicável.,Não aplicável.,FALSE
Kit facoemulsificação; Pinça descartável forte; Fibra optica laser 23G Pack para cirurgia combinada  vitretomia e catarata,Ajuste Direto Regime Geral,Aquisição de bens móveis,"33140000-3, Material médico de consumo","Centro Hospitalar e Universitário de Coimbra, E. P. E. (510103448)","ALCON PORTUGAL, LDA. (501251685)","24.829,14 €",28-12-2017,13-12-2017,20 dias,"Portugal, Coimbra, Coimbra","Artigo 24.º, n.º 1, alínea e) do Código dos Contratos Públicos",,,,,,Não aplicável.,Não aplicável.,FALSE
Lente IO moldável n/hidrofilica monobloco; Lente IO  asferica para cirurgia catarata,Ajuste Direto Regime Geral,Aquisição de bens móveis,"33184000-3, Próteses","Centro Hospitalar e Universitário de Coimbra, E. P. E. (510103448)","ALCON PORTUGAL, LDA. (501251685)","51.482,55 €",28-12-2017,11-12-2017,20 dias,"Portugal, Coimbra, Coimbra","Artigo 24.º, n.º 1, alínea e) do Código dos Contratos Públicos",,,,,,Não aplicável.,Não aplicável.,FALSE
Pacemakers,Ajuste Direto Regime Geral,Aquisição de bens móveis,"33182210-4, Estimulador cardíaco (pacemaker)","Centro Hospitalar e Universitário de Coimbra, E. P. E. (510103448)",Medtronic Portugal (504223933),"217.400,00 €",27-12-2017,25-10-2017,90 dias,"Portugal, Coimbra, Coimbra","Artigo 24.º, n.º 1, alínea c) do Código dos Contratos Públicos",,,,,,Não aplicável.,Não aplicável.,FALSE
cardioverores com ressincronização,Ajuste Direto Regime Geral,Aquisição de bens móveis,"33182210-4, Estimulador cardíaco (pacemaker)","Centro Hospitalar e Universitário de Coimbra, E. P. E. (510103448)",Medtronic Portugal (504223933),"315.000,00 €",27-12-2017,26-10-2017,90 dias,"Portugal, Coimbra, Coimbra","Artigo 24.º, n.º 1, alínea c) do Código dos Contratos Públicos",,,,,,Não aplicável.,Não aplicável.,FALSE
Cardioversor camara única  CDI VVI,Ajuste Direto Regime Geral,Aquisição de bens móveis,"33182210-4, Estimulador cardíaco (pacemaker)","Centro Hospitalar e Universitário de Coimbra, E. P. E. (510103448)",MEDTRONIC PORTUGAL LDA (504223933),"189.000,00 €",27-12-2017,13-12-2017,90 dias,"Portugal, Coimbra, Coimbra","Artigo 24.º, n.º 1, alínea c) do Código dos Contratos Públicos",,,,,,Não aplicável.,Não aplicável.,FALSE
Stents coronários  com revestimento  everolimus,Ajuste Direto Regime Geral,Aquisição de bens móveis,"33184500-8, Endopróteses coronárias","Centro Hospitalar e Universitário de Coimbra, E. P. E. (510103448)","BOSTON SCIENTIFIC PORTUGAL-DISP.MEDICOS,LDA. (504988964)","108.000,00 €",27-12-2017,04-10-2017,90 dias,"Portugal, Coimbra, Coimbra","Artigo 24.º, n.º 1, alínea c) do Código dos Contratos Públicos",,,,,,Não aplicável.,Não aplicável.,FALSE
Cardioversores,Ajuste Direto Regime Geral,Aquisição de bens móveis,"33182210-4, Estimulador cardíaco (pacemaker)","Centro Hospitalar e Universitário de Coimbra, E. P. E. (510103448)","BOSTON SCIENTIFIC PORTUGAL-DISP.MEDICOS,LDA. (504988964)","46.500,00 €",27-12-2017,30-10-2017,60 dias,"Portugal, Coimbra, Coimbra","Artigo 24.º, n.º 1, alínea c) do Código dos Contratos Públicos",,,,,,Não aplicável.,Não aplicável.,FALSE
Stents coronarios,Ajuste Direto Regime Geral,Aquisição de bens móveis,"33184500-8, Endopróteses coronárias","Centro Hospitalar e Universitário de Coimbra, E. P. E. (510103448)","BOSTON SCIENTIFIC PORTUGAL-DISP.MEDICOS,LDA. (504988964)","111.600,00 €",27-12-2017,26-10-2017,60 dias,"Portugal, Coimbra, Coimbra","Artigo 24.º, n.º 1, alínea c) do Código dos Contratos Públicos",,,,,,Não aplicável.,Não aplicável.,FALSE
Cardioversores,Ajuste Direto Regime Geral,Aquisição de bens móveis,"33182210-4, Estimulador cardíaco (pacemaker)","Centro Hospitalar e Universitário de Coimbra, E. P. E. (510103448)",BIOTRONIK PORTUGAL (UNIPESSOAL) LDA (510726941),"143.650,00 €",27-12-2017,09-11-2017,60 dias,"Portugal, Coimbra, Coimbra","Artigo 24.º, n.º 1, alínea c) do Código dos Contratos Públicos",,,,,,Não aplicável.,Não aplicável.,FALSE
Cardioversores,Ajuste Direto Regime Geral,Aquisição de bens móveis,"33182210-4, Estimulador cardíaco (pacemaker)","Centro Hospitalar e Universitário de Coimbra, E. P. E. (510103448)",BIOTRONIK PORTUGAL (UNIPESSOAL) LDA (510726941),"283.270,00 €",27-12-2017,31-10-2017,90 dias,"Portugal, Coimbra, Coimbra","Artigo 24.º, n.º 1, alínea c) do Código dos Contratos Públicos",,,,,,Não aplicável.,Não aplicável.,FALSE
Stent coronário biabsorvivel,Ajuste Direto Regime Geral,Aquisição de bens móveis,"33184500-8, Endopróteses coronárias","Centro Hospitalar e Universitário de Coimbra, E. P. E. (510103448)",BIOTRONIK PORTUGAL (UNIPESSOAL) LDA (510726941),"8.000,00 €",27-12-2017,18-10-2017,8000 dias,"Portugal, Coimbra, Coimbra","Artigo 24.º, n.º 1, alínea c) do Código dos Contratos Públicos",,,,,,Não aplicável.,Não aplicável.,FALSE
Stent coronário com  revestimento,Ajuste Direto Regime Geral,Aquisição de bens móveis,"33184500-8, Endopróteses coronárias","Centro Hospitalar e Universitário de Coimbra, E. P. E. (510103448)",BIOTRONIK PORTUGAL (UNIPESSOAL) LDA (510726941),"66.000,00 €",27-12-2017,09-11-2017,90 dias,"Portugal, Coimbra, Coimbra","Artigo 24.º, n.º 1, alínea c) do Código dos Contratos Públicos",,,,,,Não aplicável.,Não aplicável.,FALSE
Sistema pacemakers,Ajuste Direto Regime Geral,Aquisição de bens móveis,"33182210-4, Estimulador cardíaco (pacemaker)","Centro Hospitalar e Universitário de Coimbra, E. P. E. (510103448)",BIOTRONIK PORTUGAL (UNIPESSOAL) LDA (510726941),"108.450,00 €",27-12-2017,20-10-2017,90 dias,"Portugal, Coimbra, Coimbra","Artigo 24.º, n.º 1, alínea c) do Código dos Contratos Públicos",,,,,,Não aplicável.,Não aplicável.,FALSE
Válvulas biológicas c/ stent pericárdio; Anel rígido triscupide,Ajuste Direto Regime Geral,Aquisição de bens móveis,"33184300-6, Próteses cardíacas","Centro Hospitalar e Universitário de Coimbra, E. P. E. (510103448)","Edwards Lifesciences (Portugal) Comercio  e Distribuição de Dispositivos Medicos, Lda (508014832)","41.004,00 €",27-12-2017,21-11-2017,20 dias,"Portugal, Coimbra, Coimbra","Artigo 24.º, n.º 1, alínea e) do Código dos Contratos Públicos",,,,,,Não aplicável.,Não aplicável.,FALSE
Valvula biológica com stent pericardio,Ajuste Direto Regime Geral,Aquisição de bens móveis,"33184300-6, Próteses cardíacas","Centro Hospitalar e Universitário de Coimbra, E. P. E. (510103448)","Medicinália Cormédica - Cormecialização de Produtos Médico Hospitalares, Lda (500684324)","56.160,00 €",27-12-2017,21-11-2017,20 dias,"Portugal, Coimbra, Coimbra","Artigo 24.º, n.º 1, alínea e) do Código dos Contratos Públicos",,,,,,Não aplicável.,Não aplicável.,FALSE
Válvulas biológicas  com stent pericárdio;  Anel Physio   mitral; Anel rigido mitral,Ajuste Direto Regime Geral,Aquisição de bens móveis,"33184300-6, Próteses cardíacas","Centro Hospitalar e Universitário de Coimbra, E. P. E. (510103448)","Edwards lifesciences (Portugal) Comercio  e Distribuição de Dispositivos Medicos, Lda (508014832)","29.727,00 €",27-12-2017,21-12-2017,20 dias,"Portugal, Coimbra, Coimbra","Artigo 24.º, n.º 1, alínea e) do Código dos Contratos Públicos",,,,,,Não aplicável.,Não aplicável.,FALSE
Válvulas biológicas c/ stent porcina; Válvulas mecânicas  bileaflet,Ajuste Direto Regime Geral,Aquisição de bens móveis,"33184300-6, Próteses cardíacas","Centro Hospitalar e Universitário de Coimbra, E. P. E. (510103448)","St. Jude Medical Portugal, Lda. (504180746)","33.145,00 €",27-12-2017,21-11-2017,20 dias,"Portugal, Coimbra, Coimbra","Artigo 24.º, n.º 1, alínea e) do Código dos Contratos Públicos",,,,,,Não aplicável.,Não aplicável.,FALSE
