Entidade.y.x,2017,2018,category
"Centro Hospitalar Universitário do Algarve, E. P. E.",5852827,8519083,Hospitais que aumentaram os gastos com tarefeiros em 2018
"Centro Hospitalar do Tâmega e Sousa, E. P. E. ",3167671,4093473,Hospitais que aumentaram os gastos com tarefeiros em 2018
"Unidade Local de Saúde do Nordeste, E. P. E. ",2198573,2938501,Hospitais que aumentaram os gastos com tarefeiros em 2018
Centro Hospitalar de Setúbal E.P.E.,4436020,5007978,Hospitais que aumentaram os gastos com tarefeiros em 2018
"Hospital Garcia de Orta, E. P. E. ",2962997,3384509,Hospitais que aumentaram os gastos com tarefeiros em 2018
"Administração Regional de Saúde do Algarve, I. P. ",40278,439398,Hospitais que aumentaram os gastos com tarefeiros em 2018
"Centro Hospitalar Barreiro Montijo, E. P. E. ",2381016,2751566,Hospitais que aumentaram os gastos com tarefeiros em 2018
"Centro Hospitalar Universitário do Porto, E. P. E.",1528187,1878874,Hospitais que aumentaram os gastos com tarefeiros em 2018
"Centro Hospitalar do Baixo Vouga, E. P. E ",2440549,2689023,Hospitais que aumentaram os gastos com tarefeiros em 2018
"Unidade Local de Saúde de Castelo Branco, E. P. E.",1220133,1437077,Hospitais que aumentaram os gastos com tarefeiros em 2018
"CENTRO HOSP. DE TRÁS-OS-MONTES E ALTO DOURO, EPE",2680138,2892113,Hospitais que aumentaram os gastos com tarefeiros em 2018
"Hospital Distrital de Santarém, E. P. E. ",2247240,2420347,Hospitais que aumentaram os gastos com tarefeiros em 2018
"Unidade Local de Saúde do Norte Alentejano, E. P. E. ",4496668,4633810,Hospitais que aumentaram os gastos com tarefeiros em 2018
"Centro Hospitalar Vila Nova de Gaia - Espinho, E. P. E. ",627900,744133,Hospitais que aumentaram os gastos com tarefeiros em 2018
"Hospital Distrital Figueira da Foz, E.P.E. ",576522,691637,Hospitais que aumentaram os gastos com tarefeiros em 2018
"Instituto Nacional de Emergência Médica, IP ",2040475,2123283,Hospitais que aumentaram os gastos com tarefeiros em 2018
Centro Hospitalar do Oeste,5283945,5358367,Hospitais que aumentaram os gastos com tarefeiros em 2018
"Administração Regional de Saúde do Centro, I.P. ",509748,576798,Hospitais que aumentaram os gastos com tarefeiros em 2018
Unidade Local Saude Baixo Alentejo EPE,4521364,4574695,Hospitais que aumentaram os gastos com tarefeiros em 2018
"Hospital de Santa Maria Maior, E. P. E. ",793087,828146,Hospitais que aumentaram os gastos com tarefeiros em 2018
"Centro Hospitalar e Universitário de Coimbra, E. P. E. ",894192,913233,Hospitais que aumentaram os gastos com tarefeiros em 2018
"Hospital de Magalhães Lemos, E.P.E. ",57287,72737,Hospitais que aumentaram os gastos com tarefeiros em 2018
"Centro Hospitalar Tondela-Viseu, E. P. E. ",487621,490056,Hospitais que aumentaram os gastos com tarefeiros em 2018
"Instituto Nacional de Saúde Dr. Ricardo Jorge, I.P. ",19098,20427,Hospitais que aumentaram os gastos com tarefeiros em 2018
