Objeto do Contrato,Tipo de Procedimento,Tipo(s) de Contrato,CPVs,Entidade(s) Adjudicante(s),Entidade(s) Adjudicatária(s),Preço Contratual,Data de Publicação,Data de Celebração do Contrato,Prazo de Execução,Local de Execução,Fundamentação,Data de Fecho do Contrato,Preço Total Efetivo,Causas das Alterações ao Prazo,Causas das Alterações ao Preço,Estado,N.º registo do Acordo Quadro,Descrição do Acordo Quadro,Procedimento Centralizado
"Aquisição de 2 Máquinas de Selar para a Central de Esterilização do CHSJ, EPE",Ajuste Direto Regime Geral,Aquisição de bens móveis,"33191000-5, Aparelhos para esterilização, desinfecção e higiene","Centro Hospitalar de São João, E. P. E. (509821197)",HG Helder Gonçalves Lda. (503855421),"5.713,00 €",21-03-2016,26-11-2015,30 dias,"Portugal, Porto, Porto","Artigo 20.º, n.º 1, alínea a) do Código dos Contratos Públicos",,,,,,Não aplicável.,Não aplicável.,FALSE
"Aquisição de 11 Sistemas de Anestesia com Ventilador para o CHSJ, EPE",Concurso público,Aquisição de bens móveis,"33172100-7, Aparelhos para anestesia","Centro Hospitalar de São João, E. P. E. (509821197)","General Electric Portuguesa, SA (500357129)","330.000,00 €",21-03-2016,20-10-2015,30 dias,"Portugal, Porto, Porto","Artigo 20.º, n.º 1, alínea b) do Código dos Contratos Públicos",,,,,,Não aplicável.,Não aplicável.,FALSE
