freguesia,acronym,validVotesPercentage,votes,dicofre
"União das freguesias de Provesende, Gouvães do Douro e São Cristóvão do Douro",PS,46.63,76,171016
"União das freguesias de Provesende, Gouvães do Douro e São Cristóvão do Douro",PPD/PSD,31.9,52,171016
"União das freguesias de Provesende, Gouvães do Douro e São Cristóvão do Douro",CDS-PP,6.13,10,171016
"União das freguesias de Provesende, Gouvães do Douro e São Cristóvão do Douro",B.E.,4.29,7,171016
"União das freguesias de Provesende, Gouvães do Douro e São Cristóvão do Douro",PCP-PEV,2.45,4,171016
"União das freguesias de Provesende, Gouvães do Douro e São Cristóvão do Douro",PPM.PPV/CDC,1.84,3,171016
"União das freguesias de Provesende, Gouvães do Douro e São Cristóvão do Douro",PURP,1.84,3,171016
"União das freguesias de Provesende, Gouvães do Douro e São Cristóvão do Douro",A,1.23,2,171016
"União das freguesias de Provesende, Gouvães do Douro e São Cristóvão do Douro",PAN,1.23,2,171016
"União das freguesias de Provesende, Gouvães do Douro e São Cristóvão do Douro",PDR,1.23,2,171016
"União das freguesias de Provesende, Gouvães do Douro e São Cristóvão do Douro",L,0.61,1,171016
"União das freguesias de Provesende, Gouvães do Douro e São Cristóvão do Douro",PNR,0.61,1,171016
"União das freguesias de Provesende, Gouvães do Douro e São Cristóvão do Douro",IL,0,0,171016
"União das freguesias de Provesende, Gouvães do Douro e São Cristóvão do Douro",MAS,0,0,171016
"União das freguesias de Provesende, Gouvães do Douro e São Cristóvão do Douro",NC,0,0,171016
"União das freguesias de Provesende, Gouvães do Douro e São Cristóvão do Douro",PCTP/MRPP,0,0,171016
"União das freguesias de Provesende, Gouvães do Douro e São Cristóvão do Douro",PTP,0,0,171016
