Objeto do Contrato,Tipo de Procedimento,Tipo(s) de Contrato,CPVs,Entidade(s) Adjudicante(s),Entidade(s) Adjudicatária(s),Preço Contratual,Data de Publicação,Data de Celebração do Contrato,Prazo de Execução,Local de Execução,Fundamentação,Data de Fecho do Contrato,Preço Total Efetivo,Causas das Alterações ao Prazo,Causas das Alterações ao Preço,Estado,N.º registo do Acordo Quadro,Descrição do Acordo Quadro,Procedimento Centralizado
Rampa de acesso a deficientes US Lamas,Ajuste Direto Regime Geral,Empreitadas de obras públicas,"45215100-8, Obras de construção de edifícios relacionados com serviços de saúde","Administração Regional de Saúde do Norte, I. P. (503135593)","Ecodata - Unipessoal, Lda (509411150)","9.250,00 €",11-12-2013,29-11-2013,30 dias,"Portugal, Braga, Barcelos","Artigo 19.º, alínea a) do Código dos Contratos Públicos","","9.250,00 €",Trabalhos executados antes do término do prazo,"",,Não aplicável.,Não aplicável.,
Aquisição de 60 Vacinas Pneumo Poliosídica 23 Serotipos Sol. Inj. IM SC,Ao abrigo de acordo-quadro (art.º 258.º),Aquisição de bens móveis,"33651600-4, Vacinas","Administração Regional de Saúde do Norte, I. P. (503135593)",Sanofi Pasteur MSD (507632796),"493,20 €",10-12-2013,21-11-2013,40 dias,"Portugal, Porto, Maia",Artigo 258.º do Código dos Contratos Públicos,27-11-2013,"493,20 €","","",,610556,"CONCURSO PÚBLICO PARA A CELEBRAÇÃO DE CONTRATOS PÚBLICOS DE APROVISIONAMENTO PARA A ÁREA DA SAÚDE, COM VISTA AO FORNECIMENTO DE VACINAS E TUBERCULINAS, ÀS INSTITUIÇÕES E SERVIÇOS DO SERVIÇO NACIONAL DE SAÚDE",
Requalificação de espaços US Azevedo Campanhã,Ajuste Direto Regime Geral,Empreitadas de obras públicas,"45454000-4, Obras de reestruturação","Administração Regional de Saúde do Norte, I. P. (503135593)","Surpreender & Seduzir, Construções, Unipessoal, Lda (509621457)","67.057,50 €",10-12-2013,06-12-2013,15 dias,"Portugal, Porto, Porto","Artigo 19.º, alínea a) do Código dos Contratos Públicos","","67.057,50 €",Os trabalhos foram concluídos antes do término do prazo previsto.,"",,Não aplicável.,Não aplicável.,
Aquisição de 420 unidades de Metoclopramida 10mg  Comp.,Ao abrigo de acordo-quadro (art.º 259.º),Aquisição de bens móveis,"33600000-6, Produtos farmacêuticos","Administração Regional de Saúde do Norte, I. P. (503135593)","Sanofi - Produtos Farmacêuticos, lda (500134960)","15,75 €",10-12-2013,11-11-2013,49 dias,"Portugal, Porto, Maia<BR/>Portugal, Vila Real, Vila Real",Artigo 259.º do Código dos Contratos Públicos,26-11-2013,"15,75 €","","",,455180,"CONCURSO PÚBLICO PARA A CELEBRAÇÃO DE CONTRATOS PÚBLICOS DE APROVISIONAMENTO PARA A ÁREA DA SAÚDE, COM VISTA AO FORNECIMENTO DE MEDICAMENTOS ANTI-INFECIOSOS: ANTIVÍRICOS E ANTIFÚNGICOS, ÀS INSTITUIÇÕES E SERVIÇOS DO SERVIÇO NACIONAL DE SAÚDE  ",
Aquisição de 1000 unidades de Pasta Niveladora / Protectora da pele periestomal,Ao abrigo de acordo-quadro (art.º 258.º),Aquisição de bens móveis,"33140000-3, Material médico de consumo","Administração Regional de Saúde do Norte, I. P. (503135593)","Spcare, lda (508284872)","778,90 €",09-12-2013,10-10-2013,80 dias,"Portugal, Porto, Maia<BR/>Portugal, Vila Real, Vila Real",Artigo 258.º do Código dos Contratos Públicos,09-12-2013,"778,90 €","","",,419168,CONCURSO PÚBLICO PARA A CELEBRAÇÃO DE CONTRATOS PÚBLICOS DE APROVISIONAMENTO PARA AQUISIÇÃO DE MATERIAL OSTOMIA DE ELIMINAÇÃO,
Conservação e Reparação Sede Rodrigues de Freitas,Ajuste Direto Regime Geral,Empreitadas de obras públicas,"45453000-7, Obras de revisão e recuperação","Administração Regional de Saúde do Norte, I. P. (503135593)","Surpreender & Seduzir, Construções, Unipessoal, Lda (509621457)","17.102,80 €",06-12-2013,03-12-2013,20 dias,"Portugal, Porto, Porto","Artigo 19.º, alínea a) do Código dos Contratos Públicos","","17.102,80 €","","",,Não aplicável.,Não aplicável.,
Instalação de ArCondicionado USF Ligios,Ajuste Direto Regime Geral,Empreitadas de obras públicas,"45350000-5, Instalações mecânicas","Administração Regional de Saúde do Norte, I. P. (503135593)","Tropikbarómetro - Climatizações, Lda (510483747)","19.975,00 €",06-12-2013,13-11-2013,30 dias,"Portugal, Braga, Barcelos","Artigo 19.º, alínea a) do Código dos Contratos Públicos","","19.975,00 €",Os trabalhos foram concluídos antes do término do prazo previsto.,"",,Não aplicável.,Não aplicável.,
Aquisição de 10 unidades vacina Imunoglobulina humana tétano sol. inj. 250 UI/ml IM,Ajuste Direto Regime Geral,Aquisição de bens móveis,"33651600-4, Vacinas","Administração Regional de Saúde do Norte, I. P. (503135593)",CSL - Behring lda (503047201),"150,00 €",06-12-2013,31-10-2013,60 dias,"Portugal, Porto, Maia<BR/>Portugal, Vila Real, Vila Real","Artigo 24.º, n.º 1, alínea e) do Código dos Contratos Públicos",05-11-2013,"150,00 €","","",,Não aplicável.,Não aplicável.,
Aquisição de 10 unidades de Dimetindeno 1mg/g Gel Bisnaga 30 g,Ajuste Direto Regime Geral,Aquisição de bens móveis,"33600000-6, Produtos farmacêuticos","Administração Regional de Saúde do Norte, I. P. (503135593)","Novartis - Consumer Health, Prod. Farm. e Nut. (500268215)","46,31 €",06-12-2013,07-11-2013,5 dias,"Portugal, Porto, Maia<BR/>Portugal, Vila Real, Vila Real","Artigo 24.º, n.º 1, alínea e) do Código dos Contratos Públicos",12-11-2013,"46,31 €","","",,Não aplicável.,Não aplicável.,
Aquisição de 2.496 unidades Ofloxacina 200mg,Ao abrigo de acordo-quadro (art.º 259.º),Aquisição de bens móveis,"33600000-6, Produtos farmacêuticos","Administração Regional de Saúde do Norte, I. P. (503135593)",Ratiopharm (502414910),"499,20 €",05-12-2013,07-11-2013,60 dias,"Portugal, Vila Real, Vila Real<BR/>Portugal, Porto, Maia",Artigo 259.º do Código dos Contratos Públicos,12-11-2013,"499,20 €","","",,611389,"CONCURSO PÚBLICO PARA A CELEBRAÇÃO DE CONTRATOS PÚBLICOS DE APROVISIONAMENTO PARA A ÁREA DA SAÚDE, COM VISTA AO FORNECIMENTO DE MEDICAMENTOS ANTI-INFECIOSOS: EXCETO ANTIVÍRICOS E ANTIFÚNGICOS, ÀS INSTITUIÇÕES E SERVIÇOS DO SERVIÇO NACIONAL DE SAÚDE",
Aquisição de 2000 unidades de Betametasona 1mg/g Creme,Ao abrigo de acordo-quadro (art.º 259.º),Aquisição de bens móveis,"33600000-6, Produtos farmacêuticos","Administração Regional de Saúde do Norte, I. P. (503135593)",Glaxosmithkline - Produtos Famacêuticos (500139962),"2.300,00 €",05-12-2013,07-11-2013,60 dias,"Portugal, Porto, Maia<BR/>Portugal, Vila Real, Vila Real",Artigo 259.º do Código dos Contratos Públicos,12-11-2013,"2.300,00 €","","",,457668,"CONCURSO PÚBLICO PARA A CELEBRAÇÃO DE CONTRATOS PÚBLICOS DE APROVISIONAMENTO PARA A ÁREA DA SAÚDE, COM VISTA AO FORNECIMENTO DE MEDICAMENTOS ANTI-INFECIOSOS: EXCETO ANTIVÍRICOS E ANTUFÚNGICOS, ÀS INSTITUIÇÕES E SERVIÇOS DO SERVIÇO NACIONAL DE SAÚDE",
30 caixas de Testes IGRA mitogénio Ref. 0593-0201; 30 caixas de Testes IGRA antigénio TB e NIL Ref. 0590-0201,Ajuste Direto Regime Geral,Aquisição de bens móveis,"33600000-6, Produtos farmacêuticos","Administração Regional de Saúde do Norte, I. P. (503135593)","Quilaban- quim. Lab. Analitica, Lda (500399670)","31.947,30 €",05-12-2013,11-11-2013,365 dias,"Portugal, Vila Real, Vila Real","Artigo 24.º, n.º 1, alínea e) do Código dos Contratos Públicos",21-11-2013,"31.947,30 €","","",,Não aplicável.,Não aplicável.,
Aquisição de 100 unidades de Oxibuprocaína (cloridrato) 4 mg/ml Colírio,Ajuste Direto Regime Geral,Aquisição de bens móveis,"33600000-6, Produtos farmacêuticos","Administração Regional de Saúde do Norte, I. P. (503135593)","Lab. Edol Produtos Fmarcêuticos, S.A. (507072642)","270,00 €",05-12-2013,05-11-2013,60 dias,"Portugal, Porto, Maia<BR/>Portugal, Vila Real, Vila Real","Artigo 24.º, n.º 1, alínea e) do Código dos Contratos Públicos",13-11-2013,"270,00 €","","",,Não aplicável.,Não aplicável.,
60 unidades de Reagente determinação amilase no sangue tira; 60 unidades Reagente determinação da glucose sangue tira reflotron; 90 unidades reagente det amilase pancreática no sangue tira; 80 TST roche cobas h232 myoglobin 20; 20 TST roche cobas h232 proBNP +,Ajuste Direto Regime Geral,Aquisição de bens móveis,"33600000-6, Produtos farmacêuticos","Administração Regional de Saúde do Norte, I. P. (503135593)","Roche Sistemas de Diagnosticos, LDA (504282921)","1.233,76 €",05-12-2013,04-12-2013,365 dias,"Portugal, Vila Real, Vila Real","Artigo 24.º, n.º 1, alínea e) do Código dos Contratos Públicos",04-12-2013,"1.233,76 €","","",,Não aplicável.,Não aplicável.,
Conservação / Adaptação USF Serpa Pinto,Ajuste Direto Regime Geral,Empreitadas de obras públicas,"45454000-4, Obras de reestruturação","Administração Regional de Saúde do Norte, I. P. (503135593)","Nosniky - Engenharia e Construção Civil, Lda (510397352)","73.061,00 €",05-12-2013,26-11-2013,30 dias,"Portugal, Porto, Porto","Artigo 19.º, alínea a) do Código dos Contratos Públicos","","73.061,00 €",Os trabalhos foram concluídos antes do término do prazo previsto.,"",,Não aplicável.,Não aplicável.,
Instalação de elevador/Centrais de incêndio e telefónica US Aver-o-Mar,Ajuste Direto Regime Geral,Empreitadas de obras públicas,"45351000-2, Instalação de equipamento de engenharia mecânica","Administração Regional de Saúde do Norte, I. P. (503135593)","Norquadros, Lda (504950932)","81.191,00 €",05-12-2013,26-11-2013,30 dias,"Portugal, Porto, Póvoa de Varzim","Artigo 19.º, alínea a) do Código dos Contratos Públicos","","81.191,00 €","","",,Não aplicável.,Não aplicável.,
Conservação / Adaptação USF Prelada,Ajuste Direto Regime Geral,Empreitadas de obras públicas,"45454000-4, Obras de reestruturação","Administração Regional de Saúde do Norte, I. P. (503135593)","Espaços & Sítios, Lda (510573991)","81.000,00 €",05-12-2013,26-11-2013,30 dias,"Portugal, Porto, Porto","Artigo 19.º, alínea a) do Código dos Contratos Públicos","","81.000,00 €","","",,Não aplicável.,Não aplicável.,
Conservação e saneamento US Figueiró,Ajuste Direto Regime Geral,Empreitadas de obras públicas,"45453000-7, Obras de revisão e recuperação","Administração Regional de Saúde do Norte, I. P. (503135593)","Modesta & Rangel Ferraz, Lda (510249132)","71.150,00 €",05-12-2013,20-11-2013,30 dias,"Portugal, Porto, Amarante","Artigo 19.º, alínea a) do Código dos Contratos Públicos","","71.150,00 €","","",,Não aplicável.,Não aplicável.,
Obras na cobertura e sinalética US Cucujães,Ajuste Direto Regime Geral,Empreitadas de obras públicas,"45454000-4, Obras de reestruturação","Administração Regional de Saúde do Norte, I. P. (503135593)","Espaços & Sítios, Lda (510573991)","22.800,00 €",05-12-2013,13-11-2013,30 dias,"Portugal, Aveiro, Oliveira de Azemeis","Artigo 19.º, alínea a) do Código dos Contratos Públicos","","22.800,00 €","","",,Não aplicável.,Não aplicável.,
Climatização US Vale de Cambra,Ajuste Direto Regime Geral,Empreitadas de obras públicas,"45350000-5, Instalações mecânicas","Administração Regional de Saúde do Norte, I. P. (503135593)","Advantarget - Climatização e Ventilação, Lda (510654975)","17.500,30 €",05-12-2013,13-11-2013,30 dias,"Portugal, Aveiro, Vale de Cambra","Artigo 19.º, alínea a) do Código dos Contratos Públicos","","17.500,30 €",A empreitada terminou antes do término da obra,"",,Não aplicável.,Não aplicável.,
Aquisição de 3.500 unidades de Ácido fusídico 20 mg/ g pomada 15g,Ao abrigo de acordo-quadro (art.º 258.º),Aquisição de bens móveis,"33600000-6, Produtos farmacêuticos","Administração Regional de Saúde do Norte, I. P. (503135593)","Laboratórios  Medinfar, S.A. (500384045)","7.000,00 €",04-12-2013,07-11-2013,60 dias,"Portugal, Vila Real, Vila Real<BR/>Portugal, Porto, Maia",Artigo 258.º do Código dos Contratos Públicos,14-11-2013,"7.000,00 €","","",,602875,"CONCURSO PÚBLICO PARA A CELEBRAÇÃO DE CONTRATOS PÚBLICOS DE APROVISIONAMENTO PARA A ÁREA DA SAÚDE, COM VISTA AO FORNECIMENTO DE MEDICAMENTOS DE CONSUMO GERAL - USADOS NAS AFECÇÕES CUTÂNEAS, ÀS INSTITUIÇÕES E SERVIÇOS DO SERVIÇO NACIONAL DE SAÚDE",
120 comprimidos Alprazolam 0.25 mg,Ajuste Direto Regime Geral,Aquisição de bens móveis,"33600000-6, Produtos farmacêuticos","Administração Regional de Saúde do Norte, I. P. (503135593)","Generis Farmacêutica, SA (508107997)","0,84 €",03-12-2013,14-11-2013,365 dias,"Portugal, Vila Real, Vila Real",Artigo 258.º do Código dos Contratos Públicos,06-12-2013,"0,84 €","","",,1110975,120 comprimidos Alprazolam 0.25 mg,
Aquisição de 60 comprimidos de fluvoxamina 50 mg,Ajuste Direto Regime Geral,Aquisição de bens móveis,"33600000-6, Produtos farmacêuticos","Administração Regional de Saúde do Norte, I. P. (503135593)",Generis Farmaceutica (508107997),"5,04 €",03-12-2013,20-11-2013,365 dias,"Portugal, Vila Real, Vila Real",Artigo 258.º do Código dos Contratos Públicos,22-11-2013,"5,04 €","","",,1110908,Aquisição de 60 comprimidos de fluvoxamina 50 mg,
Aquisição de  1 800 caixas de Sulpirida 50 mg e 600 comprimidos de sulpirida 200 mg,Ajuste Direto Regime Geral,Aquisição de bens móveis,"33600000-6, Produtos farmacêuticos","Administração Regional de Saúde do Norte, I. P. (503135593)",Sanofi - Produtos Farmaceuticos (500134960),"208,74 €",03-12-2013,25-11-2013,365 dias,"Portugal, Vila Real, Vila Real",Artigo 258.º do Código dos Contratos Públicos,"","","","",,1110899,Aquisição de  1 800 caixas de Sulpirida 50 mg e 600 comprimidos de sulpirida 200 mg,
"Aquisição de 250 frascos de bromexina 1,6 mg/ml Xarope 200 ml",Ajuste Direto Regime Geral,Aquisição de bens móveis,"33600000-6, Produtos farmacêuticos","Administração Regional de Saúde do Norte, I. P. (503135593)",Overpharma - Produtos Médicos Farmaceuticos (505792362),"680,00 €",03-12-2013,25-11-2013,365 dias,"Portugal, Vila Real, Vila Real",Artigo 258.º do Código dos Contratos Públicos,27-12-2013,"680,00 €","","",,1110871,"Aquisição de 250 frascos de bromexina 1,6 mg/ml Xarope 200 ml",
357 comprimidos Buprenorfina 2 mg; 119 comprimidos Buprenorfina 8 mg,Ajuste Direto Regime Geral,Aquisição de bens móveis,"33600000-6, Produtos farmacêuticos","Administração Regional de Saúde do Norte, I. P. (503135593)","DLA - farmacêutica, SA (503894427)","183,26 €",03-12-2013,26-11-2013,365 dias,"Portugal, Vila Real, Vila Real",Artigo 258.º do Código dos Contratos Públicos,26-11-2013,"183,26 €","","",,1110865,357 comprimidos Buprenorfina 2 mg; 119 comprimidos Buprenorfina 8 mg,
"Aquisição de 400 frascos de Lactulose 666,7 mg/ml Xarope 200 ml",Ajuste Direto Regime Geral,Aquisição de bens móveis,"33600000-6, Produtos farmacêuticos","Administração Regional de Saúde do Norte, I. P. (503135593)",Generis Farmaceutica (508107997),"944,00 €",03-12-2013,25-11-2013,365 dias,"Portugal, Vila Real, Vila Real",Artigo 258.º do Código dos Contratos Públicos,28-11-2013,"944,00 €","","",,1110854,"Aquisição de 400 frascos de Lactulose 666,7 mg/ml Xarope 200 ml",
2 400 comprimidos Oxazepam 50 mg; 3 600 comprimidos Oxazepam 15 mg,Ajuste Direto Regime Geral,Aquisição de bens móveis,"33600000-6, Produtos farmacêuticos","Administração Regional de Saúde do Norte, I. P. (503135593)",Meda Pharma - Produtos Farmacêuticos (500082090),"293,28 €",03-12-2013,26-11-2013,365 dias,"Portugal, Vila Real, Vila Real",Artigo 258.º do Código dos Contratos Públicos,05-12-2013,"293,28 €","","",,1110849,2 400 comprimidos Oxazepam 50 mg; 3 600 comprimidos Oxazepam 15 mg,
Aquisição de 10 frascos de Nistatina 1 00000 U.I./ml Susp. oral Fr.,Ajuste Direto Regime Geral,Aquisição de bens móveis,"33600000-6, Produtos farmacêuticos","Administração Regional de Saúde do Norte, I. P. (503135593)",Bristol - Myers Squibb (500048193),"26,00 €",03-12-2013,25-11-2013,365 dias,"Portugal, Vila Real, Vila Real",Artigo 258.º do Código dos Contratos Públicos,28-11-2013,"26,00 €","","",,1110835,Aquisição de 10 frascos de Nistatina 1 00000 U.I./ml Susp. oral Fr.,
960 comprimidos Diazepam 10 mg; 3 000 comprimidos Diazepam 5 mg,Ajuste Direto Regime Geral,Aquisição de bens móveis,"33600000-6, Produtos farmacêuticos","Administração Regional de Saúde do Norte, I. P. (503135593)",Ratiopharm (502414910),"59,28 €",03-12-2013,26-11-2013,365 dias,"Portugal, Vila Real, Vila Real",Artigo 258.º do Código dos Contratos Públicos,28-11-2013,"59,28 €","","",,1110833,960 comprimidos Diazepam 10 mg; 3 000 comprimidos Diazepam 5 mg,
Aquisição de 420 comprimidos de ácido fólico 1 mg + ferro 90 mg,Ajuste Direto Regime Geral,Aquisição de bens móveis,"33600000-6, Produtos farmacêuticos","Administração Regional de Saúde do Norte, I. P. (503135593)","Bial - Portela & Cª, S.A. (500220913)","60,35 €",03-12-2013,25-11-2013,365 dias,"Portugal, Vila Real, Vila Real",Artigo 258.º do Código dos Contratos Públicos,13-12-2013,"60,35 €","","",,1110818,Aquisição de 420 comprimidos de ácido fólico 1 mg + ferro 90 mg,
3 300 capsulas de Flurazepina 15 mg; 1800 capsulas de Flurazepina 30 mg,Ajuste Direto Regime Geral,Aquisição de bens móveis,"33600000-6, Produtos farmacêuticos","Administração Regional de Saúde do Norte, I. P. (503135593)",Tecnifar Ind Técnica farm Sar (500280436),"371,55 €",03-12-2013,26-11-2013,365 dias,"Portugal, Vila Real, Vila Real",Artigo 258.º do Código dos Contratos Públicos,06-12-2013,"371,55 €","","",,1110817,3 300 capsulas de Flurazepina 15 mg; 1800 capsulas de Flurazepina 30 mg,
1 comprimido de diazepam 10 mg; 3 comprimidos de diazepam 5 mg,Ajuste Direto Regime Geral,Aquisição de bens móveis,"33600000-6, Produtos farmacêuticos","Administração Regional de Saúde do Norte, I. P. (503135593)","Labesfal- laboratório Almiro, SA (501169580)","84,10 €",03-12-2013,26-11-2013,365 dias,"Portugal, Vila Real, Vila Real",Artigo 258.º do Código dos Contratos Públicos,05-12-2013,"84,10 €","","",,1110798,1 comprimido de diazepam 10 mg; 3 comprimidos de diazepam 5 mg,
"Aquisição de 40 frascos de Picossulfato de sódio 7,5 mg/ml Sol oral Fr. 30 ml",Ajuste Direto Regime Geral,Aquisição de bens móveis,"33600000-6, Produtos farmacêuticos","Administração Regional de Saúde do Norte, I. P. (503135593)",UNILFARMA (500293023),"111,98 €",03-12-2013,25-11-2013,365 dias,"Portugal, Vila Real, Vila Real",Artigo 258.º do Código dos Contratos Públicos,27-11-2013,"111,98 €","","",,1110790,"Aquisição de 40 frascos de Picossulfato de sódio 7,5 mg/ml Sol oral Fr. 30 ml",
Aquisição de 17 500 lâminas citologia bordo esmiralado com extremidade fosca,Ajuste Direto Regime Geral,Aquisição de bens móveis,"33140000-3, Material médico de consumo","Administração Regional de Saúde do Norte, I. P. (503135593)","Normax - Fábrica de Vidros Científicos, Lda (500203130)","332,50 €",03-12-2013,22-11-2013,365 dias,"Portugal, Vila Real, Vila Real","Artigo 20.º, n.º 1, alínea a) do Código dos Contratos Públicos",06-12-2013,"332,50 €","","",,Não aplicável.,Não aplicável.,
Aquisição de 17 500 lâminas citologia bordo esmiralado com extremidade fosca,Ajuste Direto Regime Geral,Aquisição de bens móveis,"33140000-3, Material médico de consumo","Administração Regional de Saúde do Norte, I. P. (503135593)",VIDROLAB 2 (501450629),"332,50 €",03-12-2013,22-11-2013,365 dias,"Portugal, Vila Real, Vila Real","Artigo 20.º, n.º 1, alínea a) do Código dos Contratos Públicos",31-01-2014,"237,50 €","",Não foi adqurida a encomenda na totalidade,,Não aplicável.,Não aplicável.,
600 comprimidos de Quetiapina 100mg Comp,Ajuste Direto Regime Geral,Aquisição de bens móveis,"33600000-6, Produtos farmacêuticos","Administração Regional de Saúde do Norte, I. P. (503135593)","Astrazeneca Produtos Farmacêuticos, Lda (502942240)","104,85 €",03-12-2013,13-11-2013,365 dias,"Portugal, Vila Real, Vila Real",Artigo 258.º do Código dos Contratos Públicos,18-11-2013,"104,85 €","","",,1110744,600 comprimidos de Quetiapina 100mg Comp,
Aquisição de 300 pinças dissecção 15/16 cm; 256 pinças para tirar agrafes e 50 tesouras Mezenbaun fino curva(para DIU) 20/23 cm,Ajuste Direto Regime Geral,Aquisição de bens móveis,"33140000-3, Material médico de consumo","Administração Regional de Saúde do Norte, I. P. (503135593)","Bastos Viegas, S.A. (500042772)","886,70 €",03-12-2013,22-11-2013,365 dias,"Portugal, Vila Real, Vila Real","Artigo 20.º, n.º 1, alínea a) do Código dos Contratos Públicos",26-12-2013,"886,70 €","","",,Não aplicável.,Não aplicável.,
150 unidades de Risperidona 1mg/ml Sol oral Frasco 30 ml,Ajuste Direto Regime Geral,Aquisição de bens móveis,"33600000-6, Produtos farmacêuticos","Administração Regional de Saúde do Norte, I. P. (503135593)",Ratiopharm (502414910),"442,50 €",03-12-2013,13-11-2013,365 dias,"Portugal, Vila Real, Vila Real",Artigo 258.º do Código dos Contratos Públicos,30-12-2013,"442,50 €","","",,1110733,150 unidades de rispiridona 1 mg/ml sol oral frasco 30 ml,
"Aquisição de 1000 cateteres veia perif. polur nº 24 c/ aleta, sist. anti-picada",Ajuste Direto Regime Geral,Aquisição de bens móveis,"33140000-3, Material médico de consumo","Administração Regional de Saúde do Norte, I. P. (503135593)",Dimor Lusitania (500730741),"510,00 €",03-12-2013,25-11-2013,365 dias,"Portugal, Vila Real, Vila Real",Artigo 258.º do Código dos Contratos Públicos,29-11-2013,"510,00 €","","",,1110721,"Aquisição de 1000 cateteres veia perif. polur nº 24 c/ aleta, sist. anti-picada",
Aquisição de 2 000 Borboletas extração múltipla sangue por vácuo,Ajuste Direto Regime Geral,Aquisição de bens móveis,"33140000-3, Material médico de consumo","Administração Regional de Saúde do Norte, I. P. (503135593)",VACUETE Portugal (505348470),"320,00 €",03-12-2013,14-11-2013,365 dias,"Portugal, Vila Real, Vila Real",Artigo 258.º do Código dos Contratos Públicos,29-11-2013,"320,00 €","","",,1110595,Aquisição de 2 000 Borboletas extração múltipla sangue por vácuo,
900 comprimidos de Risperidona 2mg,Ajuste Direto Regime Geral,Aquisição de bens móveis,"33600000-6, Produtos farmacêuticos","Administração Regional de Saúde do Norte, I. P. (503135593)",Actavis AS sucursal (980334934),"39,60 €",03-12-2013,13-11-2013,365 dias,"Portugal, Vila Real, Vila Real",Artigo 258.º do Código dos Contratos Públicos,28-11-2013,"39,60 €","","",,1110598,900 comprimidos de Risperidona 2 mg,
12 unidades insuflador manual c/saco reserv. e filtro descartavel pediatrico,Ajuste Direto Regime Geral,Aquisição de bens móveis,"33140000-3, Material médico de consumo","Administração Regional de Saúde do Norte, I. P. (503135593)","H.R. Produtos quimicos, Lda (501895558)","107,40 €",03-12-2013,15-11-2013,365 dias,"Portugal, Vila Real, Vila Real","Artigo 20.º, n.º 1, alínea a) do Código dos Contratos Públicos",15-11-2013,"107,40 €","","",,Não aplicável.,Não aplicável.,
"Aquisição de 1000 cateter veia perif. poliur nº 24 c/ aleta, sist. anti-picada",Ajuste Direto Regime Geral,Aquisição de bens móveis,"33140000-3, Material médico de consumo","Administração Regional de Saúde do Norte, I. P. (503135593)","B Braun Medical, Lda (501506543)","510,00 €",03-12-2013,25-11-2013,365 dias,"Portugal, Vila Real, Vila Real",Artigo 258.º do Código dos Contratos Públicos,29-11-2013,"510,00 €","","",,1110571,"Aquisição de 1000 cateter veia perif. poliur nº 24 c/ aleta, sist. anti-picada",
Aquisição de 10 frascos Ciamemazina 40 mg/ml Sol. Oral Fr. 30 ml,Ajuste Direto Regime Geral,Aquisição de bens móveis,"33600000-6, Produtos farmacêuticos","Administração Regional de Saúde do Norte, I. P. (503135593)",Laboratório Vitória SA (500162220),"36,20 €",03-12-2013,12-11-2013,365 dias,"Portugal, Vila Real, Vila Real","Artigo 24.º, n.º 1, alínea e) do Código dos Contratos Públicos",27-11-2013,"36,20 €","","",,Não aplicável.,Não aplicável.,
Aquisição de 8 000 espéculo descartável p/ otorcópio adulto e 8 000 especulos descartável,Ajuste Direto Regime Geral,Aquisição de bens móveis,"33140000-3, Material médico de consumo","Administração Regional de Saúde do Norte, I. P. (503135593)","RMV Produtos Hospitalares, Unipessoal (507866347)","715,12 €",03-12-2013,18-11-2013,365 dias,"Portugal, Vila Real, Vila Real","Artigo 20.º, n.º 1, alínea a) do Código dos Contratos Públicos",19-11-2013,"715,12 €","","",,Não aplicável.,Não aplicável.,
Aquisição de 20 malas domicílio médio; 50 sacos domicilio enfermagem grande e 20 sacos domicilio enfermagem médio,Ajuste Direto Regime Geral,Aquisição de bens móveis,"18930000-7, Sacas e sacos","Administração Regional de Saúde do Norte, I. P. (503135593)","Eugenio Pereira, Limitada (503989525)","7.235,80 €",03-12-2013,20-11-2013,365 dias,"Portugal, Vila Real, Vila Real","Artigo 20.º, n.º 1, alínea a) do Código dos Contratos Públicos",27-12-2013,"7.235,80 €","","",,Não aplicável.,Não aplicável.,
60 bisnagas de Diclofenac 10 mg/g Gel 100 g,Ajuste Direto Regime Geral,Aquisição de bens móveis,"33600000-6, Produtos farmacêuticos","Administração Regional de Saúde do Norte, I. P. (503135593)","Generis farmacêutica, SA (508107997)","186,00 €",03-12-2013,19-11-2013,365 dias,"Portugal, Vila Real, Vila Real","Artigo 20.º, n.º 1, alínea a) do Código dos Contratos Públicos",22-11-2013,"186,00 €","","",,Não aplicável.,Não aplicável.,
Aquisição de 46 000 comprimidos de Piridoxina (Vitamina B 6) 40 mg,Ajuste Direto Regime Geral,Aquisição de bens móveis,"33600000-6, Produtos farmacêuticos","Administração Regional de Saúde do Norte, I. P. (503135593)","Labesfal - Laboratórios Almiro, S.A. (501169580)","18.538,00 €",03-12-2013,24-10-2013,365 dias,"Portugal, Vila Real, Vila Real","Artigo 20.º, n.º 1, alínea a) do Código dos Contratos Públicos",30-10-2013,"18.538,00 €","","",,Não aplicável.,Não aplicável.,
Aquisição de 3000 electródos universais e 10 pares de pás para disfibrilhador adulto,Ajuste Direto Regime Geral,Aquisição de bens móveis,"33140000-3, Material médico de consumo","Administração Regional de Saúde do Norte, I. P. (503135593)","Bramedicafisio, Produtos de Saúde, Lda (508560152)","492,95 €",03-12-2013,19-11-2013,365 dias,"Portugal, Vila Real, Vila Real","Artigo 20.º, n.º 1, alínea a) do Código dos Contratos Públicos",27-12-2013,"492,95 €","","",,Não aplicável.,Não aplicável.,
Aquisiçao de 40 bisnagas de Policresaleno 50 mg/g + Cinchocaína 10 mg/g Pomasa rect. Bisnaga 3 g,Ajuste Direto Regime Geral,Aquisição de bens móveis,"33600000-6, Produtos farmacêuticos","Administração Regional de Saúde do Norte, I. P. (503135593)","Altana Pharma, Lda (502801204)","300,00 €",03-12-2013,03-12-2013,365 dias,"Portugal, Vila Real, Vila Real","Artigo 24.º, n.º 1, alínea e) do Código dos Contratos Públicos",30-12-2013,"300,00 €","","",,Não aplicável.,Não aplicável.,
Aquisição de 30 000  sacos recolha urina c/ válvula saída 1500/2000 cc e 10 000 sacos p/ recolha urina 1500/2000 cc,Ajuste Direto Regime Geral,Aquisição de bens móveis,"33140000-3, Material médico de consumo","Administração Regional de Saúde do Norte, I. P. (503135593)","Ezequiel Panão Jorge, Lda (501412727)","6.575,00 €",03-12-2013,22-11-2013,365 dias,"Portugal, Vila Real, Vila Real","Artigo 20.º, n.º 1, alínea a) do Código dos Contratos Públicos",30-12-2013,"6.575,00 €","","",,Não aplicável.,Não aplicável.,
Aquisição de 720 Comprimidos de ácido fólico 5 mg,Ajuste Direto Regime Geral,Aquisição de bens móveis,"33600000-6, Produtos farmacêuticos","Administração Regional de Saúde do Norte, I. P. (503135593)","Generis Farmaceutica, S.A. (508107997)","23,04 €",03-12-2013,14-11-2013,365 dias,"Portugal, Vila Real, Vila Real",Artigo 258.º do Código dos Contratos Públicos,22-11-2013,"23,04 €","","",,1109486,Aquisição de 720 Comprimidos de ácido fólico 5 mg,
Aquisição de  11840 pensos de adesivo impermeável com compressa 10 cm x15 cm,Ajuste Direto Regime Geral,Aquisição de bens móveis,"33140000-3, Material médico de consumo","Administração Regional de Saúde do Norte, I. P. (503135593)",Molnlycke Health Care (511101066),"2.131,20 €",02-12-2013,28-10-2013,365 dias,"Portugal, Vila Real, Vila Real",Artigo 258.º do Código dos Contratos Públicos,06-11-2013,"2.131,20 €","","",,1108628,Aquisição de  11840 pensos de adesivo impermeável com compressa 10 cm x15 cm,
Aquisição de 600 ampolas de tiamina 100 mg/2 ml Sol. inj. IV SC,Ajuste Direto Regime Geral,Aquisição de bens móveis,"33600000-6, Produtos farmacêuticos","Administração Regional de Saúde do Norte, I. P. (503135593)","Labesfal - Laboratórios Almiro, S.A. (501169580)","1.080,00 €",02-12-2013,13-11-2013,365 dias,"Portugal, Vila Real, Vila Real","Artigo 20.º, n.º 1, alínea a) do Código dos Contratos Públicos",03-12-2013,"1.080,00 €","","",,Não aplicável.,Não aplicável.,
