Objeto do Contrato,Tipo de Procedimento,Tipo(s) de Contrato,CPVs,Entidade(s) Adjudicante(s),Entidade(s) Adjudicatária(s),Preço Contratual,Data de Publicação,Data de Celebração do Contrato,Prazo de Execução,Local de Execução,Fundamentação,Data de Fecho do Contrato,Preço Total Efetivo,Causas das Alterações ao Prazo,Causas das Alterações ao Preço,Estado,N.º registo do Acordo Quadro,Descrição do Acordo Quadro,Procedimento Centralizado
"Aquisição de serviços de conferência de MCDT's manuais, ",Ajuste Direto Regime Geral,Aquisição de serviços,"72512000-7, Serviços de gestão de documentos","Administração Regional de Saúde do Norte, I. P. (503135593)","Confact, S.A. (504271733)","240.300,00 €",09-05-2014,26-02-2014,365 dias,"Portugal, Porto, Porto","Artigo 27.º, n.º 1, alínea a) do Código dos Contratos Públicos",31-12-2014,"206.409,90 €",,O número de faturas lidas foi inferior ao estimado,,Não aplicável.,Não aplicável.,FALSE
"Aquisição de 396 frascos de trocloseno sódico 500 mg, grânulos DM",Ajuste Direto Regime Geral,Aquisição de bens móveis,"33600000-6, Produtos farmacêuticos","Administração Regional de Saúde do Norte, I. P. (503135593)",Johnson & Johnson (500153370),"4.950,00 €",09-05-2014,30-04-2014,365 dias,"Portugal, Vila Real, Vila Real",Artigo 258.º do Código dos Contratos Públicos,22-05-2014,"4.950,00 €",,"",,1211660,"Aquisição de 396 frascos de trocloseno sódico 500 mg, grânulos DM",FALSE
Aquisição 4000 ml Octanol,Ajuste Direto Regime Geral,Aquisição de bens móveis,"33696500-0, Reagentes de laboratório","Administração Regional de Saúde do Norte, I. P. (503135593)","VWR - Internacional, Material Laboratório Lda (503842770)","95,20 €",08-05-2014,08-05-2014,365 dias,"Portugal, Vila Real, Vila Real","Artigo 20.º, n.º 1, alínea a) do Código dos Contratos Públicos",23-05-2014,"95,20 €",,"",,Não aplicável.,Não aplicável.,FALSE
Aquisição de 650 unidades teste alcool,Ajuste Direto Regime Geral,Aquisição de bens móveis,"33600000-6, Produtos farmacêuticos","Administração Regional de Saúde do Norte, I. P. (503135593)","Normax - Fábrica de Vidros Cientificos, Lda (500203130)","682,50 €",08-05-2014,05-05-2014,365 dias,"Portugal, Vila Real, Vila Real","Artigo 20.º, n.º 1, alínea a) do Código dos Contratos Públicos",24-11-2014,"682,50 €",,"",,Não aplicável.,Não aplicável.,FALSE
Aquisição de 2.400 unidades de Algália Folley silicone teflon 2 vias com balão 5/15 nº14,Concurso público,Locação de bens móveis,"33140000-3, Material médico de consumo","Administração Regional de Saúde do Norte, I. P. (503135593)",EPJMédica (506820513),"0,36 €",05-05-2014,28-02-2014,330 dias,"Portugal, Vila Real, Vila Real<BR/>Portugal, Distrito não determinado, Concelho não determinado<BR/>Portugal, Porto, Maia","Artigo 155.º, alínea a) do Código dos Contratos Públicos",17-11-2014,"0,36 €",,"",,Não aplicável.,Não aplicável.,FALSE
Aquisição de 300 unidades de Algália Folley silicone teflon 2 vias com balão 5/15 nº8,Concurso público,Locação de bens móveis,"33140000-3, Material médico de consumo","Administração Regional de Saúde do Norte, I. P. (503135593)","Overpharma, lda (505792362)","0,81 €",05-05-2014,28-02-2014,330 dias,"Portugal, Porto, Maia<BR/>Portugal, Distrito não determinado, Concelho não determinado<BR/>Portugal, Vila Real, Vila Real","Artigo 155.º, alínea a) do Código dos Contratos Públicos",17-11-2014,"0,81 €",,"",,Não aplicável.,Não aplicável.,FALSE
Aquisição de 450 unidades de Algália Folley 100% silicone 2 vias com balão 5/15 nº24,Concurso público,Locação de bens móveis,"33140000-3, Material médico de consumo","Administração Regional de Saúde do Norte, I. P. (503135593)","Overpharma,lda (505792362)","1,30 €",05-05-2014,28-02-2014,330 dias,"Portugal, Vila Real, Vila Real<BR/>Portugal, Porto, Maia<BR/>Portugal, Distrito não determinado, Concelho não determinado","Artigo 155.º, alínea a) do Código dos Contratos Públicos",24-11-2014,"1,30 €",,"",,Não aplicável.,Não aplicável.,FALSE
Aquisição de 300 unidades de Algália Folley 100% silicone 2 vias c/balão 5/15 nº22.,Concurso público,Locação de bens móveis,"33140000-3, Material médico de consumo","Administração Regional de Saúde do Norte, I. P. (503135593)","Overpharma, lda (505792362)","1,30 €",05-05-2014,28-02-2014,330 dias,"Portugal, Distrito não determinado, Concelho não determinado<BR/>Portugal, Porto, Maia<BR/>Portugal, Vila Real, Vila Real","Artigo 155.º, alínea a) do Código dos Contratos Públicos",24-11-2014,"1,30 €",,"",,Não aplicável.,Não aplicável.,FALSE
Aquisição de 2.000 unidades de Algália Folley 100% silicone 2 vias com balão 5/15 nº20,Concurso público,Locação de bens móveis,"33140000-3, Material médico de consumo","Administração Regional de Saúde do Norte, I. P. (503135593)",Overpharma (505792362),"1,30 €",05-05-2014,20-02-2014,330 dias,"Portugal, Distrito não determinado, Concelho não determinado<BR/>Portugal, Vila Real, Vila Real<BR/>Portugal, Porto, Maia","Artigo 155.º, alínea a) do Código dos Contratos Públicos",24-11-2014,"1,30 €",,"",,Não aplicável.,Não aplicável.,FALSE
Aquisição de de 6.000 unidades de Algália Folley 100% silicone  2 vias c/ balão 5/15 nº18,Concurso público,Locação de bens móveis,"33140000-3, Material médico de consumo","Administração Regional de Saúde do Norte, I. P. (503135593)","Overpaharma, lda (505792362)","1,16 €",05-05-2014,28-02-2014,330 dias,"Portugal, Vila Real, Vila Real<BR/>Portugal, Porto, Maia<BR/>Portugal, Distrito não determinado, Concelho não determinado","Artigo 155.º, alínea a) do Código dos Contratos Públicos",24-11-2014,"1,16 €",,"",,Não aplicável.,Não aplicável.,FALSE
Aquisição de 22 000 máscaras protecção doentes irrecuperável (CDP),Ajuste Direto Regime Geral,Aquisição de bens móveis,"33140000-3, Material médico de consumo","Administração Regional de Saúde do Norte, I. P. (503135593)",Factor Plus S.A. (502810645),"8.225,80 €",02-05-2014,11-04-2014,365 dias,"Portugal, Vila Real","Artigo 20.º, n.º 1, alínea a) do Código dos Contratos Públicos",28-08-2014,"8.225,80 €",,"",,Não aplicável.,Não aplicável.,FALSE
Aquisição de 840 comprimidos de ácido fólico 1 mg + ferro 90 mg,Ajuste Direto Regime Geral,Aquisição de bens móveis,"33600000-6, Produtos farmacêuticos","Administração Regional de Saúde do Norte, I. P. (503135593)","Bial - Portela & Cª, S.A. (500220913)","109,70 €",02-05-2014,30-04-2014,365 dias,"Portugal, Vila Real, Vila Real",Artigo 258.º do Código dos Contratos Públicos,07-05-2014,"109,70 €",,"",,1207230,Aquisição de 840 comprimidos de ácido fólico 1 mg + ferro 90 mg,FALSE
Aquisição de 30 tabuleiro inox 28x20x5 cm,Ajuste Direto Regime Geral,Aquisição de bens móveis,"39221160-6, Tabuleiros","Administração Regional de Saúde do Norte, I. P. (503135593)","Eugenio Pereira, Lda (503989525)","329,70 €",02-05-2014,30-04-2014,365 dias,"Portugal, Vila Real, Vila Real","Artigo 20.º, n.º 1, alínea a) do Código dos Contratos Públicos",19-06-2014,"329,70 €",,"",,Não aplicável.,Não aplicável.,FALSE
Aquisição de 4 000 comprimidos de hidroxizina 25 mg,Ajuste Direto Regime Geral,Aquisição de bens móveis,"33600000-6, Produtos farmacêuticos","Administração Regional de Saúde do Norte, I. P. (503135593)",UCB Pharma (Produtos Farmacêuticos) (500291322),"261,20 €",02-05-2014,11-04-2014,365 dias,"Portugal, Vila Real, Vila Real","Artigo 20.º, n.º 1, alínea a) do Código dos Contratos Públicos",17-11-2014,"261,20 €",,"",,Não aplicável.,Não aplicável.,FALSE
"Aquisição de 660 unidades de Reagente determinação amilase no sangue; 450 unid. de reagente determinação bilrrubina no sangue; 2400 unid. de reagente determinação creatinina no sangue; 810 unidades de reagente determinação da Gama no sangue;  540 unid. de reagente determinação da glucose sangue; 810 unid. de reagente determinação da GPT no sangue;  1020 tiras de Reflotron Hemoglobin; ; 900 unid. de reagente det. amilase pancreática no sangue; 1620 unid. de reagente determinação potássio; 1410 unid. de reagente determinação da ureia;  1000 testes Roche Cobas h232 CK-MB, 700 testes de Roche Cobas h2323 D-Dimer; 800 testes roche cobas h232 Myoglobin 20, 120 testes Roche Cobas h232 proBNP e 1850 unid. Roche Cobas h232 T Quantitative 10",Ajuste Direto Regime Geral,Aquisição de bens móveis,"33694000-1, Meios de diagnóstico","Administração Regional de Saúde do Norte, I. P. (503135593)","Roche Sistemas de Diagnóstico, Lda (504282921)","47.243,51 €",02-05-2014,14-02-2014,365 dias,"Portugal, Vila Real, Vila Real","Artigo 24.º, n.º 1, alínea e) do Código dos Contratos Públicos",20-05-2014,"47.243,51 €",,"",,Não aplicável.,Não aplicável.,FALSE
