freguesia,acronym,validVotesPercentage,votes,dicofre
Vilarinho dos Freires,PS,46.86,97,170810
Vilarinho dos Freires,PPD/PSD.CDS-PP,28.5,59,170810
Vilarinho dos Freires,PCP-PEV,9.66,20,170810
Vilarinho dos Freires,MPT,7.25,15,170810
Vilarinho dos Freires,L,3.38,7,170810
Vilarinho dos Freires,B.E.,1.93,4,170810
Vilarinho dos Freires,PCTP/MRPP,0.97,2,170810
Vilarinho dos Freires,PDA,0.48,1,170810
Vilarinho dos Freires,POUS,0.48,1,170810
Vilarinho dos Freires,PTP,0.48,1,170810
Vilarinho dos Freires,MAS,0,0,170810
Vilarinho dos Freires,PAN,0,0,170810
Vilarinho dos Freires,PND,0,0,170810
Vilarinho dos Freires,PNR,0,0,170810
Vilarinho dos Freires,PPM,0,0,170810
Vilarinho dos Freires,PPV,0,0,170810
