Objeto do Contrato,Tipo de Procedimento,Tipo(s) de Contrato,CPVs,Entidade(s) Adjudicante(s),Entidade(s) Adjudicatária(s),Preço Contratual,Data de Publicação,Data de Celebração do Contrato,Prazo de Execução,Local de Execução,Fundamentação,Data de Fecho do Contrato,Preço Total Efetivo,Causas das Alterações ao Prazo,Causas das Alterações ao Preço,Estado,N.º registo do Acordo Quadro,Descrição do Acordo Quadro,Procedimento Centralizado
Aquisição de medicamentos,Ajuste Direto Regime Geral,Aquisição de bens móveis,"33690000-3, Medicamentos vários","Hospital do Espírito Santo de Évora, E.P.E. (508085888)",Lab. Pfizer (500162166),"41.399,60 €",21-05-2013,16-05-2013,5 dias,"Portugal, Évora, Évora","Artigo 26.º, n.º 1, alínea e) do Código dos Contratos Públicos",,,,,,Não aplicável.,Não aplicável.,
Serviços médicos,Concurso público,Aquisição de serviços,"85100000-0, Serviços de saúde","Hospital do Espírito Santo de Évora, E.P.E. (508085888)",GS24 HEALTHCARE SOLUTIONS LDA (507824652),"24.336,00 €",20-05-2013,08-05-2013,365 dias,"Portugal, Évora, Évora","Artigo 20.º, n.º 1, alínea b) do Código dos Contratos Públicos",,,,,,Não aplicável.,Não aplicável.,
Serviços médicos,Concurso público,Aquisição de serviços,"85100000-0, Serviços de saúde","Hospital do Espírito Santo de Évora, E.P.E. (508085888)",SERVSAD-SERVIÇOS AVANÇADOS SAÚDE SA (504260235),"149.760,00 €",20-05-2013,13-03-2013,365 dias,"Portugal, Évora, Évora","Artigo 20.º, n.º 1, alínea b) do Código dos Contratos Públicos",,,,,,Não aplicável.,Não aplicável.,
Aquisição de medicamentos,Ajuste Direto Regime Geral,Aquisição de bens móveis,"33690000-3, Medicamentos vários","Hospital do Espírito Santo de Évora, E.P.E. (508085888)",Janssen Cilag Farmacêutica (500189412),"8.333,22 €",20-05-2013,07-05-2013,5 dias,"Portugal, Évora, Évora","Artigo 26.º, n.º 1, alínea e) do Código dos Contratos Públicos",,,,,,Não aplicável.,Não aplicável.,
MCDT Patologia Clinica,Ajuste Direto Regime Geral,Aquisição de serviços,"85145000-7, Serviços prestados por laboratórios médicos","Hospital do Espírito Santo de Évora, E.P.E. (508085888)",Genética Médica Diagnóstico Pré-Natal (503622931),"10.000,00 €",20-05-2013,31-01-2013,90 dias,"Portugal, Évora, Évora","Artigo 20.º, n.º 1, alínea a) do Código dos Contratos Públicos",,,,,,Não aplicável.,Não aplicável.,
Aquisição de medicamentos,Ajuste Direto Regime Geral,Aquisição de bens móveis,"33690000-3, Medicamentos vários","Hospital do Espírito Santo de Évora, E.P.E. (508085888)",Grifols Portugal (502041285),"6.400,00 €",17-05-2013,05-04-2013,5 dias,"Portugal, Évora, Évora","Artigo 26.º, n.º 1, alínea e) do Código dos Contratos Públicos",,,,,,Não aplicável.,Não aplicável.,
Aquisição de medicamentos,Ajuste Direto Regime Geral,Aquisição de bens móveis,"33690000-3, Medicamentos vários","Hospital do Espírito Santo de Évora, E.P.E. (508085888)",Lab Pfizer (500162166),"6.899,90 €",17-05-2013,11-04-2013,5 dias,"Portugal, Évora, Évora","Artigo 26.º, n.º 1, alínea e) do Código dos Contratos Públicos",,,,,,Não aplicável.,Não aplicável.,
Aquisição de medicamentos,Ajuste Direto Regime Geral,Aquisição de bens móveis,"33600000-6, Produtos farmacêuticos","Hospital do Espírito Santo de Évora, E.P.E. (508085888)",Celgene  (507791690),"10.834,28 €",14-05-2013,02-05-2013,8 dias,"Portugal, Évora, Évora<BR/>Portugal","Artigo 20.º, n.º 1, alínea a) do Código dos Contratos Públicos",,,,,,Não aplicável.,Não aplicável.,
Aquisição de dispositivos médicos,Ajuste Direto Regime Geral,Aquisição de bens móveis,"33190000-8, Dispositivos e produtos médicos variados","Hospital do Espírito Santo de Évora, E.P.E. (508085888)",Volcano Europe (BE0859842345),"5.700,00 €",14-05-2013,29-04-2013,8 dias,"Portugal, Évora, Évora","Artigo 20.º, n.º 1, alínea a) do Código dos Contratos Públicos",,,,,,Não aplicável.,Não aplicável.,
Aquisição de dispositivos médicos,Ajuste Direto Regime Geral,Aquisição de bens móveis,"33190000-8, Dispositivos e produtos médicos variados","Hospital do Espírito Santo de Évora, E.P.E. (508085888)",Med X Ray (506187071),"6.300,00 €",14-05-2013,29-04-2013,8 dias,"Portugal, Évora, Évora","Artigo 20.º, n.º 1, alínea a) do Código dos Contratos Públicos",,,,,,Não aplicável.,Não aplicável.,
