Objeto do Contrato,Tipo de Procedimento,Tipo(s) de Contrato,CPVs,Entidade(s) Adjudicante(s),Entidade(s) Adjudicatária(s),Preço Contratual,Data de Publicação,Data de Celebração do Contrato,Prazo de Execução,Local de Execução,Fundamentação,Data de Fecho do Contrato,Preço Total Efetivo,Causas das Alterações ao Prazo,Causas das Alterações ao Preço,Estado,N.º registo do Acordo Quadro,Descrição do Acordo Quadro,Procedimento Centralizado
Aquisição de<br/>50 (cinquenta) Dispositivos de desgliceralização de componentes eritrócitos c/solução e sistema;<br/>50 (cinquenta) Dispositivo de gliceralização de componentes eritrócitos c/solução e sistema;<br/>50 (cinquenta) Dispositivos de lavagem de componentes eritrocitários.,Ajuste Direto Regime Geral,Aquisição de bens móveis,"33141500-5, Produtos hematológicos","Instituto Português do Sangue, I.P. (502423943)",DLA Farmacêutica (503894427),"20.904,50 €",09-05-2012,19-04-2012,220 dias,"Portugal, Porto, Porto","Artigo 24.º, n.º 1, alínea e) do Código dos Contratos Públicos",,,,,,Não aplicável.,Não aplicável.,
"Aquisição de 15 caixas de panos anti estaticos, impregenados em isopropanol a 70%, esterilizados, marca Kimberly Clarck Ref.ª 7649.",Ajuste Direto Regime Geral,Aquisição de bens móveis,"33140000-3, Material médico de consumo","Instituto Português do Sangue, I.P. (502423943)","Futurlab MaterialLaboratorio, Ldª (507195256)","2.259,00 €",04-05-2012,13-04-2012,225 dias,"Portugal, Coimbra, Coimbra","Artigo 20.º, n.º 1, alínea a) do Código dos Contratos Públicos",,,,,,Não aplicável.,Não aplicável.,
"Aquisição de 560 unidades de Solução Aditiva Eritrocitária Sag-Manitol, bolsa em PVC 350ml, com conexão Luer fêmea, para os Serviços de Colheitas por Aférese do IPS,IP., durante o ano 2012.",Ajuste Direto Regime Geral,Aquisição de bens móveis,"33141500-5, Produtos hematológicos","Instituto Português do Sangue, I.P. (502423943)",DLA Farmaceutica (503894427),"6.193,60 €",04-05-2012,30-03-2012,228 dias,"Portugal, Porto, Porto<BR/>Portugal, Lisboa, Lisboa<BR/>Portugal, Coimbra, Coimbra","Artigo 24.º, n.º 1, alínea b) do Código dos Contratos Públicos",,,,,,Não aplicável.,Não aplicável.,
