freguesia,acronym,validVotesPercentage,votes,dicofre
Friões,PPD/PSD,74,148,171212
Friões,PS,16.5,33,171212
Friões,CDS-PP,3,6,171212
Friões,B.E.,1.5,3,171212
Friões,PPM.PPV/CDC,1.5,3,171212
Friões,PAN,1,2,171212
Friões,A,0.5,1,171212
Friões,L,0.5,1,171212
Friões,NC,0.5,1,171212
Friões,PCP-PEV,0.5,1,171212
Friões,PTP,0.5,1,171212
Friões,IL,0,0,171212
Friões,MAS,0,0,171212
Friões,PCTP/MRPP,0,0,171212
Friões,PDR,0,0,171212
Friões,PNR,0,0,171212
Friões,PURP,0,0,171212
