freguesia,acronym,validVotesPercentage,votes,dicofre
"União das freguesias de Santiago do Cacém, Santa Cruz e São Bartolomeu da Serra",PS,31.72,719,150912
"União das freguesias de Santiago do Cacém, Santa Cruz e São Bartolomeu da Serra",PCP-PEV,30.79,698,150912
"União das freguesias de Santiago do Cacém, Santa Cruz e São Bartolomeu da Serra",PPD/PSD.CDS-PP,19.01,431,150912
"União das freguesias de Santiago do Cacém, Santa Cruz e São Bartolomeu da Serra",MPT,5.56,126,150912
"União das freguesias de Santiago do Cacém, Santa Cruz e São Bartolomeu da Serra",B.E.,4.9,111,150912
"União das freguesias de Santiago do Cacém, Santa Cruz e São Bartolomeu da Serra",PCTP/MRPP,2.07,47,150912
"União das freguesias de Santiago do Cacém, Santa Cruz e São Bartolomeu da Serra",L,1.9,43,150912
"União das freguesias de Santiago do Cacém, Santa Cruz e São Bartolomeu da Serra",PAN,1.68,38,150912
"União das freguesias de Santiago do Cacém, Santa Cruz e São Bartolomeu da Serra",PPM,0.79,18,150912
"União das freguesias de Santiago do Cacém, Santa Cruz e São Bartolomeu da Serra",PTP,0.4,9,150912
"União das freguesias de Santiago do Cacém, Santa Cruz e São Bartolomeu da Serra",MAS,0.31,7,150912
"União das freguesias de Santiago do Cacém, Santa Cruz e São Bartolomeu da Serra",PND,0.31,7,150912
"União das freguesias de Santiago do Cacém, Santa Cruz e São Bartolomeu da Serra",PNR,0.31,7,150912
"União das freguesias de Santiago do Cacém, Santa Cruz e São Bartolomeu da Serra",PDA,0.09,2,150912
"União das freguesias de Santiago do Cacém, Santa Cruz e São Bartolomeu da Serra",POUS,0.09,2,150912
"União das freguesias de Santiago do Cacém, Santa Cruz e São Bartolomeu da Serra",PPV,0.09,2,150912
