Objeto do Contrato,Tipo de Procedimento,Tipo(s) de Contrato,CPVs,Entidade(s) Adjudicante(s),Entidade(s) Adjudicatária(s),Preço Contratual,Data de Publicação,Data de Celebração do Contrato,Prazo de Execução,Local de Execução,Fundamentação,Data de Fecho do Contrato,Preço Total Efetivo,Causas das Alterações ao Prazo,Causas das Alterações ao Preço,Estado,N.º registo do Acordo Quadro,Descrição do Acordo Quadro,Procedimento Centralizado
Aquisição de Reagentes para Análises Clinicas para o Laboratório Regional de Saúde Pública da Administração Regional de Saúde do Algarve,Ajuste Direto Regime Geral,Aquisição de bens móveis,"33696200-7, Reagentes para análises ao sangue","Administração Regional de Saúde do Algarve, I.P. (503148709)","ABBOTT Laboratórios, Lda (500006148)","14.031,88 €",09-05-2013,09-05-2013,236 dias,"Portugal, Faro, Faro","Artigo 24.º, n.º 1, alínea e) do Código dos Contratos Públicos",31-12-2013,"11.862,08 €",,Quantidades fornecidas.,,Não aplicável.,Não aplicável.,
SC/53/2013 - Aquisição de Adesivos,Ao abrigo de acordo-quadro (art.º 259.º),Aquisição de bens móveis,"33141111-1, Pensos adesivos","Administração Regional de Saúde do Algarve, I.P. (503148709)","Ezequiel Panão Jorge, Lda. (501412727)","74,13 €",08-05-2013,04-04-2013,270 dias,"Portugal, Faro",Artigo 259.º do Código dos Contratos Públicos,26-06-2013,"74,13 €",,"",,194000,CONCURSO PÚBLICO PARA A CELEBRAÇÃO DE CONTRATOS PÚBLICOS DE APROVISIONAMENTO PARA AQUISIÇÃO DE PENSO TRADICIONAL OU CLÁSSICO,
SC/53/2013 - Aquisição de Adesivos,Ao abrigo de acordo-quadro (art.º 259.º),Aquisição de bens móveis,"33141111-1, Pensos adesivos","Administração Regional de Saúde do Algarve, I.P. (503148709)","Dimor Lusitana Comércio de Produtos de Saúde e Higiene, Lda. (500730741)","376,50 €",08-05-2013,04-04-2013,270 dias,"Portugal, Faro",Artigo 259.º do Código dos Contratos Públicos,15-11-2013,"175,70 €",,Quantidade encomendada,,194000,CONCURSO PÚBLICO PARA A CELEBRAÇÃO DE CONTRATOS PÚBLICOS DE APROVISIONAMENTO PARA AQUISIÇÃO DE PENSO TRADICIONAL OU CLÁSSICO,
SC/53/2013 - Aquisição de Adesivos,Ao abrigo de acordo-quadro (art.º 259.º),Aquisição de bens móveis,"33141111-1, Pensos adesivos","Administração Regional de Saúde do Algarve, I.P. (503148709)","Anastácio Saldanha Unipessoal, Lda. (505804441)","228,80 €",08-05-2013,04-04-2013,270 dias,"Portugal, Faro",Artigo 259.º do Código dos Contratos Públicos,21-11-2013,"135,20 €",,Quantidade encomendada,,194000,CONCURSO PÚBLICO PARA A CELEBRAÇÃO DE CONTRATOS PÚBLICOS DE APROVISIONAMENTO PARA AQUISIÇÃO DE PENSO TRADICIONAL OU CLÁSSICO,
SC/53/2013 - Aquisição de Adesivos,Ao abrigo de acordo-quadro (art.º 259.º),Aquisição de bens móveis,"33140000-3, Material médico de consumo<BR/>33141111-1, Pensos adesivos","Administração Regional de Saúde do Algarve, I.P. (503148709)","Paul Hartmann, Lda. (502271728)","955,75 €",08-05-2013,04-04-2013,270 dias,"Portugal, Faro",Artigo 259.º do Código dos Contratos Públicos,20-09-2013,"854,00 €",,Quantidade encomendada,,194000,CONCURSO PÚBLICO PARA A CELEBRAÇÃO DE CONTRATOS PÚBLICOS DE APROVISIONAMENTO PARA AQUISIÇÃO DE PENSO TRADICIONAL OU CLÁSSICO,
SC/53/2013 - Aquisição de Adesivos,Ao abrigo de acordo-quadro (art.º 259.º),Aquisição de bens móveis,"33141111-1, Pensos adesivos","Administração Regional de Saúde do Algarve, I.P. (503148709)","Overpharma Produtos Médicos e Farmacêuticos, Lda. (505792362)","4.104,00 €",08-05-2013,04-04-2013,270 dias,"Portugal, Faro",Artigo 259.º do Código dos Contratos Públicos,04-12-2013,"3.864,00 €",,Quantidade encomendada,,194000,CONCURSO PÚBLICO PARA A CELEBRAÇÃO DE CONTRATOS PÚBLICOS DE APROVISIONAMENTO PARA AQUISIÇÃO DE PENSO TRADICIONAL OU CLÁSSICO,
SC/53/2013 - Aquisição de Adesivos,Ao abrigo de acordo-quadro (art.º 259.º),Aquisição de bens móveis,"33141111-1, Pensos adesivos","Administração Regional de Saúde do Algarve, I.P. (503148709)","Bastos Viegas, S.A. (500042772)","3.953,92 €",08-05-2013,04-04-2013,270 dias,"Portugal, Faro",Artigo 259.º do Código dos Contratos Públicos,16-12-2013,"3.144,32 €",,Quantidade encomendada,,194000,CONCURSO PÚBLICO PARA A CELEBRAÇÃO DE CONTRATOS PÚBLICOS DE APROVISIONAMENTO PARA AQUISIÇÃO DE PENSO TRADICIONAL OU CLÁSSICO,
SC/53/2013 - Aquisição de Adesivos,Ao abrigo de acordo-quadro (art.º 259.º),Aquisição de bens móveis,"33141111-1, Pensos adesivos","Administração Regional de Saúde do Algarve, I.P. (503148709)","3M Portugal, Lda. (500193940)","91,80 €",08-05-2013,04-04-2013,270 dias,"Portugal, Faro",Artigo 259.º do Código dos Contratos Públicos,"","",,"",,194000,CONCURSO PÚBLICO PARA A CELEBRAÇÃO DE CONTRATOS PÚBLICOS DE APROVISIONAMENTO PARA AQUISIÇÃO DE PENSO TRADICIONAL OU CLÁSSICO,
SC/53/2013 - Aquisição de Adesivos,Ao abrigo de acordo-quadro (art.º 259.º),Aquisição de bens móveis,"33141111-1, Pensos adesivos","Administração Regional de Saúde do Algarve, I.P. (503148709)","Smith & Nephew, Lda (503552461)","373,86 €",08-05-2013,04-04-2013,270 dias,"Portugal, Faro",Artigo 259.º do Código dos Contratos Públicos,13-12-2013,"373,86 €",,"",,194000,CONCURSO PÚBLICO PARA A CELEBRAÇÃO DE CONTRATOS PÚBLICOS DE APROVISIONAMENTO PARA AQUISIÇÃO DE PENSO TRADICIONAL OU CLÁSSICO,
"Aquisição de equipamento médico para os Agrupamentos dos Centros de Saúde - ACES:  - Lote I -  Doppler Fetal, 16 unidades;  - Lote II - Marquesa Polivalente Ginecológica Eléctrica, 4 unidades;  - Lote III - Candeeiro de Luz Fria, 14 unidades.",Ajuste Direto Regime Geral,Aquisição de bens móveis,"33100000-1, Equipamento médico","Administração Regional de Saúde do Algarve, I.P. (503148709)","SPECULUM, Artigos Médicos, S.A (502996323)","15.782,40 €",08-05-2013,07-05-2013,20 dias,"Portugal, Faro, Portimão<BR/>Portugal, Faro, Faro<BR/>Portugal, Faro, Tavira","Artigo 20.º, n.º 1, alínea a) do Código dos Contratos Públicos",31-05-2013,"15.782,40 €",,"",,Não aplicável.,Não aplicável.,
SC/59/2013 - Aquisição de Material de Terapia Respiratória,Ajuste Direto Regime Geral,Aquisição de bens móveis,"33141641-5, Sondas<BR/>33157200-7, Kits para fornecimento de oxigénio","Administração Regional de Saúde do Algarve, I.P. (503148709)","Overpharma Produtos Médicos e Farmacêuticos, Lda. (505792362)","1.718,50 €",08-05-2013,20-03-2013,285 dias,"Portugal, Faro","Artigo 20.º, n.º 1, alínea a) do Código dos Contratos Públicos",31-12-2013,"1.503,90 €",,Quantidade encomendada,,Não aplicável.,Não aplicável.,
SC/59/2013 - Aquisição de Material de Terapia Respiratória,Ajuste Direto Regime Geral,Aquisição de bens móveis,"33141641-5, Sondas<BR/>33140000-3, Material médico de consumo","Administração Regional de Saúde do Algarve, I.P. (503148709)","Covidien Portugal - Produtos de Saúde Unipessoal, Lda. (503413410)","5.238,40 €",08-05-2013,20-03-2013,285 dias,"Portugal, Faro","Artigo 20.º, n.º 1, alínea a) do Código dos Contratos Públicos",04-12-2013,"733,20 €",,Quantidade encomendada,,Não aplicável.,Não aplicável.,
SC/59/2013 - Aquisição de Material de Terapia Respiratória,Ajuste Direto Regime Geral,Aquisição de bens móveis,"33140000-3, Material médico de consumo<BR/>33141200-2, Cateteres","Administração Regional de Saúde do Algarve, I.P. (503148709)","Intersurgical Portugal - Comércio de Produtos Hospitalares, Lda. (503480045)","413,20 €",08-05-2013,20-03-2013,285 dias,"Portugal, Faro","Artigo 20.º, n.º 1, alínea a) do Código dos Contratos Públicos",04-12-2013,"413,20 €",,"",,Não aplicável.,Não aplicável.,
Prestação de Serviços de Limpeza para o Lote 4 - ACES Sotavento,Ao abrigo de acordo-quadro (art.º 259.º),Aquisição de serviços,"90910000-9, Serviços de limpeza","Administração Regional de Saúde do Algarve, I.P. (503148709)","Interlimpe - Facility Services, S. A. (502611057)","13.817,45 €",06-05-2013,02-04-2013,91 dias,"Portugal, Faro, Tavira<BR/>Portugal, Faro, Castro Marim<BR/>Portugal, Faro, Vila Real Sto Antonio<BR/>Portugal, Faro, Alcoutim",Artigo 259.º do Código dos Contratos Públicos,"","",,"",,600259,Concurso público para selecção de fornecedores de produtos de higiene e de prestadores de serviços de limpeza,
"Prestação de Serviços de Limpeza para o Lote 1, 2 e 3",Ao abrigo de acordo-quadro (art.º 259.º),Aquisição de serviços,"90910000-9, Serviços de limpeza","Administração Regional de Saúde do Algarve, I.P. (503148709)","Ctlimpe - Sociedade de Limpezas, Lda (503024155)","76.232,30 €",06-05-2013,02-04-2013,91 dias,"Portugal, Faro, Silves<BR/>Portugal, Faro, Monchique<BR/>Portugal, Faro, Faro<BR/>Portugal, Faro, Loulé<BR/>Portugal, Faro, São Brás de Alportel<BR/>Portugal, Faro, Lagos<BR/>Portugal, Faro, Albufeira<BR/>Portugal, Faro, Portimão<BR/>Portugal, Faro, Olhão<BR/>Portugal, Faro, Aljezur<BR/>Portugal, Faro, Vila do Bispo<BR/>Portugal, Faro, Lagoa",Artigo 259.º do Código dos Contratos Públicos,"","",,"",,600259,Concurso público para selecção de fornecedores de produtos de higiene e de prestadores de serviços de limpeza,
