Objeto do Contrato,Tipo de Procedimento,Tipo(s) de Contrato,CPVs,Entidade(s) Adjudicante(s),Entidade(s) Adjudicatária(s),Preço Contratual,Data de Publicação,Data de Celebração do Contrato,Prazo de Execução,Local de Execução,Fundamentação,Data de Fecho do Contrato,Preço Total Efetivo,Causas das Alterações ao Prazo,Causas das Alterações ao Preço,Estado,N.º registo do Acordo Quadro,Descrição do Acordo Quadro,Procedimento Centralizado
Fornecimento das substâncias ativas: Afatinib 30mg; Nintedanib 100mg (Vargatef e Ofev) e 150mg (Ofev),Ajuste Direto Regime Geral,Aquisição de bens móveis,"33600000-6, Produtos farmacêuticos","Unidade Local de Saúde de Matosinhos, EPE (ULSM) (506361390)",UNILFARMA - UNIAO INTERN. LAB. S FARMACEUTICOS (500293023),"112.805,99 €",07-09-2018,05-06-2018,210 dias,"Portugal, Porto, Matosinhos","Artigo 24.º, n.º 1, alínea e), subalínea iii) do Código dos Contratos Públicos",,,,,,Não aplicável.,Não aplicável.,FALSE
Fornecimento da substância ativa: Vandetanib 100mg,Ajuste Direto Regime Geral,Aquisição de bens móveis,"33600000-6, Produtos farmacêuticos","Unidade Local de Saúde de Matosinhos, EPE (ULSM) (506361390)",SANOFI - PRODUTOS FARMACÊUTICOS SA (500134960),"67.200,05 €",07-09-2018,06-06-2018,244 dias,"Portugal, Porto, Matosinhos","Artigo 24.º, n.º 1, alínea e), subalínea iii) do Código dos Contratos Públicos",,,,,,Não aplicável.,Não aplicável.,FALSE
Fornecimento de substância ativa: Afatinib 40mg,Ajuste Direto Regime Geral,Aquisição de bens móveis,"33600000-6, Produtos farmacêuticos","Unidade Local de Saúde de Matosinhos, EPE (ULSM) (506361390)",UNILFARMA - UNIAO INTERN. LAB. S FARMACEUTICOS (500293023),"67.832,64 €",07-09-2018,27-06-2018,207 dias,"Portugal, Porto, Matosinhos","Artigo 24.º, n.º 1, alínea e), subalínea iii) do Código dos Contratos Públicos",,,,,,Não aplicável.,Não aplicável.,FALSE
Medicamentos de Autorização de Utilização Excecional,Consulta Prévia,Aquisição de bens móveis,"33600000-6, Produtos farmacêuticos","Unidade Local de Saúde de Matosinhos, E. P. E. (506361390)","RB - Produtos Farmacêuticos, Unipessoal, Lda (510784429)","2.785,10 €",07-09-2018,30-04-2018,246 dias,"Portugal, Porto, Matosinhos","Artigo 20.º, n.º 1, alínea c) do Código dos Contratos Públicos",,,,,,Não aplicável.,Não aplicável.,FALSE
Medicamentos de Autorização de Utilização Excecional,Consulta Prévia,Aquisição de bens móveis,"33600000-6, Produtos farmacêuticos","Unidade Local de Saúde de Matosinhos, E. P. E. (506361390)",Duxpharma Unipessoal Lda (510803679),"4.459,60 €",07-09-2018,20-04-2018,246 dias,"Portugal, Porto, Matosinhos","Artigo 20.º, n.º 1, alínea c) do Código dos Contratos Públicos",,,,,,Não aplicável.,Não aplicável.,FALSE
