Objeto do Contrato,Tipo de Procedimento,Tipo(s) de Contrato,CPVs,Entidade(s) Adjudicante(s),Entidade(s) Adjudicatária(s),Preço Contratual,Data de Publicação,Data de Celebração do Contrato,Prazo de Execução,Local de Execução,Fundamentação,Data de Fecho do Contrato,Preço Total Efetivo,Causas das Alterações ao Prazo,Causas das Alterações ao Preço,Estado,N.º registo do Acordo Quadro,Descrição do Acordo Quadro,Procedimento Centralizado
F40026/2015 - MEDICAMENTOS ANTI - INFECCIOSOS,Ajuste Direto Regime Geral,Aquisição de bens móveis,"33600000-6, Produtos farmacêuticos","CHBM - Centro Hospital Barreiro Montijo, EPE (509186998)",LAB. PFIZER (500162166),"306,25 €",11-05-2015,06-02-2015,365 dias,"Portugal, Setúbal, Barreiro","Artigo 20.º, n.º 1, alínea a) do Código dos Contratos Públicos","","",,"",,Não aplicável.,Não aplicável.,FALSE
F40026/2015 - MEDICAMENTOS ANTI - INFECCIOSOS,Ajuste Direto Regime Geral,Aquisição de bens móveis,"33600000-6, Produtos farmacêuticos","CHBM - Centro Hospital Barreiro Montijo, EPE (509186998)",LABESFAL (501169580),"5.931,50 €",11-05-2015,06-02-2015,365 dias,"Portugal, Setúbal, Barreiro","Artigo 20.º, n.º 1, alínea a) do Código dos Contratos Públicos","","",,"",,Não aplicável.,Não aplicável.,FALSE
F40026/2015 - MEDICAMENTOS ANTI - INFECCIOSOS,Ajuste Direto Regime Geral,Aquisição de bens móveis,"33600000-6, Produtos farmacêuticos","CHBM - Centro Hospital Barreiro Montijo, EPE (509186998)",BIOMET PORTUGAL (500254990),"1.638,00 €",11-05-2015,06-02-2015,365 dias,"Portugal, Setúbal, Barreiro","Artigo 20.º, n.º 1, alínea a) do Código dos Contratos Públicos","","",,"",,Não aplicável.,Não aplicável.,FALSE
F40025/2015 - MEDICAMENTOS USADOS EM AFECÇÕES CUTÂNEAS,Ajuste Direto Regime Geral,Aquisição de bens móveis,"33600000-6, Produtos farmacêuticos","CHBM - Centro Hospital Barreiro Montijo, EPE (509186998)",LOGIFARMA (503934640),"0,00 €",11-05-2015,19-03-2015,365 dias,"Portugal, Setúbal, Barreiro","Artigo 20.º, n.º 1, alínea a) do Código dos Contratos Públicos","","",,"",,Não aplicável.,Não aplicável.,FALSE
F40025/2015 - MEDICAMENTOS USADOS EM AFECÇÕES CUTÂNEAS,Ajuste Direto Regime Geral,Aquisição de bens móveis,"33600000-6, Produtos farmacêuticos","CHBM - Centro Hospital Barreiro Montijo, EPE (509186998)",MEDINFAR (500384045),"0,00 €",11-05-2015,19-03-2015,365 dias,"Portugal, Setúbal, Barreiro","Artigo 20.º, n.º 1, alínea a) do Código dos Contratos Públicos","","",,"",,Não aplicável.,Não aplicável.,FALSE
F40025/2015 - MEDICAMENTOS USADOS EM AFECÇÕES CUTÂNEAS,Ajuste Direto Regime Geral,Aquisição de bens móveis,"33600000-6, Produtos farmacêuticos","CHBM - Centro Hospital Barreiro Montijo, EPE (509186998)",BASTOS VIEGAS (500042772),"0,00 €",11-05-2015,19-03-2015,365 dias,"Portugal, Setúbal, Barreiro","Artigo 20.º, n.º 1, alínea a) do Código dos Contratos Públicos","","",,"",,Não aplicável.,Não aplicável.,FALSE
F40025/2015 - MEDICAMENTOS USADOS EM AFECÇÕES CUTÂNEAS,Ajuste Direto Regime Geral,Aquisição de bens móveis,"33600000-6, Produtos farmacêuticos","CHBM - Centro Hospital Barreiro Montijo, EPE (509186998)",OVERPHARMA (505792362),"3.237,99 €",11-05-2015,19-03-2015,365 dias,"Portugal, Setúbal, Barreiro","Artigo 20.º, n.º 1, alínea a) do Código dos Contratos Públicos","","",,"",,Não aplicável.,Não aplicável.,FALSE
F40025/2015 - MEDICAMENTOS USADOS EM AFECÇÕES CUTÂNEAS,Ajuste Direto Regime Geral,Aquisição de bens móveis,"33600000-6, Produtos farmacêuticos","CHBM - Centro Hospital Barreiro Montijo, EPE (509186998)",PROCLINICA (500222665),"4.451,44 €",11-05-2015,19-03-2015,365 dias,"Portugal, Setúbal, Barreiro","Artigo 20.º, n.º 1, alínea a) do Código dos Contratos Públicos","","",,"",,Não aplicável.,Não aplicável.,FALSE
F40025/2015 - MEDICAMENTOS USADOS EM AFECÇÕES CUTÂNEAS,Ajuste Direto Regime Geral,Aquisição de bens móveis,"33600000-6, Produtos farmacêuticos","CHBM - Centro Hospital Barreiro Montijo, EPE (509186998)",VYGON (503232785),"1.572,49 €",11-05-2015,19-03-2015,365 dias,"Portugal, Setúbal, Barreiro","Artigo 20.º, n.º 1, alínea a) do Código dos Contratos Públicos","","",,"",,Não aplicável.,Não aplicável.,FALSE
F40025/2015 - MEDICAMENTOS USADOS EM AFECÇÕES CUTÂNEAS,Ajuste Direto Regime Geral,Aquisição de bens móveis,"33600000-6, Produtos farmacêuticos","CHBM - Centro Hospital Barreiro Montijo, EPE (509186998)",LAB. EDOL (507072642),"4.875,00 €",11-05-2015,19-03-2015,365 dias,"Portugal, Setúbal, Barreiro","Artigo 20.º, n.º 1, alínea a) do Código dos Contratos Públicos","","",,"",,Não aplicável.,Não aplicável.,FALSE
F40025/2015 - MEDICAMENTOS USADOS EM AFECÇÕES CUTÂNEAS,Ajuste Direto Regime Geral,Aquisição de bens móveis,"33600000-6, Produtos farmacêuticos","CHBM - Centro Hospital Barreiro Montijo, EPE (509186998)",EXPOMÉDICA (501886621),"423,00 €",11-05-2015,19-03-2015,365 dias,"Portugal, Setúbal, Barreiro","Artigo 20.º, n.º 1, alínea a) do Código dos Contratos Públicos","","",,"",,Não aplicável.,Não aplicável.,FALSE
F40025/2015 - MEDICAMENTOS USADOS EM AFECÇÕES CUTÂNEAS,Ajuste Direto Regime Geral,Aquisição de bens móveis,"33600000-6, Produtos farmacêuticos","CHBM - Centro Hospital Barreiro Montijo, EPE (509186998)",LABESFAL (501169580),"2.726,97 €",11-05-2015,19-03-2015,365 dias,"Portugal, Setúbal, Barreiro","Artigo 20.º, n.º 1, alínea a) do Código dos Contratos Públicos","","",,"",,Não aplicável.,Não aplicável.,FALSE
F40034/2015 - HORMONAS E MED. USADOS NO TRATAMENTO DAS DOENÇAS ENDÓCRINAS,Ajuste Direto Regime Geral,Aquisição de bens móveis,"33600000-6, Produtos farmacêuticos","CHBM - Centro Hospital Barreiro Montijo, EPE (509186998)",HOSPIRA (502913096),"3.180,00 €",11-05-2015,20-01-2015,365 dias,"Portugal, Setúbal, Barreiro","Artigo 20.º, n.º 1, alínea a) do Código dos Contratos Públicos","","",,"",,Não aplicável.,Não aplicável.,FALSE
FEXC0116/2015 - COTRIMOXAZOL 480 MG AMP 5 ML SOL INJ ( 400 MG SULFAMETOXAZOL + 80 MG TRIMETOPRIM ),Ajuste Direto Regime Geral,Aquisição de bens móveis,"33600000-6, Produtos farmacêuticos","Centro Hospitalar Barreiro Montijo, E. P. E. (509186998)",RATIOPHARM (502414910),"8.897,00 €",11-05-2015,06-04-2015,365 dias,"Portugal, Setúbal, Barreiro","Artigo 24.º, n.º 1, alínea e) do Código dos Contratos Públicos","","",,"",,Não aplicável.,Não aplicável.,FALSE
FEXC0118/2015 - TRASTUZUMAB EMTASINA 100 MG PÓ SOL INJ,Ajuste Direto Regime Geral,Aquisição de bens móveis,"33600000-6, Produtos farmacêuticos","Centro Hospitalar Barreiro Montijo, E. P. E. (509186998)",ROCHE FARMACEUTICA (500233810),"84.425,00 €",11-05-2015,20-04-2015,365 dias,"Portugal, Setúbal, Barreiro","Artigo 24.º, n.º 1, alínea e) do Código dos Contratos Públicos","","",,"",,Não aplicável.,Não aplicável.,FALSE
FEX0121/2015 - ELVITEGRAVIR 150 MG + COBICISTATO 150 MG + EMTRIC 200 MG + TENOF 245 MG,Ajuste Direto Regime Geral,Aquisição de bens móveis,"33600000-6, Produtos farmacêuticos","Centro Hospitalar Barreiro Montijo, E. P. E. (509186998)",GILEAD SCIENCES (503604704),"9.668,16 €",11-05-2015,01-04-2015,365 dias,"Portugal, Setúbal, Barreiro","Artigo 24.º, n.º 1, alínea e) do Código dos Contratos Públicos","","",,"",,Não aplicável.,Não aplicável.,FALSE
"FEXC0122/2015 - PENSO ESPUMA ( V.A.C. ) 15 X 15 CM UTILIZAÇÃO ÚNICA ( PICO ), PENSO ESPUMA ( V.A.C. ) 15 X 20 CM UTILIZAÇÃO ÚNICA ( PICO )",Ajuste Direto Regime Geral,Aquisição de bens móveis<br/>Sociedade,"33600000-6, Produtos farmacêuticos","Centro Hospitalar Barreiro Montijo, E. P. E. (509186998)",SMITH & NEPHEW (503552461),"14.937,60 €",08-05-2015,14-04-2015,365 dias,"Portugal, Setúbal, Barreiro","Artigo 24.º, n.º 1, alínea e) do Código dos Contratos Públicos","","",,"",,Não aplicável.,Não aplicável.,FALSE
FEXC0134/2015 - LACTULOSE 10 GR ( 0.6667 GR/ML CART 15 ML ) XAROPE,Ajuste Direto Regime Geral,Aquisição de bens móveis,"33600000-6, Produtos farmacêuticos","Centro Hospitalar Barreiro Montijo, E. P. E. (509186998)",FERRAZ LYNCE (500113270),"5.326,20 €",08-05-2015,29-04-2015,365 dias,"Portugal, Setúbal, Barreiro","Artigo 24.º, n.º 1, alínea e) do Código dos Contratos Públicos","","",,"",,Não aplicável.,Não aplicável.,FALSE
FEXC0094/2015 - ENTECAVIR 1 MG COMP REVEST.,Ajuste Direto Regime Geral,Aquisição de bens móveis,"33600000-6, Produtos farmacêuticos","Centro Hospitalar Barreiro Montijo, E. P. E. (509186998)",BRISTOL MYERS SQUIBB (500048193),"9.691,42 €",08-05-2015,23-02-2015,365 dias,"Portugal, Setúbal, Barreiro","Artigo 24.º, n.º 1, alínea e) do Código dos Contratos Públicos","","",,"",,Não aplicável.,Não aplicável.,FALSE
FEXC0096/2015 - CERTOLIZUMAB PEGOL 200 MG ( 200 MG/ML SER 1 ML ) SOL INJ,Ajuste Direto Regime Geral,Aquisição de bens móveis<br/>Locação de bens móveis,"33600000-6, Produtos farmacêuticos","Centro Hospitalar Barreiro Montijo, E. P. E. (509186998)",UCB PHARMA (500291322),"43.709,60 €",08-05-2015,04-03-2015,365 dias,"Portugal, Setúbal, Barreiro","Artigo 24.º, n.º 1, alínea e) do Código dos Contratos Públicos","","",,"",,Não aplicável.,Não aplicável.,FALSE
"FEXC0109/2015 - TOCILIZUMAB 162 MG ( 180 MG/ML CANETA PRÉ CHEIA 0,9 ML )",Ajuste Direto Regime Geral,Sociedade<br/>Aquisição de bens móveis,"33600000-6, Produtos farmacêuticos","Centro Hospitalar Barreiro Montijo, E. P. E. (509186998)",ROCHE FARMACEUTICA (500233810),"7.741,35 €",08-05-2015,17-03-2015,365 dias,"Portugal, Setúbal, Barreiro","Artigo 24.º, n.º 1, alínea e) do Código dos Contratos Públicos","","",,"",,Não aplicável.,Não aplicável.,FALSE
FEXC0028/2015 - MED. SISTEMA NERVOSO CENTRAL,Ajuste Direto Regime Geral,Sociedade<br/>Aquisição de bens móveis,"33600000-6, Produtos farmacêuticos","Centro Hospitalar Barreiro Montijo, E. P. E. (509186998)",LAB. PFIZER (500162166),"106,60 €",08-05-2015,19-03-2015,365 dias,"Portugal, Setúbal, Barreiro","Artigo 24.º, n.º 1, alínea e) do Código dos Contratos Públicos","","",,"",,Não aplicável.,Não aplicável.,FALSE
FEXC0028/2015 - MED. SISTEMA NERVOSO CENTRAL,Ajuste Direto Regime Geral,Sociedade<br/>Aquisição de bens móveis,"33600000-6, Produtos farmacêuticos","Centro Hospitalar Barreiro Montijo, E. P. E. (509186998)",ALLOGA (504507230),"1.592,50 €",08-05-2015,19-03-2015,365 dias,"Portugal, Setúbal, Barreiro","Artigo 24.º, n.º 1, alínea e) do Código dos Contratos Públicos","","",,"",,Não aplicável.,Não aplicável.,FALSE
FEXC0028/2015 - MED. SISTEMA NERVOSO CENTRAL,Ajuste Direto Regime Geral,Aquisição de bens móveis<br/>Sociedade,"33600000-6, Produtos farmacêuticos","Centro Hospitalar Barreiro Montijo, E. P. E. (509186998)",LAB. VITÓRIA (500162220),"5.043,64 €",08-05-2015,19-03-2015,365 dias,"Portugal, Setúbal, Barreiro","Artigo 24.º, n.º 1, alínea e) do Código dos Contratos Públicos","","",,"",,Não aplicável.,Não aplicável.,FALSE
FEXC0028/2015 - MED. SISTEMA NERVOSO CENTRAL,Ajuste Direto Regime Geral,Sociedade<br/>Aquisição de bens móveis,"33600000-6, Produtos farmacêuticos","Centro Hospitalar Barreiro Montijo, E. P. E. (509186998)",DESMA (980300649),"627,10 €",08-05-2015,19-03-2015,365 dias,"Portugal, Setúbal, Barreiro","Artigo 24.º, n.º 1, alínea e) do Código dos Contratos Públicos","","",,"",,Não aplicável.,Não aplicável.,FALSE
FEXC0028/2015 - MED. SISTEMA NERVOSO CENTRAL,Ajuste Direto Regime Geral,Sociedade<br/>Aquisição de bens móveis,"33600000-6, Produtos farmacêuticos","Centro Hospitalar Barreiro Montijo, E. P. E. (509186998)",B. BRAUN MEDICAL (501506543),"106,09 €",08-05-2015,19-03-2015,365 dias,"Portugal, Setúbal, Barreiro","Artigo 24.º, n.º 1, alínea e) do Código dos Contratos Públicos","","",,"",,Não aplicável.,Não aplicável.,FALSE
FEXC0028/2015 - MED. SISTEMA NERVOSO CENTRAL,Ajuste Direto Regime Geral,Aquisição de bens móveis<br/>Sociedade,"33600000-6, Produtos farmacêuticos","Centro Hospitalar Barreiro Montijo, E. P. E. (509186998)",JANSSEN CILAG (500189412),"6.960,30 €",08-05-2015,19-03-2015,365 dias,"Portugal, Setúbal, Barreiro","Artigo 24.º, n.º 1, alínea e) do Código dos Contratos Públicos","","",,"",,Não aplicável.,Não aplicável.,FALSE
FEXC0028/2015 - MED. SISTEMA NERVOSO CENTRAL,Ajuste Direto Regime Geral,Aquisição de bens móveis<br/>Sociedade,"33600000-6, Produtos farmacêuticos","Centro Hospitalar Barreiro Montijo, E. P. E. (509186998)",BAYER PORTUGAL (500043256),"5,04 €",08-05-2015,19-03-2015,365 dias,"Portugal, Setúbal, Barreiro","Artigo 24.º, n.º 1, alínea e) do Código dos Contratos Públicos","","",,"",,Não aplicável.,Não aplicável.,FALSE
FEXC0028/2015 - MED. SISTEMA NERVOSO CENTRAL,Ajuste Direto Regime Geral,Sociedade<br/>Aquisição de bens móveis,"33600000-6, Produtos farmacêuticos","Centro Hospitalar Barreiro Montijo, E. P. E. (509186998)",D.L.A - FARMACEUTICA (503894427),"114,40 €",08-05-2015,19-03-2015,365 dias,"Portugal, Setúbal, Barreiro","Artigo 24.º, n.º 1, alínea e) do Código dos Contratos Públicos","","",,"",,Não aplicável.,Não aplicável.,FALSE
FEXC0028/2015 - MED. SISTEMA NERVOSO CENTRAL,Ajuste Direto Regime Geral,Aquisição de bens móveis<br/>Sociedade,"33600000-6, Produtos farmacêuticos","Centro Hospitalar Barreiro Montijo, E. P. E. (509186998)",LABESFAL (501169580),"6.923,91 €",08-05-2015,19-03-2015,365 dias,"Portugal, Setúbal, Barreiro","Artigo 24.º, n.º 1, alínea e) do Código dos Contratos Públicos","","",,"",,Não aplicável.,Não aplicável.,FALSE
FEXC0028/2015 - MED. SISTEMA NERVOSO CENTRAL,Ajuste Direto Regime Geral,Aquisição de bens móveis<br/>Sociedade,"33600000-6, Produtos farmacêuticos","Centro Hospitalar Barreiro Montijo, E. P. E. (509186998)",MEDA PHARMA (500082090),"63,00 €",08-05-2015,19-03-2015,365 dias,"Portugal, Setúbal, Barreiro","Artigo 24.º, n.º 1, alínea e) do Código dos Contratos Públicos","","",,"",,Não aplicável.,Não aplicável.,FALSE
4EXC0030-2015 UPGRADE P TAC,Ajuste Direto Regime Geral,Aquisição de bens móveis,"33000000-0, Equipamento médico, medicamentos e produtos para cuidados pessoais","Centro Hospitalar Barreiro Montijo, E. P. E. (509186998)","SIEMENS, SA (500247480)","39.569,19 €",08-05-2015,23-04-2015,365 dias,"Portugal, Setúbal, Barreiro","Artigo 24.º, n.º 1, alínea e) do Código dos Contratos Públicos",08-05-2015,"39.569,19 €",,"",,Não aplicável.,Não aplicável.,FALSE
FEXC0034/2015 - MEDICAMENTOS USADOS EM AFECÇÕES OCULARES,Ajuste Direto Regime Geral,Aquisição de bens móveis,"33600000-6, Produtos farmacêuticos","Centro Hospitalar Barreiro Montijo, E. P. E. (509186998)",BAUCH & LOMB S.A (980218764),"3.745,00 €",07-05-2015,18-03-2015,365 dias,"Portugal, Setúbal, Barreiro","Artigo 24.º, n.º 1, alínea e) do Código dos Contratos Públicos","","",,"",,Não aplicável.,Não aplicável.,FALSE
FEXC0034/2015 - MEDICAMENTOS USADOS EM AFECÇÕES OCULARES,Ajuste Direto Regime Geral,Aquisição de bens móveis,"33600000-6, Produtos farmacêuticos","Centro Hospitalar Barreiro Montijo, E. P. E. (509186998)",ALCON PORTUGAL (501251685),"120,60 €",07-05-2015,18-03-2015,365 dias,"Portugal, Setúbal, Barreiro","Artigo 24.º, n.º 1, alínea e) do Código dos Contratos Públicos","","",,"",,Não aplicável.,Não aplicável.,FALSE
FEXC0034/2015 - MEDICAMENTOS USADOS EM AFECÇÕES OCULARES,Ajuste Direto Regime Geral,Aquisição de bens móveis,"33600000-6, Produtos farmacêuticos","Centro Hospitalar Barreiro Montijo, E. P. E. (509186998)",DÁVI II FARMACEUTICA (508309450),"1.190,00 €",07-05-2015,18-03-2015,365 dias,"Portugal, Setúbal, Barreiro","Artigo 24.º, n.º 1, alínea e) do Código dos Contratos Públicos","","",,"",,Não aplicável.,Não aplicável.,FALSE
FEXC0034/2015 - MEDICAMENTOS USADOS EM AFECÇÕES OCULARES,Ajuste Direto Regime Geral,Aquisição de bens móveis,"33600000-6, Produtos farmacêuticos","Centro Hospitalar Barreiro Montijo, E. P. E. (509186998)",THÉA (507978358),"877,10 €",07-05-2015,18-03-2015,365 dias,"Portugal, Setúbal, Barreiro","Artigo 24.º, n.º 1, alínea e) do Código dos Contratos Públicos","","",,"",,Não aplicável.,Não aplicável.,FALSE
FEXC0033/2015 - MED. APARELHO RESPIRATÓRIO,Ajuste Direto Regime Geral,Aquisição de bens móveis,"33600000-6, Produtos farmacêuticos","Centro Hospitalar Barreiro Montijo, E. P. E. (509186998)",ZAMBON (502155930),"7.014,00 €",07-05-2015,12-03-2015,365 dias,"Portugal, Setúbal, Barreiro","Artigo 24.º, n.º 1, alínea e) do Código dos Contratos Públicos","","",,"",,Não aplicável.,Não aplicável.,FALSE
FEXC0033/2015 - MED. APARELHO RESPIRATÓRIO,Ajuste Direto Regime Geral,Aquisição de bens móveis,"33600000-6, Produtos farmacêuticos","Centro Hospitalar Barreiro Montijo, E. P. E. (509186998)",FERRAZ LYNCE (500113270),"201,20 €",07-05-2015,12-03-2015,365 dias,"Portugal, Setúbal, Barreiro","Artigo 24.º, n.º 1, alínea e) do Código dos Contratos Públicos","","",,"",,Não aplicável.,Não aplicável.,FALSE
FEXC0032/2015 - MEDICAMENTOS USADOS EM AFECÇÕES CUTÂNEAS,Ajuste Direto Regime Geral,Aquisição de bens móveis,"33600000-6, Produtos farmacêuticos","Centro Hospitalar Barreiro Montijo, E. P. E. (509186998)","LOGIFARMA, LOGISTICA FARMACEUTICA (503934640)","217,50 €",07-05-2015,16-03-2015,365 dias,"Portugal, Setúbal, Barreiro","Artigo 24.º, n.º 1, alínea e) do Código dos Contratos Públicos","","",,"",,Não aplicável.,Não aplicável.,FALSE
FEXC0032/2015 - MEDICAMENTOS USADOS EM AFECÇÕES CUTÂNEAS,Ajuste Direto Regime Geral,Aquisição de bens móveis,"33600000-6, Produtos farmacêuticos","Centro Hospitalar Barreiro Montijo, E. P. E. (509186998)",C.S. PORTUGAL (503395960),"2.737,50 €",07-05-2015,16-03-2015,365 dias,"Portugal, Setúbal, Barreiro","Artigo 24.º, n.º 1, alínea e) do Código dos Contratos Públicos","","",,"",,Não aplicável.,Não aplicável.,FALSE
FEXC0032/2015 - MEDICAMENTOS USADOS EM AFECÇÕES CUTÂNEAS,Ajuste Direto Regime Geral,Aquisição de bens móveis,"33600000-6, Produtos farmacêuticos","Centro Hospitalar Barreiro Montijo, E. P. E. (509186998)",BAYER PORTUGAL (500043256),"700,80 €",07-05-2015,16-03-2015,365 dias,"Portugal, Setúbal, Barreiro","Artigo 24.º, n.º 1, alínea e) do Código dos Contratos Públicos","","",,"",,Não aplicável.,Não aplicável.,FALSE
FEXC0032/2015 - MEDICAMENTOS USADOS EM AFECÇÕES CUTÂNEAS,Ajuste Direto Regime Geral,Aquisição de bens móveis,"33600000-6, Produtos farmacêuticos","Centro Hospitalar Barreiro Montijo, E. P. E. (509186998)",PAUL HARTMANN (502271728),"348,00 €",07-05-2015,16-03-2015,365 dias,"Portugal, Setúbal, Barreiro","Artigo 24.º, n.º 1, alínea e) do Código dos Contratos Públicos","","",,"",,Não aplicável.,Não aplicável.,FALSE
FEXC0032/2015 - MEDICAMENTOS USADOS EM AFECÇÕES CUTÂNEAS,Ajuste Direto Regime Geral,Aquisição de bens móveis,"33600000-6, Produtos farmacêuticos","Centro Hospitalar Barreiro Montijo, E. P. E. (509186998)",LAB. VITÓRIA (500162220),"107,50 €",07-05-2015,16-03-2015,365 dias,"Portugal, Setúbal, Barreiro","Artigo 24.º, n.º 1, alínea e) do Código dos Contratos Públicos","","",,"",,Não aplicável.,Não aplicável.,FALSE
FEXC0032/2015 - MEDICAMENTOS USADOS EM AFECÇÕES CUTÂNEAS,Ajuste Direto Regime Geral,Aquisição de bens móveis,"33600000-6, Produtos farmacêuticos","Centro Hospitalar Barreiro Montijo, E. P. E. (509186998)",JOHNSON & JONSON MEDICAL (500153370),"2.342,40 €",07-05-2015,16-03-2015,365 dias,"Portugal, Setúbal, Barreiro","Artigo 24.º, n.º 1, alínea e) do Código dos Contratos Públicos","","",,"",,Não aplicável.,Não aplicável.,FALSE
FEXC0032/2015 - MEDICAMENTOS USADOS EM AFECÇÕES CUTÂNEAS,Ajuste Direto Regime Geral,Aquisição de bens móveis,"33600000-6, Produtos farmacêuticos","Centro Hospitalar Barreiro Montijo, E. P. E. (509186998)",J.M.V. PROD. HOSPITALARES (501887148),"293,70 €",07-05-2015,16-03-2015,365 dias,"Portugal, Setúbal, Barreiro","Artigo 24.º, n.º 1, alínea e) do Código dos Contratos Públicos","","",,"",,Não aplicável.,Não aplicável.,FALSE
FEXC0032/2015 - MEDICAMENTOS USADOS EM AFECÇÕES CUTÂNEAS,Ajuste Direto Regime Geral,Aquisição de bens móveis,"33600000-6, Produtos farmacêuticos","Centro Hospitalar Barreiro Montijo, E. P. E. (509186998)",NOVARTIS CONSUMER (500268215),"198,40 €",07-05-2015,16-03-2015,365 dias,"Portugal, Setúbal, Barreiro","Artigo 24.º, n.º 1, alínea e) do Código dos Contratos Públicos","","",,"",,Não aplicável.,Não aplicável.,FALSE
FEXC0032/2015 - MEDICAMENTOS USADOS EM AFECÇÕES CUTÂNEAS,Ajuste Direto Regime Geral,Aquisição de bens móveis,"33600000-6, Produtos farmacêuticos","Centro Hospitalar Barreiro Montijo, E. P. E. (509186998)",CONFAR (500070229),"898,00 €",07-05-2015,16-03-2015,365 dias,"Portugal, Setúbal, Barreiro","Artigo 24.º, n.º 1, alínea e) do Código dos Contratos Públicos","","",,"",,Não aplicável.,Não aplicável.,FALSE
FEXC0025/2015 - CORRECTIVOS DA VOLÉMIA E DAS ALTERAÇÕES ELECTROLITICAS,Ajuste Direto Regime Geral,Aquisição de bens móveis,"33600000-6, Produtos farmacêuticos","Centro Hospitalar Barreiro Montijo, E. P. E. (509186998)",LABESFAL (501169580),"6.315,00 €",07-05-2015,23-01-2015,365 dias,"Portugal, Setúbal, Barreiro","Artigo 24.º, n.º 1, alínea a) do Código dos Contratos Públicos","","",,"",,Não aplicável.,Não aplicável.,FALSE
FEXC0025/2015 - CORRECTIVOS DA VOLÉMIA E DAS ALTERAÇÕES ELECTROLITICAS,Ajuste Direto Regime Geral,Aquisição de bens móveis,"33600000-6, Produtos farmacêuticos","Centro Hospitalar Barreiro Montijo, E. P. E. (509186998)",B. BRAUN MEDICAL (501506543),"5.232,00 €",07-05-2015,23-01-2015,365 dias,"Portugal, Setúbal, Barreiro","Artigo 24.º, n.º 1, alínea a) do Código dos Contratos Públicos","","",,"",,Não aplicável.,Não aplicável.,FALSE
110001/2012 - Fornecimento de Gases Medicinais,Concurso público,Aquisição de bens móveis,"24100000-5, Gases","Centro Hospitalar Barreiro Montijo, E. P. E. (509186998)",LINDE (500266344),"269.332,80 €",07-05-2015,07-02-2012,365 dias,"Portugal, Setúbal, Barreiro","Artigo 20.º, n.º 1, alínea b) do Código dos Contratos Públicos",31-12-2012,"269.332,80 €",,"",,Não aplicável.,Não aplicável.,FALSE
CORRECTIVOS DE VOLEMIA E DAS ALTERAÇÕES ELECTROLITICAS,Ajuste Direto Regime Geral,Aquisição de bens móveis,"33600000-6, Produtos farmacêuticos","CHBM - Centro Hospital Barreiro Montijo, EPE (509186998)",JABA (500492867),"0,00 €",06-05-2015,03-02-2014,365 dias,"Portugal, Setúbal, Barreiro","Artigo 20.º, n.º 1, alínea a) do Código dos Contratos Públicos",31-12-2014,"",,"",,Não aplicável.,Não aplicável.,FALSE
CORRECTIVOS DE VOLEMIA E DAS ALTERAÇÕES ELECTROLITICAS,Ajuste Direto Regime Geral,Aquisição de bens móveis,"33600000-6, Produtos farmacêuticos","CHBM - Centro Hospital Barreiro Montijo, EPE (509186998)",B. BRAUN MEDICAL (501506543),"211,15 €",06-05-2015,03-02-2014,365 dias,"Portugal, Setúbal, Barreiro","Artigo 20.º, n.º 1, alínea a) do Código dos Contratos Públicos",31-12-2014,"211,15 €",,"",,Não aplicável.,Não aplicável.,FALSE
CORRECTIVOS DE VOLEMIA E DAS ALTERAÇÕES ELECTROLITICAS,Ajuste Direto Regime Geral,Aquisição de bens móveis,"33600000-6, Produtos farmacêuticos","CHBM - Centro Hospital Barreiro Montijo, EPE (509186998)",FRESENIUS KABI (504293753),"5.147,20 €",06-05-2015,15-04-2014,365 dias,"Portugal, Setúbal, Barreiro","Artigo 20.º, n.º 1, alínea a) do Código dos Contratos Públicos",31-12-2014,"5.147,20 €",,"",,Não aplicável.,Não aplicável.,FALSE
F40016/2014 - HORMONAS E MED. USADOS NO TRAT.DAS DOENÇAS ENDÓCRINAS,Ajuste Direto Regime Geral,Aquisição de bens móveis,"33600000-6, Produtos farmacêuticos","CHBM - Centro Hospital Barreiro Montijo, EPE (509186998)",NOVO NORDISK (501485210),"1.648,00 €",06-05-2015,07-02-2014,365 dias,"Portugal, Setúbal, Barreiro","Artigo 20.º, n.º 1, alínea a) do Código dos Contratos Públicos",31-12-2014,"1.648,00 €",,"",,Não aplicável.,Não aplicável.,FALSE
F40016/2014 - HORMONAS E MED. USADOS NO TRAT.DAS DOENÇAS ENDÓCRINAS,Ajuste Direto Regime Geral,Aquisição de bens móveis,"33600000-6, Produtos farmacêuticos","CHBM - Centro Hospital Barreiro Montijo, EPE (509186998)",HOSPIRA (502918098),"2.847,00 €",06-05-2015,07-02-2014,365 dias,"Portugal, Setúbal, Barreiro","Artigo 20.º, n.º 1, alínea a) do Código dos Contratos Públicos",31-12-2014,"2.847,00 €",,"",,Não aplicável.,Não aplicável.,FALSE
4CP0001/2014 - GASES MEDICINAIS ( NA SEQUENCIA DO C.P 1/10001/2011 ),Ajuste Direto Regime Geral,Aquisição de bens móveis,"33600000-6, Produtos farmacêuticos","Centro Hospitalar Barreiro Montijo, E. P. E. (509186998)",LINDE PORTUGAL (500266344),"242.181,93 €",06-05-2015,15-01-2014,365 dias,"Portugal, Setúbal, Barreiro","Artigo 26.º, n.º 1, alínea a) do Código dos Contratos Públicos",31-12-2014,"242.181,93 €",,"",,Não aplicável.,Não aplicável.,FALSE
FI0377/2014 - PROTOXIDO AZOTO GÁS LIQUIDO CILINDRO 43 LTS,Ao abrigo de acordo-quadro (art.º 259.º),Aquisição de bens móveis,"33600000-6, Produtos farmacêuticos","Centro Hospitalar Barreiro Montijo, E. P. E. (509186998)","LINDE PORTUGAL, LDA (500266344)","5.691,58 €",06-05-2015,15-04-2014,365 dias,"Portugal, Setúbal, Barreiro",Artigo 259.º do Código dos Contratos Públicos,31-12-2014,"5.691,58 €",,"",,1306526,ACORDO QUADRO PARA FORNECIMENTO DE GASES MEDICINAIS CONSIDERADOS DISPOSITIVOS MÉDICOS ÀS INSTITUIÇÕES E SERVIÇOS DO SERVIÇO NACIONAL DE SAÚDE,FALSE
FI0038/2014 - MED. MATERIAL DE PENSO DE EFEITO TERAPEUTICO,Ao abrigo de acordo-quadro (art.º 259.º),Aquisição de bens móveis,"33600000-6, Produtos farmacêuticos","Centro Hospitalar Barreiro Montijo, E. P. E. (509186998)",KVTECK PORTUGAL (508671531),"3.703,00 €",06-05-2015,02-04-2014,365 dias,"Portugal, Setúbal, Barreiro",Artigo 259.º do Código dos Contratos Públicos,31-12-2014,"3.703,00 €",,"",,490160,"CONCURSO PÚBLICO PARA A CELEBRAÇÃO DE CONTRATOS PÚBLICOS DE APROVISIONAMENTO PARA A ÁREA DA SAÚDE, COM VISTA AO FORNECIMENTO DE MATERIAL PENSO DE EFEITO TERAPÊUTICO - ÀS INSTITUIÇÕES E SERVIÇOS DO SERVIÇO NACIONAL DE SAÚDE",FALSE
4SEX0075/2015 - REP GASTROSCOPIO,Ajuste Direto Regime Geral,Aquisição de serviços,"50000000-5, Serviços de reparação e manutenção","Centro Hospitalar Barreiro Montijo, E. P. E. (509186998)",OLYMPUS IBERIA S.A.U. - SUCURSAL EM PORTUGAL (980474710),"6.939,13 €",05-05-2015,23-04-2015,90 dias,"Portugal, Setúbal, Barreiro","Artigo 24.º, n.º 1, alínea e) do Código dos Contratos Públicos",21-08-2015,"6.939,13 €",,"",,Não aplicável.,Não aplicável.,FALSE
"4SEX0013/2015 - CAT E MANUT AOS ECOGRAFOS TOSHIBA DO CHBM, EPE, P/ 2015",Ajuste Direto Regime Geral,Aquisição de serviços,"50000000-5, Serviços de reparação e manutenção","Centro Hospitalar Barreiro Montijo, E. P. E. (509186998)",TOSHIBA MEDICAL SYSTEMS S.A. (980023700),"17.475,00 €",05-05-2015,02-01-2015,365 dias,"Portugal, Setúbal, Barreiro","Artigo 24.º, n.º 1, alínea e) do Código dos Contratos Públicos",31-12-2015,"17.475,00 €",,"",,Não aplicável.,Não aplicável.,FALSE
"4SEX0012/2015 - CAT E MANUT AOS 3 GERADORES DA CENTRAL TERMICA DO CHBM, EPE, P/ 2015",Ajuste Direto Regime Geral,Aquisição de serviços,"50000000-5, Serviços de reparação e manutenção","Centro Hospitalar Barreiro Montijo, E. P. E. (509186998)","TERMETAL INDUSTRIAS TERMICAS E CONSTRUÇÕES METALICAS, LDA. (500626758)","11.851,47 €",05-05-2015,15-01-2015,365 dias,"Portugal, Setúbal, Barreiro","Artigo 24.º, n.º 1, alínea e) do Código dos Contratos Públicos",31-12-2015,"11.851,47 €",,"",,Não aplicável.,Não aplicável.,FALSE
"4SEX0011/2015 - CAT E MANUT AOS 5 ECOGRAFOS E 1 TAC NO CHBM, EPE, P/ ",Ajuste Direto Regime Geral,Aquisição de serviços,"50000000-5, Serviços de reparação e manutenção","Centro Hospitalar Barreiro Montijo, E. P. E. (509186998)","SIEMENS, S.A. (500247480)","41.017,95 €",05-05-2015,02-01-2015,365 dias,"Portugal, Setúbal, Barreiro","Artigo 24.º, n.º 1, alínea e) do Código dos Contratos Públicos",31-12-2015,"41.017,95 €",,"",,Não aplicável.,Não aplicável.,FALSE
"4SEX0009/2015 - CAT E MANUT AOS EQUIPAMENTOS DE IMAGIOLOGIA PHILIPS, P/ 2015",Ajuste Direto Regime Geral,Aquisição de serviços,"50000000-5, Serviços de reparação e manutenção","Centro Hospitalar Barreiro Montijo, E. P. E. (509186998)","PHILIPS PORTUGUESA, S.A. (500216843)","9.897,72 €",05-05-2015,01-01-2015,365 dias,"Portugal, Setúbal, Barreiro","Artigo 24.º, n.º 1, alínea e) do Código dos Contratos Públicos",31-12-2015,"9.751,48 €",,RETIROU-SE 1 DOS EQUIPAMENTOS DO CONTRATO POIS O MESMO AVARIOU E FOI PARA ABATE POIS NÃO JUSTIFICAVA A REPARAÇÃO,,Não aplicável.,Não aplicável.,FALSE
"4SEX0008/2015 - CAT E MANUT AOS 6 ELEVADORES DO CHBM, EPE P/ 2015",Ajuste Direto Regime Geral,Aquisição de serviços,"50000000-5, Serviços de reparação e manutenção","Centro Hospitalar Barreiro Montijo, E. P. E. (509186998)","OTIS ELEVADORES, LDA (500069824)","14.325,12 €",05-05-2015,02-01-2015,365 dias,"Portugal, Setúbal, Barreiro","Artigo 24.º, n.º 1, alínea e) do Código dos Contratos Públicos",31-12-2015,"14.325,12 €",,"",,Não aplicável.,Não aplicável.,FALSE
4SEX0007/2015 - CAT E MANUT ÀS MÁQUINAS DE LAVAR ENDOSCÓPIOS DA UROLOGIA E DAS TÉCNICAS DE GASTRO P/ 2015,Ajuste Direto Regime Geral,Aquisição de serviços,"50000000-5, Serviços de reparação e manutenção","Centro Hospitalar Barreiro Montijo, E. P. E. (509186998)","OLYMPUS IBERIA, S.A.U. - SUCURSAL EM PORTUGAL (980474710)","10.800,13 €",05-05-2015,02-01-2015,365 dias,"Portugal, Setúbal, Barreiro","Artigo 24.º, n.º 1, alínea e) do Código dos Contratos Públicos",31-12-2015,"10.800,13 €",,"",,Não aplicável.,Não aplicável.,FALSE
"4SEX0017/2015 - CAT E MANUT AOS EQUIPAMENTOS DE VENTILAÇÃO DA UCI DO CHBM, EPE P/ 2015",Ajuste Direto Regime Geral,Aquisição de serviços,"50000000-5, Serviços de reparação e manutenção","Centro Hospitalar Barreiro Montijo, E. P. E. (509186998)","MAQUET PORTUGAL COMERCIO DE EQUIPAMENTOS HOSPITALARES UNIPESSOAL, LDA (506819698)","11.724,00 €",05-05-2015,19-02-2015,365 dias,"Portugal, Setúbal, Barreiro","Artigo 24.º, n.º 1, alínea e) do Código dos Contratos Públicos",31-12-2015,"11.724,00 €",,"",,Não aplicável.,Não aplicável.,FALSE
"4SEX0006/2015 - CAT E MANUT AOS SERVIDORES BLADE, STORAGE, SAN E EVA DO DATA CENTER DO CHBM P/ 2015",Ajuste Direto Regime Geral,Aquisição de serviços,"50000000-5, Serviços de reparação e manutenção","Centro Hospitalar Barreiro Montijo, E. P. E. (509186998)","HEWLETT PACKARD PORTUGAL, LDA. (501570691)","17.582,84 €",05-05-2015,02-01-2015,365 dias,"Portugal, Setúbal, Barreiro","Artigo 24.º, n.º 1, alínea e) do Código dos Contratos Públicos",31-12-2015,"17.582,84 €",,"",,Não aplicável.,Não aplicável.,FALSE
"4SEX0048/2015 - CAT E MANUT P/ EQUIPAMENTOS: MONITORES, APARELHOS DE ANESTESIA E VENTILADORES DO BLOCO OPERATÓRIO, BLOCO DE PARTOS, IMAGIOLOGIA E UNIDADE DE CIRURGIA DO AMBULATÓRIO P/ 2015",Ajuste Direto Regime Geral,Aquisição de serviços,"50000000-5, Serviços de reparação e manutenção","Centro Hospitalar Barreiro Montijo, E. P. E. (509186998)","GENERAL ELECTRIC PORTUGUESA, SA (500357129)","26.040,07 €",05-05-2015,12-02-2015,365 dias,"Portugal, Setúbal, Barreiro","Artigo 24.º, n.º 1, alínea e) do Código dos Contratos Públicos",31-12-2015,"24.461,25 €",,RETIROU-SE 1 DOS EQUIPAMENTOS DO CONTRATO POIS AVARIOU E NÃO JUSTIFICAVA A REPARAÇÃO TENDO IDO PARA ABATE,,Não aplicável.,Não aplicável.,FALSE
"4SEX0016/2015 - CAT E MANUT P/ EQUIPAMENTO DE MAMOGRAFIA, TAC, RX E ECOGRAFIA P/ 2015",Ajuste Direto Regime Geral,Aquisição de serviços,"50000000-5, Serviços de reparação e manutenção","Centro Hospitalar Barreiro Montijo, E. P. E. (509186998)","GENERAL ELECTRIC PORTUGUESA, SA (500357129)","50.112,99 €",05-05-2015,12-02-2015,365 dias,"Portugal, Setúbal, Barreiro","Artigo 24.º, n.º 1, alínea e) do Código dos Contratos Públicos",31-12-2015,"50.112,99 €",,"",,Não aplicável.,Não aplicável.,FALSE
