Objeto do Contrato,Tipo de Procedimento,Tipo(s) de Contrato,CPVs,Entidade(s) Adjudicante(s),Entidade(s) Adjudicatária(s),Preço Contratual,Data de Publicação,Data de Celebração do Contrato,Prazo de Execução,Local de Execução,Fundamentação,Data de Fecho do Contrato,Preço Total Efetivo,Causas das Alterações ao Prazo,Causas das Alterações ao Preço,Estado,N.º registo do Acordo Quadro,Descrição do Acordo Quadro,Procedimento Centralizado
Fornecimento de eletricidade conf. acordo quadro c/base contrato 3/2014,Ajuste Direto Regime Geral,Aquisição de bens móveis,"09310000-5, Electricidade",Hospital Dr. Francisco Zagalo (501510150),"EDP COMERCIAL-Comercialização de Energia, S.A. (503504564)","6.842,37 €",18-03-2015,03-03-2015,30 dias,"Portugal, Aveiro, Ovar","Artigo 20.º, n.º 1, alínea a) do Código dos Contratos Públicos",03-03-2015,"6.842,37 €",,"",,Não aplicável.,Não aplicável.,FALSE
Contrato de manutenção,Ajuste Direto Regime Geral,Aquisição de serviços,"50000000-5, Serviços de reparação e manutenção",Hospital Dr. Francisco Zagalo (501510150),"Vigie Solutions, Lda. (509041108)","784,90 €",13-03-2015,26-02-2015,365 dias,"Portugal, Aveiro, Ovar","Artigo 20.º, n.º 1, alínea a) do Código dos Contratos Públicos",13-03-2015,"784,90 €",,"",,Não aplicável.,Não aplicável.,FALSE
Serviços de transportes a doentes em ambulancia,Ajuste Direto Regime Geral,Aquisição de serviços,"60100000-9, Serviços de transporte rodoviário",Hospital Dr. Francisco Zagalo (501510150),Bombeiros Voluntarios de Ovar (501287566),"23.130,60 €",11-03-2015,23-02-2015,360 dias,"Portugal, Aveiro, Ovar","Artigo 20.º, n.º 1, alínea a) do Código dos Contratos Públicos",31-12-2015,"23.855,96 €",,Serviço acima do previsto,,Não aplicável.,Não aplicável.,FALSE
