freguesia,acronym,validVotesPercentage,votes,dicofre
União das freguesias de Campelos e Outeiro da Cabeça,PS,34.29,310,111322
União das freguesias de Campelos e Outeiro da Cabeça,PPD/PSD,32.08,290,111322
União das freguesias de Campelos e Outeiro da Cabeça,B.E.,7.19,65,111322
União das freguesias de Campelos e Outeiro da Cabeça,CDS-PP,6.97,63,111322
União das freguesias de Campelos e Outeiro da Cabeça,PCP-PEV,4.42,40,111322
União das freguesias de Campelos e Outeiro da Cabeça,PAN,3.98,36,111322
União das freguesias de Campelos e Outeiro da Cabeça,PPM.PPV/CDC,3.98,36,111322
União das freguesias de Campelos e Outeiro da Cabeça,A,2.21,20,111322
União das freguesias de Campelos e Outeiro da Cabeça,IL,0.77,7,111322
União das freguesias de Campelos e Outeiro da Cabeça,L,0.77,7,111322
União das freguesias de Campelos e Outeiro da Cabeça,PCTP/MRPP,0.66,6,111322
União das freguesias de Campelos e Outeiro da Cabeça,NC,0.55,5,111322
União das freguesias de Campelos e Outeiro da Cabeça,PDR,0.55,5,111322
União das freguesias de Campelos e Outeiro da Cabeça,PURP,0.55,5,111322
União das freguesias de Campelos e Outeiro da Cabeça,PNR,0.44,4,111322
União das freguesias de Campelos e Outeiro da Cabeça,PTP,0.33,3,111322
União das freguesias de Campelos e Outeiro da Cabeça,MAS,0.22,2,111322
