Objeto do Contrato,Tipo de Procedimento,Tipo(s) de Contrato,CPVs,Entidade(s) Adjudicante(s),Entidade(s) Adjudicatária(s),Preço Contratual,Data de Publicação,Data de Celebração do Contrato,Prazo de Execução,Local de Execução,Fundamentação,Data de Fecho do Contrato,Preço Total Efetivo,Causas das Alterações ao Prazo,Causas das Alterações ao Preço,Estado,N.º registo do Acordo Quadro,Descrição do Acordo Quadro,Procedimento Centralizado
PAMIDRONATO SÓDICO 9 MG/ML SOL INJ FR 10 ML IV - Ajuste Directo Nº 11049916,Ao abrigo de acordo-quadro (art.º 259.º),Aquisição de bens móveis,"33600000-6, Produtos farmacêuticos","Hospital Garcia de Orta, E. P. E. (506361470)","HOSPIRA PORTUGAL, LDA. (502918098)","282,60 €",04-10-2017,10-02-2016,90 dias,"Portugal, Setúbal, Almada",Artigo 259.º do Código dos Contratos Públicos,,,,,,1410779,CP 2015/47 - Acordo quadro para fornecimento de medicamentos do aparelho locomotor às instituições e serviços do serviço nacional de saúde,FALSE
"TESOURA CURVA 5MM DE DIAMETRO, 23 CM DE COMPRIMENTO DA HASTE - Ajuste Directo Nº 2446877",Ajuste Direto Regime Geral,Aquisição de bens móveis,"33140000-3, Material médico de consumo","Hospital Garcia de Orta, E. P. E. (506361470)",JOHNSON & JOHNSON (500153370),"5.100,00 €",04-10-2017,29-09-2017,365 dias,"Portugal, Setúbal, Almada",Artigo 258.º do Código dos Contratos Públicos,,,,,,Não aplicável.,Não aplicável.,FALSE
DEXAMETASONA 700 ΜG IMPL INTRAVÍTREO APLIC INTRAVÍTREO - Ajuste Directo Nº 14049416,Ao abrigo de acordo-quadro (art.º 259.º),Aquisição de bens móveis,"33600000-6, Produtos farmacêuticos","Hospital Garcia de Orta, E. P. E. (506361470)","PROFARIN, LDA. (500223238)","1.824,00 €",04-10-2017,10-02-2016,90 dias,"Portugal, Setúbal, Almada",Artigo 259.º do Código dos Contratos Públicos,,,,,,1377420,Acordo quadro para fornecimento de medicamentos usados nas afecções oculares e otorrinolaringologias às instituições e serviços do serviço nacional de saúde,FALSE
LETROZOL 2.5 MG COMP - Ajuste Directo Nº 11049116,Ajuste Direto Regime Geral,Aquisição de bens móveis,"33600000-6, Produtos farmacêuticos","Hospital Garcia de Orta, E. P. E. (506361470)","ACCORD HEALTHCARE, UNIPESSOAL LDA. (508622263)","0,00 €",04-10-2017,10-02-2016,180 dias,"Portugal, Setúbal, Almada",Artigo 258.º do Código dos Contratos Públicos,,,,,,2941358,LETROZOL 2.5 MG COMP,FALSE
LETROZOL 2.5 MG COMP - Ajuste Directo Nº 11049116,Ajuste Direto Regime Geral,Aquisição de bens móveis,"33600000-6, Produtos farmacêuticos","Hospital Garcia de Orta, E. P. E. (506361470)","DLA FARMACÊUTICA, LDA. (503894427)","0,00 €",04-10-2017,10-02-2016,180 dias,"Portugal, Setúbal, Almada",Artigo 258.º do Código dos Contratos Públicos,,,,,,2941358,LETROZOL 2.5 MG COMP,FALSE
CLARITROMICINA 250 MG COMP - Ajuste Directo Nº 11049016,Ao abrigo de acordo-quadro (art.º 259.º),Aquisição de bens móveis,"33600000-6, Produtos farmacêuticos","Hospital Garcia de Orta, E. P. E. (506361470)","SANOFI - PRODUTOS FARMACÊUTICOS, LDA. (500134960)","1.100,00 €",04-10-2017,05-02-2016,180 dias,"Portugal, Setúbal, Almada",Artigo 259.º do Código dos Contratos Públicos,,,,,,1326195,ACORDO QUADRO PARA FORNECIMENTO DE MEDICAMENTOS ANTI-INFECIOSOS: EXCETO ANTIVÍRICOS E ANTIFÚNGICOS ÀS INSTITUIÇÕES E SERVIÇOS DO SERVIÇO NACIONAL DE SAÚDE,FALSE
"CLORETO DE SÓDIO 4.5 MG/ML (0,45% HIPOT) SOL INJ FR 500 ML IV - Ajuste Directo Nº 11048516",Ao abrigo de acordo-quadro (art.º 259.º),Aquisição de bens móveis,"33600000-6, Produtos farmacêuticos","Hospital Garcia de Orta, E. P. E. (506361470)","B. BRAUN MEDICAL, LDA. (501506543)","679,10 €",03-10-2017,08-02-2016,90 dias,"Portugal, Setúbal, Almada",Artigo 259.º do Código dos Contratos Públicos,,,,,,1331181,Acordo Quadro para fornecimento de corretivos da volémia e outras soluções estéreis às Instituições e Serviços do Serviço Nacional de Saúde,FALSE
"CLORETO DE SÓDIO 4.5 MG/ML (0,45% HIPOT) SOL INJ FR 500 ML IV - Ajuste Directo Nº 11048516",Ao abrigo de acordo-quadro (art.º 259.º),Aquisição de bens móveis,"33600000-6, Produtos farmacêuticos","Hospital Garcia de Orta, E. P. E. (506361470)","LABESFAL, S.A. (501169580)","663,96 €",03-10-2017,08-02-2016,90 dias,"Portugal, Setúbal, Almada",Artigo 259.º do Código dos Contratos Públicos,,,,,,1331181,Acordo Quadro para fornecimento de corretivos da volémia e outras soluções estéreis às Instituições e Serviços do Serviço Nacional de Saúde,FALSE
ACICLOVIR 250 MG PÓ SOL INJ FR IV - Ajuste Directo Nº 11048486,Ao abrigo de acordo-quadro (art.º 259.º),Aquisição de bens móveis,"33600000-6, Produtos farmacêuticos","Hospital Garcia de Orta, E. P. E. (506361470)",HIKMA FARMACEUTICA (PORTUGAL) S.A. (502266791),"1.140,00 €",03-10-2017,08-02-2016,180 dias,"Portugal, Setúbal, Almada",Artigo 259.º do Código dos Contratos Públicos,,,,,,1422736,CP 2015/41 - ACORDO QUADRO PARA FORNECIMENTO DE MEDICAMENTOS ANTI-INFECIOSOS: ANTIVÍRICOS E ANTIFÚNGICOS ÀS INSTITUIÇÕES E SERVIÇOS DO SERVIÇO NACIONAL DE SAÚDE,FALSE
HIDROXIETILAMIDO 60 MG/ML + CLORETO DE SÓDIO 9 MG/ML SOL INJ FR 500 ML IV - Ajuste Directo Nº 11048216,Ao abrigo de acordo-quadro (art.º 259.º),Aquisição de bens móveis,"33600000-6, Produtos farmacêuticos","Hospital Garcia de Orta, E. P. E. (506361470)",FRESENIUS KABI PHARMA PORTUGAL (504293753),"2.947,20 €",03-10-2017,04-02-2016,365 dias,"Portugal, Setúbal, Almada",Artigo 259.º do Código dos Contratos Públicos,,,,,,1331181,Acordo Quadro para fornecimento de corretivos da volémia e outras soluções estéreis às Instituições e Serviços do Serviço Nacional de Saúde,FALSE
POLIELECTROLITICO + GLUCOSE 50 MG/ML SOL INJ FR 500 ML IV - Ajuste Directo Nº 11048116,Ao abrigo de acordo-quadro (art.º 259.º),Aquisição de bens móveis,"33600000-6, Produtos farmacêuticos","Hospital Garcia de Orta, E. P. E. (506361470)","LABESFAL, S.A. (501169580)","3.000,48 €",03-10-2017,08-02-2016,90 dias,"Portugal, Setúbal, Almada",Artigo 259.º do Código dos Contratos Públicos,,,,,,1331181,Acordo Quadro para fornecimento de corretivos da volémia e outras soluções estéreis às Instituições e Serviços do Serviço Nacional de Saúde,FALSE
BICALUTAMIDA 150 MG COMP - Ajuste Directo Nº 11047816,Ajuste Direto Regime Geral,Aquisição de bens móveis,"33000000-0, Equipamento médico, medicamentos e produtos para cuidados pessoais","Hospital Garcia de Orta, E. P. E. (506361470)","TEVA PHARMA, PROD. FARMAC., LDA. (507045491)","0,00 €",03-10-2017,11-02-2016,90 dias,"Portugal, Setúbal, Almada",Artigo 258.º do Código dos Contratos Públicos,,,,,,2939946,BICALUTAMIDA 150 MG COMP,FALSE
CLOROHEXIDINA 2% CORADA FRASCO 500 ML - Ajuste Directo Nº 11047716,Ao abrigo de acordo-quadro (art.º 259.º),Aquisição de bens móveis,"33600000-6, Produtos farmacêuticos","Hospital Garcia de Orta, E. P. E. (506361470)","B. BRAUN MEDICAL, LDA. (501506543)","426,00 €",03-10-2017,05-02-2016,90 dias,"Portugal, Setúbal, Almada",Artigo 259.º do Código dos Contratos Públicos,,,,,,1406003,CP 2015/8,FALSE
BICALUTAMIDA 50 MG COMP - Ajuste Directo Nº 11047516,Ajuste Direto Regime Geral,Aquisição de bens móveis,"33600000-6, Produtos farmacêuticos","Hospital Garcia de Orta, E. P. E. (506361470)","ACCORD HEALTHCARE, UNIPESSOAL LDA. (508622263)","0,00 €",03-10-2017,11-02-2016,180 dias,"Portugal, Setúbal, Almada",Artigo 258.º do Código dos Contratos Públicos,,,,,,2939507,BICALUTAMIDA 50 MG COMP,FALSE
ONDANSETROM (CLORIDRATO) 8 MG COMP - Ajuste Directo Nº 11046916,Ajuste Direto Regime Geral,Aquisição de bens móveis,"33600000-6, Produtos farmacêuticos","Hospital Garcia de Orta, E. P. E. (506361470)","LABESFAL, S.A. (501169580)","0,00 €",03-10-2017,10-02-2016,90 dias,"Portugal, Setúbal, Almada",Artigo 258.º do Código dos Contratos Públicos,,,,,,2939193,ONDANSETROM (CLORIDRATO) 8 MG COMP,FALSE
FLUCONAZOL 2 MG/ML SOL INJ FR 50 ML IV - Ajuste Directo Nº 14046816,Ao abrigo de acordo-quadro (art.º 259.º),Aquisição de bens móveis,"33600000-6, Produtos farmacêuticos","Hospital Garcia de Orta, E. P. E. (506361470)",FRESENIUS KABI PHARMA PORTUGAL (504293753),"468,00 €",03-10-2017,10-02-2016,90 dias,"Portugal, Setúbal, Almada",Artigo 259.º do Código dos Contratos Públicos,,,,,,1422736,CP 2015/41 - ACORDO QUADRO PARA FORNECIMENTO DE MEDICAMENTOS ANTI-INFECIOSOS: ANTIVÍRICOS E ANTIFÚNGICOS ÀS INSTITUIÇÕES E SERVIÇOS DO SERVIÇO NACIONAL DE SAÚDE,FALSE
ESOMEPRAZOL 20 MG COMP - Ajuste Directo Nº 11046516,Ao abrigo de acordo-quadro (art.º 259.º),Aquisição de bens móveis,"33600000-6, Produtos farmacêuticos","Hospital Garcia de Orta, E. P. E. (506361470)","SANOFI - PRODUTOS FARMACÊUTICOS, LDA. (500134960)","2.392,32 €",03-10-2017,08-02-2016,90 dias,"Portugal, Setúbal, Almada",Artigo 259.º do Código dos Contratos Públicos,,,,,,1194708,"CONCURSO PÚBLICO PARA A CELEBRAÇÃO DE CONTRATOS PÚBLICOS DE APROVISIONAMENTO PARA A ÁREA DA SAÚDE, MEDICAMENTOS DO APARELHO DIGESTIVO, ÀS INSTITUIÇÕES E SERVIÇOS DO SERVIÇO NACIONAL DE SAÚDE",FALSE
ESOMEPRAZOL 40 MG PÓ SOL INJ FR IV - Ajuste Directo Nº 11046416,Ao abrigo de acordo-quadro (art.º 259.º),Aquisição de bens móveis,"33600000-6, Produtos farmacêuticos","Hospital Garcia de Orta, E. P. E. (506361470)","DLA FARMACÊUTICA, LDA. (503894427)","4.560,00 €",03-10-2017,05-02-2016,90 dias,"Portugal, Setúbal, Almada",Artigo 259.º do Código dos Contratos Públicos,,,,,,1194708,"CONCURSO PÚBLICO PARA A CELEBRAÇÃO DE CONTRATOS PÚBLICOS DE APROVISIONAMENTO PARA A ÁREA DA SAÚDE, MEDICAMENTOS DO APARELHO DIGESTIVO, ÀS INSTITUIÇÕES E SERVIÇOS DO SERVIÇO NACIONAL DE SAÚDE",FALSE
INSULINA HUMANA ISOFÂNICA 100 U.I./ML ACÇÃO INTERM SUSP INJ FR 10 ML SC - Ajuste Directo Nº 11046216,Ao abrigo de acordo-quadro (art.º 259.º),Aquisição de bens móveis,"33600000-6, Produtos farmacêuticos","Hospital Garcia de Orta, E. P. E. (506361470)",NOVO NORDISK (501485210),"1.240,50 €",02-10-2017,03-02-2016,120 dias,"Portugal, Setúbal, Almada",Artigo 259.º do Código dos Contratos Públicos,,,,,,1415640,CP 2015/7 - ACORDO QUADRO PARA FORNECIMENTO DE HORMONAS E OUTROS MEDICAMENTOS USADOS NO TRATAMENTO DAS DOENÇAS ENDÓCRINAS ÀS INSTITUIÇÕES E SERVIÇOS DO SERVIÇO NACIONAL DE SAÚDE,FALSE
BACLOFENO 10 MG/5 ML SOL INJ FR 5 ML IT - Ajuste Directo Nº 11046016,Ao abrigo de acordo-quadro (art.º 259.º),Aquisição de bens móveis,"33600000-6, Produtos farmacêuticos","Hospital Garcia de Orta, E. P. E. (506361470)","NOVARTIS FARMA, S.A. (500063524)","995,50 €",02-10-2017,03-02-2016,365 dias,"Portugal, Setúbal, Almada",Artigo 259.º do Código dos Contratos Públicos,,,,,,2211341,Medicamentos anestésicos e relaxantes musculares,FALSE
ACIDO ZOLEDRÓNICO 4 MG PÓ SOL INJ FR IV - Ajuste Directo Nº 11045716,Ao abrigo de acordo-quadro (art.º 259.º),Aquisição de bens móveis,"33600000-6, Produtos farmacêuticos","Hospital Garcia de Orta, E. P. E. (506361470)","OVERPHARMA, PROD. MED. FARMAC., LDA. (505792362)","324,00 €",02-10-2017,05-02-2016,180 dias,"Portugal, Setúbal, Almada",Artigo 259.º do Código dos Contratos Públicos,,,,,,1394106,CP 2015/64 - Medicamentos Diversos,FALSE
ACIDO ZOLEDRÓNICO 4 MG PÓ SOL INJ FR IV - Ajuste Directo Nº 11045716,Ao abrigo de acordo-quadro (art.º 259.º),Aquisição de bens móveis,"33600000-6, Produtos farmacêuticos","Hospital Garcia de Orta, E. P. E. (506361470)","GENERIS FARMACEUTICA, S.A. (505625520)","340,00 €",02-10-2017,05-02-2016,365 dias,"Portugal, Setúbal, Almada",Artigo 259.º do Código dos Contratos Públicos,,,,,,1394106,CP 2015/64 - Medicamentos Diversos,FALSE
ACIDO ZOLEDRÓNICO 4 MG PÓ SOL INJ FR IV - Ajuste Directo Nº 11045716,Ao abrigo de acordo-quadro (art.º 259.º),Aquisição de bens móveis,"33600000-6, Produtos farmacêuticos","Hospital Garcia de Orta, E. P. E. (506361470)",HIKMA FARMACEUTICA (PORTUGAL) S.A. (502266791),"330,00 €",02-10-2017,05-02-2016,180 dias,"Portugal, Setúbal, Almada",Artigo 259.º do Código dos Contratos Públicos,,,,,,1394106,CP 2015/64 - Medicamentos Diversos,FALSE
TREPROSTINIL SODICO 1 MG/ML AMP 20 ML - Ajuste Directo Nº 11044216,Ao abrigo de acordo-quadro (art.º 259.º),Aquisição de bens móveis,"33600000-6, Produtos farmacêuticos","Hospital Garcia de Orta, E. P. E. (506361470)","FERRER PORTUGAL, S.A. (500069190)","2.577,87 €",02-10-2017,02-02-2016,90 dias,"Portugal, Setúbal, Almada",Artigo 259.º do Código dos Contratos Públicos,,,,,,1210107,"CONCURSO PÚBLICO PARA A CELEBRAÇÃO DE CONTRATOS PÚBLICOS DE APROVISIONAMENTO PARA A ÁREA DA SAÚDE, COM VISTA AO FORNECIMENTO DE MEDICAMENTOS DO GRUPO 4: SANGUE, ÀS INSTITUIÇÕES E SERVIÇOS DO SERVIÇO NACIONAL DE SAÚDE",FALSE
IODOPOVIDONA 10% SPRAY - Ajuste Directo Nº 11045516,Ao abrigo de acordo-quadro (art.º 259.º),Aquisição de bens móveis,"33600000-6, Produtos farmacêuticos","Hospital Garcia de Orta, E. P. E. (506361470)","B. BRAUN MEDICAL, LDA. (501506543)","624,00 €",02-10-2017,03-02-2016,120 dias,"Portugal, Setúbal, Almada",Artigo 259.º do Código dos Contratos Públicos,,,,,,1406003,CP 2015/8,FALSE
SUPLEMENTO VITAMINICO HIDROSSOLUVEL  INJ  AMP - Ajuste Directo Nº 11045016,Ao abrigo de acordo-quadro (art.º 259.º),Aquisição de bens móveis,"33600000-6, Produtos farmacêuticos","Hospital Garcia de Orta, E.P.E. (506361470)",FRESENIUS KABI (504293753),"1.034,80 €",02-10-2017,03-02-2016,365 dias,"Portugal, Setúbal, Almada",Artigo 259.º do Código dos Contratos Públicos,,,,,,1377429,Acordo Quadro para fornecimento de medicamentos para Nutrição Parentérica às Instituições e Serviços do Serviço Nacional de Saúde,FALSE
GLUCOSE 200 MG/ML SOL INJ FR 20 ML IV - Ajuste Directo Nº 11044816,Ao abrigo de acordo-quadro (art.º 259.º),Aquisição de bens móveis,"33600000-6, Produtos farmacêuticos","Hospital Garcia de Orta, E.P.E. (506361470)","B. BRAUN MEDICAL, LDA. (501506543)","276,80 €",02-10-2017,03-02-2016,365 dias,"Portugal, Setúbal, Almada",Artigo 259.º do Código dos Contratos Públicos,,,,,,1331181,Acordo Quadro para fornecimento de corretivos da volémia e outras soluções estéreis às Instituições e Serviços do Serviço Nacional de Saúde,FALSE
TIAPRIDA 100 MG/2 ML SOL INJ FR 2 ML IM IV - Ajuste Directo Nº 11044716,Ao abrigo de acordo-quadro (art.º 259.º),Aquisição de bens móveis,"33600000-6, Produtos farmacêuticos","Hospital Garcia de Orta, E. P. E. (506361470)","SANOFI - PRODUTOS FARMACÊUTICOS, LDA. (500134960)","1.248,00 €",02-10-2017,03-02-2016,365 dias,"Portugal, Setúbal, Almada",Artigo 259.º do Código dos Contratos Públicos,,,,,,1153380,"CONCURSO PÚBLICO PARA A CELEBRAÇÃO DE CONTRATOS PÚBLICOS DE APROVISIONAMENTO PARA A ÁREA DA SAÚDE, COM VISTA AO FORNECIMENTO DE MEDICAMENTOS ANTIPSICÓTICOS, ÀS INSTITUIÇÕES E SERVIÇOS DO SERVIÇO NACIONAL DE SAÚDE",FALSE
CLORETO DE SÓDIO 0.9%  100 ML C/CÂNULA - Ajuste Directo Nº 11044616,Ao abrigo de acordo-quadro (art.º 259.º),Aquisição de bens móveis,"33600000-6, Produtos farmacêuticos","Hospital Garcia de Orta, E. P. E. (506361470)","B. BRAUN MEDICAL, LDA. (501506543)","1.584,00 €",02-10-2017,05-02-2016,120 dias,"Portugal, Setúbal, Almada",Artigo 259.º do Código dos Contratos Públicos,,,,,,1331181,Acordo Quadro para fornecimento de corretivos da volémia e outras soluções estéreis às Instituições e Serviços do Serviço Nacional de Saúde,FALSE
CLORETO DE SÓDIO 0.9%  100 ML C/CÂNULA - Ajuste Directo Nº 11044616,Ao abrigo de acordo-quadro (art.º 259.º),Aquisição de bens móveis,"33600000-6, Produtos farmacêuticos","Hospital Garcia de Orta, E. P. E. (506361470)","LABESFAL, S.A. (501169580)","2.466,00 €",02-10-2017,05-02-2016,90 dias,"Portugal, Setúbal, Almada",Artigo 259.º do Código dos Contratos Públicos,,,,,,1331181,Acordo Quadro para fornecimento de corretivos da volémia e outras soluções estéreis às Instituições e Serviços do Serviço Nacional de Saúde,FALSE
TOPOTECANO 4 +MG PÓ SOL INJ FR IV - Ajuste Directo Nº 1104416,Ajuste Direto Regime Geral,Aquisição de bens móveis,"33600000-6, Produtos farmacêuticos","Hospital Garcia de Orta, E. P. E. (506361470)","ACCORD HEALTHCARE, UNIPESSOAL LDA. (508622263)","0,00 €",02-10-2017,03-02-2016,90 dias,"Portugal, Setúbal, Almada",Artigo 258.º do Código dos Contratos Públicos,,,,,,2937234,TOPOTECANO 4 MG PÓ SOL INJ FR IV,FALSE
