freguesia,acronym,validVotesPercentage,votes,dicofre
Calvaria de Cima,PPD/PSD.CDS-PP,35.92,204,101605
Calvaria de Cima,PS,33.98,193,101605
Calvaria de Cima,MPT,8.1,46,101605
Calvaria de Cima,PCP-PEV,7.57,43,101605
Calvaria de Cima,B.E.,5.28,30,101605
Calvaria de Cima,L,2.46,14,101605
Calvaria de Cima,PAN,1.94,11,101605
Calvaria de Cima,PND,1.58,9,101605
Calvaria de Cima,PCTP/MRPP,1.06,6,101605
Calvaria de Cima,PTP,1.06,6,101605
Calvaria de Cima,PDA,0.35,2,101605
Calvaria de Cima,PPM,0.35,2,101605
Calvaria de Cima,PNR,0.18,1,101605
Calvaria de Cima,PPV,0.18,1,101605
Calvaria de Cima,MAS,0,0,101605
Calvaria de Cima,POUS,0,0,101605
