Objeto do Contrato,Tipo de Procedimento,Tipo(s) de Contrato,CPVs,Entidade(s) Adjudicante(s),Entidade(s) Adjudicatária(s),Preço Contratual,Data de Publicação,Data de Celebração do Contrato,Prazo de Execução,Local de Execução,Fundamentação,Data de Fecho do Contrato,Preço Total Efetivo,Causas das Alterações ao Prazo,Causas das Alterações ao Preço,Estado,N.º registo do Acordo Quadro,Descrição do Acordo Quadro,Procedimento Centralizado
Fornecimento e Instalação de 1 Ventilador Invasivo Portátil para o Serviço de Medicina Intensiva,Ajuste Direto Regime Geral,Aquisição de bens móveis,"33157000-5, Aparelhos para assistência respiratória e oxigenoterapia","Centro Hospitalar do Baixo Vouga, E. P. E. (510123210)","IBERDATA-EQUIPAMENTOS, SA (501904921)","11.490,00 €",06-02-2019,28-01-2019,30 dias,"Portugal, Aveiro, Aveiro","Artigo 20.º, n.º 1, alínea a) do Código dos Contratos Públicos",,,,,,Não aplicável.,Não aplicável.,FALSE
"00262_2018 Concurso Público para a prestação de serviços de higiene e limpeza com fornecimento de consumíveis de casa de banho para o Centro Hospitalar do Oeste, EPE e para o Centro Hospitalar do Baixo Vouga, EPE",Concurso público,Aquisição de serviços,"90000000-7, Serviços relativos a águas residuais, resíduos, limpeza e ambiente","Centro Hospitalar do Baixo Vouga, E. P. E. (510123210)","FERLIMPA 2 - LIMPEZAS GERAIS E MANUTENÇÃO, LDA (506278522)","733.569,34 €",05-02-2019,15-01-2019,365 dias,"Portugal, Aveiro<BR/>Portugal, Leiria","Artigo 20.º, n.º 1, alínea a) do Código dos Contratos Públicos",,,,,,Não aplicável.,Não aplicável.,TRUE
Aquisição de Serviços de Segurança e Vigilância [A.Q. Lote 19 da Espap/SPMS - Ref. 00073_2017],Ao abrigo de acordo-quadro (art.º 259.º),Aquisição de serviços,"79417000-0, Serviços de consultoria em matéria de segurança","Centro Hospitalar do Baixo Vouga, E. P. E. (SNCP) (510123210)","Grupo 8 - Vigilância e Prevenção Eletrónica, S.A. (500131210)","299.135,64 €",04-02-2019,01-01-2018,365 dias,"Portugal, Aveiro, Estarreja<BR/>Portugal, Aveiro, Aveiro<BR/>Portugal, Aveiro, Águeda","Artigo 20.º, n.º 1, alínea b) do Código dos Contratos Públicos",,,,,,613183,Acordo quadro para a prestação de serviços de vigilância e segurança,TRUE
Aquisição de Seguro de Acidentes de Trabalho,Concurso público,Aquisição de serviços,"66512100-3, Serviços de seguros de acidentes","Centro Hospitalar do Baixo Vouga, E. P. E. (510123210)","MDS - CORRECTOR DE SEGUROS, S.A (501469460)","161.826,99 €",04-02-2019,02-01-2019,183 dias,"Portugal, Aveiro, Águeda<BR/>Portugal<BR/>Portugal, Aveiro, Aveiro<BR/>Portugal, Aveiro, Estarreja","Artigo 20.º, n.º 1, alínea b) do Código dos Contratos Públicos",,,,,,Não aplicável.,Não aplicável.,FALSE
