Objeto do Contrato,Tipo de Procedimento,Tipo(s) de Contrato,CPVs,Entidade(s) Adjudicante(s),Entidade(s) Adjudicatária(s),Preço Contratual,Data de Publicação,Data de Celebração do Contrato,Prazo de Execução,Local de Execução,Fundamentação,Data de Fecho do Contrato,Preço Total Efetivo,Causas das Alterações ao Prazo,Causas das Alterações ao Preço,Estado,N.º registo do Acordo Quadro,Descrição do Acordo Quadro,Procedimento Centralizado
"Aquisição de colonoscópio, incluindo reparação e contrato de manutenção.",Ajuste Direto Regime Geral,Aquisição de bens móveis,"33100000-1, Equipamento médico","Centro Hospitalar Médio Ave, E.P.E.. (508093937)",OLYMPUS IBERIA S.A.U. (980474710),"37.500,00 €",01-09-2015,29-07-2015,153 dias,"Portugal, Braga, Vila Nova de Famalicão","Artigo 20.º, n.º 1, alínea a) do Código dos Contratos Públicos",,,,,,Não aplicável.,Não aplicável.,FALSE
Aquisição de serviços de jardinagem e limpeza exterior,Concurso público,Aquisição de serviços,"77310000-6, Serviços de plantação e manutenção de áreas verdes","Centro Hospitalar do Médio Ave, E. P. E. (508093937)","FLORLUXUOSA - CONSTRUÇÃO DE JARDINS, UNIPESSOAL, LDA (508641780)","3.700,00 €",01-09-2015,30-07-2015,153 dias,"Portugal, Braga, Vila Nova de Famalicão","Artigo 20.º, n.º 1, alínea b) do Código dos Contratos Públicos",,,,,,Não aplicável.,Não aplicável.,FALSE
Aquisição de um Software de Gestão de Imobilizado,Ajuste Direto Regime Geral,Aquisição de serviços,"72268000-1, Serviços de fornecimento de software","Centro Hospitalar Médio Ave, E.P.E.. (508093937)","ST+I, SERVIÇOS TÉCNICOS DE INFORMÁTICA, UNIPESSOAL, LDA (502246995)","10.125,00 €",31-08-2015,31-07-2015,260 dias,"Portugal, Porto, Santo Tirso<BR/>Portugal, Braga, Vila Nova de Famalicão","Artigo 20.º, n.º 1, alínea a) do Código dos Contratos Públicos",,,,,,Não aplicável.,Não aplicável.,FALSE
Aquisição de material de reparação e conservação - Material de construção civil,Ajuste Direto Regime Geral,Aquisição de bens móveis,"44000000-0, Estruturas e materiais de construção; produtos auxiliares de construção (excepto aparelhos eléctricos)","Centro Hospitalar do Médio Ave, E. P. E. (508093937)","CONSTRUGENEBRA, CONSTRUÇÕES, LDA (504657364)","30.000,00 €",31-08-2015,28-07-2015,151 dias,"Portugal, Porto, Santo Tirso<BR/>Portugal, Braga, Vila Nova de Famalicão","Artigo 20.º, n.º 1, alínea a) do Código dos Contratos Públicos",,,,,,Não aplicável.,Não aplicável.,FALSE
Aquisição de material de reparação e conservação - Material elétrico,Ajuste Direto Regime Geral,Aquisição de bens móveis,"44000000-0, Estruturas e materiais de construção; produtos auxiliares de construção (excepto aparelhos eléctricos)","Centro Hospitalar do Médio Ave, E. P. E. (508093937)","TIRSOL ELECTRO TEXTIL, LDA (500285241)","15.000,00 €",31-08-2015,29-07-2015,151 dias,"Portugal, Porto, Santo Tirso<BR/>Portugal, Braga, Vila Nova de Famalicão","Artigo 20.º, n.º 1, alínea a) do Código dos Contratos Públicos",,,,,,Não aplicável.,Não aplicável.,FALSE
