freguesia,acronym,validVotesPercentage,votes,dicofre
União das freguesias de Zebreira e Segura,PS,54.72,203,050521
União das freguesias de Zebreira e Segura,PPD/PSD.CDS-PP,19.95,74,050521
União das freguesias de Zebreira e Segura,PCP-PEV,13.75,51,050521
União das freguesias de Zebreira e Segura,PCTP/MRPP,3.23,12,050521
União das freguesias de Zebreira e Segura,MPT,2.43,9,050521
União das freguesias de Zebreira e Segura,B.E.,1.62,6,050521
União das freguesias de Zebreira e Segura,PND,1.62,6,050521
União das freguesias de Zebreira e Segura,PPM,0.81,3,050521
União das freguesias de Zebreira e Segura,PAN,0.54,2,050521
União das freguesias de Zebreira e Segura,POUS,0.54,2,050521
União das freguesias de Zebreira e Segura,PTP,0.54,2,050521
União das freguesias de Zebreira e Segura,MAS,0.27,1,050521
União das freguesias de Zebreira e Segura,L,0,0,050521
União das freguesias de Zebreira e Segura,PDA,0,0,050521
União das freguesias de Zebreira e Segura,PNR,0,0,050521
União das freguesias de Zebreira e Segura,PPV,0,0,050521
