Objeto do Contrato,Tipo de Procedimento,Tipo(s) de Contrato,CPVs,Entidade(s) Adjudicante(s),Entidade(s) Adjudicatária(s),Preço Contratual,Data de Publicação,Data de Celebração do Contrato,Prazo de Execução,Local de Execução,Fundamentação,Data de Fecho do Contrato,Preço Total Efetivo,Causas das Alterações ao Prazo,Causas das Alterações ao Preço,Estado,N.º registo do Acordo Quadro,Descrição do Acordo Quadro,Procedimento Centralizado
Lenalidomida - Aquisição centralizada de medicamentos ao abrigo do Despacho 1571/B de 2016,Ajuste Direto Regime Geral,Aquisição de bens móveis,"33000000-0, Equipamento médico, medicamentos e produtos para cuidados pessoais","Instituto Português de Oncologia do Porto Francisco Gentil, E. P. E. (506362299)",Celgene Sociedade Unipessoal lda (507791690),"196.866,63 €",11-07-2017,10-05-2017,240 dias,"Portugal, Porto, Porto","Artigo 24.º, n.º 1, alínea e) do Código dos Contratos Públicos",,,,,,Não aplicável.,Não aplicável.,FALSE
Ibrutinib - Aquisição centralizada de medicamentos ao abrigo do Despacho 1571/B de 2016,Ajuste Direto Regime Geral,Aquisição de bens móveis,"33000000-0, Equipamento médico, medicamentos e produtos para cuidados pessoais","Instituto Português de Oncologia do Porto Francisco Gentil, E. P. E. (506362299)","Janssen-Cilag Farmacêutica, Lda. (500189412)","307.807,92 €",11-07-2017,13-04-2017,270 dias,"Portugal, Porto, Porto","Artigo 24.º, n.º 1, alínea e) do Código dos Contratos Públicos",,,,,,Não aplicável.,Não aplicável.,FALSE
Bussulfano - Aquisição centralizada de medicamentos ao abrigo do Despacho 1571/B de 2016 - Acordo Quadro 2015/6,Ao abrigo de acordo-quadro (art.º 259.º),Aquisição de bens móveis,"33000000-0, Equipamento médico, medicamentos e produtos para cuidados pessoais","Instituto Português de Oncologia do Porto Francisco Gentil, E. P. E. (506362299)","Fresenius Kabi Pharma Portugal, Lda. (504293753)","21.068,60 €",11-07-2017,03-05-2017,240 dias,"Portugal, Porto, Porto",Artigo 259.º do Código dos Contratos Públicos,,,,,,1771819,CP 2015/6 - Acordo quadro para o fornecimento de Medicamentos do Foro Oncológico,FALSE
Alargamento da infraestrutura de rede wireless - Edif. Cuidados Paliativos,Ajuste Direto Regime Geral,Aquisição de bens móveis,"32420000-3, Equipamento de rede","Instituto Português de Oncologia do Porto Francisco Gentil, E. P. E. (506362299)","Gonksys, SA (510874169)","54.988,79 €",05-07-2017,05-06-2017,59 dias,"Portugal, Porto, Porto","Artigo 20.º, n.º 1, alínea a) do Código dos Contratos Públicos",,,,,,Não aplicável.,Não aplicável.,FALSE
Renovação dos bastidores de acesso da infraestrutura de rede informática,Concurso público,Aquisição de bens móveis,"32400000-7, Redes",INSTITUTO PORTUGUÊS ONCOLOGIA PORTO FRANCISCO GENTIL (506362299),"Gonksys, SA (510874169)","343.763,87 €",05-07-2017,17-05-2017,60 dias,"Portugal, Porto, Porto","Artigo 20.º, n.º 1, alínea b) do Código dos Contratos Públicos",,,,,,Não aplicável.,Não aplicável.,FALSE
Lenalidomida (25MG) - Aquisição centralizada de medicamentos ao abrigo do Despacho 1571/B de 2016,Ajuste Direto Regime Geral,Aquisição de bens móveis,"33000000-0, Equipamento médico, medicamentos e produtos para cuidados pessoais","Instituto Português de Oncologia do Porto Francisco Gentil, E. P. E. (506362299)","CELGENE SOCIEDADE UNIPESSOAL, LDA (507791690)","195.017,00 €",03-07-2017,10-05-2017,210 dias,"Portugal, Porto, Porto","Artigo 24.º, n.º 1, alínea e) do Código dos Contratos Públicos",,,,,,Não aplicável.,Não aplicável.,FALSE
Talidomida - Aquisição centralizada de medicamentos ao abrigo do Despacho 1571/B de 2016,Ajuste Direto Regime Geral,Aquisição de bens móveis,"33000000-0, Equipamento médico, medicamentos e produtos para cuidados pessoais","Instituto Português de Oncologia do Porto Francisco Gentil, E. P. E. (506362299)","CELGENE SOCIEDADE UNIPESSOAL, LDA (507791690)","130.312,00 €",03-07-2017,10-05-2017,210 dias,"Portugal, Porto, Porto","Artigo 24.º, n.º 1, alínea e) do Código dos Contratos Públicos",,,,,,Não aplicável.,Não aplicável.,FALSE
Lenalidomina (15MG) - Aquisição centralizada de medicamentos ao abrigo do Despacho 1571/B de 2016,Ajuste Direto Regime Geral,Aquisição de bens móveis,"33000000-0, Equipamento médico, medicamentos e produtos para cuidados pessoais","Instituto Português de Oncologia do Porto Francisco Gentil, E. P. E. (506362299)","CELGENE SOCIEDADE UNIPESSOAL, LDA (507791690)","19.698,68 €",03-07-2017,10-05-2017,210 dias,"Portugal, Porto, Porto","Artigo 24.º, n.º 1, alínea e) do Código dos Contratos Públicos",,,,,,Não aplicável.,Não aplicável.,FALSE
Lenalidomida- Aquisição centralizada de medicamentos ao abrigo do Despacho 1571/B de 2016 - Acordo Quadro 2015/6,Ajuste Direto Regime Geral,Aquisição de bens móveis,"33000000-0, Equipamento médico, medicamentos e produtos para cuidados pessoais","Instituto Português de Oncologia do Porto Francisco Gentil, E. P. E. (506362299)","CELGENE SOCIEDADE UNIPESSOAL, LDA (507791690)","13.358,78 €",03-07-2017,10-05-2017,210 dias,"Portugal, Porto, Porto","Artigo 24.º, n.º 1, alínea e) do Código dos Contratos Públicos",,,,,,Não aplicável.,Não aplicável.,FALSE
