freguesia,acronym,validVotesPercentage,votes,dicofre
Alegrete,PS,46.41,168,121402
Alegrete,PPD/PSD,29.56,107,121402
Alegrete,B.E.,7.46,27,121402
Alegrete,CDS-PP,7.18,26,121402
Alegrete,PCP-PEV,2.49,9,121402
Alegrete,L,1.38,5,121402
Alegrete,PPM.PPV/CDC,1.38,5,121402
Alegrete,PNR,1.1,4,121402
Alegrete,PAN,0.83,3,121402
Alegrete,PCTP/MRPP,0.83,3,121402
Alegrete,A,0.55,2,121402
Alegrete,IL,0.28,1,121402
Alegrete,PTP,0.28,1,121402
Alegrete,PURP,0.28,1,121402
Alegrete,MAS,0,0,121402
Alegrete,NC,0,0,121402
Alegrete,PDR,0,0,121402
