Objeto do Contrato,Tipo de Procedimento,Tipo(s) de Contrato,CPVs,Entidade(s) Adjudicante(s),Entidade(s) Adjudicatária(s),Preço Contratual,Data de Publicação,Data de Celebração do Contrato,Prazo de Execução,Local de Execução,Fundamentação,Data de Fecho do Contrato,Preço Total Efetivo,Causas das Alterações ao Prazo,Causas das Alterações ao Preço,Estado,N.º registo do Acordo Quadro,Descrição do Acordo Quadro,Procedimento Centralizado
"Aquisição de Contracetivos Orais, Profiláticos e Mecânicos - 2018",Ao abrigo de acordo-quadro (art.º 259.º),Aquisição de bens móveis,"33600000-6, Produtos farmacêuticos","Administração Regional de Saúde do Algarve, I. P. (503148709)","Ezequiel Panão Jorge, Lda. (501412727)","2.211,32 €",21-12-2018,11-07-2018,170 dias,"Portugal, Faro, Faro",Artigo 259.º do Código dos Contratos Públicos,"","",,"",,1459323,CP 2015/20,TRUE
"Aquisição de Contracetivos Orais, Profiláticos e Mecânicos - 2018",Ao abrigo de acordo-quadro (art.º 259.º),Aquisição de bens móveis,"33600000-6, Produtos farmacêuticos","Administração Regional de Saúde do Algarve, I. P. (503148709)","Pfizer, Lda. (500162166)","556,50 €",21-12-2018,16-02-2018,270 dias,"Portugal, Faro, Faro",Artigo 259.º do Código dos Contratos Públicos,"","",,"",,1459323,CP 2015/20,TRUE
Aquisição de Medicamentos Gerais - artigos diversos,Ao abrigo de acordo-quadro (art.º 259.º),Aquisição de bens móveis,"33690000-3, Medicamentos vários","Administração Regional de Saúde do Algarve, I. P. (503148709)","Generis, S.A. (508107997)","21,60 €",19-12-2018,20-11-2018,41 dias,"Portugal, Faro, Faro",Artigo 259.º do Código dos Contratos Públicos,"","",,"",,1638654,CP 2015/12 - Acordo quadro para fornecimento de Medicamentos do Aparelho Respiratório às Instituições e Serviços do Serviço Nacional de Saúde,FALSE
Aquisição de Medicamentos Gerais - Minociclina,Ao abrigo de acordo-quadro (art.º 259.º),Aquisição de bens móveis,"33600000-6, Produtos farmacêuticos","Administração Regional de Saúde do Algarve, I.P. (503148709)","Laboratórios Medinfar, S.A. (500384045)","139,20 €",19-12-2018,26-09-2018,90 dias,Portugal,Artigo 259.º do Código dos Contratos Públicos,"","",,"",,2775691,CP 2017/5 - Acordo Quadro para fornecimento de Medicamentos anti-infeciosos: exceto antivíricos e antifúngicos,FALSE
"Aquisição de Contracetivos Orais, Profiláticos e Mecânicos - 2018",Ao abrigo de acordo-quadro (art.º 259.º),Aquisição de bens móveis,"33600000-6, Produtos farmacêuticos","Administração Regional de Saúde do Algarve, I. P. (503148709)","Logifarma, Lda. (503934640)","37.869,50 €",19-12-2018,16-03-2018,290 dias,"Portugal, Faro, Faro",Artigo 259.º do Código dos Contratos Públicos,"","",,"",,1459323,CP 2015/20,TRUE
P259-2018-206 - Aquisição de vacinas em cumprimento do Programa Nacional de Vacinação 2018 para Instituições de Saúde,Ao abrigo de acordo-quadro (art.º 259.º),Aquisição de bens móveis,"33650000-1, Anti-infecciosos gerais de uso sistémico, vacinas, antineoplásicos e imunomoduladores","Administração Regional de Saúde do Algarve, I.P. (503148709)","Sanofi Pasteur MSD, SA (507632796)","47.766,00 €",19-12-2018,18-12-2018,12 dias,Portugal,Artigo 259.º do Código dos Contratos Públicos,"","",,"",,1923518,CP 2016/13 - Acordo Quadro para fornecimento de Vacinas e Tuberculinas   às Instituições e Serviços do Serviço Nacional de Saúde,TRUE
AD 377/2018 - Aquisição de carros de emergência,Ajuste Direto Regime Geral,Aquisição de bens móveis,"33190000-8, Dispositivos e produtos médicos variados","Administração Regional de Saúde do Algarve, I. P. (503148709)","PARAMEDICA EQUIPAMENTOS MEDICOS, LDA (501393005)","8.820,00 €",18-12-2018,06-12-2018,25 dias,"Portugal, Faro, Faro","Artigo 20.º, n.º 1, alínea d) do Código dos Contratos Públicos","","",,"",,Não aplicável.,Não aplicável.,FALSE
PV 410/2018 - Prestação de Serviços de Manutenção Corretiva de Equipamentos de Saúde Oral/Medicina Dentária para o CS Portimão e o CS Lagos,Consulta Prévia,Aquisição de serviços,"50000000-5, Serviços de reparação e manutenção","Administração Regional de Saúde do Algarve, I. P. (503148709)",MONTELLANO (500196494),"1.169,38 €",18-12-2018,17-12-2018,14 dias,"Portugal, Faro, Portimão","Artigo 20.º, n.º 1, alínea c) do Código dos Contratos Públicos",31-12-2018,"1.169,38 €",,"",,Não aplicável.,Não aplicável.,FALSE
AD-2018-97 - Aquisição da vacina V22 - Vacina BCG para cumprimento do Programa Nacional de Vacinação 2018 para as Administrações Regionais de Saúde e Direções Regionais de Saúde,Ajuste Direto Regime Geral,Aquisição de bens móveis,"33651600-4, Vacinas","Administração Regional de Saúde do Algarve, I.P. (503148709)","J.M.Farmacêutica, S.A. (503550558)","2.250,00 €",18-12-2018,31-10-2018,60 dias,Portugal,"Artigo 24.º, n.º 1, alínea e), subalínea ii) do Código dos Contratos Públicos","","",,"",,Não aplicável.,Não aplicável.,TRUE
PV 244/2018 - Aquisição de Retinógrafo Não Midriático para Rastreio da Retinopatia Diabética,Consulta Prévia,Aquisição de bens móveis,"33122000-1, Equipamento oftalmológico","Administração Regional de Saúde do Algarve, I. P. (503148709)","PM - Equipamentos e Serviços, Lda (508299900)","26.700,00 €",17-12-2018,11-12-2018,20 dias,"Portugal, Faro, Faro","Artigo 20.º, n.º 1, alínea c) do Código dos Contratos Públicos","","",,"",,Não aplicável.,Não aplicável.,FALSE
Aquisição de Material de Investimento CPA 2015076,Ao abrigo de acordo-quadro (art.º 259.º),Aquisição de bens móveis,"33190000-8, Dispositivos e produtos médicos variados","Administração Regional de Saúde do Algarve, I.P. (503148709)","Cenatolim, Lda (507397924)","4.942,50 €",17-12-2018,17-12-2018,14 dias,Portugal,Artigo 259.º do Código dos Contratos Públicos,31-12-2018,"4.792,50 €",,1 artigo não entregue,,1587913,Acordo Quadro para fornecimento de Equipamentos e Dispositivos Médicos de uso comum em internamento e ambulatório - Parte I às instituições e serviços do Serviço Nacional de Saúde.,FALSE
Aquisição de Consumíveis de Impressão para OKIMB760,Consulta Prévia,Aquisição de bens móveis,"30192112-9, Tinta para máquinas de impressão","Administração Regional de Saúde do Algarve, I. P. (503148709)","Hardtop II - Consumíveis Informáticos, Lda. (508490561)","3.500,00 €",17-12-2018,07-12-2018,24 dias,"Portugal, Faro, Faro","Artigo 20.º, n.º 1, alínea c) do Código dos Contratos Públicos","","",,"",,Não aplicável.,Não aplicável.,FALSE
Aquisição de Consumíveis de Impressão para OKIMB760,Consulta Prévia,Aquisição de bens móveis,"30192112-9, Tinta para máquinas de impressão","Administração Regional de Saúde do Algarve, I.P. (503148709)","Max One, Lda (507052609)","4.267,50 €",17-12-2018,07-12-2018,24 dias,Portugal,"Artigo 20.º, n.º 1, alínea c) do Código dos Contratos Públicos","","",,"",,Não aplicável.,Não aplicável.,FALSE
Aquisição de Material de Penso de Efeito Terapêutico - I,Concurso público,Aquisição de bens móveis,"33140000-3, Material médico de consumo","Administração Regional de Saúde do Algarve, I. P. (503148709)","Quilaban, S.A. (500399670)","2.960,00 €",14-12-2018,05-12-2018,25 dias,"Portugal, Faro, Faro","Artigo 20.º, n.º 1, alínea b) do Código dos Contratos Públicos","","",,"",,Não aplicável.,Não aplicável.,FALSE
Aquisição de Material de Penso de Efeito Terapêutico - I,Concurso público,Aquisição de bens móveis,"33140000-3, Material médico de consumo","Administração Regional de Saúde do Algarve, I. P. (503148709)","Kvtech, Lda. (508671531)","11.620,95 €",14-12-2018,06-12-2018,25 dias,"Portugal, Faro, Faro","Artigo 20.º, n.º 1, alínea b) do Código dos Contratos Públicos","","",,"",,Não aplicável.,Não aplicável.,FALSE
PV 384/2018 - Prestação de Serviços de Reparação em Sistemas de Distribuição de Águas Quentes do Sistema AVAC do Centro de Saúde de Faro,Consulta Prévia,Aquisição de serviços,"50000000-5, Serviços de reparação e manutenção","Administração Regional de Saúde do Algarve, I.P. (503148709)","IBERFARO CLIMATIZAÇÃO - IBÉRICA, LDA (501931961)","4.618,00 €",14-12-2018,14-12-2018,17 dias,"Portugal, Faro, Faro","Artigo 20.º, n.º 1, alínea c) do Código dos Contratos Públicos",31-12-2018,"4.618,00 €",,"",,Não aplicável.,Não aplicável.,FALSE
P259-2018-163 - Aquisição de vacinas para cumprimento do Programa Nacional de Vacinação 2018 para a ARS Algarve,Ao abrigo de acordo-quadro (art.º 259.º),Aquisição de bens móveis,"33651600-4, Vacinas","Administração Regional de Saúde do Algarve, I.P. (503148709)","GlaxoSmithKline, Lda. (500139962)","771,00 €",14-12-2018,20-11-2018,40 dias,Portugal,"Artigo 24.º, n.º 1, alínea b) do Código dos Contratos Públicos","","",,"",,1923518,CP 2016/13 - Acordo Quadro para fornecimento de Vacinas e Tuberculinas   às Instituições e Serviços do Serviço Nacional de Saúde,TRUE
AD-2018-104 - Aquisição de vacinas para cumprimento do Programa Nacional de Vacinação 2018 para as Instituições de Saúde,Ajuste Direto Regime Geral,Aquisição de bens móveis,"33650000-1, Anti-infecciosos gerais de uso sistémico, vacinas, antineoplásicos e imunomoduladores","Administração Regional de Saúde do Algarve, I. P. (503148709)","J.M.Farmacêutica, S.A. (503550558)","24.178,50 €",12-12-2018,07-12-2018,24 dias,Portugal,"Artigo 24.º, n.º 1, alínea b) do Código dos Contratos Públicos","","",,"",,Não aplicável.,Não aplicável.,TRUE
AD-2018-92 - aquisição de T222 – Tuberculina PPD para cumprimento do Programa Nacional de Vacinação de 2018 para as Administrações Regionais de Saúde e Direções Regionais de Saúde,Ajuste Direto Regime Geral,Aquisição de bens móveis,"33650000-1, Anti-infecciosos gerais de uso sistémico, vacinas, antineoplásicos e imunomoduladores","Administração Regional de Saúde do Algarve, I. P. (503148709)","J.M.Farmacêutica, Lda. (503550558)","1.560,00 €",12-12-2018,18-10-2018,70 dias,Portugal,"Artigo 24.º, n.º 1, alínea b) do Código dos Contratos Públicos",28-11-2018,"1.560,00 €",,"",,Não aplicável.,Não aplicável.,TRUE
PV 387/2018 - Aquisição de Componentes para Reparação dos Sistemas AVAC do Centro de Saúde de Portimão,Consulta Prévia,Aquisição de bens móveis,"42512500-3, Peças para aparelhos de ar condicionado","Administração Regional de Saúde do Algarve, I. P. (503148709)","CARLOS LOPES GOUVEIA, LDA (501522603)","25.404,26 €",11-12-2018,11-12-2018,20 dias,"Portugal, Faro, Portimão","Artigo 20.º, n.º 1, alínea c) do Código dos Contratos Públicos",31-12-2018,"25.404,26 €",,"",,Não aplicável.,Não aplicável.,FALSE
"P259-2018-114 - Aquisição de vacinas para o PNV de 2018, para as Administrações Regionais de Saúde e Direções Regionais de Saúde",Ao abrigo de acordo-quadro (art.º 259.º),Aquisição de bens móveis,"33600000-6, Produtos farmacêuticos","Administração Regional de Saúde do Algarve, I. P. (503148709)","Glaxo Smith Kline, Lda. (500139962)","462,60 €",11-12-2018,05-11-2018,60 dias,Portugal,Artigo 259.º do Código dos Contratos Públicos,20-11-2018,"462,60 €",,"",,2327827,CP 2016/13-A - Acordo Quadro para fornecimento de Vacinas e Tuberculinas - Parte II,TRUE
