Objeto do Contrato,Tipo de Procedimento,Tipo(s) de Contrato,CPVs,Entidade(s) Adjudicante(s),Entidade(s) Adjudicatária(s),Preço Contratual,Data de Publicação,Data de Celebração do Contrato,Prazo de Execução,Local de Execução,Fundamentação,Data de Fecho do Contrato,Preço Total Efetivo,Causas das Alterações ao Prazo,Causas das Alterações ao Preço,Estado,N.º registo do Acordo Quadro,Descrição do Acordo Quadro,Procedimento Centralizado
Contratação de serviços para desenvolvimento de novas funcionalidades/alterações no sistema-Gateway de Pagamentos.,Ajuste Direto Regime Geral,Aquisição de bens móveis,"48985000-6, Linguagens de programação","INFARMED - Autoridade Nacional do Medicamento e Produtos de Saúde, I.P. (600037002)","INDRA Sistemas Portugal, S.A. (506176142)","9.900,00 €",20-03-2013,20-03-2013,365 dias,Portugal,"Artigo 20.º, n.º 1, alínea a) do Código dos Contratos Públicos",,,,,,Não aplicável.,Não aplicável.,
Serviços de viagem e alojamento para participação na reunião CAMD - Reunião de AC de Dispositivos Médicos e reunião CMC em Dublin- 1 Participante/4 dias,Ajuste Direto Regime Geral,Aquisição de serviços,"63510000-7, Serviços de agências de viagens e serviços similares","INFARMED - Autoridade Nacional do Medicamento e Produtos de Saúde, I.P. (600037002)","Topatlantico- Viagens e Turismo, SA (501061126)","921,17 €",20-03-2013,01-02-2013,4 dias,Irlanda,"Artigo 27.º, n.º 1, alínea h) do Código dos Contratos Públicos",,,,,,Não aplicável.,Não aplicável.,
"Serviços de viagem e alojamento para participação na reunião Experts meeting on Annex VI to the proposed Regulations on Medical Devices and In Vitro diagnostic medical, em Bruxelas - 1 Participante/2 dias",Ajuste Direto Regime Geral,Aquisição de serviços,"63510000-7, Serviços de agências de viagens e serviços similares","INFARMED - Autoridade Nacional do Medicamento e Produtos de Saúde, I.P. (600037002)","Raso- Viagens e Turismo,SA (500886113)","984,38 €",18-03-2013,06-03-2013,2 dias,Bélgica,"Artigo 27.º, n.º 1, alínea h) do Código dos Contratos Públicos",,,,,,Não aplicável.,Não aplicável.,
"Serviços de viagem e alojamento para participação na reunião do grupo de trabalho Medicine Evaluation Committee (MEDEV), em Bruxelas- 1 Participante/2 dias",Ajuste Direto Regime Geral,Aquisição de serviços,"63510000-7, Serviços de agências de viagens e serviços similares","INFARMED - Autoridade Nacional do Medicamento e Produtos de Saúde, I.P. (600037002)","Raso- Viagens e Turismo, SA (500886113)","815,38 €",18-03-2013,06-03-2013,2 dias,Bélgica,"Artigo 27.º, n.º 1, alínea h) do Código dos Contratos Públicos",,,,,,Não aplicável.,Não aplicável.,
Serviço de viagem e alojamento para participação na reunião CMDh SubGroup on Variations em Londres - 1 participante/3 dias,Ajuste Direto Regime Geral,Aquisição de serviços,"63510000-7, Serviços de agências de viagens e serviços similares","INFARMED - Autoridade Nacional do Medicamento e Produtos de Saúde, I.P. (600037002)","Topatlantico - Viagens e Turismoa, SA (501061126)","1.330,90 €",18-03-2013,06-03-2013,3 dias,Reino Unido,"Artigo 27.º, n.º 1, alínea h) do Código dos Contratos Públicos",,,,,,Não aplicável.,Não aplicável.,
"Serviço de viagem e alojamento para participação da reunião do grupo de trabalho Europeu EUNETHA, em Roma - 1 Participante/3 dias",Ajuste Direto Regime Geral,Aquisição de serviços,"63510000-7, Serviços de agências de viagens e serviços similares","INFARMED - Autoridade Nacional do Medicamento e Produtos de Saúde, I.P. (600037002)","Topatlantico - Viagens e Turismo,SA (501061126)","489,62 €",18-03-2013,01-03-2013,3 dias,Itália,"Artigo 27.º, n.º 1, alínea h) do Código dos Contratos Públicos",,,,,,Não aplicável.,Não aplicável.,
"Serviços de viagem e alojamento para participação na reunião European Workshop on Training for Research Ethics Committees (EFGCP), em Estugarda - 1 Participante/2dias",Ajuste Direto Regime Geral,Aquisição de serviços,"63510000-7, Serviços de agências de viagens e serviços similares","INFARMED - Autoridade Nacional do Medicamento e Produtos de Saúde, I.P. (600037002)","Raso- Viagens e Turismo, SA (500886113)","1.117,49 €",18-03-2013,27-02-2013,2 dias,Alemanha,"Artigo 27.º, n.º 1, alínea h) do Código dos Contratos Públicos",,,,,,Não aplicável.,Não aplicável.,
Serviços de viagem e alojamento para participação na reunião Grupo de Medicamentos e Dispositivos Médicos (GMDM)- Regulamento ensaios clinicos em Bruxelas- 1 Participante/3 dias,Ajuste Direto Regime Geral,Aquisição de serviços,"63510000-7, Serviços de agências de viagens e serviços similares","INFARMED - Autoridade Nacional do Medicamento e Produtos de Saúde, I.P. (600037002)","Raso - Viagens e Turismo, SA (500886113)","1.104,38 €",18-03-2013,15-03-2013,3 dias,Bélgica,"Artigo 27.º, n.º 1, alínea h) do Código dos Contratos Públicos",,,,,,Não aplicável.,Não aplicável.,
Aquisição de serviços de manutenção ao parque tecnológico Audiovisual.,Ajuste Direto Regime Geral,Aquisição de serviços,"50330000-7, Serviços de manutenção de equipamento para telecomunicações","INFARMED - Autoridade Nacional do Medicamento e Produtos de Saúde, I.P. (600037002)","PRO AUDIO - SISTEMAS PROFISSIONAIS DE AUDIO, LDA (503017108)","7.452,00 €",13-03-2013,11-03-2013,365 dias,Portugal,"Artigo 20.º, n.º 1, alínea a) do Código dos Contratos Públicos",,,,,,Não aplicável.,Não aplicável.,
"Aquisição de serviços de manutenção e assistência técnica à central telefónica instalada no INFARMED, I.P.",Ajuste Direto Regime Geral,Aquisição de serviços,"50330000-7, Serviços de manutenção de equipamento para telecomunicações","INFARMED - Autoridade Nacional do Medicamento e Produtos de Saúde, I.P. (600037002)",TELEAPLICAÇÃO (503748544),"5.850,00 €",13-03-2013,06-03-2013,365 dias,Portugal,"Artigo 20.º, n.º 1, alínea a) do Código dos Contratos Públicos",,,,,,Não aplicável.,Não aplicável.,
