Objeto do Contrato,Tipo de Procedimento,Tipo(s) de Contrato,CPVs,Entidade(s) Adjudicante(s),Entidade(s) Adjudicatária(s),Preço Contratual,Data de Publicação,Data de Celebração do Contrato,Prazo de Execução,Local de Execução,Fundamentação,Data de Fecho do Contrato,Preço Total Efetivo,Causas das Alterações ao Prazo,Causas das Alterações ao Preço,Estado,N.º registo do Acordo Quadro,Descrição do Acordo Quadro,Procedimento Centralizado
13200188 - Aquisição de Stent's Coronários para o CHLO,Ao abrigo de acordo-quadro (art.º 259.º),Aquisição de bens móveis,"33140000-3, Material médico de consumo","Centro Hospitalar de Lisboa Ocidental, E. P. E. (507618319)","Biotronik Portugal Unipessoal, Lda (510726941)","19.218,50 €",08-01-2019,26-12-2018,365 dias,"Portugal, Lisboa, Lisboa",Artigo 259.º do Código dos Contratos Públicos,,,,,,2771022,CP 2017/34 - Acordo quadro para fornecimento de Stents Coronários às Instituições e Serviços do Serviço Nacional de Saúde,FALSE
13200178 - Aquisição de Stent's Coronários para o CHLO,Ao abrigo de acordo-quadro (art.º 259.º),Aquisição de bens móveis,"33140000-3, Material médico de consumo","Centro Hospitalar de Lisboa Ocidental, E. P. E. (507618319)","Boston Scientific Portugal - Dispositivos Médicos, Lda (504988964)","24.750,00 €",08-01-2019,26-12-2018,365 dias,"Portugal, Lisboa, Lisboa",Artigo 259.º do Código dos Contratos Públicos,,,,,,2771022,CP 2017/34 - Acordo quadro para fornecimento de Stents Coronários às Instituições e Serviços do Serviço Nacional de Saúde,FALSE
Aquisição de Dispositivos de Perfusão Subcutânea de Insulina e respetivos Consumíveis no âmbito do Programa Nacional para a Prevenção e Controlo da Diabetes (PND),Ao abrigo de acordo-quadro (art.º 259.º),Aquisição de bens móveis,"33194110-0, Bombas para perfusão","Centro Hospitalar de Lisboa Ocidental, E. P. E. (507618319)","Roche - Sistems de Diagnóstico, Lda (504282921)","5.100,00 €",08-01-2019,13-03-2018,365 dias,"Portugal, Lisboa, Lisboa",Artigo 259.º do Código dos Contratos Públicos,,,,,,1442148,ACORDO QUADRO PARA FORNECIMENTO DE BOMBAS DE PERFUSÃO SUBCUTANEA CONTINUA DE INSULINA E RESPETIVOS CONSUMÍVEIS ÀS INSTITUIÇÕES E SERVIÇOS DO SERVIÇO NACIONAL DE SAÚDE. CP 2015/29,TRUE
"INTERVENÇÕES NA ÁREA DE CONSTRUÇÃO CIVIL EM DIVERSAS INSTALAÇÕES DO CHLO, EPE",Consulta Prévia,Aquisição de serviços,"50800000-3, Serviços de reparação e manutenção diversos","Centro Hospitalar de Lisboa Ocidental, EPE (CHLO) (507618319)","COFISTRONG, LDA (513926615)","7.600,00 €",08-01-2019,04-01-2019,15 dias,"Portugal, Lisboa, Lisboa<BR/>Portugal","Artigo 20.º, n.º 1, alínea c) do Código dos Contratos Públicos",,,,,,Não aplicável.,Não aplicável.,FALSE
13200128 - Aquisição Centralizada de Stent´s e Componentes pela SPMS,Ao abrigo de acordo-quadro (art.º 259.º),Aquisição de bens móveis,"33100000-1, Equipamento médico","Centro Hospitalar de Lisboa Ocidental, EPE (CHLO) (507618319)",B BRAUN MEDICAL LDA (501506543),"37.260,00 €",04-01-2019,21-09-2018,365 dias,"Portugal, Lisboa, Lisboa",Artigo 259.º do Código dos Contratos Públicos,,,,,,2771022,CP 2017/34 - Acordo quadro para fornecimento de Stents Coronários às Instituições e Serviços do Serviço Nacional de Saúde,TRUE
13200128 - Aquisição Centralizada de Stent´s e Componentes pela SPMS,Ao abrigo de acordo-quadro (art.º 259.º),Aquisição de bens móveis,"33100000-1, Equipamento médico","Centro Hospitalar de Lisboa Ocidental, EPE (CHLO) (507618319)",Boston Scientific Portugal - Dispositivos Medicos  Lda (504988964),"53.350,00 €",04-01-2019,21-09-2018,365 dias,"Portugal, Lisboa, Lisboa",Artigo 259.º do Código dos Contratos Públicos,,,,,,2771022,CP 2017/34 - Acordo quadro para fornecimento de Stents Coronários às Instituições e Serviços do Serviço Nacional de Saúde,TRUE
13200128 - Aquisição Centralizada de Stent´s e Componentes pela SPMS,Ao abrigo de acordo-quadro (art.º 259.º),Aquisição de bens móveis,"33100000-1, Equipamento médico","Centro Hospitalar de Lisboa Ocidental, EPE (CHLO) (507618319)",B BRAUN MEDICAL LDA (501506543),"2.100,00 €",04-01-2019,21-09-2018,365 dias,"Portugal, Lisboa, Lisboa",Artigo 259.º do Código dos Contratos Públicos,,,,,,2771022,CP 2017/34 - Acordo quadro para fornecimento de Stents Coronários às Instituições e Serviços do Serviço Nacional de Saúde,TRUE
13200128 - Aquisição Centralizada de Stent's e Componentes pela SPMS,Ao abrigo de acordo-quadro (art.º 259.º),Aquisição de bens móveis,"33100000-1, Equipamento médico","Centro Hospitalar de Lisboa Ocidental, EPE (CHLO) (507618319)","Biotronik Portugal Unipessoal, Lda (510726941)","12.080,20 €",04-01-2019,21-09-2018,365 dias,"Portugal, Lisboa, Lisboa",Artigo 259.º do Código dos Contratos Públicos,,,,,,2771022,CP 2017/34 - Acordo quadro para fornecimento de Stents Coronários às Instituições e Serviços do Serviço Nacional de Saúde,TRUE
P259-2018-64 - Aquisição de Dispositivos de Perfusão Subcutânea de Insulina e respetivos Consumíveis no âmbito do Programa Nacional para a Prevenção e Controlo da Diabetes (PND),Ao abrigo de acordo-quadro (art.º 259.º),Aquisição de bens móveis,"33600000-6, Produtos farmacêuticos","Centro Hospitalar de Lisboa Ocidental, E. P. E. (507618319)","Roche - Sistemas de Diagnóstico, Lda (504282921)","13.600,00 €",04-01-2019,07-06-2018,365 dias,"Portugal, Lisboa, Lisboa",Artigo 259.º do Código dos Contratos Públicos,,,,,,1442148,ACORDO QUADRO PARA FORNECIMENTO DE BOMBAS DE PERFUSÃO SUBCUTANEA CONTINUA DE INSULINA E RESPETIVOS CONSUMÍVEIS ÀS INSTITUIÇÕES E SERVIÇOS DO SERVIÇO NACIONAL DE SAÚDE. CP 2015/29,TRUE
P259-2018-64 - Aquisição de Dispositivos de Perfusão Subcutânea de Insulina e respetivos Consumíveis no âmbito do Programa Nacional para a Prevenção e Controlo da Diabetes (PND),Ao abrigo de acordo-quadro (art.º 259.º),Aquisição de bens móveis,"33600000-6, Produtos farmacêuticos","Centro Hospitalar de Lisboa Ocidental, E. P. E. (507618319)","Medtronic Portugal, Lda (504223933)","4.250,00 €",04-01-2019,07-06-2018,365 dias,"Portugal, Lisboa, Lisboa",Artigo 259.º do Código dos Contratos Públicos,,,,,,1442148,ACORDO QUADRO PARA FORNECIMENTO DE BOMBAS DE PERFUSÃO SUBCUTANEA CONTINUA DE INSULINA E RESPETIVOS CONSUMÍVEIS ÀS INSTITUIÇÕES E SERVIÇOS DO SERVIÇO NACIONAL DE SAÚDE. CP 2015/29,TRUE
Aquisição de serviços de lavagem e tratamento de roupa para o primeiro semestre do ano de 2018,Ajuste Direto Regime Geral,Aquisição de serviços,"98310000-9, Serviços de lavagem e de limpeza a seco","Centro Hospitalar de Lisboa Ocidental, E. P. E. (507618319)",SUCH- Serviço de Utilização Comum dos Hospitais (500900469),"244.136,55 €",04-01-2019,07-03-2018,182 dias,"Portugal, Lisboa, Lisboa","Artigo 26.º, n.º 2, alínea b) do Código dos Contratos Públicos",,,,,,Não aplicável.,Não aplicável.,FALSE
Aquisição de Dispositivos de Perfusão Subcutânea de Insulina e respetivos Consumíveis no âmbito do Programa Nacional para a Prevenção e Controlo da Diabetes (PND),Ao abrigo de acordo-quadro (art.º 259.º),Aquisição de bens móveis,"33194110-0, Bombas para perfusão","Centro Hospitalar de Lisboa Ocidental, E. P. E. (507618319)","Medtronic Portugal, Lda (504223933)","2.840,00 €",03-01-2019,13-03-2018,365 dias,"Portugal, Lisboa, Lisboa",Artigo 259.º do Código dos Contratos Públicos,,,,,,1442148,ACORDO QUADRO PARA FORNECIMENTO DE BOMBAS DE PERFUSÃO SUBCUTANEA CONTINUA DE INSULINA E RESPETIVOS CONSUMÍVEIS ÀS INSTITUIÇÕES E SERVIÇOS DO SERVIÇO NACIONAL DE SAÚDE. CP 2015/29,TRUE
11253198. - Aquisição de Ureterorenoscopios para o CHLO,Ajuste Direto Regime Geral,Aquisição de bens móveis,"33140000-3, Material médico de consumo","Centro Hospitalar de Lisboa Ocidental, EPE (CHLO) (507618319)",Boston Scientific Portugal - Dispositivos Medicos  Lda (504988964),"10.000,00 €",03-01-2019,03-01-2019,365 dias,"Portugal, Lisboa, Lisboa","Artigo 24.º, n.º 1, alínea c) do Código dos Contratos Públicos",,,,,,Não aplicável.,Não aplicável.,FALSE
SUBSTITUIÇÃO DO QUEIMADOR DA CALDEIRA DE ÁGUA QUENTE Nº.2 DO HSFX,Ajuste Direto Regime Geral,Aquisição de serviços,"51130000-2, Serviços de instalação de geradores de vapor, caldeiras, turbinas, compressores e queimadores","Centro Hospitalar de Lisboa Ocidental, EPE (CHLO) (507618319)","SUCH-VEOLIA, ACE PORTUGAL (503718289)","11.065,55 €",03-01-2019,26-12-2018,15 dias,Portugal,"Artigo 24.º, n.º 1, alínea e), subalínea ii) do Código dos Contratos Públicos",,,,,,Não aplicável.,Não aplicável.,FALSE
13200158 - Aquisição de Stent's para o CHLO,Ao abrigo de acordo-quadro (art.º 259.º),Aquisição de bens móveis,"33140000-3, Material médico de consumo","Centro Hospitalar de Lisboa Ocidental, E. P. E. (507618319)","Abbott Laboratórios, Lda (500006148)","86.700,00 €",02-01-2019,26-12-2018,365 dias,"Portugal, Lisboa, Lisboa",Artigo 259.º do Código dos Contratos Públicos,,,,,,2771022,CP 2017/34 - Acordo quadro para fornecimento de Stents Coronários às Instituições e Serviços do Serviço Nacional de Saúde,FALSE
13200148 - Aquisição de Stent's para o CHLO,Ao abrigo de acordo-quadro (art.º 259.º),Aquisição de bens móveis,"33140000-3, Material médico de consumo","Centro Hospitalar de Lisboa Ocidental, E. P. E. (507618319)","Medtronic Portugal, Lda (504223933)","115.600,00 €",02-01-2019,21-12-2018,365 dias,"Portugal, Lisboa, Lisboa",Artigo 259.º do Código dos Contratos Públicos,,,,,,2771022,CP 2017/34 - Acordo quadro para fornecimento de Stents Coronários às Instituições e Serviços do Serviço Nacional de Saúde,FALSE
14200098 - Aquisição de Endoproteses para o CHLO,Concurso público,Aquisição de bens móveis,"33140000-3, Material médico de consumo","Centro Hospitalar de Lisboa Ocidental, EPE (CHLO) (507618319)",BIOSONDA COMERCIO DE MATERIAL HOSP. LDA (501463313),"61.500,00 €",02-01-2019,29-11-2018,365 dias,"Portugal, Lisboa, Lisboa","Artigo 20.º, n.º 1, alínea a) do Código dos Contratos Públicos",,,,,,Não aplicável.,Não aplicável.,FALSE
12200018 - Aquisição de Eletrodos Multifunções Radiotransparentes para o CHLO,Consulta Prévia,Aquisição de bens móveis,"33140000-3, Material médico de consumo","Centro Hospitalar de Lisboa Ocidental, E. P. E. (507618319)","CARDINAL HEALTH PORTUGAL 513 UNIPESSOAL, LDA (513620834)","18.258,00 €",02-01-2019,19-11-2018,365 dias,"Portugal, Lisboa, Lisboa","Artigo 20.º, n.º 1, alínea c) do Código dos Contratos Públicos",,,,,,Não aplicável.,Não aplicável.,FALSE
Aquisição de Proteses Valvulares Pulmonares Percutaneas Pediatricas para o CHLO,Ajuste Direto Regime Geral,Aquisição de bens móveis,"33140000-3, Material médico de consumo","Centro Hospitalar de Lisboa Ocidental, E. P. E. (507618319)",MEDTRONIC PORTUGAL LDA (504223933),"54.000,00 €",02-01-2019,31-10-2018,365 dias,"Portugal, Lisboa, Lisboa","Artigo 24.º, n.º 1, alínea e), subalínea ii) do Código dos Contratos Públicos",,,,,,Não aplicável.,Não aplicável.,FALSE
13200058 - Aquisição de Nastros e Fitas Cirúrgicas para o CHLO,Ao abrigo de acordo-quadro (art.º 259.º),Aquisição de bens móveis,"33140000-3, Material médico de consumo","Centro Hospitalar de Lisboa Ocidental, E. P. E. (507618319)","Docworld, Lda (508592909)","390,82 €",02-01-2019,10-12-2018,365 dias,"Portugal, Lisboa, Lisboa",Artigo 259.º do Código dos Contratos Públicos,,,,,,2183753,CP 2016/82 - Acordo quadro para fornecimento de Nastros e Fitas Cirúrgicas às Instituições e Serviços do Serviço Nacional de Saúde,FALSE
13200058 - Aquisição de Nastros e Fitas Cirúrgicas para o CHLO,Ao abrigo de acordo-quadro (art.º 259.º),Aquisição de bens móveis,"33140000-3, Material médico de consumo","Centro Hospitalar de Lisboa Ocidental, E. P. E. (507618319)","Clinifar, Produtos Clinicos Farmacêuiticos, S.A. (503281115)","1.740,69 €",02-01-2019,10-12-2018,365 dias,"Portugal, Lisboa, Lisboa",Artigo 259.º do Código dos Contratos Públicos,,,,,,2183753,CP 2016/82 - Acordo quadro para fornecimento de Nastros e Fitas Cirúrgicas às Instituições e Serviços do Serviço Nacional de Saúde,FALSE
13200058 - Aquisição de Nastros e Fitas Cirúrgicas para o CHLO,Ao abrigo de acordo-quadro (art.º 259.º),Aquisição de bens móveis,"33140000-3, Material médico de consumo","Centro Hospitalar de Lisboa Ocidental, E. P. E. (507618319)","Overpharma, Produtos Médicos e Farmacêuticos, Lda (505792362)","8.738,31 €",02-01-2019,03-12-2018,365 dias,"Portugal, Lisboa, Lisboa",Artigo 259.º do Código dos Contratos Públicos,,,,,,2183753,CP 2016/82 - Acordo quadro para fornecimento de Nastros e Fitas Cirúrgicas às Instituições e Serviços do Serviço Nacional de Saúde,FALSE
