Objeto do Contrato,Tipo de Procedimento,Tipo(s) de Contrato,CPVs,Entidade(s) Adjudicante(s),Entidade(s) Adjudicatária(s),Preço Contratual,Data de Publicação,Data de Celebração do Contrato,Prazo de Execução,Local de Execução,Fundamentação,Data de Fecho do Contrato,Preço Total Efetivo,Causas das Alterações ao Prazo,Causas das Alterações ao Preço,Estado,N.º registo do Acordo Quadro,Descrição do Acordo Quadro,Procedimento Centralizado
Aquisição de Toxina Botulinica A 500U,Ajuste Direto Regime Geral,Aquisição de bens móveis,"33600000-6, Produtos farmacêuticos",Centro de Medicina de Reabilitação da Região Centro - Rovisco Pais (503767336),"Ipsen Portugal - Produtos Farmacêuticos,S.A (502609800)","5.904,60 €",01-03-2013,12-02-2013,30 dias,"Portugal, Coimbra, Cantanhede","Artigo 26.º, n.º 1, alínea a) do Código dos Contratos Públicos",,,,,,Não aplicável.,Não aplicável.,
"Prestação de serviços de segurança e vigilancia, janeiro/2013",Ajuste Direto Regime Geral,Aquisição de serviços,"79714000-2, Serviços de vigilância",Centro de Medicina de Reabilitação da Região Centro - Rovisco Pais (503767336),"2045-Empresa de Segurança, S.A. (502332905)","5.422,02 €",28-02-2013,05-02-2013,30 dias,"Portugal, Coimbra, Cantanhede","Artigo 27.º, n.º 1, alínea a) do Código dos Contratos Públicos",,,,,,Não aplicável.,Não aplicável.,
