Objeto do Contrato,Tipo de Procedimento,Tipo(s) de Contrato,CPVs,Entidade(s) Adjudicante(s),Entidade(s) Adjudicatária(s),Preço Contratual,Data de Publicação,Data de Celebração do Contrato,Prazo de Execução,Local de Execução,Fundamentação,Data de Fecho do Contrato,Preço Total Efetivo,Causas das Alterações ao Prazo,Causas das Alterações ao Preço,Estado,N.º registo do Acordo Quadro,Descrição do Acordo Quadro,Procedimento Centralizado
"Aquisição de Prestação de Serviços de Recolha Interna, Recolha Externa, Transporte, Tratamento e Eliminação de Resíduos Hospitalares",Concurso público,Aquisição de serviços,"90524400-0, Recolha, transporte e eliminação de resíduos hospitalares","CENTRO HOSPITALAR DE ENTRE O DOURO E VOUGA, E.P.E. (508878462)","Ambimed - Gestão Ambiental, Lda (503593427)","188.337,95 €",31-01-2019,24-01-2019,365 dias,Portugal,"Artigo 20.º, n.º 1, alínea a) do Código dos Contratos Públicos",,,,,,Não aplicável.,Não aplicável.,FALSE
Aquisição de 3 Desfibrilhadores,Consulta Prévia,Aquisição de bens móveis,"33100000-1, Equipamento médico","CENTRO HOSPITALAR DE ENTRE O DOURO E VOUGA, E.P.E. (508878462)","Iberdata Equipamentos, S.A. (501904921)","14.200,00 €",29-01-2019,02-01-2019,60 dias,"Portugal, Aveiro, Santa Maria da Feira","Artigo 20.º, n.º 1, alínea c) do Código dos Contratos Públicos",,,,,,Não aplicável.,Não aplicável.,FALSE
AQUISIÇÃO DE PRESTAÇÃO DE SERVIÇOS PARA FORNECIMENTO DE ALIMENTAÇÃO,Concurso público,Aquisição de serviços,"55322000-3, Serviços de confecção de refeições","Centro Hospitalar de Entre o Douro e Vouga, E.P.E. (508878462)","UNISELF - SOCIEDADE DE RESTAURANTES PÚBLICOS E PRIVADOS, S.A. (501323325)","682.872,36 €",23-01-2019,17-01-2019,365 dias,"Portugal, Aveiro, Santa Maria da Feira","Artigo 20.º, n.º 1, alínea b) do Código dos Contratos Públicos",,,,,,Não aplicável.,Não aplicável.,FALSE
Concurso Público nº 02/00006.12/2019 - Aquisição de Reagentes de Biologia Molecular,Concurso público,Aquisição de bens móveis,"33696500-0, Reagentes de laboratório","Centro Hospitalar de Entre o Douro e Vouga, E.P.E. (508878462)","Werfen Portugal, Lda (501086110)","41.166,00 €",22-01-2019,07-01-2019,365 dias,"Portugal, Aveiro, Santa Maria da Feira","Artigo 20.º, n.º 1, alínea b) do Código dos Contratos Públicos",,,,,,Não aplicável.,Não aplicável.,FALSE
Serviços de Plataforma informática,Ajuste Direto Regime Geral,Aquisição de serviços<br/>Aquisição de bens móveis,"48000000-8, Pacotes de software e sistemas de informação","Centro Hospitalar de Entre o Douro e Vouga, E.P.E. (508878462)",SEAMLINK-Seamless Enterprise Link Lda  (508284538),"9.000,00 €",21-01-2019,18-01-2019,120 dias,"Portugal, Aveiro, Santa Maria da Feira","Artigo 20.º, n.º 1, alínea d) do Código dos Contratos Públicos",,,,,,Não aplicável.,Não aplicável.,FALSE
Aquisição de Sistema de transmissão de som / áudio,Consulta Prévia,Aquisição de bens móveis,"33000000-0, Equipamento médico, medicamentos e produtos para cuidados pessoais","Centro Hospitalar de Entre o Douro e Vouga, E.P.E. (508878462)",Olympus Ibéria S.A.U. (980474710),"11.347,50 €",21-01-2019,02-01-2019,45 dias,"Portugal, Aveiro, Santa Maria da Feira","Artigo 20.º, n.º 1, alínea c) do Código dos Contratos Públicos",,,,,,Não aplicável.,Não aplicável.,FALSE
