{
  "Comment.nvim": { "branch": "master", "commit": "6821b3ae27a57f1f3cf8ed030e4a55d70d0c4e43" },
  "LuaSnip": { "branch": "master", "commit": "500981ff6cefc7343e3959ef0f939bd0bfd49ba9" },
  "auto-pairs": { "branch": "master", "commit": "39f06b873a8449af8ff6a3eee716d3da14d63a76" },
  "cmp-buffer": { "branch": "main", "commit": "3022dbc9166796b644a841a02de8dd1cc1d311fa" },
  "cmp-cmdline": { "branch": "main", "commit": "8fcc934a52af96120fe26358985c10c035984b53" },
  "cmp-nvim-lsp": { "branch": "main", "commit": "0e6b2ed705ddcff9738ec4ea838141654f12eeef" },
  "cmp-path": { "branch": "main", "commit": "91ff86cd9c29299a64f968ebb45846c485725f23" },
  "cmp_luasnip": { "branch": "master", "commit": "18095520391186d634a0045dacaa346291096566" },
  "indent-blankline.nvim": { "branch": "master", "commit": "018bd04d80c9a73d399c1061fa0c3b14a7614399" },
  "kanagawa.nvim": { "branch": "master", "commit": "4c8d48726621a7f3998c7ed35b2c2535abc22def" },
  "lazy.nvim": { "branch": "main", "commit": "8077428e63feb0f3bf795d53b23ba1695b28ab0e" },
  "lspkind.nvim": { "branch": "master", "commit": "c68b3a003483cf382428a43035079f78474cd11e" },
  "lualine.nvim": { "branch": "master", "commit": "e99d733e0213ceb8f548ae6551b04ae32e590c80" },
  "neo-tree.nvim": { "branch": "v2.x", "commit": "245cf1e68840defcc75a16297740f6203f5a045d" },
  "neodev.nvim": { "branch": "main", "commit": "a81e749d0fe8429cd340b2e40f274b344bef42ac" },
  "nui.nvim": { "branch": "main", "commit": "d147222a1300901656f3ebd5b95f91732785a329" },
  "null-ls.nvim": { "branch": "main", "commit": "689cdd78f70af20a37b5309ebc287ac645ae4f76" },
  "numbers.nvim": { "branch": "master", "commit": "d1f95879a4cdf339f59e6a2dc6aef26912cf554c" },
  "nvim-cmp": { "branch": "main", "commit": "8202df9561b90102b41dbc1ad71945534ef4ea39" },
  "nvim-lspconfig": { "branch": "master", "commit": "b5db147e28337319331d516a826b00976f3584de" },
  "nvim-treesitter": { "branch": "master", "commit": "ce0dba96f47cd8bbd46b4c3ac8fd1b9502f1002a" },
  "nvim-ts-autotag": { "branch": "main", "commit": "fdefe46c6807441460f11f11a167a2baf8e4534b" },
  "nvim-web-devicons": { "branch": "master", "commit": "4709a504d2cd2680fb511675e64ef2790d491d36" },
  "plenary.nvim": { "branch": "master", "commit": "253d34830709d690f013daf2853a9d21ad7accab" },
  "telescope.nvim": { "branch": "master", "commit": "a486ac3e8fb2198f3636da1927ed57a28836fbd8" },
  "trouble.nvim": { "branch": "main", "commit": "3b754285635a66a93aeb15fa71a23417d8997217" },
  "typescript.nvim": { "branch": "main", "commit": "f66d4472606cb24615dfb7dbc6557e779d177624" },
  "vim-floaterm": { "branch": "master", "commit": "06c73980682f61307e890fe652d1343be82e7ec7" },
  "vim-fugitive": { "branch": "master", "commit": "62f42f013d866139fa23068ac2651b3f7e05a56f" },
  "vim-python-pep8-indent": { "branch": "master", "commit": "60ba5e11a61618c0344e2db190210145083c91f8" },
  "vimpeccable": { "branch": "master", "commit": "bd19b2a86a3d4a0ee184412aa3edb7ed57025d56" }
}