{
  "clientes": [
    {
      "id": "1",
      "nome": "VICTOR DE CASTRO",
      "cpf": "7158945657",
      "telefone": "719167851"
    },
    {
      "id": "2",
      "nome": "TAUAN MAZZIERO",
      "cpf": "7385296374",
      "telefone": "7192761993"
    },
    {
      "id": "3",
      "nome": "PEDRO GUIMARAES MENDES",
      "cpf": "7468685533",
      "telefone": "92791776"
    },
    {
      "id": "4",
      "nome": "RICARDO HENRIQUE GUIMARAES",
      "cpf": "7865435715",
      "telefone": "7191674589"
    },
    {
      "id": "5",
      "nome": "VÍTOR DE SOUZA COSTA",
      "cpf": "12587965422",
      "telefone": "7193002946"
    },
    {
      "id": "6",
      "nome": "VINÍCIUS PRADO",
      "cpf": "13159491565",
      "telefone": "91457898"
    }
  ]
}