# Blender MTL File: 'hover_bike.blend'
# Material Count: 1

newmtl Material
Ns 96.078431
Ka 0.000000 0.000000 0.000000
Kd 1.000000 1.000000 1.000000
Ks 0.100000 0.100000 0.100000
Ni 1.000000
d 1.000000
illum 2
map_Kd hover_bike.png
map_Bump hover_bike_dDo\\hover_bike_dDo_n.png
