solid propeller-innerCylinder
   facet normal -5.413177e-18 4.486527e-02 -9.989930e-01
      outer loop
         vertex 1.250000e+00 1.120491e-01 -1.244968e+00
         vertex 1.250000e+00 4.592425e-16 -1.250000e+00
         vertex -1.250000e+00 1.530808e-16 -1.250000e+00
      endloop
   endfacet
   facet normal 5.494410e-18 -4.486527e-02 -9.989930e-01
      outer loop
         vertex -1.250000e+00 1.530808e-16 -1.250000e+00
         vertex 1.250000e+00 4.592425e-16 -1.250000e+00
         vertex -1.250000e+00 -1.120491e-01 -1.244968e+00
      endloop
   endfacet
   facet normal 0.000000e+00 -4.486527e-02 -9.989930e-01
      outer loop
         vertex 1.250000e+00 4.592425e-16 -1.250000e+00
         vertex 1.250000e+00 -1.120491e-01 -1.244968e+00
         vertex -1.250000e+00 -1.120491e-01 -1.244968e+00
      endloop
   endfacet
   facet normal 0.000000e+00 -1.785568e-01 -9.839296e-01
      outer loop
         vertex -1.250000e+00 -1.120491e-01 -1.244968e+00
         vertex 1.250000e+00 -1.120491e-01 -1.244968e+00
         vertex 1.250000e+00 -3.325461e-01 -1.204954e+00
      endloop
   endfacet
   facet normal 0.000000e+00 -1.785568e-01 -9.839296e-01
      outer loop
         vertex -1.250000e+00 -1.120491e-01 -1.244968e+00
         vertex 1.250000e+00 -3.325461e-01 -1.204954e+00
         vertex -1.250000e+00 -3.325461e-01 -1.204954e+00
      endloop
   endfacet
   facet normal 0.000000e+00 -3.513748e-01 -9.362349e-01
      outer loop
         vertex -1.250000e+00 -3.325461e-01 -1.204954e+00
         vertex 1.250000e+00 -3.325461e-01 -1.204954e+00
         vertex 1.250000e+00 -5.423547e-01 -1.126211e+00
      endloop
   endfacet
   facet normal 0.000000e+00 -3.513748e-01 -9.362349e-01
      outer loop
         vertex -1.250000e+00 -3.325461e-01 -1.204954e+00
         vertex 1.250000e+00 -5.423547e-01 -1.126211e+00
         vertex -1.250000e+00 -5.423547e-01 -1.126211e+00
      endloop
   endfacet
   facet normal 0.000000e+00 -5.128992e-01 -8.584488e-01
      outer loop
         vertex -1.250000e+00 -5.423547e-01 -1.126211e+00
         vertex 1.250000e+00 -5.423547e-01 -1.126211e+00
         vertex 1.250000e+00 -7.347316e-01 -1.011271e+00
      endloop
   endfacet
   facet normal 0.000000e+00 -5.128992e-01 -8.584488e-01
      outer loop
         vertex -1.250000e+00 -5.423547e-01 -1.126211e+00
         vertex 1.250000e+00 -7.347316e-01 -1.011271e+00
         vertex -1.250000e+00 -7.347316e-01 -1.011271e+00
      endloop
   endfacet
   facet normal 0.000000e+00 -6.579387e-01 -7.530715e-01
      outer loop
         vertex -1.250000e+00 -7.347316e-01 -1.011271e+00
         vertex 1.250000e+00 -7.347316e-01 -1.011271e+00
         vertex 1.250000e+00 -9.034936e-01 -8.638283e-01
      endloop
   endfacet
   facet normal 0.000000e+00 -6.579387e-01 -7.530715e-01
      outer loop
         vertex -1.250000e+00 -7.347316e-01 -1.011271e+00
         vertex 1.250000e+00 -9.034936e-01 -8.638283e-01
         vertex -1.250000e+00 -9.034936e-01 -8.638283e-01
      endloop
   endfacet
   facet normal 0.000000e+00 -7.818314e-01 -6.234899e-01
      outer loop
         vertex -1.250000e+00 -9.034936e-01 -8.638283e-01
         vertex 1.250000e+00 -9.034936e-01 -8.638283e-01
         vertex 1.250000e+00 -1.043217e+00 -6.886212e-01
      endloop
   endfacet
   facet normal 0.000000e+00 -7.818314e-01 -6.234899e-01
      outer loop
         vertex -1.250000e+00 -9.034936e-01 -8.638283e-01
         vertex 1.250000e+00 -1.043217e+00 -6.886212e-01
         vertex -1.250000e+00 -1.043217e+00 -6.886212e-01
      endloop
   endfacet
   facet normal 0.000000e+00 -8.805954e-01 -4.738688e-01
      outer loop
         vertex -1.250000e+00 -1.043217e+00 -6.886212e-01
         vertex 1.250000e+00 -1.043217e+00 -6.886212e-01
         vertex 1.250000e+00 -1.149410e+00 -4.912813e-01
      endloop
   endfacet
   facet normal 0.000000e+00 -8.805954e-01 -4.738688e-01
      outer loop
         vertex -1.250000e+00 -1.043217e+00 -6.886212e-01
         vertex 1.250000e+00 -1.149410e+00 -4.912813e-01
         vertex -1.250000e+00 -1.149410e+00 -4.912813e-01
      endloop
   endfacet
   facet normal 0.000000e+00 -9.510566e-01 -3.090167e-01
      outer loop
         vertex -1.250000e+00 -1.149410e+00 -4.912813e-01
         vertex 1.250000e+00 -1.149410e+00 -4.912813e-01
         vertex 1.250000e+00 -1.218660e+00 -2.781512e-01
      endloop
   endfacet
   facet normal 0.000000e+00 -9.510566e-01 -3.090167e-01
      outer loop
         vertex -1.250000e+00 -1.149410e+00 -4.912813e-01
         vertex 1.250000e+00 -1.218660e+00 -2.781512e-01
         vertex -1.250000e+00 -1.218660e+00 -2.781512e-01
      endloop
   endfacet
   facet normal 0.000000e+00 -9.909497e-01 -1.342336e-01
      outer loop
         vertex -1.250000e+00 -1.218660e+00 -2.781512e-01
         vertex 1.250000e+00 -1.218660e+00 -2.781512e-01
         vertex 1.250000e+00 -1.248741e+00 -5.608104e-02
      endloop
   endfacet
   facet normal 0.000000e+00 -9.909497e-01 -1.342336e-01
      outer loop
         vertex -1.250000e+00 -1.218660e+00 -2.781512e-01
         vertex 1.250000e+00 -1.248741e+00 -5.608104e-02
         vertex -1.250000e+00 -1.248741e+00 -5.608104e-02
      endloop
   endfacet
   facet normal 0.000000e+00 -9.989930e-01 4.486528e-02
      outer loop
         vertex -1.250000e+00 -1.248741e+00 -5.608104e-02
         vertex 1.250000e+00 -1.248741e+00 -5.608104e-02
         vertex 1.250000e+00 -1.238687e+00 1.677916e-01
      endloop
   endfacet
   facet normal 0.000000e+00 -9.989930e-01 4.486528e-02
      outer loop
         vertex -1.250000e+00 -1.248741e+00 -5.608104e-02
         vertex 1.250000e+00 -1.238687e+00 1.677916e-01
         vertex -1.250000e+00 -1.238687e+00 1.677916e-01
      endloop
   endfacet
   facet normal 0.000000e+00 -9.749279e-01 2.225209e-01
      outer loop
         vertex -1.250000e+00 -1.238687e+00 1.677916e-01
         vertex 1.250000e+00 -1.238687e+00 1.677916e-01
         vertex 1.250000e+00 -1.188821e+00 3.862712e-01
      endloop
   endfacet
   facet normal 0.000000e+00 -9.749279e-01 2.225209e-01
      outer loop
         vertex -1.250000e+00 -1.238687e+00 1.677916e-01
         vertex 1.250000e+00 -1.188821e+00 3.862712e-01
         vertex -1.250000e+00 -1.188821e+00 3.862712e-01
      endloop
   endfacet
   facet normal 0.000000e+00 -9.195278e-01 3.930250e-01
      outer loop
         vertex -1.250000e+00 -1.188821e+00 3.862712e-01
         vertex 1.250000e+00 -1.188821e+00 3.862712e-01
         vertex 1.250000e+00 -1.100744e+00 5.923358e-01
      endloop
   endfacet
   facet normal 0.000000e+00 -9.195278e-01 3.930250e-01
      outer loop
         vertex -1.250000e+00 -1.188821e+00 3.862712e-01
         vertex 1.250000e+00 -1.100744e+00 5.923358e-01
         vertex -1.250000e+00 -1.100744e+00 5.923358e-01
      endloop
   endfacet
   facet normal 0.000000e+00 -8.345734e-01 5.508967e-01
      outer loop
         vertex -1.250000e+00 -1.100744e+00 5.923358e-01
         vertex 1.250000e+00 -1.100744e+00 5.923358e-01
         vertex 1.250000e+00 -9.772894e-01 7.793623e-01
      endloop
   endfacet
   facet normal 0.000000e+00 -8.345734e-01 5.508967e-01
      outer loop
         vertex -1.250000e+00 -1.100744e+00 5.923358e-01
         vertex 1.250000e+00 -9.772894e-01 7.793623e-01
         vertex -1.250000e+00 -9.772894e-01 7.793623e-01
      endloop
   endfacet
   facet normal 0.000000e+00 -7.227947e-01 6.910628e-01
      outer loop
         vertex -1.250000e+00 -9.772894e-01 7.793623e-01
         vertex 1.250000e+00 -9.772894e-01 7.793623e-01
         vertex 1.250000e+00 -8.224234e-01 9.413393e-01
      endloop
   endfacet
   facet normal 0.000000e+00 -7.227947e-01 6.910628e-01
      outer loop
         vertex -1.250000e+00 -9.772894e-01 7.793623e-01
         vertex 1.250000e+00 -8.224234e-01 9.413393e-01
         vertex -1.250000e+00 -8.224234e-01 9.413393e-01
      endloop
   endfacet
   facet normal 0.000000e+00 -5.877853e-01 8.090170e-01
      outer loop
         vertex -1.250000e+00 -8.224234e-01 9.413393e-01
         vertex 1.250000e+00 -8.224234e-01 9.413393e-01
         vertex 1.250000e+00 -6.411241e-01 1.073061e+00
      endloop
   endfacet
   facet normal 0.000000e+00 -5.877853e-01 8.090170e-01
      outer loop
         vertex -1.250000e+00 -8.224234e-01 9.413393e-01
         vertex 1.250000e+00 -6.411241e-01 1.073061e+00
         vertex -1.250000e+00 -6.411241e-01 1.073061e+00
      endloop
   endfacet
   facet normal 0.000000e+00 -4.338837e-01 9.009689e-01
      outer loop
         vertex -1.250000e+00 -6.411241e-01 1.073061e+00
         vertex 1.250000e+00 -6.411241e-01 1.073061e+00
         vertex 1.250000e+00 -4.392185e-01 1.170294e+00
      endloop
   endfacet
   facet normal 0.000000e+00 -4.338837e-01 9.009689e-01
      outer loop
         vertex -1.250000e+00 -6.411241e-01 1.073061e+00
         vertex 1.250000e+00 -4.392185e-01 1.170294e+00
         vertex -1.250000e+00 -4.392185e-01 1.170294e+00
      endloop
   endfacet
   facet normal 0.000000e+00 -2.660372e-01 9.639628e-01
      outer loop
         vertex -1.250000e+00 -4.392185e-01 1.170294e+00
         vertex 1.250000e+00 -4.392185e-01 1.170294e+00
         vertex 1.250000e+00 -2.231961e-01 1.229912e+00
      endloop
   endfacet
   facet normal 0.000000e+00 -2.660372e-01 9.639628e-01
      outer loop
         vertex -1.250000e+00 -4.392185e-01 1.170294e+00
         vertex 1.250000e+00 -2.231961e-01 1.229912e+00
         vertex -1.250000e+00 -2.231961e-01 1.229912e+00
      endloop
   endfacet
   facet normal 0.000000e+00 -8.963906e-02 9.959743e-01
      outer loop
         vertex -1.250000e+00 -2.231961e-01 1.229912e+00
         vertex 1.250000e+00 -2.231961e-01 1.229912e+00
         vertex 1.250000e+00 0.000000e+00 1.250000e+00
      endloop
   endfacet
   facet normal 0.000000e+00 -8.963906e-02 9.959743e-01
      outer loop
         vertex -1.250000e+00 -2.231961e-01 1.229912e+00
         vertex 1.250000e+00 0.000000e+00 1.250000e+00
         vertex -1.250000e+00 0.000000e+00 1.250000e+00
      endloop
   endfacet
   facet normal -0.000000e+00 8.963906e-02 9.959743e-01
      outer loop
         vertex -1.250000e+00 0.000000e+00 1.250000e+00
         vertex 1.250000e+00 0.000000e+00 1.250000e+00
         vertex 1.250000e+00 2.231961e-01 1.229912e+00
      endloop
   endfacet
   facet normal 0.000000e+00 8.963906e-02 9.959743e-01
      outer loop
         vertex -1.250000e+00 0.000000e+00 1.250000e+00
         vertex 1.250000e+00 2.231961e-01 1.229912e+00
         vertex -1.250000e+00 2.231961e-01 1.229912e+00
      endloop
   endfacet
   facet normal -0.000000e+00 2.660372e-01 9.639628e-01
      outer loop
         vertex -1.250000e+00 2.231961e-01 1.229912e+00
         vertex 1.250000e+00 2.231961e-01 1.229912e+00
         vertex 1.250000e+00 4.392185e-01 1.170294e+00
      endloop
   endfacet
   facet normal 0.000000e+00 2.660372e-01 9.639628e-01
      outer loop
         vertex -1.250000e+00 2.231961e-01 1.229912e+00
         vertex 1.250000e+00 4.392185e-01 1.170294e+00
         vertex -1.250000e+00 4.392185e-01 1.170294e+00
      endloop
   endfacet
   facet normal -0.000000e+00 4.338837e-01 9.009689e-01
      outer loop
         vertex -1.250000e+00 4.392185e-01 1.170294e+00
         vertex 1.250000e+00 4.392185e-01 1.170294e+00
         vertex 1.250000e+00 6.411241e-01 1.073061e+00
      endloop
   endfacet
   facet normal 0.000000e+00 4.338837e-01 9.009689e-01
      outer loop
         vertex -1.250000e+00 4.392185e-01 1.170294e+00
         vertex 1.250000e+00 6.411241e-01 1.073061e+00
         vertex -1.250000e+00 6.411241e-01 1.073061e+00
      endloop
   endfacet
   facet normal -0.000000e+00 5.877853e-01 8.090170e-01
      outer loop
         vertex -1.250000e+00 6.411241e-01 1.073061e+00
         vertex 1.250000e+00 6.411241e-01 1.073061e+00
         vertex 1.250000e+00 8.224234e-01 9.413393e-01
      endloop
   endfacet
   facet normal 0.000000e+00 5.877853e-01 8.090170e-01
      outer loop
         vertex -1.250000e+00 6.411241e-01 1.073061e+00
         vertex 1.250000e+00 8.224234e-01 9.413393e-01
         vertex -1.250000e+00 8.224234e-01 9.413393e-01
      endloop
   endfacet
   facet normal -0.000000e+00 7.227947e-01 6.910628e-01
      outer loop
         vertex -1.250000e+00 8.224234e-01 9.413393e-01
         vertex 1.250000e+00 8.224234e-01 9.413393e-01
         vertex 1.250000e+00 9.772894e-01 7.793623e-01
      endloop
   endfacet
   facet normal 0.000000e+00 7.227947e-01 6.910628e-01
      outer loop
         vertex -1.250000e+00 8.224234e-01 9.413393e-01
         vertex 1.250000e+00 9.772894e-01 7.793623e-01
         vertex -1.250000e+00 9.772894e-01 7.793623e-01
      endloop
   endfacet
   facet normal -0.000000e+00 8.345734e-01 5.508967e-01
      outer loop
         vertex -1.250000e+00 9.772894e-01 7.793623e-01
         vertex 1.250000e+00 9.772894e-01 7.793623e-01
         vertex 1.250000e+00 1.100744e+00 5.923358e-01
      endloop
   endfacet
   facet normal 0.000000e+00 8.345734e-01 5.508967e-01
      outer loop
         vertex -1.250000e+00 9.772894e-01 7.793623e-01
         vertex 1.250000e+00 1.100744e+00 5.923358e-01
         vertex -1.250000e+00 1.100744e+00 5.923358e-01
      endloop
   endfacet
   facet normal -0.000000e+00 9.195278e-01 3.930250e-01
      outer loop
         vertex -1.250000e+00 1.100744e+00 5.923358e-01
         vertex 1.250000e+00 1.100744e+00 5.923358e-01
         vertex 1.250000e+00 1.188821e+00 3.862712e-01
      endloop
   endfacet
   facet normal 0.000000e+00 9.195278e-01 3.930250e-01
      outer loop
         vertex -1.250000e+00 1.100744e+00 5.923358e-01
         vertex 1.250000e+00 1.188821e+00 3.862712e-01
         vertex -1.250000e+00 1.188821e+00 3.862712e-01
      endloop
   endfacet
   facet normal -0.000000e+00 9.749279e-01 2.225209e-01
      outer loop
         vertex -1.250000e+00 1.188821e+00 3.862712e-01
         vertex 1.250000e+00 1.188821e+00 3.862712e-01
         vertex 1.250000e+00 1.238687e+00 1.677916e-01
      endloop
   endfacet
   facet normal 0.000000e+00 9.749279e-01 2.225209e-01
      outer loop
         vertex -1.250000e+00 1.188821e+00 3.862712e-01
         vertex 1.250000e+00 1.238687e+00 1.677916e-01
         vertex -1.250000e+00 1.238687e+00 1.677916e-01
      endloop
   endfacet
   facet normal -0.000000e+00 9.989930e-01 4.486528e-02
      outer loop
         vertex -1.250000e+00 1.238687e+00 1.677916e-01
         vertex 1.250000e+00 1.238687e+00 1.677916e-01
         vertex 1.250000e+00 1.248741e+00 -5.608104e-02
      endloop
   endfacet
   facet normal 0.000000e+00 9.989930e-01 4.486528e-02
      outer loop
         vertex -1.250000e+00 1.238687e+00 1.677916e-01
         vertex 1.250000e+00 1.248741e+00 -5.608104e-02
         vertex -1.250000e+00 1.248741e+00 -5.608104e-02
      endloop
   endfacet
   facet normal 0.000000e+00 9.909497e-01 -1.342336e-01
      outer loop
         vertex -1.250000e+00 1.248741e+00 -5.608104e-02
         vertex 1.250000e+00 1.248741e+00 -5.608104e-02
         vertex 1.250000e+00 1.218660e+00 -2.781512e-01
      endloop
   endfacet
   facet normal 0.000000e+00 9.909497e-01 -1.342336e-01
      outer loop
         vertex -1.250000e+00 1.248741e+00 -5.608104e-02
         vertex 1.250000e+00 1.218660e+00 -2.781512e-01
         vertex -1.250000e+00 1.218660e+00 -2.781512e-01
      endloop
   endfacet
   facet normal 0.000000e+00 9.510566e-01 -3.090167e-01
      outer loop
         vertex -1.250000e+00 1.218660e+00 -2.781512e-01
         vertex 1.250000e+00 1.218660e+00 -2.781512e-01
         vertex 1.250000e+00 1.149410e+00 -4.912813e-01
      endloop
   endfacet
   facet normal 0.000000e+00 9.510566e-01 -3.090167e-01
      outer loop
         vertex -1.250000e+00 1.218660e+00 -2.781512e-01
         vertex 1.250000e+00 1.149410e+00 -4.912813e-01
         vertex -1.250000e+00 1.149410e+00 -4.912813e-01
      endloop
   endfacet
   facet normal 0.000000e+00 8.805954e-01 -4.738688e-01
      outer loop
         vertex -1.250000e+00 1.149410e+00 -4.912813e-01
         vertex 1.250000e+00 1.149410e+00 -4.912813e-01
         vertex 1.250000e+00 1.043217e+00 -6.886212e-01
      endloop
   endfacet
   facet normal 0.000000e+00 8.805954e-01 -4.738688e-01
      outer loop
         vertex -1.250000e+00 1.149410e+00 -4.912813e-01
         vertex 1.250000e+00 1.043217e+00 -6.886212e-01
         vertex -1.250000e+00 1.043217e+00 -6.886212e-01
      endloop
   endfacet
   facet normal 0.000000e+00 7.818314e-01 -6.234899e-01
      outer loop
         vertex -1.250000e+00 1.043217e+00 -6.886212e-01
         vertex 1.250000e+00 1.043217e+00 -6.886212e-01
         vertex 1.250000e+00 9.034936e-01 -8.638283e-01
      endloop
   endfacet
   facet normal 0.000000e+00 7.818314e-01 -6.234899e-01
      outer loop
         vertex -1.250000e+00 1.043217e+00 -6.886212e-01
         vertex 1.250000e+00 9.034936e-01 -8.638283e-01
         vertex -1.250000e+00 9.034936e-01 -8.638283e-01
      endloop
   endfacet
   facet normal 0.000000e+00 6.579387e-01 -7.530715e-01
      outer loop
         vertex -1.250000e+00 9.034936e-01 -8.638283e-01
         vertex 1.250000e+00 9.034936e-01 -8.638283e-01
         vertex 1.250000e+00 7.347316e-01 -1.011271e+00
      endloop
   endfacet
   facet normal 0.000000e+00 6.579387e-01 -7.530715e-01
      outer loop
         vertex -1.250000e+00 9.034936e-01 -8.638283e-01
         vertex 1.250000e+00 7.347316e-01 -1.011271e+00
         vertex -1.250000e+00 7.347316e-01 -1.011271e+00
      endloop
   endfacet
   facet normal 0.000000e+00 5.128992e-01 -8.584488e-01
      outer loop
         vertex -1.250000e+00 7.347316e-01 -1.011271e+00
         vertex 1.250000e+00 7.347316e-01 -1.011271e+00
         vertex 1.250000e+00 5.423547e-01 -1.126211e+00
      endloop
   endfacet
   facet normal 0.000000e+00 5.128992e-01 -8.584488e-01
      outer loop
         vertex -1.250000e+00 7.347316e-01 -1.011271e+00
         vertex 1.250000e+00 5.423547e-01 -1.126211e+00
         vertex -1.250000e+00 5.423547e-01 -1.126211e+00
      endloop
   endfacet
   facet normal 0.000000e+00 3.513748e-01 -9.362349e-01
      outer loop
         vertex -1.250000e+00 5.423547e-01 -1.126211e+00
         vertex 1.250000e+00 5.423547e-01 -1.126211e+00
         vertex 1.250000e+00 3.325461e-01 -1.204954e+00
      endloop
   endfacet
   facet normal 0.000000e+00 3.513748e-01 -9.362349e-01
      outer loop
         vertex -1.250000e+00 5.423547e-01 -1.126211e+00
         vertex 1.250000e+00 3.325461e-01 -1.204954e+00
         vertex -1.250000e+00 3.325461e-01 -1.204954e+00
      endloop
   endfacet
   facet normal 0.000000e+00 1.785568e-01 -9.839296e-01
      outer loop
         vertex -1.250000e+00 3.325461e-01 -1.204954e+00
         vertex 1.250000e+00 3.325461e-01 -1.204954e+00
         vertex 1.250000e+00 1.120491e-01 -1.244968e+00
      endloop
   endfacet
   facet normal 0.000000e+00 1.785568e-01 -9.839296e-01
      outer loop
         vertex -1.250000e+00 3.325461e-01 -1.204954e+00
         vertex 1.250000e+00 1.120491e-01 -1.244968e+00
         vertex -1.250000e+00 1.120491e-01 -1.244968e+00
      endloop
   endfacet
   facet normal 0.000000e+00 4.486527e-02 -9.989930e-01
      outer loop
         vertex -1.250000e+00 1.120491e-01 -1.244968e+00
         vertex 1.250000e+00 1.120491e-01 -1.244968e+00
         vertex -1.250000e+00 1.530808e-16 -1.250000e+00
      endloop
   endfacet
   facet normal 1.000000e+00 -0.000000e+00 0.000000e+00
      outer loop
         vertex 1.250000e+00 -3.325461e-01 -1.204954e+00
         vertex 1.250000e+00 -1.120491e-01 -1.244968e+00
         vertex 1.250000e+00 0.000000e+00 0.000000e+00
      endloop
   endfacet
   facet normal 1.000000e+00 0.000000e+00 0.000000e+00
      outer loop
         vertex 1.250000e+00 0.000000e+00 0.000000e+00
         vertex 1.250000e+00 -1.120491e-01 -1.244968e+00
         vertex 1.250000e+00 1.530808e-16 -1.250000e+00
      endloop
   endfacet
   facet normal 1.000000e+00 0.000000e+00 0.000000e+00
      outer loop
         vertex 1.250000e+00 0.000000e+00 0.000000e+00
         vertex 1.250000e+00 1.530808e-16 -1.250000e+00
         vertex 1.250000e+00 1.120491e-01 -1.244968e+00
      endloop
   endfacet
   facet normal 1.000000e+00 -0.000000e+00 0.000000e+00
      outer loop
         vertex 1.250000e+00 -9.034936e-01 -8.638283e-01
         vertex 1.250000e+00 -7.347316e-01 -1.011271e+00
         vertex 1.250000e+00 0.000000e+00 0.000000e+00
      endloop
   endfacet
   facet normal 1.000000e+00 0.000000e+00 0.000000e+00
      outer loop
         vertex 1.250000e+00 0.000000e+00 0.000000e+00
         vertex 1.250000e+00 -7.347316e-01 -1.011271e+00
         vertex 1.250000e+00 -5.423547e-01 -1.126211e+00
      endloop
   endfacet
   facet normal 1.000000e+00 0.000000e+00 0.000000e+00
      outer loop
         vertex 1.250000e+00 0.000000e+00 0.000000e+00
         vertex 1.250000e+00 -5.423547e-01 -1.126211e+00
         vertex 1.250000e+00 -3.325461e-01 -1.204954e+00
      endloop
   endfacet
   facet normal 1.000000e+00 -0.000000e+00 0.000000e+00
      outer loop
         vertex 1.250000e+00 -1.218660e+00 -2.781512e-01
         vertex 1.250000e+00 -1.149410e+00 -4.912813e-01
         vertex 1.250000e+00 0.000000e+00 0.000000e+00
      endloop
   endfacet
   facet normal 1.000000e+00 0.000000e+00 0.000000e+00
      outer loop
         vertex 1.250000e+00 0.000000e+00 0.000000e+00
         vertex 1.250000e+00 -1.149410e+00 -4.912813e-01
         vertex 1.250000e+00 -1.043217e+00 -6.886212e-01
      endloop
   endfacet
   facet normal 1.000000e+00 0.000000e+00 0.000000e+00
      outer loop
         vertex 1.250000e+00 0.000000e+00 0.000000e+00
         vertex 1.250000e+00 -1.043217e+00 -6.886212e-01
         vertex 1.250000e+00 -9.034936e-01 -8.638283e-01
      endloop
   endfacet
   facet normal 1.000000e+00 0.000000e+00 0.000000e+00
      outer loop
         vertex 1.250000e+00 -1.188821e+00 3.862712e-01
         vertex 1.250000e+00 -1.238687e+00 1.677916e-01
         vertex 1.250000e+00 0.000000e+00 0.000000e+00
      endloop
   endfacet
   facet normal 1.000000e+00 0.000000e+00 0.000000e+00
      outer loop
         vertex 1.250000e+00 0.000000e+00 0.000000e+00
         vertex 1.250000e+00 -1.238687e+00 1.677916e-01
         vertex 1.250000e+00 -1.248741e+00 -5.608104e-02
      endloop
   endfacet
   facet normal 1.000000e+00 0.000000e+00 0.000000e+00
      outer loop
         vertex 1.250000e+00 0.000000e+00 0.000000e+00
         vertex 1.250000e+00 -1.248741e+00 -5.608104e-02
         vertex 1.250000e+00 -1.218660e+00 -2.781512e-01
      endloop
   endfacet
   facet normal 1.000000e+00 0.000000e+00 0.000000e+00
      outer loop
         vertex 1.250000e+00 -8.224234e-01 9.413393e-01
         vertex 1.250000e+00 -9.772894e-01 7.793623e-01
         vertex 1.250000e+00 0.000000e+00 0.000000e+00
      endloop
   endfacet
   facet normal 1.000000e+00 0.000000e+00 0.000000e+00
      outer loop
         vertex 1.250000e+00 0.000000e+00 0.000000e+00
         vertex 1.250000e+00 -9.772894e-01 7.793623e-01
         vertex 1.250000e+00 -1.100744e+00 5.923358e-01
      endloop
   endfacet
   facet normal 1.000000e+00 0.000000e+00 0.000000e+00
      outer loop
         vertex 1.250000e+00 0.000000e+00 0.000000e+00
         vertex 1.250000e+00 -1.100744e+00 5.923358e-01
         vertex 1.250000e+00 -1.188821e+00 3.862712e-01
      endloop
   endfacet
   facet normal 1.000000e+00 0.000000e+00 0.000000e+00
      outer loop
         vertex 1.250000e+00 -2.231961e-01 1.229912e+00
         vertex 1.250000e+00 -4.392185e-01 1.170294e+00
         vertex 1.250000e+00 0.000000e+00 0.000000e+00
      endloop
   endfacet
   facet normal 1.000000e+00 0.000000e+00 0.000000e+00
      outer loop
         vertex 1.250000e+00 0.000000e+00 0.000000e+00
         vertex 1.250000e+00 -4.392185e-01 1.170294e+00
         vertex 1.250000e+00 -6.411241e-01 1.073061e+00
      endloop
   endfacet
   facet normal 1.000000e+00 0.000000e+00 0.000000e+00
      outer loop
         vertex 1.250000e+00 0.000000e+00 0.000000e+00
         vertex 1.250000e+00 -6.411241e-01 1.073061e+00
         vertex 1.250000e+00 -8.224234e-01 9.413393e-01
      endloop
   endfacet
   facet normal 1.000000e+00 0.000000e+00 0.000000e+00
      outer loop
         vertex 1.250000e+00 4.392185e-01 1.170294e+00
         vertex 1.250000e+00 2.231961e-01 1.229912e+00
         vertex 1.250000e+00 0.000000e+00 0.000000e+00
      endloop
   endfacet
   facet normal 1.000000e+00 0.000000e+00 0.000000e+00
      outer loop
         vertex 1.250000e+00 0.000000e+00 0.000000e+00
         vertex 1.250000e+00 2.231961e-01 1.229912e+00
         vertex 1.250000e+00 0.000000e+00 1.250000e+00
      endloop
   endfacet
   facet normal 1.000000e+00 0.000000e+00 -0.000000e+00
      outer loop
         vertex 1.250000e+00 0.000000e+00 0.000000e+00
         vertex 1.250000e+00 0.000000e+00 1.250000e+00
         vertex 1.250000e+00 -2.231961e-01 1.229912e+00
      endloop
   endfacet
   facet normal 1.000000e+00 0.000000e+00 0.000000e+00
      outer loop
         vertex 1.250000e+00 9.772894e-01 7.793623e-01
         vertex 1.250000e+00 8.224234e-01 9.413393e-01
         vertex 1.250000e+00 0.000000e+00 0.000000e+00
      endloop
   endfacet
   facet normal 1.000000e+00 0.000000e+00 0.000000e+00
      outer loop
         vertex 1.250000e+00 0.000000e+00 0.000000e+00
         vertex 1.250000e+00 8.224234e-01 9.413393e-01
         vertex 1.250000e+00 6.411241e-01 1.073061e+00
      endloop
   endfacet
   facet normal 1.000000e+00 0.000000e+00 0.000000e+00
      outer loop
         vertex 1.250000e+00 0.000000e+00 0.000000e+00
         vertex 1.250000e+00 6.411241e-01 1.073061e+00
         vertex 1.250000e+00 4.392185e-01 1.170294e+00
      endloop
   endfacet
   facet normal 1.000000e+00 0.000000e+00 0.000000e+00
      outer loop
         vertex 1.250000e+00 1.238687e+00 1.677916e-01
         vertex 1.250000e+00 1.188821e+00 3.862712e-01
         vertex 1.250000e+00 0.000000e+00 0.000000e+00
      endloop
   endfacet
   facet normal 1.000000e+00 0.000000e+00 0.000000e+00
      outer loop
         vertex 1.250000e+00 0.000000e+00 0.000000e+00
         vertex 1.250000e+00 1.188821e+00 3.862712e-01
         vertex 1.250000e+00 1.100744e+00 5.923358e-01
      endloop
   endfacet
   facet normal 1.000000e+00 0.000000e+00 0.000000e+00
      outer loop
         vertex 1.250000e+00 0.000000e+00 0.000000e+00
         vertex 1.250000e+00 1.100744e+00 5.923358e-01
         vertex 1.250000e+00 9.772894e-01 7.793623e-01
      endloop
   endfacet
   facet normal 1.000000e+00 0.000000e+00 -0.000000e+00
      outer loop
         vertex 1.250000e+00 1.149410e+00 -4.912813e-01
         vertex 1.250000e+00 1.218660e+00 -2.781512e-01
         vertex 1.250000e+00 0.000000e+00 0.000000e+00
      endloop
   endfacet
   facet normal 1.000000e+00 0.000000e+00 0.000000e+00
      outer loop
         vertex 1.250000e+00 0.000000e+00 0.000000e+00
         vertex 1.250000e+00 1.218660e+00 -2.781512e-01
         vertex 1.250000e+00 1.248741e+00 -5.608104e-02
      endloop
   endfacet
   facet normal 1.000000e+00 -0.000000e+00 0.000000e+00
      outer loop
         vertex 1.250000e+00 0.000000e+00 0.000000e+00
         vertex 1.250000e+00 1.248741e+00 -5.608104e-02
         vertex 1.250000e+00 1.238687e+00 1.677916e-01
      endloop
   endfacet
   facet normal 1.000000e+00 0.000000e+00 -0.000000e+00
      outer loop
         vertex 1.250000e+00 7.347316e-01 -1.011271e+00
         vertex 1.250000e+00 9.034936e-01 -8.638283e-01
         vertex 1.250000e+00 0.000000e+00 0.000000e+00
      endloop
   endfacet
   facet normal 1.000000e+00 0.000000e+00 0.000000e+00
      outer loop
         vertex 1.250000e+00 0.000000e+00 0.000000e+00
         vertex 1.250000e+00 9.034936e-01 -8.638283e-01
         vertex 1.250000e+00 1.043217e+00 -6.886212e-01
      endloop
   endfacet
   facet normal 1.000000e+00 0.000000e+00 0.000000e+00
      outer loop
         vertex 1.250000e+00 0.000000e+00 0.000000e+00
         vertex 1.250000e+00 1.043217e+00 -6.886212e-01
         vertex 1.250000e+00 1.149410e+00 -4.912813e-01
      endloop
   endfacet
   facet normal 1.000000e+00 0.000000e+00 -0.000000e+00
      outer loop
         vertex 1.250000e+00 1.120491e-01 -1.244968e+00
         vertex 1.250000e+00 3.325461e-01 -1.204954e+00
         vertex 1.250000e+00 0.000000e+00 0.000000e+00
      endloop
   endfacet
   facet normal 1.000000e+00 0.000000e+00 0.000000e+00
      outer loop
         vertex 1.250000e+00 0.000000e+00 0.000000e+00
         vertex 1.250000e+00 3.325461e-01 -1.204954e+00
         vertex 1.250000e+00 5.423547e-01 -1.126211e+00
      endloop
   endfacet
   facet normal 1.000000e+00 0.000000e+00 0.000000e+00
      outer loop
         vertex 1.250000e+00 0.000000e+00 0.000000e+00
         vertex 1.250000e+00 5.423547e-01 -1.126211e+00
         vertex 1.250000e+00 7.347316e-01 -1.011271e+00
      endloop
   endfacet
   facet normal -1.000000e+00 -0.000000e+00 0.000000e+00
      outer loop
         vertex -1.250000e+00 3.325461e-01 -1.204954e+00
         vertex -1.250000e+00 1.120491e-01 -1.244968e+00
         vertex -1.250000e+00 0.000000e+00 0.000000e+00
      endloop
   endfacet
   facet normal -1.000000e+00 0.000000e+00 0.000000e+00
      outer loop
         vertex -1.250000e+00 0.000000e+00 0.000000e+00
         vertex -1.250000e+00 1.120491e-01 -1.244968e+00
         vertex -1.250000e+00 4.592425e-16 -1.250000e+00
      endloop
   endfacet
   facet normal -1.000000e+00 0.000000e+00 -0.000000e+00
      outer loop
         vertex -1.250000e+00 0.000000e+00 0.000000e+00
         vertex -1.250000e+00 4.592425e-16 -1.250000e+00
         vertex -1.250000e+00 -1.120491e-01 -1.244968e+00
      endloop
   endfacet
   facet normal -1.000000e+00 -0.000000e+00 0.000000e+00
      outer loop
         vertex -1.250000e+00 9.034936e-01 -8.638283e-01
         vertex -1.250000e+00 7.347316e-01 -1.011271e+00
         vertex -1.250000e+00 0.000000e+00 0.000000e+00
      endloop
   endfacet
   facet normal -1.000000e+00 0.000000e+00 0.000000e+00
      outer loop
         vertex -1.250000e+00 0.000000e+00 0.000000e+00
         vertex -1.250000e+00 7.347316e-01 -1.011271e+00
         vertex -1.250000e+00 5.423547e-01 -1.126211e+00
      endloop
   endfacet
   facet normal -1.000000e+00 0.000000e+00 0.000000e+00
      outer loop
         vertex -1.250000e+00 0.000000e+00 0.000000e+00
         vertex -1.250000e+00 5.423547e-01 -1.126211e+00
         vertex -1.250000e+00 3.325461e-01 -1.204954e+00
      endloop
   endfacet
   facet normal -1.000000e+00 -0.000000e+00 0.000000e+00
      outer loop
         vertex -1.250000e+00 1.218660e+00 -2.781512e-01
         vertex -1.250000e+00 1.149410e+00 -4.912813e-01
         vertex -1.250000e+00 0.000000e+00 0.000000e+00
      endloop
   endfacet
   facet normal -1.000000e+00 0.000000e+00 0.000000e+00
      outer loop
         vertex -1.250000e+00 0.000000e+00 0.000000e+00
         vertex -1.250000e+00 1.149410e+00 -4.912813e-01
         vertex -1.250000e+00 1.043217e+00 -6.886212e-01
      endloop
   endfacet
   facet normal -1.000000e+00 0.000000e+00 0.000000e+00
      outer loop
         vertex -1.250000e+00 0.000000e+00 0.000000e+00
         vertex -1.250000e+00 1.043217e+00 -6.886212e-01
         vertex -1.250000e+00 9.034936e-01 -8.638283e-01
      endloop
   endfacet
   facet normal -1.000000e+00 0.000000e+00 -0.000000e+00
      outer loop
         vertex -1.250000e+00 1.188821e+00 3.862712e-01
         vertex -1.250000e+00 1.238687e+00 1.677916e-01
         vertex -1.250000e+00 0.000000e+00 0.000000e+00
      endloop
   endfacet
   facet normal -1.000000e+00 0.000000e+00 0.000000e+00
      outer loop
         vertex -1.250000e+00 0.000000e+00 0.000000e+00
         vertex -1.250000e+00 1.238687e+00 1.677916e-01
         vertex -1.250000e+00 1.248741e+00 -5.608104e-02
      endloop
   endfacet
   facet normal -1.000000e+00 0.000000e+00 0.000000e+00
      outer loop
         vertex -1.250000e+00 0.000000e+00 0.000000e+00
         vertex -1.250000e+00 1.248741e+00 -5.608104e-02
         vertex -1.250000e+00 1.218660e+00 -2.781512e-01
      endloop
   endfacet
   facet normal -1.000000e+00 0.000000e+00 -0.000000e+00
      outer loop
         vertex -1.250000e+00 8.224234e-01 9.413393e-01
         vertex -1.250000e+00 9.772894e-01 7.793623e-01
         vertex -1.250000e+00 0.000000e+00 0.000000e+00
      endloop
   endfacet
   facet normal -1.000000e+00 0.000000e+00 0.000000e+00
      outer loop
         vertex -1.250000e+00 0.000000e+00 0.000000e+00
         vertex -1.250000e+00 9.772894e-01 7.793623e-01
         vertex -1.250000e+00 1.100744e+00 5.923358e-01
      endloop
   endfacet
   facet normal -1.000000e+00 0.000000e+00 0.000000e+00
      outer loop
         vertex -1.250000e+00 0.000000e+00 0.000000e+00
         vertex -1.250000e+00 1.100744e+00 5.923358e-01
         vertex -1.250000e+00 1.188821e+00 3.862712e-01
      endloop
   endfacet
   facet normal -1.000000e+00 0.000000e+00 -0.000000e+00
      outer loop
         vertex -1.250000e+00 2.231961e-01 1.229912e+00
         vertex -1.250000e+00 4.392185e-01 1.170294e+00
         vertex -1.250000e+00 0.000000e+00 0.000000e+00
      endloop
   endfacet
   facet normal -1.000000e+00 0.000000e+00 0.000000e+00
      outer loop
         vertex -1.250000e+00 0.000000e+00 0.000000e+00
         vertex -1.250000e+00 4.392185e-01 1.170294e+00
         vertex -1.250000e+00 6.411241e-01 1.073061e+00
      endloop
   endfacet
   facet normal -1.000000e+00 0.000000e+00 0.000000e+00
      outer loop
         vertex -1.250000e+00 0.000000e+00 0.000000e+00
         vertex -1.250000e+00 6.411241e-01 1.073061e+00
         vertex -1.250000e+00 8.224234e-01 9.413393e-01
      endloop
   endfacet
   facet normal -1.000000e+00 0.000000e+00 0.000000e+00
      outer loop
         vertex -1.250000e+00 -4.392185e-01 1.170294e+00
         vertex -1.250000e+00 -2.231961e-01 1.229912e+00
         vertex -1.250000e+00 0.000000e+00 0.000000e+00
      endloop
   endfacet
   facet normal -1.000000e+00 0.000000e+00 0.000000e+00
      outer loop
         vertex -1.250000e+00 0.000000e+00 0.000000e+00
         vertex -1.250000e+00 -2.231961e-01 1.229912e+00
         vertex -1.250000e+00 0.000000e+00 1.250000e+00
      endloop
   endfacet
   facet normal -1.000000e+00 0.000000e+00 0.000000e+00
      outer loop
         vertex -1.250000e+00 0.000000e+00 0.000000e+00
         vertex -1.250000e+00 0.000000e+00 1.250000e+00
         vertex -1.250000e+00 2.231961e-01 1.229912e+00
      endloop
   endfacet
   facet normal -1.000000e+00 0.000000e+00 0.000000e+00
      outer loop
         vertex -1.250000e+00 -9.772894e-01 7.793623e-01
         vertex -1.250000e+00 -8.224234e-01 9.413393e-01
         vertex -1.250000e+00 0.000000e+00 0.000000e+00
      endloop
   endfacet
   facet normal -1.000000e+00 0.000000e+00 0.000000e+00
      outer loop
         vertex -1.250000e+00 0.000000e+00 0.000000e+00
         vertex -1.250000e+00 -8.224234e-01 9.413393e-01
         vertex -1.250000e+00 -6.411241e-01 1.073061e+00
      endloop
   endfacet
   facet normal -1.000000e+00 0.000000e+00 0.000000e+00
      outer loop
         vertex -1.250000e+00 0.000000e+00 0.000000e+00
         vertex -1.250000e+00 -6.411241e-01 1.073061e+00
         vertex -1.250000e+00 -4.392185e-01 1.170294e+00
      endloop
   endfacet
   facet normal -1.000000e+00 0.000000e+00 0.000000e+00
      outer loop
         vertex -1.250000e+00 -1.238687e+00 1.677916e-01
         vertex -1.250000e+00 -1.188821e+00 3.862712e-01
         vertex -1.250000e+00 0.000000e+00 0.000000e+00
      endloop
   endfacet
   facet normal -1.000000e+00 0.000000e+00 0.000000e+00
      outer loop
         vertex -1.250000e+00 0.000000e+00 0.000000e+00
         vertex -1.250000e+00 -1.188821e+00 3.862712e-01
         vertex -1.250000e+00 -1.100744e+00 5.923358e-01
      endloop
   endfacet
   facet normal -1.000000e+00 0.000000e+00 0.000000e+00
      outer loop
         vertex -1.250000e+00 0.000000e+00 0.000000e+00
         vertex -1.250000e+00 -1.100744e+00 5.923358e-01
         vertex -1.250000e+00 -9.772894e-01 7.793623e-01
      endloop
   endfacet
   facet normal -1.000000e+00 0.000000e+00 0.000000e+00
      outer loop
         vertex -1.250000e+00 -1.149410e+00 -4.912813e-01
         vertex -1.250000e+00 -1.218660e+00 -2.781512e-01
         vertex -1.250000e+00 0.000000e+00 0.000000e+00
      endloop
   endfacet
   facet normal -1.000000e+00 0.000000e+00 0.000000e+00
      outer loop
         vertex -1.250000e+00 0.000000e+00 0.000000e+00
         vertex -1.250000e+00 -1.218660e+00 -2.781512e-01
         vertex -1.250000e+00 -1.248741e+00 -5.608104e-02
      endloop
   endfacet
   facet normal -1.000000e+00 -0.000000e+00 0.000000e+00
      outer loop
         vertex -1.250000e+00 0.000000e+00 0.000000e+00
         vertex -1.250000e+00 -1.248741e+00 -5.608104e-02
         vertex -1.250000e+00 -1.238687e+00 1.677916e-01
      endloop
   endfacet
   facet normal -1.000000e+00 0.000000e+00 0.000000e+00
      outer loop
         vertex -1.250000e+00 -7.347316e-01 -1.011271e+00
         vertex -1.250000e+00 -9.034936e-01 -8.638283e-01
         vertex -1.250000e+00 0.000000e+00 0.000000e+00
      endloop
   endfacet
   facet normal -1.000000e+00 0.000000e+00 0.000000e+00
      outer loop
         vertex -1.250000e+00 0.000000e+00 0.000000e+00
         vertex -1.250000e+00 -9.034936e-01 -8.638283e-01
         vertex -1.250000e+00 -1.043217e+00 -6.886212e-01
      endloop
   endfacet
   facet normal -1.000000e+00 0.000000e+00 0.000000e+00
      outer loop
         vertex -1.250000e+00 0.000000e+00 0.000000e+00
         vertex -1.250000e+00 -1.043217e+00 -6.886212e-01
         vertex -1.250000e+00 -1.149410e+00 -4.912813e-01
      endloop
   endfacet
   facet normal -1.000000e+00 0.000000e+00 0.000000e+00
      outer loop
         vertex -1.250000e+00 -1.120491e-01 -1.244968e+00
         vertex -1.250000e+00 -3.325461e-01 -1.204954e+00
         vertex -1.250000e+00 0.000000e+00 0.000000e+00
      endloop
   endfacet
   facet normal -1.000000e+00 0.000000e+00 0.000000e+00
      outer loop
         vertex -1.250000e+00 0.000000e+00 0.000000e+00
         vertex -1.250000e+00 -3.325461e-01 -1.204954e+00
         vertex -1.250000e+00 -5.423547e-01 -1.126211e+00
      endloop
   endfacet
   facet normal -1.000000e+00 0.000000e+00 0.000000e+00
      outer loop
         vertex -1.250000e+00 0.000000e+00 0.000000e+00
         vertex -1.250000e+00 -5.423547e-01 -1.126211e+00
         vertex -1.250000e+00 -7.347316e-01 -1.011271e+00
      endloop
   endfacet
endsolid propeller-innerCylinder