{
  "version": 2,
  "builds": [
      {
          "src": "Backend/FarmaApi/main.py",
          "use": "@vercel/python"
      }
  ],
  "routes":[
      {
          "src": "/(.*)",
          "dest": "Backend/FarmaApi/main.py"
      }
  ]
}