<?xml version="1.0" encoding="utf-8"?>
<!-- Generator: Adobe Illustrator 19.0.0, SVG Export Plug-In . SVG Version: 6.00 Build 0)  -->
<svg version="1.1" id="Capa_1" xmlns="http://www.w3.org/2000/svg" xmlns:xlink="http://www.w3.org/1999/xlink" x="0px" y="0px"
	 viewBox="0 0 100 100" style="enable-background:new 0 0 100 100;" xml:space="preserve">
<style type="text/css">
	.st0{fill-rule:evenodd;clip-rule:evenodd;fill:#0298d5;}
</style>
<path id="XMLID_2_" class="st0" d="M66.6,49.3h-8.8v-8.8h-8.8v8.8h-8.8V58h8.8v8.8h8.8V58h8.8V49.3z M62.3,27.3H44.7v4.4h17.5V27.3z
	 M80.1,75.5H26.9c-2.2,0-4.1-1.8-4.1-4.1V35.9c0-2.3,1.8-4.1,4.1-4.1l13.5,0v-6.6c0-1.5,0.9-2.2,2.4-2.2h21.6c1.5,0,2.4,0.7,2.4,2.2
	v6.6l13.5,0c2.2,0,4.1,1.9,4.1,4.1v35.5C84.2,73.7,82.4,75.5,80.1,75.5z"/>
</svg>
