<?xml version="1.0" encoding="utf-8"?>
<!-- Generator: Adobe Illustrator 19.0.0, SVG Export Plug-In . SVG Version: 6.00 Build 0)  -->
<svg version="1.1" id="Capa_1" xmlns="http://www.w3.org/2000/svg" xmlns:xlink="http://www.w3.org/1999/xlink" x="0px" y="0px"
	 viewBox="0 0 100 100" style="enable-background:new 0 0 100 100;" xml:space="preserve">
<style type="text/css">
	.st0{fill-rule:evenodd;clip-rule:evenodd;fill:#0298d5;}
</style>
<path id="XMLID_6_" class="st0" d="M38.7,32.5v36.6c0,8.3,6.2,15,13.9,15s13.9-6.7,13.9-15V32.5c0-8.3-6.2-15-13.9-15
	S38.7,24.3,38.7,32.5z M41.5,50.8h22.2v18.6c0,6.5-5,11.8-11.1,11.8S41.5,76,41.5,69.5V50.8z"/>
</svg>
