[
    {
        "id": "001",
        "categoria_id": "001",
        "nombre_comercial": "Diklason® AP",
        "nombre_generico": "Diclofenac potásico",
        "forma_farmaceutica": "Comprimido de acción prolongada",
        "concentracion": "100mg",
        "via_administracion": "Oral",
        "laboratorio": "Leti",
        "lote": "0011021111",
        "fecha_vencimiento": "2025-12-31",
        "registro_sanitario": "CPE061433583",
        "condicion_venta": "Sin receta",
        "precio": 10.5,
        "stock_disponible": 40,
        "codigo_barras": "012548745454487845454",
        "pais_origen": "Venezuela",
        "precauciones": "No exceda la dosis prescrita. Manténgase fuera del alcance de los niños.",
        "imagen_coleccion": [
            "img/medicamentos/diklason1.JPG",
            "img/medicamentos/diklason2.JPG",
            "img/medicamentos/diklason3.JPG"
        ],
        "reacciones_adversas": [
            "Trastornos del tubo digestivo",
            "Síntomas de alergia"
        ],
        "indicaciones": "Administrar bajo vigilancia médica. Suspender lactancia si es necesario.",
        "contraindicaciones": [
            "Alergia a los componentes de la fórmula",
            "Úlcera gastroduodenal activa",
            "Alergia al ácido acetilsalicílico",
            "Alergia a antiinflamatorios no esteroideos"
        ],
        "uso_durante_embarazo": "No administrar durante el embarazo salvo indicación médica.",
        "condiciones_almacenamiento": "Conservar en lugar fresco y seco, a temperatura inferior a 30°C.",
        "imagen": "img/medicamentos/diklason1.JPG",
        "ambito_uso": "Analgésico",
        "formula": "Diclofenac Potásico 100,00 mg, Lactosa 75,75 mg. Excipientes C.S.",
        "accion_terapeutica": "Analgésico y antiinflamatorio.",
        "via_administracion_dosis": "Administrar según indicación médica.",
        "dosis_presentacion": "Caja con 20 comprimidos de acción prolongada."
    },
    {
        "id": "002", 
        "categoria_id": "001",
        "nombre_comercial": "Aflamax®",
        "nombre_generico": "Diclofenac potásico",
        "forma_farmaceutica": "Tabletas recubiertas",
        "concentracion": "50 mg",
        "via_administracion": "Oral", 
        "laboratorio": "OFTALMI", 
        "lote": "087561215855",
        "fecha_vencimiento": "12/12/2030",
        "registro_sanitario": "AC021541455P",
        "condicion_venta": "Bajo receta médica", 
        "precio": 150.26,
        "stock_disponible":45,
        "codigo_barras": "0000254855",
        "pais_origen": "Venezuela",
        "precauciones": "Producto de uso delicado. Debe ser administrado bajo vigilancia médica. Informar al médico cualquier efecto indeseable, especialmente del tracto digestivo. No administrar durante el embarazo o lactancia. Mantener fuera del alcance de los niños. No exceder la dosis prescrita.",
        "imagen_coleccion": [
            "img/medicamentos/aflamax1.JPG",
            "img/medicamentos/aflamax2.JPG"
        ],
        "reacciones_adversas": [
            "Trastornos del tubo digestivo",
            "Síntomas de alergia"
        ],
        "indicaciones": "Tratamiento de afecciones con inflamación y/o dolor leve a moderado. Dismenorrea primaria. Migraña.",
        "contraindicaciones": [
            "Alergia a los componentes.",
            "Úlcera gastroduodenal.",
            "Insuficiencia hepática.",
            "Asma",
            "urticaria u otras alergias por AINES."
        ],
        "uso_durante_embarazo": "No recomendado",
        "condiciones_almacenamiento": "Conservar en lugar fresco y seco, a temperatura inferior a 30°C.",
        "imagen": "img/medicamentos/aflamax1.JPG",
        "ambito_uso": "Analgésico, antiinflamatorio",
        "formula": "Diclofenac potásico 50 mg + excipientes c.s.",
        "accion_terapeutica": "Inhibe la síntesis de prostaglandinas",
        "via_administracion_dosis": "Oral",
        "dosis_presentacion": "1 tableta recubierta cada 8-12 horas"
    },
    {
        "id": "003", 
        "categoria_id": "001",
        "nombre_comercial": "Melovax®",
        "nombre_generico": "Meloxicam",
        "forma_farmaceutica": "Comprimidos",
        "concentracion": "15 mg",
        "via_administracion": "Oral",
        "laboratorio": "Industrias Intercaps de Venezuela C.A. para Laboratorios Vivax Pharmaceuticals C.A.",
        "lote": "0005689144475",
        "fecha_vencimiento": "12/12/2035",
        "registro_sanitario": "MPPS EF 32.550/19, CPE 030671427",
        "condicion_venta": "Bajo receta médica",
        "precio": 45.23,
        "stock_disponible": 25,
        "codigo_barras": "00058954444",
        "pais_origen": "Venezuela",
        "precauciones": "Producto de uso delicado. No administrar durante el embarazo, lactancia o a menores de 12 años.",
        "imagen_coleccion": [
            "img/medicamentos/melovax1.JPG",
            "img/medicamentos/elovax2.JPG",
            "img/medicamentos/elovax3.JPG"
        ],
        "reacciones_adversas": [
            "Dispepsia",
             "náuseas", 
            "vómitos", 
            "dolor abdominal", 
            "estreñimiento", 
            "flatulencia", 
            "diarrea", 
            "cefaleas", 
            "pancreatitis (frecuencia no conocida)"
        ],
        "indicaciones": "Alivio del dolor y la inflamación. Consultar a un médico.",
        "contraindicaciones": [
            "Hipersensibilidad a los componentes de la fórmula."
        ],
        "uso_durante_embarazo": "No recomendado",
        "condiciones_almacenamiento": "Conservar en lugar fresco y seco a una temperatura menor de 30°C.",
        "imagen": "img/medicamentos/melovax1.JPG",
        "ambito_uso": "Analgésico, antiinflamatorio",
        "formula": "Meloxicam 15 mg, excipientes c.s.",
        "accion_terapeutica": "Inhibe la síntesis de prostaglandinas",
        "via_administracion_dosis": "Oral",
        "dosis_presentacion": "Envase con 10 capsulas de 15 mg"
    },
    {
        "id": "004",
        "categoria_id": "005",
        "nombre_comercial": "Brugesic Forte",
        "nombre_generico": "Ibuprofeno",
        "forma_farmaceutica": "Suspensión oral",
        "concentracion": "200 mg/5mL",
        "via_administracion": "Oral",
        "laboratorio": "Elmor", 
        "lote": "VF235555555",
        "fecha_vencimiento": "21/08/2025",
        "registro_sanitario": "EF 36.416/21",
        "condicion_venta": "Bajo prescripción médica (asumiendo)",
        "precio": 80.5,
        "stock_disponible": 25,
        "codigo_barras": "100000895555",
        "pais_origen": "Venezuela",
        "precauciones": "Producto de uso delicado. Debe ser administrado bajo vigilancia médica. Informar al médico de cualquier efecto indeseable, especialmente en caso de trastornos del tubo digestivo. No exceder la dosis prescrita. 1  Manténgase fuera del alcance de los niños.",
        "imagen_coleccion": [
            "img/medicamentos/brugesic_forte1.JPG",
            "img/medicamentos/brugesic_forte2.JPG",
            "img/medicamentos/brugesic_forte3.JPG"
        ],
        "reacciones_adversas": ["Trastornos del tubo digestivo", 
        "Reacciones alérgicas"], 
        "indicaciones": "A juicio del facultativo",
        "contraindicaciones": [
            "Alergia a los componentes de la fórmula, ácido acetilsalicílico y a otros antiinflamatorios",
             "Úlcera gastroduodenal activa", "Niños menores de 6 meses"
            ],
        "uso_durante_embarazo": "",
        "condiciones_almacenamiento": "Conservar a temperatura inferior a 30°C.",
        "imagen": "img/medicamentos/brugesic_forte1.JPG",
        "ambito_uso": "Analgésico y antiinflamatorio",
        "formula": "Ibuprofeno 200 mg/5mL, sacarina sódica 4.5 mg, vehículo c.s.",
        "accion_terapeutica": "Inhibe la síntesis de prostaglandinas",
        "via_administracion_dosis": "Oral",
        "dosis_presentacion": "200 mg cada 5 mL"
    },
    {
        "id": "006",
        "categoria_id": "005",
        "nombre_comercial": "Ofaflan",
        "nombre_generico": "Diclofenac Potásico",
        "forma_farmaceutica": "Suspensión oral",
        "concentracion": "2 mg/mL",
        "via_administracion": "Oral",
        "laboratorio": "Elmor",
        "lote": "AJ5844444",
        "fecha_vencimiento": "01/12/2023",
        "registro_sanitario": "AR-j 568855",
        "condicion_venta": "Bajo prescripción médica (asumiendo)",
        "precio": 21.56,
        "stock_disponible": 36,
        "codigo_barras": "0000068555",
        "pais_origen": "Venezuela",
        "precauciones": "Producto de uso delicado. Debe ser administrado bajo vigilancia médica. Informar al médico si se presenta algún efecto indeseable, en especial trastornos del tubo digestivo. Si se presentan síntomas de alergia, suspenda el uso e informe al médico. No exceda la dosis prescrita. Manténgase fuera del alcance de los niños.",
        "imagen_coleccion": [
            "img/medicamentos/ofaflan1.JPG",
            "img/medicamentos/ofaflan2.JPG"
        ],
        "reacciones_adversas": [
            "Trastornos del tubo digestivo", 
            "Reacciones alérgicas"
        ],
        "indicaciones": "A juicio del facultativo",
        "contraindicaciones": [
            "Alergia a los componentes de la fórmula, al ácido acetilsalicílico o a otros analgésicos antiinflamatorios", 
            "Úlcera gastroduodenal activa"
        ],
        "uso_durante_embarazo": "",
        "condiciones_almacenamiento": "Conservar a temperatura inferior a 30°C.",
        "imagen": "img/medicamentos/ofaflan1.JPG", 
        "ambito_uso": "Analgésico y antiinflamatorio", 
        "formula": "Diclofenac Potásico 2 mg, Sucralosa 1,4 mg, Vehículo c.s.",
        "accion_terapeutica": "Inhibe la síntesis de prostaglandinas",
        "via_administracion_dosis": "Oral",
        "dosis_presentacion": "2 mg/mL"
    },
    {
        "id": "0008", 
        "categoria_id": "005",
        "nombre_comercial": "Apiret",
        "nombre_generico": "Acetaminofén",
        "forma_farmaceutica": "Suspensión",
        "concentracion": "180 mg/5mL",
        "via_administracion": "Oral",
        "laboratorio": "Laboratorios INNOVA, C.A.",
        "lote": "CPE090562266",
        "fecha_vencimiento": "05/06/2027",
        "registro_sanitario": "E.F.34.032/19",
        "condicion_venta": "Venta sin prescripción facultativa",
        "precio": 85,
        "stock_disponible":125,
        "codigo_barras": "7 591196 002785",
        "pais_origen": "Venezuela",
        "precauciones": "Este medicamento produce un alivio temporal de los síntomas. Si no obtiene dicha mejoría después de 48 horas suspenda y consulte con el médico. La fiebre en niños, sobre todo si son pequeños debe obligar a buscar la atención del médico. No debe usarse durante el embarazo o cuando se sospeche su existencia. El paciente debe informar al médico cualquier efecto indeseable. Adminístrese con precaución en caso de disfunción hepática y renal. No debe administrarse por periodos mayores de diez (10) días. No exceda la dosis recomendada. Manténgase fuera del alcance de los niños.",
        "imagen_coleccion": [
            "img/medicamentos/apiret1.JPG",
            "img/medicamentos/apiret2.JPG",
            "img/medicamentos/apiret3.JPG"
        ],
        "reacciones_adversas":[
            "hepatitis aguda",
            "reacciones graves en la piel"
        ],
        "indicaciones": "Alivio temporal de los síntomas",
        "contraindicaciones": [
            "Alergia a los componentes de la fórmula o hipersensibilidad conocida al acetaminofén.", 
            "Insuficiencia hepatocelular grave"
        ],
        "uso_durante_embarazo": "No debe usarse",
        "condiciones_almacenamiento": "Consérvese el frasco bien cerrado, a temperatura ambiente inferior a 30°C",
        "imagen": "img/medicamentos/apiret1.JPG",
        "ambito_uso": "Analgésico y antipirético",
        "formula": "Acetaminofén 180 mg/5mL",
        "accion_terapeutica": "Reduce la fiebre y alivia el dolor leve o moderado",
        "via_administracion_dosis": "Oral",
        "dosis_presentacion": "180 mg cada 5 mL"
    },
    {
        "id": "0014",
        "categoria_id": "004",
        "nombre_comercial": "Talzic",
        "nombre_generico": "Cetirizina",
        "forma_farmaceutica": "Comprimidos recubiertos",
        "concentracion": "10 mg",
        "via_administracion": "Oral",
        "laboratorio": "LABORATORIOS ELMOR, S.A.",
        "lote": "CPE050228679",
        "fecha_vencimiento": "15/04/2029",
        "registro_sanitario": "E.F. 28.274/23",
        "condicion_venta": "Venta con Prescripción Facultativa",
        "precio":40,
        "stock_disponible": 80,
        "codigo_barras": "7 591062 000181",
        "pais_origen": "Venezuela",
        "precauciones": "Producto de uso delicado. No debe administrarse durante el embarazo o lactancia. No exceder la dosis prescrita. Manténgase fuera del alcance de los niños. No administrar a pacientes con intolerancia a la lactosa. No ingerir bebidas alcohólicas. Puede causar somnolencia. Evitar actividades que impliquen coordinación y estados de alerta mental.",
        "imagen_coleccion": [
            "img/medicamentos/talzic1.JPG",
            "img/medicamentos/talzic2.JPG",
            "img/medicamentos/talzic3.JPG"
        ],
        "reacciones_adversas":[ "I.R. moderada y grave","epilepsia"],
        "indicaciones": "A juicio del facultativo",
        "contraindicaciones": [
            "Alergia a los componentes de la fórmula. Niños menores de 2 años."
        ],
        "uso_durante_embarazo": "No debe administrarse",
        "condiciones_almacenamiento": "Conservar a temperatura inferior a 30°C.",
        "imagen": "img/medicamentos/talzic1.JPG",
        "ambito_uso": "Alivio de los síntomas alérgicos",
        "formula": "Cetirizina diclorhidrato 10,00 mg, lactosa 100,30 mg, almidón de maíz 36,00 mg",
        "accion_terapeutica": "Antagonista de los receptores H1",
        "via_administracion_dosis": "Oral",
        "dosis_presentacion": "10 mg por comprimido"
    },
    {
        "id": "025844", 
        "categoria_id": "004", 
        "nombre_comercial": "Cetral",
        "nombre_generico": "Cetirizina",
        "forma_farmaceutica": "Tableta",
        "concentracion": "10 mg",
        "via_administracion": "Oral",
        "laboratorio": "Laboratorios Siegfried S.A.",
        "lote": "236455100",
        "fecha_vencimiento": "15/08/2030",
        "registro_sanitario": "E.F.: 29.095/23",
        "condicion_venta": "Bajo receta médica",
        "precio": 118.99,
        "stock_disponible":  26,
        "codigo_barras": "00001008555",
        "pais_origen": "Venezuela",
        "precauciones": "No administrar durante el embarazo o lactancia. No consumir alcohol. No exceder la dosis. Puede causar somnolencia. No apto para personas con intolerancia a la lactosa.",
        "imagen_coleccion": [
            "img/medicamentos/cetral1.JPG",
            "img/medicamentos/cetral2.JPG",
            "img/medicamentos/cetral3.JPG"
        ],
        "reacciones_adversas": ["Consultar prospecto"],
        "indicaciones": "Alivio de los síntomas de alergia",
        "contraindicaciones": ["Alergia a los componentes de la fórmula"],
        "uso_durante_embarazo": "No recomendado",
        "uso_durante_lactancia": "No recomendado",
        "condiciones_almacenamiento": "Consultar prospecto",
        "imagen": "img/medicamentos/cetral1.JPG",
        "ambito_uso": "Tratamiento de alergias",
        "formula": "Cetirizina diclorhidrato 10 mg + Lactosa 160.70 mg + excipientes c.s.",
        "accion_terapeutica": "Antihistamínico",
        "via_administracion_dosis": "Oral, según prescripción médica",
        "dosis_presentacion": "10 tabletas por envase"
    },
    
    {
        "id": "00854",
        "categoria_id": "004",
        "nombre_comercial": "Rinaris",
        "nombre_generico": "Loratadina y Pseudoefedrina",
        "forma_farmaceutica": "Comprimidos recubiertos",
        "concentracion": "Loratadina 5 mg - Pseudoefedrina 60 mg",
        "via_administracion": "Oral",
        "laboratorio": "",
        "lote": "AER544444",
        "fecha_vencimiento": "23/06/2027",
        "registro_sanitario": "AJH- 85444",
        "condicion_venta": "Sin especificar",
        "precio": 50,
        "stock_disponible": 32,
        "codigo_barras": "000584444",
        "pais_origen": "Venezuela",
        "precauciones": "Embarazo, lactancia, niños menores de 2 años, hipertensión, enfermedad tiroidea, enfermedad cardíaca, intolerancia a la lactosa, uso concomitante con ciertos medicamentos. Evitar actividades que requieran atención. No exceder la dosis recomendada.",
        "imagen_coleccion": [
            "img/medicamentos/rinaris1.JPG",
            "img/medicamentos/rinaris2.JPG",
            "img/medicamentos/rinaris3.JPG"
        ],
        "reacciones_adversas": [
            "Mareos",
            "astenia", "visión borrosa", "insomnio", "anorexia", "náuseas", "vómito", "estreñimiento", "diarrea", "xerostomía", "disuria", "tos", "palpitaciones", 
            "hipotensión", "tinitus", "cefalea"
        ],
        "indicaciones": "Tratamiento inicial de los síntomas agudos ocasionados por la rinitis y conjuntivitis alérgica.",
        "contraindicaciones": [""],
        "uso_durante_embarazo": "No recomendado",
        "condiciones_almacenamiento": "",
        "imagen": "img/medicamentos/rinaris1.JPG",
        "ambito_uso": "Alivio de los síntomas de alergia",
        "formula": "Loratadina 5 mg, Pseudoefedrina clorhidrato 60 mg, Lactosa monohidratada 199,00 mg, Excipientes c.s.",
        "accion_terapeutica": "Antihistamínico y descongestivo nasal",
        "via_administracion_dosis": "Oral, una tableta cada 12 horas, máximo 3 días.",
        "dosis_presentacion": "1 comprimido recubierto"
    },
    {
        "id": "00569",
        "categoria_id": "008",
        "nombre_comercial": "Mesames", 
        "nombre_generico": "Drospirenona y Etinilestradiol",
        "forma_farmaceutica": "Comprimidos recubiertos",
        "concentracion": "Drospirenona 3 mg - Etinilestradiol 0.03 mg",
        "via_administracion": "Oral",
        "laboratorio": "Reemmers S.A.I.C.F. - Argentina y Blipack S.A. Argentina",
        "lote": "CPE 0220477258",
        "fecha_vencimiento": "15/08/2035", 
        "registro_sanitario": "EF. 41.203/22",
        "condicion_venta": "Venta con prescripción facultativa",
        "precio": 25,
        "stock_disponible": 123,
        "codigo_barras": "7 592601 303886",
        "pais_origen": "Argentina",
        "precauciones": "Producto de uso delicado. No administrar durante el embarazo o lactancia. Manténgase fuera del alcance de los niños. No exceda la dosis prescrita. Antes de administrar este producto, leer el prospecto interno. Este producto no debe administrarse en pacientes con intolerancia a la lactosa o galactosa. Consérvese en un lugar fresco y seco a una temperatura menor a 30°C.",
        "imagen_coleccion": [
            "img/medicamentos/mesames1.JPG",
            "img/medicamentos/mesames2.JPG"
        ],
        "reacciones_adversas": ["No especificadas en la imagen"],
        "indicaciones": "A juicio del facultativo", 
        "contraindicaciones": ["Alergia a los componentes de la fórmula"],
        "uso_durante_embarazo": "No debe administrarse",
        "condiciones_almacenamiento": "Conservar en un lugar fresco y seco a una temperatura menor a 30°C.",
        "imagen": "img/medicamentos/mesames1.JPG",
        "ambito_uso": "Anticoncepción hormonal",
        "formula": "Drospirenona 3.00 mg; Etinilestradiol 0.030 mg, Lactosa 39.20 mg Excipientes c.s.",
        "accion_terapeutica": "Anticonceptivo hormonal",
        "via_administracion_dosis": "Oral",
        "dosis_presentacion": "1 comprimido recubierto activo por día"
    },
    {
        "id": "00624",
        "categoria_id": "008",
        "nombre_comercial": "Bellaface Suave",
        "nombre_generico": "Dienogest y Etinilestradiol",
        "forma_farmaceutica": "Comprimidos recubiertos",
        "concentracion": "Dienogest 2 mg / Etinilestradiol 20 mcg",
        "via_administracion": "Oral",
        "laboratorio": "LAFRANCOL S.A.S.",
        "lote": "2019M-0015240-R1",
        "fecha_vencimiento": "13/05/2035",
        "registro_sanitario": "INVIMA 2019M-0015240-R1",
        "condicion_venta": "Venta bajo fórmula médica",
        "precio": 35,
        "stock_disponible": 80,
        "codigo_barras": "7 702870 071465",
        "pais_origen": "Colombia",
        "precauciones": "Ver inserto adjunto. Mantener fuera del alcance de los niños. Conservar a temperatura no mayor a 30°C.",
        "imagen_coleccion": [
            "img/medicamentos/bellaface1.JPG",
            "img/medicamentos/bellaface2.JPG"
        ],
        "reacciones_adversas": ["No especificadas en la imagen"],
        "indicaciones":"No especificadas en la imagen",
        "contraindicaciones": ["Ver inserto adjunto"],
        "uso_durante_embarazo": "Contraindicado",
        "condiciones_almacenamiento": "Conservar a temperatura no mayor a 30°C.",
        "imagen": "img/medicamentos/bellaface1.JPG",
        "ambito_uso": "Anticoncepción hormonal",
        "formula": "Dienogest 2 mg, Etinilestradiol 20 mcg, excipientes c.s.",
        "accion_terapeutica": "Anticonceptivo hormonal",
        "via_administracion_dosis": "Oral, según prescripción médica",
        "dosis_presentacion": "1 comprimido recubierto activo"
    },
    {
        "id": "00487", 
        "categoria_id": "008",
        "nombre_comercial": "Yaz",
        "nombre_generico": "Drospirenona y Etinilestradiol",
        "forma_farmaceutica": "Comprimidos recubiertos",
        "concentracion": "Drospirenona 3 mg - Etinilestradiol 20 mcg",
        "via_administracion": "Oral",
        "laboratorio": "Bayer S.A.",
        "lote": "CPE 1107141592",
        "fecha_vencimiento": "12/08/2056",
        "registro_sanitario": "E.F. 36.604/21",
        "condicion_venta": "Venta con prescripción facultativa",
        "precio": 12.68,
        "stock_disponible": 45,
        "codigo_barras": "7 592601 303886", 
        "pais_origen": "Brasil",
        "precauciones": "Producto de uso delicado. No administrar durante el embarazo o lactancia. No exceder la dosis prescrita. Antes de usar este producto, leer prospecto interno.",
        "imagen_coleccion": [
            "img/medicamentos/yaz1.JPG",
            "img/medicamentos/yaz2.JPG"
        ],
        "reacciones_adversas": ["No especificadas en la imagen"],
        "indicaciones": "A juicio del facultativo",
        "contraindicaciones": ["Alergia a los componentes de la fórmula."],
        "uso_durante_embarazo": "Contraindicado",
        "condiciones_almacenamiento": "Almacenar por debajo de 30°C.",
        "imagen": "img/medicamentos/yaz1.JPG", 
        "ambito_uso": "Anticoncepción hormonal",
        "formula": "Drospirenona 3 mg, Etinilestradiol 20 mcg, excipientes c.s.",
        "accion_terapeutica": "Anticonceptivo hormonal",
        "via_administracion_dosis": "Oral, según prescripción médica",
        "dosis_presentacion": "1 comprimido recubierto activo"
    },
    {
        "id": "006922",
        "categoria_id": "008",
        "nombre_comercial": "Isbela",
        "nombre_generico": "Ciproterona Acetato y Etinilestradiol",
        "forma_farmaceutica": "Comprimidos recubiertos",
        "concentracion": "Ciproterona Acetato 2 mg - Etinilestradiol 0,035 mg",
        "via_administracion": "Oral",
        "laboratorio": "LABORATORIOS VIVAX PHARMACEUTICALS, C.A.",
        "lote": "1510604",
        "fecha_vencimiento": "03/2026",
        "registro_sanitario": "EF: 42.354/20",
        "condicion_venta": "Venta con prescripción facultativa",
        "precio": 68.12,
        "stock_disponible": 45,
        "codigo_barras": "7 703153 041199",
        "pais_origen": "Venezuela",
        "precauciones": "Producto de uso delicado. No administrar durante el embarazo o lactancia. No exceder la dosis prescrita. Manténgase fuera del alcance de los niños. No administrar a pacientes con intolerancia a la lactosa o galactosa.",
        "imagen_coleccion": [
            "img/medicamentos/isbela1.JPG",
            "img/medicamentos/isbela2.JPG"
        ],
        "reacciones_adversas": ["No especificadas en la imagen"],
        "indicaciones": "A juicio del facultativo",
        "contraindicaciones": ["Alergia a los componentes de la fórmula."],
        "uso_durante_embarazo": "Contraindicado",
        "condiciones_almacenamiento": "",
        "imagen": "img/medicamentos/isbela1.JPG",
        "ambito_uso": "Anticoncepción hormonal",
        "formula": "Ciproterona Acetato 2 mg, Etinilestradiol 0,035 mg, Lactosa Monohidrato 70,65 mg, Excipientes c.s.",
        "accion_terapeutica": "Anticonceptivo hormonal",
        "via_administracion_dosis": "Oral, según prescripción médica",
        "dosis_presentacion": "1 comprimido recubierto activo"
    },
    {
        "id": "00784", 
        "categoria_id": "008", 
        "nombre_comercial": "Sense (o el nombre específico del producto)",
        "nombre_generico": "Preservativo de poliuretano",
        "forma_farmaceutica": "Dispositivo médico",
        "concentracion": "No aplicable",
        "via_administracion": "Vaginal/anal",
        "laboratorio": "Sense", 
        "lote": "5587154415441",
        "fecha_vencimiento": "12/12/2045",
        "registro_sanitario": "ades 848484",
        "condicion_venta": "Venta libre", 
        "precio": 150,
        "stock_disponible": 100,
        "codigo_barras": "0000084848",
        "pais_origen": "Venezuela",
        "precauciones": "Ver etiqueta del producto",
        "imagen_coleccion": [
            "img/medicamentos/sense1.JPG",
            "img/medicamentos/sense2.JPG"
        ],
        "reacciones_adversas": ["Irritación","reacciones alérgicas"],
        "indicaciones": "Método de barrera contra el embarazo y enfermedades de transmisión sexual",
        "contraindicaciones": ["Alergia al poliuretano"],
        "uso_durante_embarazo": "No aplicable",
        "condiciones_almacenamiento": "Almacenar en un lugar fresco y seco",
        "imagen": "img/medicamentos/sense1.JPG", 
        "ambito_uso": "Control de la natalidad y prevención de ETS",
        "formula": "Poliuretano",
        "accion_terapeutica": "Barrera física",
        "via_administracion_dosis": "Único uso por acto sexual",
        "dosis_presentacion": "1 preservativo"
    },
    {
        "id": "00589",
        "categoria_id": "008",
        "nombre_comercial": "Piel",
        "nombre_generico": "Preservativo de látex",
        "forma_farmaceutica": "Dispositivo médico",
        "concentracion": "No aplicable",
        "via_administracion": "Vaginal/anal",
        "laboratorio": "Piel",
        "lote": "4544514155445",
        "fecha_vencimiento": "20/04/2028",
        "registro_sanitario": "INVIMA 2022DM-0025043",
        "condicion_venta": "Venta libre",
        "precio": 6000,
        "stock_disponible": 500,
        "codigo_barras": "32131231231231",
        "pais_origen": "Venezuela",
        "precauciones": "Ver etiqueta del producto. El látex puede causar reacciones alérgicas.",
        "imagen_coleccion": [
            "img/medicamentos/piel1.JPG",
            "img/medicamentos/piel2.JPG"
        ],
        "reacciones_adversas": ["Irritación", "reacciones alérgicas", "incluyendo choque anafiláctico"],
        "indicaciones": "Método de barrera para prevenir el embarazo y enfermedades de transmisión sexual",
        "contraindicaciones": ["Alergia al látex"],
        "uso_durante_embarazo": "No aplicable",
        "condiciones_almacenamiento": "Almacenar en un lugar seco y fresco, entre 5°C y 30°C.",
        "imagen": "img/medicamentos/piel1.JPG",
        "ambito_uso": "Control de la natalidad y prevención de ETS",
        "formula": "Látex de caucho natural",
        "accion_terapeutica": "Barrera física",
        "via_administracion_dosis": "Único uso por acto sexual",
        "dosis_presentacion": "3 preservativo"
    },
    {
        "id": "009565", 
        "categoria_id": "008", 
        "nombre_comercial": "Duo G-Sensation",
        "nombre_generico": "Preservativo de látex",
        "forma_farmaceutica": "Dispositivo médico",
        "concentracion": "No aplicable", 
        "via_administracion": "Vaginal/anal",
        "laboratorio": "Beiersdorf",
        "lote": "4005800041495",
        "fecha_vencimiento": "20/04/2028", 
        "registro_sanitario": "EN ISO 4074", 
        "condicion_venta": "Venta libre", 
        "precio": 8000,
        "stock_disponible": 700,
        "codigo_barras": "4005800041495",
        "pais_origen": "Venezuela", 
        "precauciones": "Ver etiqueta del producto. El látex puede causar reacciones alérgicas.",
        "imagen_coleccion": [
            "img/medicamentos/duo1.JPG",
            "img/medicamentos/duo2.JPG"
        ],
        "reacciones_adversas":[ "Irritación", "reacciones alérgicas", "incluyendo choque anafiláctico"],
        "indicaciones": "Método de barrera para prevenir el embarazo y enfermedades de transmisión sexual",
        "contraindicaciones": ["Alergia al látex"],
        "uso_durante_embarazo": "No aplicable", 
        "condiciones_almacenamiento": "",
        "imagen": "img/medicamentos/duo1.JPG", 
        "ambito_uso": "Control de la natalidad y prevención de ETS",
        "formula": "Látex de caucho natural", 
        "accion_terapeutica": "Barrera física",
        "via_administracion_dosis": "Único uso por acto sexual",
        "dosis_presentacion": "1 preservativo"
    },
    {
        "id": "08484848",
        "categoria_id": "010",
        "nombre_comercial": "Asmepoc",
        "nombre_generico": "Salbutamol",
        "forma_farmaceutica": "Suspensión para inhalación aerosol",
        "concentracion": "100 mcg/dosis",
        "presentacion": "Frasco aerosol de aluminio con válvula dosificadora para 200 dosis (10 mL)",
        "via_administracion": "Inhalatoria",
        "laboratorio": "Laboratorios Farmacéuticos Ophalace",
        "fabricante": "Laboratorio Aldo-Unión S.L.",
        "pais_origen": "España",
        "lote": "454",
        "fecha_vencimiento": "20/04/2028",
        "registro_sanitario": "INVIMA 2020M-0019611",
        "condicion_venta": "Bajo receta",
        "precio": 8000,
        "stock_disponible": 700,
        "codigo_barras": "7709525706871",
        "precauciones": "Proteger de la luz y el calor. Mantener a temperatura inferior a 30°C. No congelar. Mantener fuera del alcance de los niños. Consultar prospecto.",
        "imagen_coleccion": [
            "img/medicamentos/salbutamol1.JPG",
            "img/medicamentos/salbutamol2.JPG",
            "img/medicamentos/salbutamol3.JPG"
        ],
        "reacciones_adversas":["Consultar prospecto"],
        "indicaciones": "Tratamiento del broncoespasmo",
        "contraindicaciones": ["Consultar prospecto"],
        "uso_durante_embarazo": "Consultar prospecto",
        "condiciones_almacenamiento": "Proteger de la luz y el calor. Mantener a temperatura inferior a 30°C. No congelar.",
        "imagen": "img/medicamentos/salbutamol1.JPG",
        "ambito_uso": "Tratamiento de enfermedades respiratorias obstructivas",
        "formula": "Salbutamol en suspensión para inhalación",
        "accion_terapeutica": "Broncodilatador beta-2 adrenérgico",
        "via_administracion_dosis": "Inhalación, según prescripción médica",
        "dosis_presentacion": "200 dosis"
    },
    {
        "id": "787878",
        "categoria_id": "010",
        "nombre_comercial": "Pulmolet",
        "nombre_generico": "Budesonida",
        "forma_farmaceutica": "Suspensión para nebulizar",
        "concentracion": "1 mg/mL",
        "presentacion": "Frasco con 15 mL",
        "via_administracion": "Inhalatoria oral",
        "laboratorio": "Laboratorios Farmacéuticos Ophalace", 
        "fabricante": "Genven Genéricos Venezolanos, S.A.",
        "distribuidor": "Laboratorios Leti, S.A.V.",
        "pais_origen": "Venezuela",
        "lote": "CPE0808155309", 
        "fecha_vencimiento": "20/05/2028",
        "registro_sanitario": "INVIMA 2020M-0019611, E.F. 37.253/22 (MPPS)",
        "condicion_venta": "Bajo receta",
        "precio": 8000,
        "stock_disponible": 500,
        "codigo_barras": "7591585117199",
        "precauciones": "Administrar bajo vigilancia médica. No usar durante el embarazo o lactancia sin supervisión médica. Leer prospecto antes de usar.",
        "imagen_coleccion": [
            "img/medicamentos/pulmolet1.JPG",
            "img/medicamentos/pulmolet2.JPG",
            "img/medicamentos/pulmolet3.JPG"
        ],
        "reacciones_adversas": ["Consultar prospecto"],
        "indicaciones": "Tratamiento del asma, según prescripción médica",
        "contraindicaciones": ["Alergia a los componentes de la fórmula"],
        "uso_durante_embarazo": "No recomendado sin supervisión médica",
        "uso_durante_lactancia": "No recomendado sin supervisión médica",
        "condiciones_almacenamiento": "Conservar en lugar fresco y seco, a temperatura inferior a 30°C. Agitar antes de usar",
        "imagen": "img/medicamentos/pulmolet1.JPG",
        "ambito_uso": "Tratamiento de enfermedades respiratorias inflamatorias",
        "formula": "Budesonida 1 mg/mL + vehículo",
        "accion_terapeutica": "Corticosteroide inhalado",
        "via_administracion_dosis": "Inhalación, según prescripción médica",
        "dosis_presentacion": "15 mL"
    },
    {
        "id": "45459",
        "categoria_id": "010",
        "nombre_comercial": "Berodual HFA",
        "nombre_generico": "Bromuro de ipratropio, Bromhidrato de fenoterol",
        "forma_farmaceutica": "Solución en aerosol dosificador",
        "concentracion": "20 mcg/50 mcg/dosis",
        "presentacion": "10 ml (200 dosis)",
        "via_administracion": "Inhalatoria",
        "laboratorio": "Boehringer Ingelheim",
        "lote": "No disponible en la imagen",
        "fecha_vencimiento": "No disponible en la imagen",
        "registro_sanitario": "No disponible en la imagen",
        "condicion_venta": "Bajo receta",
        "precio": 700,
        "stock_disponible": 90000,
        "codigo_barras": "7392186003522",
        "pais_origen": "Venezuela",
        "precauciones": "Almacenar a temperatura no superior a 30°C. Proteger de la luz directa. Leer prospecto para más información.",
        "imagen_coleccion": [
            "img/medicamentos/berodual1.JPG",
            "img/medicamentos/berodual2.JPG",
            "img/medicamentos/berodual3.JPG"
        ],
        "reacciones_adversas":[ "Consultar prospecto"],
        "indicaciones": "Tratamiento del broncoespasmo reversible (asma, EPOC)",
        "contraindicaciones":["Consultar prospecto"],
        "uso_durante_embarazo": "Consultar prospecto",
        "uso_durante_lactancia": "Consultar prospecto",
        "condiciones_almacenamiento": "No almacenar a temperatura superior a 30°C. Proteger de la luz directa.",
        "imagen": "img/medicamentos/berodual1.JPG",
        "ambito_uso": "Tratamiento de enfermedades respiratorias obstructivas",
        "formula": "Bromuro de ipratropio 20 mcg/dosis + Bromhidrato de fenoterol 50 mcg/dosis + excipientes",
        "accion_terapeutica": "Broncodilatador (beta-2 adrenérgico + anticolinérgico)",
        "via_administracion_dosis": "Inhalación, según prescripción médica",
        "dosis_presentacion": "200 dosis"
    },
    {
        "id": "8787878",
        "categoria_id": "010",
        "nombre_comercial": "Cortynase",
        "nombre_generico": "Furoato de Mometasona",
        "forma_farmaceutica": "Suspensión nasal",
        "concentracion": "0.05% (50 mcg/dosis)",
        "presentacion": "140 dosis",
        "via_administracion": "Nasal",
        "laboratorio": "Laboratorios LD Oftalmi, C.A.",
        "lote": "CPE070556680",
        "fecha_vencimiento": "20/09/2028", 
        "registro_sanitario": "E.F. 33.808/19",
        "condicion_venta": "Bajo receta",
        "precio": 10000,
        "stock_disponible": 800,
        "codigo_barras": "7 591196 004604",
        "pais_origen": "Venezuela",
        "precauciones": "Consultar prospecto. Uso tópico nasal únicamente. Conservar a temperatura ambiente, inferior a 30°C. Agitar bien antes de usar.",
        "imagen_coleccion": [
            "img/medicamentos/cortynase1.JPG",
            "img/medicamentos/cortynase2.JPG",
            "img/medicamentos/cortynase3.JPG"
        ],
        "reacciones_adversas": ["Consultar prospecto"],
        "indicaciones": "Tratamiento de la rinitis alérgica, según prescripción médica",
        "contraindicaciones": ["Alergia a los componentes de la fórmula"],
        "uso_durante_embarazo": "No recomendado sin supervisión médica",
        "uso_durante_lactancia": "No recomendado sin supervisión médica",
        "condiciones_almacenamiento": "Conservar a temperatura ambiente, inferior a 30°C.",
        "imagen": "img/medicamentos/cortynase1.JPG",
        "ambito_uso": "Tratamiento de alergias nasales",
        "formula": "Furoato de Mometasona 50 mcg/dosis + Celulosa microcristalina + Glicerina + Ácido cítrico + Citrato de sodio + Polisorbato 80 + Cloruro de benzalconio + Agua destilada",
        "accion_terapeutica": "Corticosteroide tópico nasal",
        "via_administracion_dosis": "Nasal, según prescripción médica",
        "dosis_presentacion": "140 dosis"
    },
    {
        "id": "051",
        "categoria_id": "006",
        "nombre_comercial": "Komency",
        "nombre_generico": "Escitalopram",
        "forma_farmaceutica": "Tableta",
        "concentracion": "10mg",
        "via_administracion": "Oral",
        "laboratorio": "Eurofarma",
        "lote": "Lote2003",
        "fecha_vencimiento": "2025-11-30",
        "registro_sanitario": "RS-2-008297",
        "condicion_venta": "Bajo formula medica",
        "precio": 15.0,
        "stock_disponible": 456,
        "codigo_barras": "1234567890305",
        "pais_origen": "Venezuela",
        "precauciones": "Empeoramiento clinico",
        "imagen_coleccion": [
            "img/medicamentos/komency1.JPG",
            "img/medicamentos/komency2.JPG",
            "img/medicamentos/komency3.JPG"
        ],
        "reacciones_adversas": [
            "convulsiones",
            "activacion de la mania/hipomania",
            "hiponatremia"
        ],
        "indicaciones": "Se utiliza comunmente para el tratamiento de trastornos depresivos.",
        "contraindicaciones": [
            "Embarazo",
            "Lactancia",
            "menores de 18 años",
            "hipersensibilidad",
            "tratamiento concomitante con inhibidores de la MAO"
        ],
        "uso_durante_embarazo": "No",
        "condiciones_almacenamiento": "Conservar en un lugar fresco y seco, a temperatura no mayor a 30°C",
        "imagen": "img/medicamentos/komency1.JPG",
        "ambito_uso": "Antidepresivos",
        "formula": "Cada TABLETA de KOMENCY contiene 10 mg de Escitalopram.",
        "accion_terapeutica": "KOMENCY está indicado como antidepresivos.",
        "via_administracion_dosis": "1 tableta de 10 mg dependiendo de la condicion medica .",
        "dosis_presentacion": "Caja por 30 tabletas recubiertas de 10 mg."
    },
    {
        "id": "052",
        "categoria_id": "006",
        "nombre_comercial": "Escitalopram calox",
        "nombre_generico": "Escitalopram",
        "forma_farmaceutica": "Tabletas recubiertas",
        "concentracion": "20mg",
        "via_administracion": "Oral",
        "laboratorio": "Calox",
        "lote": "Lote2004",
        "fecha_vencimiento": "20/10/2025",
        "registro_sanitario": "RS-985382",
        "condicion_venta": "Bajo recipe medico",
        "precio": 10.5,
        "stock_disponible": 457,
        "codigo_barras": "7591519317541",
        "pais_origen": "Venezuela",
        "precauciones": "Suicidio, sindrome serotoninergico, disminucion del sodio serico",
        "imagen_coleccion": [
            "img/medicamentos/escitalopram1.JPG",
            "img/medicamentos/escitalopram2.JPG",
            "img/medicamentos/escitalopram3.JPG"
        ],
        "reacciones_adversas": [
            "Nauseas",
            "Vomitos",
            "insomnio",
            "fatiga"
        ],
        "indicaciones": "A juicio del facultativo.",
        "contraindicaciones": [
            "Embarazo",
            "Lactancia",
            "hipersensibilidad"
        ],
        "uso_durante_embarazo": "No",
        "condiciones_almacenamiento": "Conservar en un lugar fresco y seco, a temperatura inferior a 30°C",
        "imagen": "img/medicamentos/escitalopram1.JPG",
        "ambito_uso": "Antidepresivos",
        "formula": "Cada TABLETA de Escitalopram Calox contiene 20 mg de Escitalopram.",
        "accion_terapeutica": "KOMENCY está indicado como antidepresivos.",
        "via_administracion_dosis": "1 tableta de 20 mg dependiendo de la condicion medica .",
        "dosis_presentacion": "Caja por 14 tabletas recubiertas de 20 mg."
    },
    {
        "id": "053",
        "categoria_id": "006",
        "nombre_comercial": "Quetival",
        "nombre_generico": "Quetiapina",
        "forma_farmaceutica": "Tableta",
        "concentracion": "25mg",
        "via_administracion": "Oral",
        "laboratorio": "Valmorca",
        "lote": "Lote2005",
        "fecha_vencimiento": "15/10/2025",
        "registro_sanitario": "RS-299433820",
        "condicion_venta": "Bajo formula medica",
        "precio": 14.5,
        "stock_disponible": 458,
        "codigo_barras": "7591020009232",
        "pais_origen": "Venezuela",
        "precauciones": "En conductores de vehiculos y operadores de maquinaria. Con el uso de este producto no ingiera bebidas alcoholicas, ni sedantes",
        "imagen_coleccion": [
            "img/medicamentos/quetival1.JPG",
            "img/medicamentos/quetival2.JPG",
            "img/medicamentos/quetival3.JPG"
        ],
        "reacciones_adversas": [
            "somnolencia",
            "Mareos",
            "Aumento de peso"
        ],
        "indicaciones": "A juicio del facultativo.",
        "contraindicaciones": [
            "Alergia a algun componente de la formula",
            "menores de 18 años"
        ],
        "uso_durante_embarazo": "No",
        "condiciones_almacenamiento": "Conservar a temperatura  inferior a 30°C",
        "imagen": "img/medicamentos/quetival1.JPG",
        "ambito_uso": "Antidepresivos",
        "formula": "Cada TABLETA de QUETIVAL contiene 25 mg de Quetiapina.",
        "accion_terapeutica": "QUETIVAL está indicado como antidepresivos.",
        "via_administracion_dosis": "1 tableta de 25 mg dependiendo de la condicion medica .",
        "dosis_presentacion": "Caja por 30 tabletas recubiertas de 25 mg."
    },
    {
        "id": "054",
        "categoria_id": "006",
        "nombre_comercial": "Sertralina",
        "nombre_generico": "Quetival",
        "forma_farmaceutica": "Tableta",
        "concentracion": "50mg",
        "via_administracion": "Oral",
        "laboratorio": "La Sante",
        "lote": "Lote2006",
        "fecha_vencimiento": "25/10/2025",
        "registro_sanitario": "E.F.G 32466/20",
        "condicion_venta": "Bajo formula medica",
        "precio": 16.0,
        "stock_disponible": 459,
        "codigo_barras": "7592454003780",
        "pais_origen": "Venezuela",
        "precauciones": "Suicidio, hipomania, Convulsiones",
        "imagen_coleccion": [
            "img/medicamentos/sertralina1.JPG",
            "img/medicamentos/sertralina2.JPG",
            "img/medicamentos/sertralina3.JPG"
        ],
        "reacciones_adversas": [
            "Cambios en el sueño",
            "Fatiga",
            "Dolor de cabeza"
        ],
        "indicaciones": "A juicio del facultativo.",
        "contraindicaciones": [
            "Alergia a los componentes de la formula",
            "No administrar durante embarazo o cuando se sospeche de su existencia"
        ],
        "uso_durante_embarazo": "No",
        "condiciones_almacenamiento": "Conservar a temperatura inferior a 30°C",
        "imagen": "img/medicamentos/sertralina1.JPG",
        "ambito_uso": "Antidepresivos",
        "formula": "Cada TABLETA de Sertralina contiene 50 mg de Quetival.",
        "accion_terapeutica": "Sertralina está indicado como antidepresivos.",
        "via_administracion_dosis": "1 tableta de 50 mg dependiendo de la condicion medica .",
        "dosis_presentacion": "Caja por 30 tabletas de 50 mg."
    },
    {
        "id": "055", 
        "categoria_id": "007", 
        "nombre_comercial": "Clopid",
        "nombre_generico": "Clopidogrel",
        "forma_farmaceutica": "Tabletas",
        "concentracion": "75 mg/75 mg",
        "via_administracion": "Oral",
        "laboratorio": "TITAN LABORATORIES PVT. LTD.",
        "lote": "Lote2007", 
        "fecha_vencimiento": "05/10/2025", 
        "registro_sanitario": "M.P. No. 34.565/19",
        "condicion_venta": "Bajo prescripción médica",
        "precio": 20.5, 
        "stock_disponible": 460,
        "codigo_barras": "7592247002871",
        "pais_origen": "Venezuela",
        "precauciones": "Conservar a temperatura inferior a 30ºC",
        "imagen_coleccion": ["img/medicamentos/clopid1.JPG", "img/medicamentos/clopid2.JPG"], 
        "reacciones_adversas": ["Dolor de cabeza", "Náuseas"], 
        "indicaciones": "Alivio del sarpullido",
        "contraindicaciones": ["Alergia a los componentes de la fórmula"],
        "uso_durante_embarazo": "No",
        "condiciones_almacenamiento": "Conservar en lugar fresco y seco inferior a 30°C",
        "imagen": "img/medicamentos/clopid1.JPG",
        "ambito_uso": "Cardiovascular",
        "formula": "Rutin 75 mg, Clopidogrel 75 mg, Excipientes c.s.p.",
        "accion_terapeutica": "Antiagregante plaquetario",
        "via_administracion_dosis": "1 tableta",
        "dosis_presentacion": "75 mg/75 mg"
    },
    {
        "id": "056",
        "categoria_id": "007", 
        "nombre_comercial": "Rivaroxaban",
        "nombre_generico": "Reverbán",
        "forma_farmaceutica": "Comprimidos",
        "concentracion": "20 mg",
        "via_administracion": "Oral",
        "laboratorio": "Spefar",
        "lote": "Lote2008", 
        "fecha_vencimiento": "10/05/2025", 
        "registro_sanitario": "RS-2-008297", 
        "condicion_venta": "Bajo prescripción médica",
        "precio": "07.5", 
        "stock_disponible": 461, 
        "codigo_barras": "7190027100293",
        "pais_origen": "Venezuela",
        "precauciones": "Producto de uso delicado. No administrar en pacientes con intolerancia a la lactosa o galactosa. Suspender la lactancia materna durante el tratamiento.",
        "imagen_coleccion": ["img/medicamentos/rivaroxaban1.JPG", "img/medicamentos/rivaroxaban2.JPG","img/medicamentos/rivaroxaban3.JPG"], 
        "reacciones_adversas": ["Náuseas", "Vómitos", "Diarrea"],
        "indicaciones": "A juicio del facultativo",
        "contraindicaciones": ["Alergia a cualquiera de los componentes de la fórmula."],
        "uso_durante_embarazo": "No",
        "condiciones_almacenamiento": "A temperatura ambiente inferior a 30ºC",
        "imagen": "img/medicamentos/rivaroxaban1.JPG",
        "ambito_uso": "Gastrointestinal",
        "formula": "Reverbán 20 mg, Lactosa 35.00 mg, Excipientes c.s.p.",
        "accion_terapeutica": "Antiácido", 
        "via_administracion_dosis": "1 comprimido",
        "dosis_presentacion": "20 mg/comprimido"
    },
    {
        "id": "056",
        "categoria_id": "007", 
        "nombre_comercial": "Arudil",
        "nombre_generico": "Rivaroxaban",
        "forma_farmaceutica": "Comprimidos recubiertos",
        "concentracion": "20 mg",
        "via_administracion": "Oral",
        "laboratorio": "LABORATORIOS FARMA S.A.",
        "lote": "Lote2009", 
        "fecha_vencimiento": "26/09/2025", 
        "registro_sanitario": "E.F. 41.488/22",
        "condicion_venta": "Bajo prescripción médica",
        "precio": 42.5, 
        "stock_disponible": 461, 
        "codigo_barras": "7591821210578",
        "pais_origen": "Venezuela", 
        "precauciones": "Producto de uso delicado. No administrar en pacientes con intolerancia a la lactosa o galactosa. Suspender la lactancia materna durante el tratamiento.",
        "imagen_coleccion": ["img/medicamentos/arudil1.JPG", "img/medicamentos/arudil2.JPG"], 
        "reacciones_adversas": ["Sangrado", "Mareos", "Erupción cutánea"], 
        "indicaciones": "A juicio del facultativo", 
        "contraindicaciones": ["Alergia a cualquiera de los componentes de la fórmula. No se administre durante el embarazo o cuando se sospeche su existencia."], 
        "uso_durante_embarazo": "Contraindicado",
        "condiciones_almacenamiento": "Conservar a temperatura ambiente inferior a 30ºC",
        "imagen": "img/medicamentos/arudil1.JPG",
        "ambito_uso": "Prevención de trombos", 
        "formula": "Rivaroxaban 20 mg, Lactosa monohidrato 50.60 mg, Excipientes c.s.p.",
        "accion_terapeutica": "Anticoagulante oral directo", 
        "via_administracion_dosis": "1 comprimido",
        "dosis_presentacion": "20 mg/comprimido"
    },
    {
        "id": "057", 
        "categoria_id": "010",
        "nombre_comercial": "Flinas",
        "nombre_generico": "Fluticasona Propionato",
        "forma_farmaceutica": "Solución", 
        "concentracion": "50 mcg",
        "via_administracion": "Oftálmica", 
        "laboratorio": "LABORATORIOS D.O. OFTAL. C.A.",
        "lote": "0902015422",
        "fecha_vencimiento": "21/12/2025", 
        "registro_sanitario": "M.P.P.S. 35.590/20",
        "condicion_venta": "Bajo prescripción médica",
        "precio": 432, 
        "stock_disponible": 462, 
        "codigo_barras": "7591196004563",
        "pais_origen": "Venezuela",
        "precauciones": "Conservar a temperatura ambiente inferior a 30°C",
        "imagen_coleccion": ["img/medicamentos/flinas1.JPG", "img/medicamentos/flinas2.JPG"],
        "reacciones_adversas": ["Enrojecimiento ocular", "Picazón", "Visión borrosa"],
        "indicaciones": "No especificado",
        "contraindicaciones": ["Alergia a los componentes de la fórmula."],
        "uso_durante_embarazo": "Si", 
        "condiciones_almacenamiento": "Conservar a temperatura ambiente inferior a 30°C",
        "imagen": "img/medicamentos/flinas1.JPG",
        "ambito_uso": "Oftalmología",
        "formula": "140 dosis de 50 MCG",
        "accion_terapeutica": "Suspension nasal para Nebulizar",
        "via_administracion_dosis": "Vía oftálmica",
        "dosis_presentacion": "140 dosis de 50 MCG"
    },
    {
        "id": "057", 
        "categoria_id": "010",
        "nombre_comercial": "Duovent",
        "nombre_generico": "Duovent",
        "forma_farmaceutica": "Solución para instilar",
        "concentracion": "15 ml",
        "via_administracion": "Oftálmica",
        "laboratorio": "LABORATORIOS D.O. OFTAL. C.A.",
        "lote": "0902015422",
        "fecha_vencimiento": "21/12/2025", 
        "registro_sanitario": "M.P.P.S. 35.590/20",
        "condicion_venta": "Bajo prescripción médica",
        "precio": 324, 
        "stock_disponible": 462, 
        "codigo_barras": "7591196004563",
        "pais_origen": "Venezuela",  
        "precauciones": "Cumplir estrictamente los intervalos de administración del producto y se acata a las indicaciones señaladas por el médico.",
        "imagen_coleccion": ["img/medicamentos/duovent1.JPG", "img/medicamentos/duovent2.JPG"],
        "reacciones_adversas": ["Enrojecimiento ocular", "Picazón", "Visión borrosa"], 
        "indicaciones": "No especificado",
        "contraindicaciones": ["No especificado"],
        "uso_durante_embarazo":"", 
        "condiciones_almacenamiento": "Conservar a temperatura ambiente inferior a 30°C",
        "imagen": "img/medicamentos/duovent1.JPG",
        "ambito_uso": "Oftalmología",
        "formula": "Solucion para inhalar",
        "accion_terapeutica": "No especificada",
        "via_administracion_dosis": "Oftálmica",
        "dosis_presentacion": "Solucion de 15 ml"
    },
    {
        "id": "01244",
        "categoria_id": "002",
        "nombre_comercial": "Cefonax",
        "nombre_generico": "Cefadroxilo",
        "forma_farmaceutica": "Cápsulas",
        "concentracion": "500 mg",
        "via_administracion": "Oral",
        "laboratorio": "Laboratorios ELMOR, S.A.",
        "lote": "CPE0508150452",
        "fecha_vencimiento": "15/12/2028",
        "registro_sanitario": "E.F. 27.816/23",
        "condicion_venta": "Bajo receta",
        "precio": 125,
        "stock_disponible":48,
        "codigo_barras": "0005855221",
        "pais_origen": "Venezuela",
        "precauciones": "Producto de uso delicado. No administrar durante el embarazo o lactancia. No exceder la dosis. Conservar a temperatura inferior a 30°C.",
        "imagen_coleccion": ["img/medicamentos/cefonax1.JPG", "img/medicamentos/cefonax2.JPG", "img/medicamentos/cefonax3.JPG"],
        "reacciones_adversas":[ "Consultar prospecto"],
        "indicaciones": "Infecciones bacterianas", 
        "contraindicaciones": ["Alergia a cefalosporinas", "penicilinas y componentes de la fórmula"],
        "uso_durante_embarazo": "No recomendado",
        "uso_durante_lactancia": "No recomendado",
        "condiciones_almacenamiento": "Conservar a temperatura inferior a 30°C",
        "imagen": "img/medicamentos/cefonax1.JPG",
        "ambito_uso": "Tratamiento de infecciones bacterianas",
        "formula": "Cefadroxilo 500 mg + excipientes",
        "accion_terapeutica": "Antibiótico de amplio espectro",
        "via_administracion_dosis": "Oral, según prescripción médica",
        "dosis_presentacion": "16 cápsulas"
    },
    {
        "id": "028444",
        "categoria_id": "002",
        "nombre_comercial": "La Santé",
        "nombre_generico": "Amoxicilina",
        "forma_farmaceutica": "Cápsulas",
        "concentracion": "500 mg",
        "presentacion": "12 cápsulas",
        "via_administracion": "Oral",
        "laboratorio": "Pharmetical Labs",
        "lote": "854515555",
        "fecha_vencimiento": "25/05/2026",
        "registro_sanitario": "APRD -45784 ",
        "condicion_venta": "Bajo receta médica",
        "precio": 235.52,
        "stock_disponible": 62,
        "codigo_barras": "0002358444",
        "pais_origen": "Venezuela",
        "precauciones": "Producto de uso delicado. No administrar durante el embarazo o lactancia. No exceder la dosis. Conservar a temperatura inferior a 30°C.",
        "imagen_coleccion": ["img/medicamentos/amoxicilina1.JPG", "img/medicamentos/amoxicilina2.JPG"],
        "reacciones_adversas": ["Diarrea intensa y persistente con náuseas", "dolor abdominal y fiebre"], 
        "indicaciones": "Infecciones bacterianas",
        "contraindicaciones": ["Alergia a los componentes de la fórmula", "a las cefalosporinas o a la penicilina y sus derivados"],
        "uso_durante_embarazo": "No recomendado",
        "uso_durante_lactancia": "No recomendado",
        "condiciones_almacenamiento": "Conservar a temperatura inferior a 30°C",
        "imagen": "img/medicamentos/amoxicilina1.JPG",
        "ambito_uso": "Tratamiento de infecciones bacterianas", 
        "formula": "Amoxicilina trihidrato 500 mg + excipientes",
        "accion_terapeutica": "Antibiótico",
        "via_administracion_dosis": "Oral, según prescripción médica",
        "dosis_presentacion": "12 cápsulas"
    }
]