{
  "test_profiles": ["Release"],
  "test_targets": ["tests-1", "tests-2", "tests-3"],
  "submit_files": [
    "rsm/kv/client",
    "rsm/kv/node",
    "rsm/multipaxos"
  ],
  "lint_files": [
    "rsm/kv/client",
    "rsm/kv/node",
    "rsm/multipaxos"
  ]
}
