<svg width="152" height="152" viewBox="0 0 152 152" fill="none" xmlns="http://www.w3.org/2000/svg">
<path d="M88.099 5.47003C127.052 5.47003 148.482 37.0474 148.482 76C148.482 114.953 127.052 146.53 88.099 146.53C49.1463 146.53 3.51953 129.762 3.51953 90.8095C3.51953 51.8569 49.1463 5.47003 88.099 5.47003Z" fill="#E8F0FD"/>
<path d="M64.652 66.992V55.216H84.364V102H71.244V66.992H64.652Z" fill="#2EA0C5"/>
</svg>
