<svg width="152" height="152" viewBox="0 0 152 152" fill="none" xmlns="http://www.w3.org/2000/svg">
<path d="M88.099 5.47003C127.052 5.47003 148.482 37.0474 148.482 76C148.482 114.953 127.052 146.53 88.099 146.53C49.1463 146.53 3.51953 129.762 3.51953 90.8095C3.51953 51.8569 49.1463 5.47003 88.099 5.47003Z" fill="#E8F0FD"/>
<path d="M56.764 94.32V83.952L76.412 55.92H90.172V83.44H95.1V94.32H90.172V102H77.5V94.32H56.764ZM78.46 70.064L69.628 83.44H78.46V70.064Z" fill="#2EA0C5"/>
</svg>
