<svg width="552" height="552" viewBox="0 0 552 552" fill="none" xmlns="http://www.w3.org/2000/svg">
<path fill-rule="evenodd" clip-rule="evenodd" d="M552 0H0V552H552V0ZM4 260.799C3.99999 421.073 123.589 548 274.809 548C426.03 548 547 352.505 547 192.231C547 31.9572 426.03 5.00001 274.809 5C123.589 4.99999 4.00001 100.525 4 260.799Z" fill="white"/>
</svg>
