D:\Documents\intellijProjects\gs-serving-web-content\complete\src\main\java\hello\Application.java
D:\Documents\intellijProjects\gs-serving-web-content\complete\src\main\java\hello\GreetingController.java
D:\Documents\intellijProjects\gs-serving-web-content\complete\src\main\java\hello\entity\Employee.java
