{
    "$schema": "http://json-schema.org/draft-07/schema",
    "$id": "https://pcmasterrace.org/pcmrbot.js/bots/automod/root.json",
    "title": "PCMRBot.js AutoModerator Configuration Root",
    "description": "The main PCMRBot.js AutoModerator configuration specification.",
    "type": "array",
    "items": {
        "type": "object",
        "title": "Top Level Rule",
        "description": "A collection of triggers and actions to perform when AutoModerator matches a post.",
        "required": [
            "when",
            "do"
        ],
        "properties": {
            "when": {
                "$id": "#/when",
                "title": "When Schema",
                "description": "The rules describing what kinds of content AutoMod should act upon",
                "type": "object",
                "additionalProperties": false,
                "minProperties": 1,
                "properties": {
                    "reddit": {
                        "$id": "#/when/reddit",
                        "title": "Reddit Triggers",
                        "description": "Content triggers from Reddit sources that will trigger an action.",
                        "type": "object",
                        "additionalProperties": false,
                        "minProperties": 1,
                        "properties": {
                            "post": {
                                "$ref": "#/definitions/post"
                            },
                            "comment": {
                                "$ref": "#/definitions/post"
                            },
                            "submission": {
                                "$ref": "#/definitions/post"
                            }
                        }
                    }
                }
            },
            "do": {
                "$id": "#/do",
                "title": "Do Schema",
                "description": "The rules describing how AutoMod should act upon detected content",
                "type": "object",
                "properties": {
                    "slack": {
                        "$id": "#/do/slack",
                        "title": "Slack Actions",
                        "description": "Parameters for acting on Slack based on detected content",
                        "type": "object",
                        "properties": {
                            "alert": {
                                "$id": "#/do/slack/alert",
                                "title": "Slack Alert",
                                "description": "Parameters for sending an alert to a specified channel on Slack with the post information",
                                "type": "object",
                                "properties": {
                                    "channel": {
                                        "type": "string",
                                        "minLength": 9
                                    },
                                    "message": {
                                        "type": "string"
                                    }
                                }
                            }
                        }
                    }
                }
            }
        }
    },
    "definitions": {
        "post": {
            "title": "Post-like Trigger",
            "description": "A generic type for comments and submissions ingested.",
            "type": "object",
            "additionalProperties": false,
            "minProperties": 1,
            "properties": {
                "contains": {
                    "title": "Contains",
                    "description": "A string, or an array of strings, denoting text that should be matched.",
                    "anyOf": [
                        {"type": "string", "minLength": 1},
                        {"type": "array", "items": {"type": "string", "minLength": 1}, "minItems": 1}
                    ]
                }
            }
        }
    }
}