**DIRAC
.TITLE
 Se=Se
.WAVE FUNCTION
**GENERAL
**INTEGRALS
*READIN
.UNCONTRACTED
**HAMILTONIAN
**WAVE FUNCTION
.SCF
.RESOLVE
*SCF
.CLOSED SHELL
32 34
.OPEN SHELL
1
2/4,0
.EVCCNV
1.0d-05
**MOLECULE
*BASIS
.DEFAULT
 dyall.v2z
**END OF

&GOSCIP IPRNT=5 &END
