**DIRAC
.TITLE
H2O
.PROPERTIES
**HAMILTONIAN
.X2C
**INTEGRALS
*TWOINT
.SCREEN
1.0D-12
*READIN
.UNCONT
**WAVE FUNCTIONS
.SCF
*SCF
.CLOSED SHELL
10
**PROPERTIES
*EXCITATION ENERGIES
.OCCUP
1
.VIRTUA
72
.EXCITATION
1 1
.EXCITATION
2 1
.EXCITATION
3 1
.EXCITATION
4 1
.INTENS
0
.ANALYZE
*END OF
