**DIRAC
.WAVE FUNCTION
.ANALYZE
.PROPERTIES
**INTEGRALS
*READIN
.UNCONTRACT
**HAMILTONIAN
.SPINFREE
.DFT
PBE0
**WAVE FUNCTION
.SCF
*SCF
.CLOSED SHELL
6 8
**ANALYZE
.MULPOP
*MULPOP
.VECPOP
1..5
1..5
**PROPERTIES
.PRINT
1
*EXCITATION ENERGIES
.OCCUP
1
1
.EXCITATIONS  !Ag
1 3
.EXCITATIONS  !B3u
2 3
.EXCITATIONS  !B2u
3 3
.EXCITATIONS  !B1g
4 3
.EXCITATIONS  !B1u
5 3
.EXCITATIONS  !B2g
6 3
.EXCITATIONS  !B3g
7 3
.EXCITATIONS  !Au
8 3
.INTENS
0
.ANALYZE
.SKIPEP
*END OF INPUT
