10081357;709;3
10081293;709;3
10094244;709;3
10089815;709;3
10096748;709;3
10079161;709;3
10096060;709;3
10078679;709;3
10079854;709;3
10087144;709;3
10077374;709;3
10074918;709;3
10079081;709;3
10078681;709;3
10097084;709;3
10096847;709;3
10087770;709;3
10078897;714;18
10097742;714;18
10078913;714;18
10078345;714;18
10073380;714;18
10079081;714;18
10073812;714;18
10081293;714;18
10076177;714;18
10071777;715;22
10097742;715;22
10081357;715;22
10078679;715;22
10075953;715;22
10095741;715;22
10079081;715;22
10079079;715;22
10073812;715;22
10096960;715;22
10096748;715;22
10081293;715;22
10073091;739;26
10075775;739;26
10090593;739;26
10081131;739;26
10079606;739;26
10096012;739;26
10079809;739;26
10077230;739;26
10084814;739;26
10083052;739;26
10090094;739;26
10084734;739;26
10074291;739;26
10077066;739;26
10094244;739;26
10082915;739;26
10074935;739;26
10076214;739;26
10086697;739;26
10082157;739;26
10093396;739;26
10090688;739;26
10087144;739;26
10087896;739;26
10073672;739;26
10086731;739;26
10073259;739;26
10085744;739;26
10095945;741;14
10095381;741;14
10098245;741;14
10084448;741;14
10081628;741;14
10077715;741;14
10096713;741;14
10094658;741;14
10084734;741;14
10090073;741;14
10079161;741;14
10093762;741;14
10088770;741;14
10082635;741;14
10069752;741;14
10094198;741;14
10071005;741;14
10085084;741;14
10085751;741;14
10096344;741;14
10079854;741;14
10077188;741;14
10095249;741;14
10086021;741;14
10096012;741;14
10097884;741;14
10079053;741;14
10087144;741;14
10075001;741;14
10095740;741;14
10078941;741;14
10071008;741;14
10073694;741;14
10070584;741;14
10097345;741;14
10096972;741;14
10086539;741;14
10087242;741;14
10071582;741;14
10082610;741;14
10086963;741;14
10093699;741;14
10082971;741;14
10077066;741;14
10086609;741;14
10078681;741;14
10098115;741;14
10093874;741;14
10095694;741;14
10073812;741;14
10084056;741;14
10085744;741;14
10093544;741;14
10082878;741;14
10069429;741;14
10093011;746;80
10093830;746;80
10073467;746;80
10094819;746;80
10075697;746;80
10079126;746;80
10096344;746;80
10092189;746;80
10073667;746;80
10090579;746;80
10096972;746;80
10087246;746;80
10073676;746;80
10094678;746;80
10085057;746;80
10075777;746;80
10078994;746;80
10073310;746;80
10094137;746;80
10084738;746;80
10078782;746;80
10071102;746;80
10078332;746;80
10078156;746;80
10096238;746;80
10083194;746;80
10078425;746;80
10083351;746;80
10089871;746;80
10084806;746;80
10094760;746;80
10095697;746;80
10087696;746;80
10087183;746;80
10082041;746;80
10070007;746;80
10073675;746;80
10069572;746;80
10079303;746;80
10091344;746;80
10070639;746;80
10069427;746;80
10096853;746;80
10096982;746;80
10069414;746;80
10096765;746;80
10083897;746;80
10092692;746;80
10090365;746;80
10096892;746;80
10073639;746;80
10082114;746;80
10073293;746;80
10096711;746;80
10084344;746;80
10078971;746;80
10088132;746;80
10091089;746;80
10077134;746;80
10083209;746;80
10073216;746;80
10077394;746;80
10073125;746;80
10091180;746;80
10089478;746;80
10077933;746;80
10073815;746;80
10081620;746;80
10072339;746;80
10083660;746;80
10087489;746;80
10069546;746;80
10082663;746;80
10088937;746;80
10097982;746;80
10086448;746;80
10078086;746;80
10093559;746;80
10070307;746;80
10088917;746;80
10093431;746;80
10096970;746;80
10073324;746;80
10080698;746;80
10072303;746;80
10072215;746;80
10088839;746;80
10087846;746;80
10069236;746;80
10071021;746;80
10073744;746;80
10073834;746;80
10093902;747;93
10083069;747;93
10086026;747;93
10078350;747;93
10084734;747;93
10092150;747;93
10084679;747;93
10079126;747;93
10093471;747;93
10077404;747;93
10078970;747;93
10096344;747;93
10092189;747;93
10097267;747;93
10091911;747;93
10079081;747;93
10078653;747;93
10096972;747;93
10093626;747;93
10073676;747;93
10094678;747;93
10078918;747;93
10070497;747;93
10092924;747;93
10078782;747;93
10071102;747;93
10093879;747;93
10083351;747;93
10081426;747;93
10073812;747;93
10069286;747;93
10087696;747;93
10084788;747;93
10096760;747;93
10096764;747;93
10071038;747;93
10079441;747;93
10080471;747;93
10096757;747;93
10073323;747;93
10073675;747;93
10069572;747;93
10079303;747;93
10069427;747;93
10083898;747;93
10090363;747;93
10071486;747;93
10079018;747;93
10096982;747;93
10069414;747;93
10077945;747;93
10069433;747;93
10076610;747;93
10097044;747;93
10096956;747;93
10070970;747;93
10089934;747;93
10073115;747;93
10083897;747;93
10076859;747;93
10077190;747;93
10085777;747;93
10069875;747;93
10073345;747;93
10069415;747;93
10073293;747;93
10089646;747;93
10075056;747;93
10070269;747;93
10073254;747;93
10091876;747;93
10076575;747;93
10070210;747;93
10073125;747;93
10085775;747;93
10078218;747;93
10097898;747;93
10077570;747;93
10077153;747;93
10096943;747;93
10073815;747;93
10081620;747;93
10072339;747;93
10070956;747;93
10092619;747;93
10078825;747;93
10087489;747;93
10076696;747;93
10082663;747;93
10090859;747;93
10085678;747;93
10069299;747;93
10072410;747;93
10070048;747;93
10097730;747;93
10073793;747;93
10093559;747;93
10070307;747;93
10089219;747;93
10084027;747;93
10097690;747;93
10080590;747;93
10091951;747;93
10081531;747;93
10083318;747;93
10071674;747;93
10095705;747;93
10080367;747;93
10095021;747;93
10088643;747;93
10091652;747;93
10087806;747;93
10088541;747;93
10094733;748;41
10084734;748;41
10079126;748;41
10092099;748;41
10070200;748;41
10096060;748;41
10081991;748;41
10078970;748;41
10076279;748;41
10086143;748;41
10078679;748;41
10092189;748;41
10073651;748;41
10079081;748;41
10078799;748;41
10073487;748;41
10073676;748;41
10078994;748;41
10087766;748;41
10078918;748;41
10076801;748;41
10071102;748;41
10073812;748;41
10084960;748;41
10087629;748;41
10087696;748;41
10071038;748;41
10083958;748;41
10086856;748;41
10070176;748;41
10093007;748;41
10073675;748;41
10093551;748;41
10083760;748;41
10079682;748;41
10087978;748;41
10087138;748;41
10084015;748;41
10096853;748;41
10096982;748;41
10086626;748;41
10083970;748;41
10070970;748;41
10082166;748;41
10082866;748;41
10087746;748;41
10085648;748;41
10077190;748;41
10091620;748;41
10079145;748;41
10093063;748;41
10087984;748;41
10090387;748;41
10071044;748;41
10081587;748;41
10069415;748;41
10088986;748;41
10075056;748;41
10085524;748;41
10082150;748;41
10087948;748;41
10097043;748;41
10092253;748;41
10089209;748;41
10085251;748;41
10087842;748;41
10086676;748;41
10074329;748;41
10069379;748;41
10081620;748;41
10083157;748;41
10072285;748;41
10070956;748;41
10097770;748;41
10075332;748;41
10087489;748;41
10090327;748;41
10069299;748;41
10070978;748;41
10083698;748;41
10093559;748;41
10093752;748;41
10089272;748;41
10096970;748;41
10073040;748;41
10084102;748;41
10073772;748;41
10087959;748;41
10072215;748;41
10084027;748;41
10070982;748;41
10083634;748;41
10090110;748;41
10089084;748;41
10081402;748;41
10079280;748;41
10069236;748;41
10083318;748;41
10079283;748;41
10091269;748;41
10095021;748;41
10087241;748;41
10073744;748;41
10073834;748;41
10088517;748;41
10088541;748;41
10089669;748;41
10094733;749;43
10095128;749;43
10070545;749;43
10088941;749;43
10070567;749;43
10095142;749;43
10095131;749;43
10078832;749;43
10092200;749;43
10076132;749;43
10079126;749;43
10073361;749;43
10097211;749;43
10085193;749;43
10078970;749;43
10094059;749;43
10091953;749;43
10077788;749;43
10091911;749;43
10098008;749;43
10077200;749;43
10075148;749;43
10073281;749;43
10073676;749;43
10075777;749;43
10078782;749;43
10079966;749;43
10083405;749;43
10083351;749;43
10094377;749;43
10087696;749;43
10078135;749;43
10076527;749;43
10095292;749;43
10086499;749;43
10069869;749;43
10085090;749;43
10082908;749;43
10078639;749;43
10076298;749;43
10073323;749;43
10093007;749;43
10073675;749;43
10073375;749;43
10071816;749;43
10072367;749;43
10077773;749;43
10069927;749;43
10096853;749;43
10090363;749;43
10096982;749;43
10094979;749;43
10075486;749;43
10077945;749;43
10094817;749;43
10091936;749;43
10082624;749;43
10080081;749;43
10073115;749;43
10096949;749;43
10078624;749;43
10085034;749;43
10073504;749;43
10069875;749;43
10089950;749;43
10079167;749;43
10082304;749;43
10075227;749;43
10072827;749;43
10085038;749;43
10096892;749;43
10092809;749;43
10076709;749;43
10097752;749;43
10070378;749;43
10091089;749;43
10085055;749;43
10077134;749;43
10070086;749;43
10069568;749;43
10093481;749;43
10080830;749;43
10076387;749;43
10095742;749;43
10089246;749;43
10095699;749;43
10071051;749;43
10076930;749;43
10075332;749;43
10087489;749;43
10079834;749;43
10097982;749;43
10078086;749;43
10093559;749;43
10078634;749;43
10096970;749;43
10095891;749;43
10097219;749;43
10070982;749;43
10090104;749;43
10098197;749;43
10092237;749;43
10090397;749;43
10085917;749;43
10087263;749;43
10091191;749;43
10087241;749;43
10093051;749;43
10091652;749;43
10094733;750;119
10090133;750;119
10094860;750;119
10073467;750;119
10085189;750;119
10084734;750;119
10092117;750;119
10073361;750;119
10092911;750;119
10081991;750;119
10086985;750;119
10075037;750;119
10092189;750;119
10097345;750;119
10091911;750;119
10078653;750;119
10096972;750;119
10078377;750;119
10077200;750;119
10073676;750;119
10094678;750;119
10075777;750;119
10096754;750;119
10083225;750;119
10072332;750;119
10078782;750;119
10086496;750;119
10078425;750;119
10096896;750;119
10083351;750;119
10095087;750;119
10084960;750;119
10094760;750;119
10078117;750;119
10080875;750;119
10083848;750;119
10079757;750;119
10096760;750;119
10071038;750;119
10091997;750;119
10076145;750;119
10096757;750;119
10069429;750;119
10073675;750;119
10082242;750;119
10073375;750;119
10069572;750;119
10078230;750;119
10073105;750;119
10079936;750;119
10083915;750;119
10090363;750;119
10096947;750;119
10088788;750;119
10081458;750;119
10078053;750;119
10096956;750;119
10088648;750;119
10085648;750;119
10096765;750;119
10096949;750;119
10089169;750;119
10077770;750;119
10077542;750;119
10073133;750;119
10087882;750;119
10087212;750;119
10077671;750;119
10096892;750;119
10093446;750;119
10075056;750;119
10070175;750;119
10071295;750;119
10087948;750;119
10079684;750;119
10076819;750;119
10073216;750;119
10081254;750;119
10085775;750;119
10082445;750;119
10078441;750;119
10077153;750;119
10078246;750;119
10092478;750;119
10079008;750;119
10078825;750;119
10087489;750;119
10074949;750;119
10076696;750;119
10077889;750;119
10072410;750;119
10071103;750;119
10097982;750;119
10096143;750;119
10083632;750;119
10073793;750;119
10078086;750;119
10093559;750;119
10079762;750;119
10070307;750;119
10096727;750;119
10096970;750;119
10081933;750;119
10079232;750;119
10098306;750;119
10070436;750;119
10081402;750;119
10090397;750;119
10093951;750;119
10071674;750;119
10091191;750;119
10083214;750;119
10085028;750;119
10093083;750;119
10074686;750;119
10070567;751;176
10078832;751;176
10094813;751;176
10084734;751;176
10092117;751;176
10088908;751;176
10082441;751;176
10096344;751;176
10073651;751;176
10082971;751;176
10085057;751;176
10078918;751;176
10078723;751;176
10070186;751;176
10086919;751;176
10083351;751;176
10093374;751;176
10071038;751;176
10086526;751;176
10083958;751;176
10079057;751;176
10076923;751;176
10069429;751;176
10073675;751;176
10096853;751;176
10094458;751;176
10083937;751;176
10079229;751;176
10096949;751;176
10096240;751;176
10073504;751;176
10093063;751;176
10071044;751;176
10087882;751;176
10069415;751;176
10082114;751;176
10075056;751;176
10078971;751;176
10087948;751;176
10083209;751;176
10092253;751;176
10073125;751;176
10079072;751;176
10095742;751;176
10083772;751;176
10078521;751;176
10076930;751;176
10087489;751;176
10073313;751;176
10069299;751;176
10081609;751;176
10093559;751;176
10093752;751;176
10089214;751;176
10070436;751;176
10098197;751;176
10079280;751;176
10081531;751;176
10073673;751;176
10082097;751;176
10090665;751;176
10070285;751;176
10095705;751;176
10079283;751;176
10079505;751;176
10079460;751;176
10087241;751;176
10088992;751;176
10090422;751;176
10094813;752;171
10092117;752;171
10080867;752;171
10073651;752;171
10091911;752;171
10078653;752;171
10078799;752;171
10078994;752;171
10087604;752;171
10074155;752;171
10096847;752;171
10078425;752;171
10095697;752;171
10089724;752;171
10080875;752;171
10087696;752;171
10094369;752;171
10071038;752;171
10082588;752;171
10088477;752;171
10083363;752;171
10073675;752;171
10087978;752;171
10083937;752;171
10094817;752;171
10087746;752;171
10083266;752;171
10083897;752;171
10091737;752;171
10084229;752;171
10091620;752;171
10074926;752;171
10093063;752;171
10071044;752;171
10096711;752;171
10075056;752;171
10081643;752;171
10087948;752;171
10091876;752;171
10085731;752;171
10081140;752;171
10092474;752;171
10079247;752;171
10079072;752;171
10083273;752;171
10089787;752;171
10071246;752;171
10088055;752;171
10083157;752;171
10078712;752;171
10087489;752;171
10093264;752;171
10070215;752;171
10093559;752;171
10093752;752;171
10077539;752;171
10082008;752;171
10082559;752;171
10085761;752;171
10092237;752;171
10081402;752;171
10069236;752;171
10090665;752;171
10095705;752;171
10079283;752;171
10079505;752;171
10077935;752;171
10092975;752;171
10087292;754;5
10094956;754;5
10095131;754;5
10084734;754;5
10077571;754;5
10075148;754;5
10086341;754;5
10081293;754;5
10079854;754;5
10096807;754;5
10087144;754;5
10076156;754;5
10076537;754;5
10095740;754;5
10093374;754;5
10074918;754;5
10073672;754;5
10082969;754;5
10084056;754;5
10094137;754;5
10073150;754;5
10092940;754;5
10081544;754;5
10075823;754;5
10085927;754;5
10082919;754;5
10087751;754;5
10085804;754;5
10096786;754;5
10077866;754;5
10086731;754;5
10094059;754;5
10078956;754;5
10096748;754;5
10093933;754;5
10087613;754;5
10074155;754;5
10071651;754;5
10079108;754;5
10094001;754;5
10080407;754;5
10078782;754;5
10084024;754;5
10070242;754;5
10090780;754;5
10078323;754;5
10071005;754;5
10094881;754;5
10073489;754;5
10072994;754;5
10093875;755;35
10095018;755;35
10069664;755;35
10078350;755;35
10074890;755;35
10070550;755;35
10075148;755;35
10093626;755;35
10069553;755;35
10087529;755;35
10073281;755;35
10094908;755;35
10072401;755;35
10098008;755;35
10087144;755;35
10082946;755;35
10073647;755;35
10079924;755;35
10094703;755;35
10085928;755;35
10073992;755;35
10081535;755;35
10097626;755;35
10082246;755;35
10082919;755;35
10069286;755;35
10090780;755;35
10085945;755;35
10085804;755;35
10079775;755;35
10096786;755;35
10087263;755;35
10085195;755;35
10085878;755;35
10088269;755;35
10073389;755;35
10079126;759;27
10084955;759;27
10070916;759;27
10081628;759;27
10090640;759;27
10071303;759;27
10078678;759;27
10096324;759;27
10079081;759;27
10090094;759;27
10081293;759;27
10087144;760;24
10097084;760;24
10096847;760;24
10078127;760;24
10081509;760;24
10083251;760;24
10079161;760;24
10076445;760;24
10073812;760;24
10087762;760;24
10078345;760;24
10078678;760;24
10079081;760;24
10079958;760;24
10084247;760;24
10081293;760;24
10084056;761;50
10096972;761;50
10070852;761;50
10081509;761;50
10071431;761;50
10090470;761;50
10093013;761;50
10095740;761;50
10078991;761;50
10078681;761;50
10084247;761;50
10094733;763;33
10073397;763;33
10087144;763;33
10096847;763;33
10078913;763;33
10077090;763;33
10078679;763;33
10075037;763;33
10071431;763;33
10082441;763;33
10079161;763;33
10091023;763;33
10093013;763;33
10077711;763;33
10074032;763;33
10086158;763;33
10078345;763;33
10071215;763;33
10076212;763;33
10082922;763;33
10079081;763;33
10084793;777;24
10084524;777;24
10086754;777;24
10083452;777;24
10087196;794;1
10078875;794;1
10073091;794;1
10079768;794;1
10084814;794;1
10087196;798;16
10095054;798;16
10096786;813;23
10092150;813;23
10088949;813;23
10093854;813;23
10073467;813;23
10070537;813;23
10082975;813;23
10078832;813;23
10070567;813;23
10087169;813;23
10094028;813;23
10086067;813;23
10085804;813;23
10078181;813;23
10094920;813;23
10094137;813;23
10073651;813;23
10081544;813;23
10087372;813;23
10085816;813;23
10078970;813;23
10078127;813;23
10087246;813;23
10073676;813;23
10087260;813;23
10085929;813;23
10082971;813;23
10094703;813;23
10094893;813;23
10084734;813;23
10077659;813;23
10082157;813;23
10072362;813;23
10084738;813;23
10085181;814;62
10084679;814;62
10073651;814;62
10096748;814;62
10084734;814;62
10084851;814;62
10096786;814;62
10096972;814;62
10085816;814;62
10086233;814;62
10097778;814;62
10083225;814;62
10080079;814;62
10097267;814;62
10073467;814;62
10096344;814;62
10073667;814;62
10094001;814;62
10078681;814;62
10081636;814;62
10069286;814;62
10083351;814;62
10078135;814;62
10085181;815;40
10095105;815;40
10077031;815;40
10073651;815;40
10092189;815;40
10084734;815;40
10085216;815;40
10096786;815;40
10094733;815;40
10092920;815;40
10079001;815;40
10081293;815;40
10087372;815;40
10085834;815;40
10080079;815;40
10078918;815;40
10073676;815;40
10095740;815;40
10073467;815;40
10078970;815;40
10096344;815;40
10079161;815;40
10073667;815;40
10078994;815;40
10072332;815;40
10083351;815;40
10078135;815;40
10098245;816;18
10075863;816;18
10073091;816;18
10096012;816;18
10090593;816;18
10093874;816;18
10078663;816;18
10093840;816;18
10097884;821;1
10077715;821;1
10083092;821;1
10076888;821;1
10096786;823;17
10095051;823;17
10084955;823;17
10095131;823;17
10093893;823;17
10092189;823;17
10078752;823;17
10071005;823;17
10073672;823;17
10096807;823;17
10086731;823;17
10083086;823;17
10084524;823;17
10084734;823;17
10088464;823;17
10078564;823;17
10090094;823;17
10094173;823;17
10088629;823;17
10092560;823;17
10081428;823;17
10093266;823;17
10075001;823;17
10069325;823;17
10093896;823;17
10089659;823;17
10073316;823;17
10094012;823;17
10082953;823;17
10086800;823;17
10078504;823;17
10078574;823;17
10097576;823;17
10081458;823;17
10087228;823;17
10098191;823;17
10075085;823;17
10082981;823;17
10075092;823;17
10076700;823;17
10071621;823;17
10090779;823;17
10097683;823;17
10069664;824;20
10094942;824;20
10070802;824;20
10096713;824;20
10084955;824;20
10086619;824;20
10095035;824;20
10095144;824;20
10083085;824;20
10094908;824;20
10085804;824;20
10096807;824;20
10087144;824;20
10073740;824;20
10094920;824;20
10086116;824;20
10093814;824;20
10092226;824;20
10082950;824;20
10088464;824;20
10074890;824;20
10096995;824;20
10092503;824;20
10070657;824;20
10087109;824;20
10085619;824;20
10070555;824;20
10083049;824;20
10082937;824;20
10087638;824;20
10069869;824;20
10084738;824;20
10075148;824;20
10073216;824;20
10091744;824;20
10085659;824;20
10081147;824;20
10075085;824;20
10097626;824;20
10077555;824;20
10079544;824;20
10076819;824;20
10081943;824;20
10097464;824;20
10076949;824;20
10085571;824;20
10072773;824;20
10087732;824;20
10071088;824;20
10085216;834;355
10082975;834;355
10077031;834;355
10078832;834;355
10073366;834;355
10075697;834;355
10080079;834;355
10073535;834;355
10094956;834;355
10073361;834;355
10094893;834;355
10096344;834;355
10082902;834;355
10094920;834;355
10092307;834;355
10093814;834;355
10087259;834;355
10092227;834;355
10082157;834;355
10069286;834;355
10095038;835;144
10095102;835;144
10081131;835;144
10075953;835;144
10093752;835;144
10076987;835;144
10081293;835;144
10093814;835;144
10088307;835;144
10087613;835;144
10078120;835;144
10089793;835;144
10094047;835;144
10098245;839;46
10081252;839;46
10079131;839;46
10090532;839;46
10088770;839;46
10078842;844;55
10073694;844;55
10085946;847;23
10075030;847;23
10069661;847;23
10094733;851;8
10091973;851;8
10092920;1564;15
10095054;1564;15
10076496;1564;15
10095106;1654;33
10095038;1654;33
10093875;1654;33
10094934;1654;33
10085025;1654;33
10086116;1654;33
10094942;1654;33
10094073;1654;33
10094908;1654;33
10083085;1655;46
10070550;1655;46
10086116;1655;46
10073238;1655;46
10086731;1655;46
10085195;1655;46
10076279;1655;46
10097778;1655;46
10094942;1655;46
10096807;1655;46
10094104;1655;46
10096748;1655;46
10070242;1655;46
10090073;1655;46
10080600;1656;42
10093854;1656;42
10093875;1656;42
10085181;1656;42
10082975;1656;42
10086861;1656;42
10086731;1656;42
10087292;1656;42
10078679;1656;42
10085195;1656;42
10086116;1656;42
10094984;1656;42
10096807;1656;42
10070231;1656;42
10084024;1656;42
10070242;1656;42
10090073;1656;42
10073489;1656;42
10075697;1665;7
10093471;1665;7
10073310;1665;7
10094096;1665;7
10084960;1665;7
10081551;1665;7
10071720;1665;7
10081831;1665;7
10085872;1665;7
10087138;1665;7
10079018;1665;7
10096765;1665;7
10083897;1665;7
10077139;1665;7
10090365;1665;7
10086285;1665;7
10081296;1665;7
10075056;1665;7
10070269;1665;7
10077153;1665;7
10069579;1665;7
10077933;1665;7
10077081;1665;7
10087489;1665;7
10090181;1665;7
10088937;1665;7
10081933;1665;7
10096166;1665;7
10073674;1665;7
10089141;1665;7
10093051;1665;7
10088541;1665;7
10089815;1666;31
10084960;1666;31
10089104;1666;31
10083958;1666;31
10078466;1666;31
10093007;1666;31
10079303;1666;31
10078624;1666;31
10091620;1666;31
10073541;1666;31
10074926;1666;31
10090365;1666;31
10082150;1666;31
10083273;1666;31
10074329;1666;31
10071051;1666;31
10087489;1666;31
10088937;1666;31
10093752;1666;31
10077539;1666;31
10097389;1666;31
10072215;1666;31
10081402;1666;31
10090397;1666;31
10079280;1666;31
10079283;1666;31
10095059;1666;31
10092956;1666;31
10079081;1667;32
10083363;1667;32
10082866;1667;32
10091620;1667;32
10089293;1667;32
10090365;1667;32
10098016;1667;32
10075056;1667;32
10097043;1667;32
10078218;1667;32
10074329;1667;32
10072285;1667;32
10087489;1667;32
10076696;1667;32
10097389;1667;32
10092114;1667;32
10081402;1667;32
10079283;1667;32
10087864;1667;32
10094214;1669;12
10077866;1669;12
10093429;1670;21
10072399;1670;21
10091648;1671;23
10075904;1671;23
10093429;1671;23
10077250;1671;23
10072399;1671;23
10095552;1671;23
10097867;1673;25
10072399;1673;25
