{
  "feature-quality": "ultra",
  "depthmap-resolution": "auto",
  "pc-quality": "ultra",
  "max-concurrency": 24,
  "end-with": "opensfm",
  "outputs": [
    "cameras.json",
    "opensfm/undistorted/images",
    "opensfm/undistorted/reconstruction.json",
    "odm_georeferencing"
  ]
}
